minor issues

1 job for dev in 9 minutes and 25 seconds (queued for 5 seconds)
Name Stage Failure
failed
coverage Test
FAILED tests/test_save_and_load.py::test_MoKimCNN - TypeError: zip argument #...
FAILED tests/test_save_and_load.py::test_MoLSANNC - TypeError: zip argument #...
FAILED tests/test_save_and_load.py::test_MoTransformer - TypeError: zip argum...
FAILED tests/test_model/test_mo_models_single.py::test_MoKimCNN - TypeError: ...
FAILED tests/test_model/test_mo_models_single.py::test_MoLSANNC - TypeError: ...
FAILED tests/test_model/test_mo_models_single.py::test_MoTransformer - TypeEr...
============= 6 failed, 38 passed, 6 warnings in 497.03s (0:08:17) =============
Cleaning up project directory and file based variables
ERROR: Job failed: exit code 1