{
    "aka": "El Dorado Maroma, a Beachfront Resort, By Karisma Hotel",
    "description": "Located on one of Travel Channels Top Ten Beaches in the World, El Dorado Maroma is an upscale, exclusive Caribbean resort for romantic couples and active vacationers alike. Intimate and beachfront. Rustic and luxurious at the same time. the hotel provides outstanding services and gourmet cuisine. Receive personalized butler and concierge service, arrive with style with a champagne check in. It is rustic, because it is not pretentious and was built using traditional materials and with the philosophy of embracing the bounty of the nature and the local environment. It lies directly on the beach of Maroma, considered to be one of the best beaches in the world by independent reviewers, including the Discovery Channel.",
    "detail_rating": {
        "cleanliness": 5.0,
        "location": 4.5,
        "rooms": 4.5,
        "service": 4.5,
        "sleep": 4.5,
        "value": 4.5
    },
    "location": {
        "city": null,
        "continent": null,
        "country": "Mexico",
        "proposed_city": null,
        "province": null,
        "region": "Yucatan Peninsula"
    },
    "name": "El Dorado Maroma, a Beachfront Resort, by Karisma",
    "places": {
        "aka": [],
        "hotel_description": [],
        "hotel_name": []
    },
    "review_count": 1182,
    "review_count_current": 20,
    "reviews": [
        {
            "date": "July 8, 2010",
            "detail_rating": {
                "business": null,
                "cleanliness": 5.0,
                "desk": null,
                "location": 5.0,
                "pool": null,
                "restaurant": null,
                "rooms": 4.0,
                "service": 5.0,
                "sleep": 5.0,
                "value": 5.0
            },
            "helpfulness": 3,
            "id": 70165828,
            "likes": {
                "disliked": null,
                "liked": null
            },
            "rating": 4.0,
            "stay_parameters": "Stayed July 2010, traveled with family",
            "text": "My husband, his two kids (my bonus kids) who are 18 & 23, and I stayed at the Maroma from June 30 \u2013 July 4. We booked the trip through FunJet and tried the \u201cEl Dorado Fun for Less\u201d deal. We found out we were going to the Maroma about 5 days before our trip. We would have paid a lot more money booking the Maroma specifically, so it was great that it worked out that way. Definitely checkout Funjet.com (and the \u201cFun for Less\u201d and \u201cFun for Less El Dorado\u201d deals) if you\u2019re interested in a good bargain.",
            "title": "Relaxation Station",
            "user": "trinicole"
        },
        {
            "date": "July 6, 2010",
            "detail_rating": {
                "business": null,
                "cleanliness": 5.0,
                "desk": null,
                "location": 5.0,
                "pool": null,
                "restaurant": null,
                "rooms": 5.0,
                "service": 5.0,
                "sleep": 5.0,
                "value": 5.0
            },
            "helpfulness": 4,
            "id": 69914757,
            "likes": {
                "disliked": null,
                "liked": null
            },
            "rating": 5.0,
            "stay_parameters": "Stayed June 2010, traveled as a couple",
            "text": "Like all of the other reviews stated, check-in was a breeze (and champagne makes everything better). We got two rooms (202 and 204), which were very close to the quiet (\u201c24\u201d) pool. The location was nice considering we didn\u2019t pay for the nicer rooms (swim-up room, honeymoon suites, etc.). The bed was amazing. I\u2019ve slept like crud the past 4 nights since we\u2019ve been back, and I want the Maroma bed. The rooms were fine, except one of our rooms (202) had a horrible sewage smell in the bathroom. We should have called about it though, so that was partly our fault.",
            "title": "You can't stay anywhere else after staying here.",
            "user": "Techsan95"
        },
        {
            "date": "July 6, 2010",
            "detail_rating": {
                "business": null,
                "cleanliness": 5.0,
                "desk": null,
                "location": 5.0,
                "pool": null,
                "restaurant": null,
                "rooms": 5.0,
                "service": 5.0,
                "sleep": 4.0,
                "value": 5.0
            },
            "helpfulness": 5,
            "id": 69891934,
            "likes": {
                "disliked": null,
                "liked": null
            },
            "rating": 5.0,
            "stay_parameters": "Stayed July 2010",
            "text": "The customer service at this resort is absolutely amazing. We joked about how we never heard the word \u201cno.\u201d For example, we wanted some cheese and crackers around cocktail hour (which was pretty much every hour, but I\u2019m referring to the 4-6 pm timeframe), and they delivered a plate to our patio. Also, we wanted sushi at night, and they brought that to our room as well. The drink service is wonderful too. The premium alcohol is a treat (compared to most resorts), but you have to ask for it. The mixed drinks are good too, and the Coco Loco (served in a coconut with a fruity face) was fun.",
            "title": "Loved it, will go back...",
            "user": "MartyWDDS"
        },
        {
            "date": "July 5, 2010",
            "detail_rating": {
                "business": null,
                "cleanliness": 5.0,
                "desk": null,
                "location": 5.0,
                "pool": null,
                "restaurant": null,
                "rooms": 5.0,
                "service": 5.0,
                "sleep": 5.0,
                "value": 5.0
            },
            "helpfulness": 7,
            "id": 69702010,
            "likes": {
                "disliked": null,
                "liked": null
            },
            "rating": 5.0,
            "stay_parameters": "Stayed June 2009, traveled as a couple",
            "text": "The pools and the beach are top-notch. My husband and I took a long walk (about 50 minutes) and the beach got even more beautiful as we went further out. It was amazing. Definitely take advantage of the beach. The resort has an area roped off to swim in. It's pretty shallow. We bought $2.50 rafts from Walmart before we left and packed those in our suitcase. Those came in handy to lay on. Both pools are very nice, beautiful, and well maintained. The pools had great drink service. The beach was a bit slower, but you can walk up to the pool bar if you need a drink urgently.",
            "title": "Blew our socks off!",
            "user": "wendywwBrighton"
        },
        {
            "date": "June 28, 2010",
            "detail_rating": {
                "business": null,
                "cleanliness": 5.0,
                "desk": null,
                "location": 5.0,
                "pool": null,
                "restaurant": null,
                "rooms": 4.0,
                "service": 5.0,
                "sleep": 5.0,
                "value": 4.0
            },
            "helpfulness": 2,
            "id": 68962099,
            "likes": {
                "disliked": null,
                "liked": null
            },
            "rating": 5.0,
            "stay_parameters": "Stayed June 2010, traveled as a couple",
            "text": "My one complaint about the resort was the food. I love food, and I\u2019ll eat pretty much anything. Don\u2019t get me wrong, we had some amazing meals. But I was disappointed in how rich everything was. My husband and I stayed at the Royale in January, and I did backflips over the food. But I think that has to do with the size of the resorts (the Royale is much larger, so there are more options). I just would have liked to see some lighter things on the menu, like more salad. After 5 days, we were ready to go back home and eat healthy (and we were craving Subway). We ate at the Japanese restaurant the first night, and we loved that. The sushi was good (even the 18 year-old liked it, and normally he is not a sushi fan), my veggie/tofu dish was mighty tasty, we got hot sake, etc. I haven\u2019t heard rave reviews about the Japanese restaurant on here, but that was my favorite. We did the Italian dinner at Sabores (with the soprano singer) the second night, the Italian restaurant the third night, and the Mexican dinner (with the mariachi band) at Sabores the last night. The menu for the Italian and Mexican dinners at Sabores was different than we were expecting, but maybe that\u2019s because we\u2019re used to Americanized Italian and Mexican food. We liked the Italian food at the regular Italian restaurant a bit better. The service at all of the restaurants was absolutely extraordinary. We tipped a dollar for each round of drinks at the bar and about $2-4 at each meal.",
            "title": "Our own slice of paradise!",
            "user": "happyc0uple20"
        },
        {
            "date": "June 27, 2010",
            "detail_rating": {
                "business": null,
                "cleanliness": 5.0,
                "desk": null,
                "location": 5.0,
                "pool": null,
                "restaurant": null,
                "rooms": 5.0,
                "service": 5.0,
                "sleep": 5.0,
                "value": 5.0
            },
            "helpfulness": 5,
            "id": 68844778,
            "likes": {
                "disliked": null,
                "liked": null
            },
            "rating": 5.0,
            "stay_parameters": "Stayed June 2010, traveled as a couple",
            "text": "Don't know where to begin describing this amazing place...........",
            "title": "Living the Luxury at the Maroma",
            "user": "GLC"
        },
        {
            "date": "June 23, 2010",
            "detail_rating": {
                "business": null,
                "cleanliness": 5.0,
                "desk": null,
                "location": 5.0,
                "pool": null,
                "restaurant": null,
                "rooms": 5.0,
                "service": 5.0,
                "sleep": 5.0,
                "value": 5.0
            },
            "helpfulness": 1,
            "id": 68478004,
            "likes": {
                "disliked": null,
                "liked": null
            },
            "rating": 5.0,
            "stay_parameters": "Stayed December 2009, traveled as a couple",
            "text": "We arrived early in the morning , gave us champagne and wet towels, then they gave us a tour of the property (which is small) and said they'd have our rooms ready in about 30 minutes, which they did. We were in the Mi Hotelito building, overlooking the smaller pool, nice view. We thought we were going to be in the swimup suites but I guess they cost for an upgrade however after looking at our room, we loved it, more rustic, very nice! The bed was the most comfortable bed we've ever had, huge bath, and a bed and table on the patio. The a/c worked fabulous too I might add!!!",
            "title": "Love staff, beautiful paradise!",
            "user": "maf815"
        },
        {
            "date": "June 13, 2010",
            "detail_rating": {
                "business": null,
                "cleanliness": 5.0,
                "desk": null,
                "location": 5.0,
                "pool": null,
                "restaurant": null,
                "rooms": 5.0,
                "service": 5.0,
                "sleep": 5.0,
                "value": 5.0
            },
            "helpfulness": 4,
            "id": 67422542,
            "likes": {
                "disliked": null,
                "liked": null
            },
            "rating": 5.0,
            "stay_parameters": "Stayed May 2010, traveled as a couple",
            "text": "We changed into swimsuits and went to the pool. We wondered where all the people were - no more than 6-8 people were ever in the pool at one time......nor the beach! It's like we had the resort to ourselves the whole time. The drinks were all top shelf and excellent - it was the first place that we didn't have to wait in line for a drink at either pool and they were always smiling to wait on you. It reminded me of a cheers bar - where everyone knows your name. It's such an intimate small resort and you just feel special the entire trip. We had our own concierge Gaby and she was exceptional. I could mention all the staff but the previous reviews did and we got to put faces to names, all so personable!",
            "title": "Romantic Getaway",
            "user": "Steve_O_7"
        },
        {
            "date": "June 12, 2010",
            "detail_rating": {
                "business": null,
                "cleanliness": null,
                "desk": null,
                "location": null,
                "pool": null,
                "restaurant": null,
                "rooms": null,
                "service": null,
                "sleep": null,
                "value": null
            },
            "helpfulness": 5,
            "id": 67275643,
            "likes": {
                "disliked": null,
                "liked": null
            },
            "rating": 5.0,
            "stay_parameters": null,
            "text": "The food is excellent!!!! We ate at Sabores, beach restaurant, Italian twice and Japanese, everything was SO tasty - I can't believe anyone would not think this food was excellent.",
            "title": "Almost Perfect",
            "user": "waterbill"
        },
        {
            "date": "June 10, 2010",
            "detail_rating": {
                "business": null,
                "cleanliness": 5.0,
                "desk": null,
                "location": 5.0,
                "pool": null,
                "restaurant": null,
                "rooms": 5.0,
                "service": 5.0,
                "sleep": 5.0,
                "value": 5.0
            },
            "helpfulness": 4,
            "id": 67075433,
            "likes": {
                "disliked": null,
                "liked": null
            },
            "rating": 5.0,
            "stay_parameters": "Stayed June 2010, traveled as a couple",
            "text": "Daniel walks around the resort giving 5 minute back massages (my husband said what a job!ha) and so I booked a 30 min massage with him the palapa over the water........ahhhhhhh it was heaven, my first massage in Mexico.",
            "title": "I wanna go back!",
            "user": "krystalh"
        },
        {
            "date": "June 7, 2010",
            "detail_rating": {
                "business": null,
                "cleanliness": 5.0,
                "desk": null,
                "location": 5.0,
                "pool": null,
                "restaurant": null,
                "rooms": 5.0,
                "service": 5.0,
                "sleep": 5.0,
                "value": 5.0
            },
            "helpfulness": 4,
            "id": 66772077,
            "likes": {
                "disliked": null,
                "liked": null
            },
            "rating": 5.0,
            "stay_parameters": "Stayed May 2010, traveled with friends",
            "text": "There are not enough words to describe how much we enjoyed our visit to this beautiful hotel. We spent 7 glorious days on the Mi Hotelito side of this property and could not have been more pleased. We were told the hotel was small and a little out of the way but what we found was a small gem with all the attitude of the Hope Diamond. The rooms are large and romantic and steps from the most perfect beach with an abundance of chaises and private beds. The food was exceptional and the wait staff attentive and accommodating. With all the things that were perfect here the thing that impressed us most was that every member of the staff, from the gardeners to the head chef, spoke to us personally. We felt like we were amoung friends. Way to go Alfredo!",
            "title": "What a gem!",
            "user": "HappyTraveler052010"
        },
        {
            "date": "June 5, 2010",
            "detail_rating": {
                "business": null,
                "cleanliness": 5.0,
                "desk": null,
                "location": 5.0,
                "pool": null,
                "restaurant": null,
                "rooms": 5.0,
                "service": 5.0,
                "sleep": 5.0,
                "value": 4.0
            },
            "helpfulness": 2,
            "id": 66530305,
            "likes": {
                "disliked": null,
                "liked": null
            },
            "rating": 5.0,
            "stay_parameters": "Stayed May 2010",
            "text": "Amazing resort with incredible staff that keep us going back again and again!",
            "title": "Amazing, as usual!",
            "user": "NeikaAlbertaCanada"
        },
        {
            "date": "June 3, 2010",
            "detail_rating": {
                "business": null,
                "cleanliness": 5.0,
                "desk": null,
                "location": 5.0,
                "pool": null,
                "restaurant": null,
                "rooms": 5.0,
                "service": 5.0,
                "sleep": 5.0,
                "value": 5.0
            },
            "helpfulness": 5,
            "id": 66356287,
            "likes": {
                "disliked": null,
                "liked": null
            },
            "rating": 5.0,
            "stay_parameters": "Stayed May 2010, traveled as a couple",
            "text": "My title pretty much sums it up. My husband and I wanted in all couples resort. We dont club or gamble so \"El Dorado Maroma\" was our best choice. Upon arrival the staff greeted us with a warm welcome of champagne and wet towels for our face. It was very humid outside so that was perfect. Next we got a tour of the place and I just loved how the staffs uniform was coordinated. It makes you feel like your really in Mexico! My husband and I love doing tours so we went to the marina next door and did the horse back riding for 2 hours. I specifically love that about el dorado. The fact that it is a secluded hotel but the marina next door provides activities. My husband and I did parasailing, horse ride, oceon safari, and the couple beach dinner and sunset cruise. I highly recomend all of them.",
            "title": "GREAT FOOD, GREAT SERVICE, GREAT LOCATION, GREAT STAFF.",
            "user": "orozcoyuri"
        },
        {
            "date": "June 2, 2010",
            "detail_rating": {
                "business": null,
                "cleanliness": 1.0,
                "desk": null,
                "location": 1.0,
                "pool": null,
                "restaurant": null,
                "rooms": 1.0,
                "service": 1.0,
                "sleep": 1.0,
                "value": 1.0
            },
            "helpfulness": 18,
            "id": 66245579,
            "likes": {
                "disliked": null,
                "liked": null
            },
            "rating": 1.0,
            "stay_parameters": "Stayed May 2010, traveled as a couple",
            "text": "The staff at this place is amazing! We felt like they wanted to please us in every way and they did! The waiters are very very NICE. They were all so helpful and hard working. My husband and I specifically loved \"Vale\" this guy was really professional and knew everything about the food, the wine, sauces etc. Sabores was our favorite restaurant because Vale worked there and the food was amazing everytime. This hotel does live by its name because the food is in fact very gourmet. Breakfast, lunch and dinner were all suberb. I loved there desserts as well.",
            "title": "Worst Waste of Time & Money We Ever Spent~Read This Review!!!!!!!!!!!",
            "user": "sskicolorado"
        },
        {
            "date": "June 1, 2010",
            "detail_rating": {
                "business": null,
                "cleanliness": 5.0,
                "desk": null,
                "location": 5.0,
                "pool": null,
                "restaurant": null,
                "rooms": 5.0,
                "service": 5.0,
                "sleep": 5.0,
                "value": 5.0
            },
            "helpfulness": 7,
            "id": 66068010,
            "likes": {
                "disliked": null,
                "liked": null
            },
            "rating": 5.0,
            "stay_parameters": "Stayed May 2010, traveled as a couple",
            "text": "The beach was never crowded and it was always easy to find a seat or palapa.I found it incredible how much sting rays you can actually see on the shore during the evening. I spotted alot of fish in this beach that I had never ever seen before.",
            "title": "Amazing relaxing resort",
            "user": "pchels"
        },
        {
            "date": "July 23, 2010",
            "detail_rating": {
                "business": null,
                "cleanliness": 5.0,
                "desk": null,
                "location": 5.0,
                "pool": null,
                "restaurant": null,
                "rooms": 5.0,
                "service": 5.0,
                "sleep": 5.0,
                "value": 5.0
            },
            "helpfulness": 3,
            "id": 72090528,
            "likes": {
                "disliked": null,
                "liked": null
            },
            "rating": 5.0,
            "stay_parameters": "Stayed July 2010, traveled as a couple",
            "text": "My husband and I just returned from a wonderful week at the El Dorado Maroma, and I had to write a review in order to share our fabulous experience with others (and the staff\u2026here\u2019s hoping they read reviews!). When we began looking for a place to stay in Riviera Maya, we wanted something small, relaxing, and luxurious. Viola, the El Dorado Maroma delivered on all levels, and exceeded our expectations in every arena.",
            "title": "Absolute Perfection!",
            "user": "katecolorado"
        },
        {
            "date": "July 17, 2010",
            "detail_rating": {
                "business": null,
                "cleanliness": 5.0,
                "desk": null,
                "location": 5.0,
                "pool": null,
                "restaurant": null,
                "rooms": 5.0,
                "service": 5.0,
                "sleep": 5.0,
                "value": 5.0
            },
            "helpfulness": 5,
            "id": 71293464,
            "likes": {
                "disliked": null,
                "liked": null
            },
            "rating": 5.0,
            "stay_parameters": "Stayed July 2010, traveled as a couple",
            "text": "Upon arrival, you wind through a lush mangrove forest which hides the resort from the local highway. In fact, the entryway is so unassuming compared to the other \u201cmega-resorts\u201d that you may feel a bit under whelmed when you arrive; luckily, we had the recommendation of a friend and I had read all of the recent reviews, so we knew that a weeklong treat awaited us! When we walked into the reception area we were handed cool towels scented with lavender water to freshen up, as well as glasses of champagne. After a tour of the resort we were shown to our room, where our baggage already awaited us.",
            "title": "A week in paradise!",
            "user": "chrissylte"
        },
        {
            "date": "July 14, 2010",
            "detail_rating": {
                "business": null,
                "cleanliness": 5.0,
                "desk": null,
                "location": 5.0,
                "pool": null,
                "restaurant": null,
                "rooms": 5.0,
                "service": 5.0,
                "sleep": 5.0,
                "value": 4.0
            },
            "helpfulness": 1,
            "id": 70946984,
            "likes": {
                "disliked": null,
                "liked": null
            },
            "rating": 5.0,
            "stay_parameters": "Stayed July 2009, traveled as a couple",
            "text": "We chose a honeymoon suite in order to take advantage of the jacuzzi tub and outdoor shower (heaven!) in addition to having the fabulous upper-floor balcony in which to sit and watch the ocean. But, when we go to the Maroma again, I think we\u2019ll stick to the Mi Hotelito side of the resort, it\u2019s cheaper, and from what we heard from other guests, the rooms were just as lovely.",
            "title": "The Perfect Honeymoon",
            "user": "philliefan"
        },
        {
            "date": "July 11, 2010",
            "detail_rating": {
                "business": null,
                "cleanliness": 5.0,
                "desk": null,
                "location": 5.0,
                "pool": null,
                "restaurant": null,
                "rooms": 5.0,
                "service": 5.0,
                "sleep": 5.0,
                "value": 5.0
            },
            "helpfulness": null,
            "id": 70555362,
            "likes": {
                "disliked": null,
                "liked": null
            },
            "rating": 5.0,
            "stay_parameters": "Stayed July 2010, traveled as a couple",
            "text": "Customer service is what sets this resort apart; the staff is truly special. Every person we encountered was simply lovely and gracious. Anabel, Gaby, Kary, Ariel, Ana, Enrique, and Cesar were wonderful, and all waved goodbye to us as we left (Kary even gave us huge hugs! Where do you find that at a resort?!).",
            "title": "Most Amazing Place and Service is Exceptional",
            "user": "espanola08"
        },
        {
            "date": "July 9, 2010",
            "detail_rating": {
                "business": null,
                "cleanliness": 5.0,
                "desk": null,
                "location": 5.0,
                "pool": null,
                "restaurant": null,
                "rooms": 5.0,
                "service": 5.0,
                "sleep": 5.0,
                "value": 5.0
            },
            "helpfulness": 3,
            "id": 70327309,
            "likes": {
                "disliked": null,
                "liked": null
            },
            "rating": 5.0,
            "stay_parameters": "Stayed June 2010, traveled as a couple",
            "text": "The food at the Maroma is amazing\u2026I was a bit hesitant about the Italian restaurant after reading reviews, but can honestly say it was perfect! Think cream of spinach soup topped with black truffle oil and ashed goat cheese, tenderloin in red wine reduction, chicken stuffed with cheese, and on and on. The sushi at the Japanese restaurant was also amazing, and we headed there on more than one occasion for that treat! Like other reviewers said, definitely order room service for breakfast! The brioche French toast with raspberry sauce, and apple pancakes with banana mousse is to die for!",
            "title": "Wow, what a perfect anniversary vacation!",
            "user": "savywest"
        }
    ],
    "slim_ranking": 0.0510204081633,
    "stars": 4.5,
    "tripadvisor": {
        "VISITED": false,
        "country_name": null,
        "locality": null,
        "pic_link": null,
        "street_address": null
    },
    "user_rating": 4.5,
    "variance": {
        "average": 63,
        "excellent": 902,
        "poor": 30,
        "terrible": 17,
        "very good": 170
    }
}