{
    "aka": "Traders Fudu Changzhou",
    "description": null,
    "detail_rating": {
        "cleanliness": null,
        "location": null,
        "rooms": null,
        "service": null,
        "sleep": null,
        "value": null
    },
    "location": {
        "city": "Changzhou",
        "continent": "Asia",
        "country": "China",
        "proposed_city": "Changzhou",
        "province": null,
        "region": null
    },
    "name": "Traders Fudu Hotel Changzhou",
    "places": {
        "aka": [
            "Changzhou"
        ],
        "hotel_description": [],
        "hotel_name": [
            "Changzhou"
        ]
    },
    "review_count": 208,
    "review_count_current": 3,
    "reviews": [
        {
            "date": "October 3, 2006",
            "detail_rating": {
                "business": 5.0,
                "cleanliness": 5.0,
                "desk": null,
                "front_desk": 5.0,
                "location": 5.0,
                "pool": null,
                "restaurant": null,
                "rooms": 5.0,
                "service": 5.0,
                "sleep": null,
                "value": 5.0
            },
            "helpfulness": null,
            "id": 5905574,
            "likes": {
                "disliked": "\u2014 nothing",
                "liked": "\u2014 Clean, modern, elegant"
            },
            "rating": 5.0,
            "stay_parameters": "Stayed September 2006, traveled on business",
            "text": "Brand new hotel, very modern in the \"new city section\" of Changzhou. First class in every respect. Furnishings and woodwork very elegant, better than almost all US hotels. Clean modern bathroom with large walk in shower, clean marble floors. High speed internet in room. Exapansive, gourmet breakfast buffet. Top tier hotel, surprise in the middle of China. You wont go wrong. The only reason I can think not to stay is if you have business on the other side of the City [location], but taxi's are cheap, so go for the plush hotel.",
            "title": "Five Star, First Class, New and Modern",
            "user": "gtpatton"
        },
        {
            "date": "September 26, 2006",
            "detail_rating": {
                "business": 3.0,
                "cleanliness": 4.0,
                "desk": null,
                "front_desk": 4.0,
                "location": 3.0,
                "pool": null,
                "restaurant": null,
                "rooms": 5.0,
                "service": 2.0,
                "sleep": null,
                "value": 4.0
            },
            "helpfulness": null,
            "id": 5880559,
            "likes": {
                "disliked": null,
                "liked": null
            },
            "rating": 4.0,
            "stay_parameters": "Stayed September 2006, traveled on business",
            "text": "The Traders Hotel group is a division of the Shangri La Hotel group and I was not disappointed in the appearance of the hotel.",
            "title": "Traders Fudu",
            "user": "slug"
        },
        {
            "date": "January 18, 2006",
            "detail_rating": {
                "business": null,
                "cleanliness": 5.0,
                "desk": null,
                "location": null,
                "pool": null,
                "restaurant": null,
                "rooms": 5.0,
                "service": 5.0,
                "sleep": null,
                "value": 5.0
            },
            "helpfulness": 2,
            "id": 4361188,
            "likes": {
                "disliked": null,
                "liked": null
            },
            "rating": 5.0,
            "stay_parameters": "Stayed November 2005, traveled on business",
            "text": "Room size and decor were very nice.",
            "title": "Oasis in Changzhou",
            "user": "Changzhourbust"
        }
    ],
    "slim_ranking": 0.00862068965517,
    "stars": 4.5,
    "tripadvisor": {
        "VISITED": false,
        "country_name": null,
        "locality": null,
        "pic_link": null,
        "street_address": null
    },
    "user_rating": 4.5,
    "variance": {
        "average": 14,
        "excellent": 100,
        "poor": 2,
        "terrible": 1,
        "very good": 91
    }
}