{
    "aka": "Marriott London",
    "description": "Located in the fashionable Mayfair neighbourhood, just seconds walk to Oxford Street and Park Lane, the London Marriott Hotel Grosvenor Square enjoys a renown that many hotels in London strive to attain. First built as a stately townhouse, it has evolved into an exclusive hotel that infuses contemporary chic with classic luxury and exceptional personal service. Special Features include; Gordon Ramsay's Michelin Starred 'Maze' restaurant, WIFI throughout and a beautiful peaceful garden location, in London's most fashionable area.",
    "detail_rating": {
        "cleanliness": 4.5,
        "location": 5.0,
        "rooms": 4.0,
        "service": 4.0,
        "sleep": 4.0,
        "value": 4.0
    },
    "location": {
        "city": "London",
        "continent": "Europe",
        "country": "United Kingdom (UK)",
        "proposed_city": "London",
        "province": null,
        "region": null
    },
    "name": "Marriott London Grosvenor Square Hotel",
    "places": {
        "aka": [
            "London"
        ],
        "hotel_description": [
            "Oxford",
            "London"
        ],
        "hotel_name": [
            "London"
        ]
    },
    "review_count": 648,
    "review_count_current": 40,
    "reviews": [
        {
            "date": "June 28, 2007",
            "detail_rating": {
                "business": 1.0,
                "cleanliness": 4.0,
                "desk": null,
                "front_desk": 5.0,
                "location": 5.0,
                "pool": null,
                "restaurant": null,
                "rooms": 4.0,
                "service": 4.0,
                "sleep": null,
                "value": 5.0
            },
            "helpfulness": null,
            "id": 8019812,
            "likes": {
                "disliked": "\u2014 Expensive add-ons such as internet service",
                "liked": "\u2014 Value"
            },
            "rating": 4.0,
            "stay_parameters": "Stayed June 2007, traveled as a couple",
            "text": "Booked the hotel through Priceline's bidding site for $225 per night. It was excellent value and the hotel is worth much more than this. Staff very helpful and knowledgeable, rooms are a good size for London and the location is fantastic for the West End.",
            "title": "Great, Well Priced Hotel",
            "user": "Anglotraveller"
        },
        {
            "date": "June 28, 2007",
            "detail_rating": {
                "business": 3.0,
                "cleanliness": 5.0,
                "desk": null,
                "front_desk": 4.0,
                "location": 5.0,
                "pool": null,
                "restaurant": null,
                "rooms": 4.0,
                "service": 4.0,
                "sleep": null,
                "value": 4.0
            },
            "helpfulness": null,
            "id": 8017435,
            "likes": {
                "disliked": "\u2014 larger rooms",
                "liked": "\u2014 beautiful accomodations and service"
            },
            "rating": 5.0,
            "stay_parameters": "Stayed June 2007, traveled with family",
            "text": "i was concerned because some of the reviews on this hotel were mixed, but on our 3 night stay in early June we found the hotel to be superb.",
            "title": "Thought it was great!",
            "user": "Vicki G"
        },
        {
            "date": "June 26, 2007",
            "detail_rating": {
                "business": 5.0,
                "cleanliness": 5.0,
                "desk": null,
                "front_desk": 5.0,
                "location": 5.0,
                "pool": null,
                "restaurant": null,
                "rooms": 5.0,
                "service": 5.0,
                "sleep": null,
                "value": 5.0
            },
            "helpfulness": null,
            "id": 7998560,
            "likes": {
                "disliked": "\u2014 expensive restaurant at hotel",
                "liked": "\u2014 Spacious room with great bed"
            },
            "rating": 5.0,
            "stay_parameters": "Stayed June 2007, traveled on business",
            "text": "The rooms were average size but beautiful. The bedding teriffic. Bath amenities great. The location is great especially for shopping and local eats.",
            "title": "amazing!",
            "user": "nathem"
        },
        {
            "date": "June 16, 2007",
            "detail_rating": {
                "business": 3.0,
                "cleanliness": 5.0,
                "desk": null,
                "front_desk": 4.0,
                "location": 5.0,
                "pool": null,
                "restaurant": null,
                "rooms": 4.0,
                "service": 5.0,
                "sleep": null,
                "value": 4.0
            },
            "helpfulness": 1,
            "id": 7857315,
            "likes": {
                "disliked": "\u2014 There was no pool",
                "liked": "\u2014 The service and the beds"
            },
            "rating": 4.0,
            "stay_parameters": "Stayed June 2007, traveled with family",
            "text": "The only negative I can note is that like everything else in London, it's terribly expensive.. The concierge floor is useful with snacks/drinks/free internet connection during some periods of the day.",
            "title": "Location!!!",
            "user": "rata_200"
        },
        {
            "date": "May 22, 2007",
            "detail_rating": {
                "business": null,
                "cleanliness": null,
                "desk": null,
                "location": null,
                "pool": null,
                "restaurant": null,
                "rooms": null,
                "service": null,
                "sleep": null,
                "value": null
            },
            "helpfulness": null,
            "id": 7673151,
            "likes": {
                "disliked": null,
                "liked": null
            },
            "rating": 5.0,
            "stay_parameters": null,
            "text": "The service at the hotel was terrific both in the hotel and the restaurant area's",
            "title": "Great Service!",
            "user": "ColeyCalifornia"
        },
        {
            "date": "December 2, 2008",
            "detail_rating": {
                "business": null,
                "cleanliness": null,
                "desk": null,
                "location": null,
                "pool": null,
                "restaurant": null,
                "rooms": null,
                "service": null,
                "sleep": null,
                "value": null
            },
            "helpfulness": 1,
            "id": 22371193,
            "likes": {
                "disliked": null,
                "liked": null
            },
            "rating": 5.0,
            "stay_parameters": null,
            "text": "Just back from a three night break from The London Marriott at Grosvenor Square London. (Fri Sat and Sun) To give you an idea of the type of person I am and what floats my boat. I'm a 40 year old professional who like reasonable quality things especially good food, pleasant surroundings and good manners.",
            "title": "A little piece of Heaven!!!",
            "user": "Waterloomoo"
        },
        {
            "date": "November 9, 2008",
            "detail_rating": {
                "business": 5.0,
                "cleanliness": 5.0,
                "desk": null,
                "front_desk": 5.0,
                "location": 5.0,
                "pool": null,
                "restaurant": null,
                "rooms": 4.0,
                "service": 5.0,
                "sleep": null,
                "value": 3.0
            },
            "helpfulness": 3,
            "id": 21663323,
            "likes": {
                "disliked": "\u2014 Dean Street morning / all night noise",
                "liked": "\u2014 Location & Staff"
            },
            "rating": 4.0,
            "stay_parameters": "Stayed November 2008, traveled on business",
            "text": "I was very taken with this hotel. (I go to London at least one a year) The room my friend and I stayed in was a deluxe room (No 230) It was on the second floor and was not as modern as the newly renovated rooms on the club floor. However to me a hotel bedroom is for sleeping washing and storing my purchases and our room although a little small did everything it said on the tin. It was clean the beds were comfortable and it had one of the better showers I've used in hotels. The d\u00e9cor was non offensive but having seen the pictures of the club room it did seems a little dated. We were given toiletries, robes, slippers and it had a nice flat screen TV a good hair-dryer and was fitted with worldwide plug sockets. Our room was on the second floor at the front of the hotel and on one evening there was a Jewish wedding but we never heard a thing and my friend is a very light sleeper.",
            "title": "Great efficient hotel - watch the front though",
            "user": "BAManEdinburgh"
        },
        {
            "date": "October 21, 2008",
            "detail_rating": {
                "business": null,
                "cleanliness": 3.0,
                "desk": null,
                "front_desk": 2.0,
                "location": 4.0,
                "pool": null,
                "restaurant": null,
                "rooms": 2.0,
                "service": 2.0,
                "sleep": null,
                "value": 1.0
            },
            "helpfulness": 1,
            "id": 21050000,
            "likes": {
                "disliked": "\u2014 The minute size of the bathroom",
                "liked": "\u2014 Nothing!"
            },
            "rating": 2.0,
            "stay_parameters": "Stayed October 2008, traveled on business",
            "text": "The hotel is located seconds from Oxford Street and 5 minutes walk from Regents Street when walking.",
            "title": "A messed up Marriott",
            "user": "The_bald_gourmet"
        },
        {
            "date": "October 2, 2008",
            "detail_rating": {
                "business": null,
                "cleanliness": 2.0,
                "desk": null,
                "front_desk": 2.0,
                "location": 3.0,
                "pool": null,
                "restaurant": null,
                "rooms": 2.0,
                "service": 1.0,
                "sleep": null,
                "value": 2.0
            },
            "helpfulness": 1,
            "id": 20558316,
            "likes": {
                "disliked": "\u2014 Poor sound-proofing, terrible service",
                "liked": null
            },
            "rating": 1.0,
            "stay_parameters": "Stayed August 2008, traveled as a couple",
            "text": "The two best elements of this hotel for me were the Gordon Ramsay Grill room which served breakfast every morning. Waiter service with no buffet which I liked. If you like to fill your plate this isn't the place for you but if you like good quality food served with good service and a pleasant smile then this is the one.",
            "title": "Plenty better places",
            "user": "First-time-in-India"
        },
        {
            "date": "September 7, 2008",
            "detail_rating": {
                "business": 1.0,
                "cleanliness": 3.0,
                "desk": null,
                "front_desk": 3.0,
                "location": 4.0,
                "pool": null,
                "restaurant": null,
                "rooms": 2.0,
                "service": 3.0,
                "sleep": null,
                "value": 3.0
            },
            "helpfulness": null,
            "id": 19862005,
            "likes": {
                "disliked": "\u2014 Dated rooms, expensive wireless Internet",
                "liked": "\u2014 Location"
            },
            "rating": 3.0,
            "stay_parameters": "Stayed September 2008, traveled as a couple",
            "text": "The staff in this hotel could not be faulted they were well mannered helpful and took the time to chat which made the holiday for me.",
            "title": "Typical Marriott Experience",
            "user": "Meg3738"
        },
        {
            "date": "March 20, 2007",
            "detail_rating": {
                "business": null,
                "cleanliness": null,
                "desk": null,
                "location": null,
                "pool": null,
                "restaurant": null,
                "rooms": null,
                "service": null,
                "sleep": null,
                "value": null
            },
            "helpfulness": 6,
            "id": 7195926,
            "likes": {
                "disliked": null,
                "liked": null
            },
            "rating": 2.0,
            "stay_parameters": null,
            "text": "My husband I and stayed here for three nights as we had early meetings around the corner and didn't want to stay at the \"Radiation Millenium Hotel\" where the Russian spy was poisoned with polonium around the corner.",
            "title": "Location excellent, but there are tradeoffs - Room 350 reviewed",
            "user": "highlandbride"
        },
        {
            "date": "January 5, 2007",
            "detail_rating": {
                "business": null,
                "cleanliness": 3.0,
                "desk": null,
                "front_desk": 3.0,
                "location": 5.0,
                "pool": null,
                "restaurant": null,
                "rooms": 4.0,
                "service": 3.0,
                "sleep": null,
                "value": 2.0
            },
            "helpfulness": 8,
            "id": 6554635,
            "likes": {
                "disliked": "\u2014 Breakfast and dining area",
                "liked": "\u2014 The location"
            },
            "rating": 3.0,
            "stay_parameters": "Stayed December 2006, traveled with family",
            "text": "US$485 a night doesn't buy much in London, especially not at this hotel. While the location can't be beat, the neighborhood was relatively peaceful, and Barry the concierge was great, our room was small - the only way we could open up two suitcases at the same time was to rearrange the furniture in the room.",
            "title": "Average",
            "user": "Swifts"
        },
        {
            "date": "January 3, 2007",
            "detail_rating": {
                "business": 4.0,
                "cleanliness": 4.0,
                "desk": null,
                "front_desk": 5.0,
                "location": 5.0,
                "pool": null,
                "restaurant": null,
                "rooms": 3.0,
                "service": 3.0,
                "sleep": null,
                "value": 3.0
            },
            "helpfulness": 4,
            "id": 6548271,
            "likes": {
                "disliked": "\u2014 room service",
                "liked": "\u2014 location"
            },
            "rating": 4.0,
            "stay_parameters": "Stayed December 2006, traveled solo",
            "text": "The room came with a tiny bathroom that only one of us could be in at a time, unless one person was in the bathroom. Granted the bathroom was done up in nice marble and had free shampoo and mouthwash, but it was just too small especially considering the prices we've paid to stay elsewhere - far less for far more spacious bathrooms and guest rooms.",
            "title": "location, location, location",
            "user": "Nadime"
        },
        {
            "date": "November 28, 2006",
            "detail_rating": {
                "business": 4.0,
                "cleanliness": 5.0,
                "desk": null,
                "front_desk": 5.0,
                "location": 5.0,
                "pool": null,
                "restaurant": null,
                "rooms": 5.0,
                "service": 5.0,
                "sleep": null,
                "value": 5.0
            },
            "helpfulness": 4,
            "id": 6185184,
            "likes": {
                "disliked": null,
                "liked": "\u2014 Ensure yor room rate includes the cost of breakfast or eat out"
            },
            "rating": 5.0,
            "stay_parameters": "Stayed November 2006, traveled as a couple",
            "text": "Quality control is a problem with this property - the sheets had holes and tears in them and the problem was reported twice before new ones were put on. Then the complimentary bathrobe was falling apart - again reported twice to the desk and maids before it was replaced. We did receive an apology note and a complimentary bottle of wine, but we ask, why should a hotel of this so-called calibre have such problems in the first place?",
            "title": "Comfortable stay",
            "user": "gcoop17"
        },
        {
            "date": "November 25, 2006",
            "detail_rating": {
                "business": 4.0,
                "cleanliness": 5.0,
                "desk": null,
                "front_desk": 5.0,
                "location": 5.0,
                "pool": null,
                "restaurant": null,
                "rooms": 5.0,
                "service": 5.0,
                "sleep": null,
                "value": 5.0
            },
            "helpfulness": 4,
            "id": 6174434,
            "likes": {
                "disliked": "\u2014 Internet access was not wireless and was rather expensive (20 pounds for 24 hours)",
                "liked": "\u2014 Location is good, very clean"
            },
            "rating": 5.0,
            "stay_parameters": "Stayed October 2006, traveled on business",
            "text": "The third floor hallway smelled of mold, and then strong cleaning solutions to cover up the mold and the smoke. We asked for a non-smoking room and were assigned a smoking room that had to be aired out (windows only open a few inches, and then sprayed down by housekeeping while we went out to do errands). Carpet in 3rd floor hallway was heavy with stains - a hotel of this so-called five star calibre should be able to do better.",
            "title": "Wonderful hotel - Room 605 is great.",
            "user": "Todd_Whitehurst"
        },
        {
            "date": "June 9, 2008",
            "detail_rating": {
                "business": null,
                "cleanliness": null,
                "desk": null,
                "location": null,
                "pool": null,
                "restaurant": null,
                "rooms": null,
                "service": null,
                "sleep": null,
                "value": null
            },
            "helpfulness": 1,
            "id": 16793101,
            "likes": {
                "disliked": null,
                "liked": null
            },
            "rating": 5.0,
            "stay_parameters": null,
            "text": "Stunning in every way. Rooms and bathrooms are luxurious, in the traditional old-world English style. Location is quite good on Park Lane, though a bit further from the tube. Breakfast is fantastic, though pricey. Service is quite nice, and the lobby area is a great place to relax and have a drink. All in all a really gorgeous hotel, would highly recommend.",
            "title": "Gorgeous Hotel Would Highly Recommend",
            "user": "IAD777"
        },
        {
            "date": "May 3, 2008",
            "detail_rating": {
                "business": null,
                "cleanliness": 4.0,
                "desk": null,
                "front_desk": 5.0,
                "location": 5.0,
                "pool": null,
                "restaurant": null,
                "rooms": 5.0,
                "service": 4.0,
                "sleep": null,
                "value": null
            },
            "helpfulness": 2,
            "id": 15624147,
            "likes": {
                "disliked": null,
                "liked": "\u2014 Great Room!"
            },
            "rating": 5.0,
            "stay_parameters": "Stayed April 2008, traveled as a couple",
            "text": "Stayed at the Marriott Grosvenor Square in late April. All went well.",
            "title": "Beautiful Hotel, GREAT Location!",
            "user": "Rob CC"
        },
        {
            "date": "March 29, 2008",
            "detail_rating": {
                "business": null,
                "cleanliness": 2.0,
                "desk": null,
                "front_desk": 1.0,
                "location": 5.0,
                "pool": null,
                "restaurant": null,
                "rooms": 3.0,
                "service": 1.0,
                "sleep": null,
                "value": 1.0
            },
            "helpfulness": 1,
            "id": 14639922,
            "likes": {
                "disliked": null,
                "liked": null
            },
            "rating": 1.0,
            "stay_parameters": "Stayed March 2008, traveled with family",
            "text": "To get to the hotel, we took the Tube (London Underground). It was a little long (45 minutes from Heathrow), but was just $4 GBP. That was different than the $50 GBP it would have cost to take a taxi and when you are coming from a weak U.S. Dollar at the time, every dollar counts. I would recommend the tube if you don't mind taking the train.",
            "title": "I don't recommend this hotel",
            "user": "luvhhi"
        },
        {
            "date": "March 28, 2008",
            "detail_rating": {
                "business": 5.0,
                "cleanliness": 5.0,
                "desk": null,
                "front_desk": 5.0,
                "location": 5.0,
                "pool": null,
                "restaurant": null,
                "rooms": 5.0,
                "service": 5.0,
                "sleep": null,
                "value": 4.0
            },
            "helpfulness": 1,
            "id": 14618823,
            "likes": {
                "disliked": "\u2014 Nothing",
                "liked": "\u2014 Everything"
            },
            "rating": 5.0,
            "stay_parameters": "Stayed March 2008, traveled on business",
            "text": "The inside of the hotel was GREAT. Upon check-in I was upgraded to a suite due to my Marriott Platinum status - nice touch. The room was huge and more than my wife and I could have hoped for. If you can, ask for a view of Grosvenor Square, which also includes the U.S. Embassy.",
            "title": "This Marriott is terrific!",
            "user": "sheetmusicsandy"
        },
        {
            "date": "March 23, 2008",
            "detail_rating": {
                "business": 2.0,
                "cleanliness": 2.0,
                "desk": null,
                "front_desk": 3.0,
                "location": 4.0,
                "pool": null,
                "restaurant": null,
                "rooms": 1.0,
                "service": 2.0,
                "sleep": null,
                "value": 1.0
            },
            "helpfulness": 2,
            "id": 14471878,
            "likes": {
                "disliked": "\u2014 construction in progress",
                "liked": "\u2014 location"
            },
            "rating": 2.0,
            "stay_parameters": "Stayed March 2008, traveled on business",
            "text": "The hotel is just minutes from Oxford Street, which is a HUGE shopping area. if that's your cup of tea, I would suggest staying here.",
            "title": "Beware Under Construction",
            "user": "smb"
        },
        {
            "date": "September 19, 2007",
            "detail_rating": {
                "business": null,
                "cleanliness": 4.0,
                "desk": null,
                "front_desk": 1.0,
                "location": 4.0,
                "pool": null,
                "restaurant": null,
                "rooms": 1.0,
                "service": 1.0,
                "sleep": null,
                "value": 1.0
            },
            "helpfulness": 4,
            "id": 8823382,
            "likes": {
                "disliked": null,
                "liked": null
            },
            "rating": 1.0,
            "stay_parameters": "Stayed September 2007",
            "text": "My husband and I stayed at the this hotel for four nights in September. We had been to three locations in Europe, all at Marriott's. My expectations were high for this hotel and unfortunately I was disappointed from the beginning until the end.",
            "title": "Poor Service and quality at the Marriot",
            "user": "jbritton78"
        },
        {
            "date": "August 31, 2007",
            "detail_rating": {
                "business": 3.0,
                "cleanliness": 4.0,
                "desk": null,
                "front_desk": 5.0,
                "location": 5.0,
                "pool": null,
                "restaurant": null,
                "rooms": 4.0,
                "service": 4.0,
                "sleep": null,
                "value": 4.0
            },
            "helpfulness": null,
            "id": 8590419,
            "likes": {
                "disliked": "\u2014 price",
                "liked": "\u2014 Location, location and Location"
            },
            "rating": 4.0,
            "stay_parameters": "Stayed August 2007, traveled with family",
            "text": "We arrived and it took them 30 minutes at the counter to get us checked in. We got to our room and we were given two twin beds when we had reserved a King. We called them and they said they would move our luggage while we were at dinner to a different room. We then spent the next two nights in another room that shared a wall with a construction area where the hotel was putting in a new suite. We were awoken each morning before 7 AM. We are platinum member guests and no one, regardless of status, should be put in a room next to a construction site. In addition, the Iron didn't work in the room, and the air conditioner barely worked. In addition, none of the rooms we stayed at had a hair dryer. We then demanded the next morning that we be switched for the next two nights. At 10 AM we left the hotel and were assured that they would move our luggage AGAIN to a new room. We got back around 5PM and had not been moved. They had not even given thought to getting us to a new room. We waited another 30 minutes to get another room with 2 twin beds. We said that was fine because at this point we were tired and just wanted some rest. We got to the room and the keys didn't work. We called down and it took them three tries to get the keys to work. We also moved our own luggage because we had dinner plans and didn't want to wait any longer. They had only had 7 hours!",
            "title": "Great Location",
            "user": "ohashem1"
        },
        {
            "date": "August 16, 2007",
            "detail_rating": {
                "business": 3.0,
                "cleanliness": 5.0,
                "desk": null,
                "front_desk": 5.0,
                "location": 5.0,
                "pool": null,
                "restaurant": null,
                "rooms": 5.0,
                "service": 5.0,
                "sleep": null,
                "value": 4.0
            },
            "helpfulness": 3,
            "id": 8432353,
            "likes": {
                "disliked": "\u2014 Service",
                "liked": "\u2014 Service"
            },
            "rating": 5.0,
            "stay_parameters": "Stayed June 2007, traveled as a couple",
            "text": "We also had access to the executive lounge. They offered no variation of snacks and rarely even had bottled water.",
            "title": "Great Hotel, Location, and Service",
            "user": "cherylnemo"
        },
        {
            "date": "August 14, 2007",
            "detail_rating": {
                "business": 4.0,
                "cleanliness": 5.0,
                "desk": null,
                "front_desk": 2.0,
                "location": 4.0,
                "pool": null,
                "restaurant": null,
                "rooms": 3.0,
                "service": 1.0,
                "sleep": null,
                "value": 2.0
            },
            "helpfulness": 2,
            "id": 8422315,
            "likes": {
                "disliked": "\u2014 Service",
                "liked": "\u2014 Service"
            },
            "rating": 2.0,
            "stay_parameters": "Stayed August 2007, traveled with family",
            "text": "The last two nights were better, except for a wedding taking place in the hotel and a massive party occuring throughout the hallways.",
            "title": "Dont take the kids!",
            "user": "Jenny100"
        },
        {
            "date": "August 6, 2007",
            "detail_rating": {
                "business": 5.0,
                "cleanliness": 5.0,
                "desk": null,
                "front_desk": 5.0,
                "location": 5.0,
                "pool": null,
                "restaurant": null,
                "rooms": 5.0,
                "service": 5.0,
                "sleep": null,
                "value": 4.0
            },
            "helpfulness": 1,
            "id": 8362879,
            "likes": {
                "disliked": "\u2014 Price",
                "liked": "\u2014 Location"
            },
            "rating": 5.0,
            "stay_parameters": "Stayed November 2005, traveled on business",
            "text": "The location of the hotel is good but so are many other hotels in London. For the price and for our experience I would not recommend this hotel to anyone.",
            "title": "Multiple stays over the years",
            "user": "Sladea"
        },
        {
            "date": "September 7, 2008",
            "detail_rating": {
                "business": 5.0,
                "cleanliness": 5.0,
                "desk": null,
                "front_desk": 5.0,
                "location": 5.0,
                "pool": null,
                "restaurant": null,
                "rooms": 5.0,
                "service": 5.0,
                "sleep": null,
                "value": 5.0
            },
            "helpfulness": 2,
            "id": 19859157,
            "likes": {
                "disliked": "\u2014 Nothing!",
                "liked": "\u2014 Everything it was fantastic!"
            },
            "rating": 5.0,
            "stay_parameters": "Stayed September 2008, traveled as a couple",
            "text": "Stayed in this hotel for only a couple of days but wish it had been much more. We used our Marriott points to book a room and were upgraded to a suite on check in. The suite was fantastic- huge living room and lovely large bedroom and bathroom, lovely molton brown toiletries finished off my excitement with the room.",
            "title": "I want to live in this hotel!!!",
            "user": "tortoisetraveller"
        },
        {
            "date": "August 17, 2008",
            "detail_rating": {
                "business": 3.0,
                "cleanliness": 5.0,
                "desk": null,
                "front_desk": 2.0,
                "location": 5.0,
                "pool": null,
                "restaurant": null,
                "rooms": 4.0,
                "service": 3.0,
                "sleep": null,
                "value": 3.0
            },
            "helpfulness": 2,
            "id": 19037268,
            "likes": {
                "disliked": "\u2014 Reception trying to fob us off when we arrived",
                "liked": "\u2014 Good quality hotel in quiet and pleasant location"
            },
            "rating": 4.0,
            "stay_parameters": "Stayed July 2008, traveled as a couple",
            "text": "The concierge- Harry was fab. He helped us to get a table at the Maze grill for lunch and remembered our names when we left the hotel, wishing us a good day out- we were there only for one weekend but felt like regulars- fantastic service!",
            "title": "Good spot in Mayfair",
            "user": "FrequentFrier"
        },
        {
            "date": "August 2, 2008",
            "detail_rating": {
                "business": null,
                "cleanliness": 2.0,
                "desk": null,
                "front_desk": 4.0,
                "location": 5.0,
                "pool": null,
                "restaurant": null,
                "rooms": 1.0,
                "service": 4.0,
                "sleep": null,
                "value": 1.0
            },
            "helpfulness": 1,
            "id": 18554010,
            "likes": {
                "disliked": "\u2014 dirty room",
                "liked": "\u2014 location"
            },
            "rating": 2.0,
            "stay_parameters": "Stayed July 2008, traveled as a couple",
            "text": "The Executive lounge was also great, stocked with the normal soft drinks and an honesty bar but also ad lovely deserts available in the afternoons and home made brownies, flapjacks. Breakfast in the lounge was also more than acceptable. As well as the usual selection of cereals and yoghurts, there as a choice of scrambled egg and bacon and also cheeses, hams, along with pastries, bread etc.",
            "title": "disappointed",
            "user": "vikingirl54"
        },
        {
            "date": "July 11, 2008",
            "detail_rating": {
                "business": 2.0,
                "cleanliness": 4.0,
                "desk": null,
                "front_desk": 3.0,
                "location": 4.0,
                "pool": null,
                "restaurant": null,
                "rooms": 2.0,
                "service": 3.0,
                "sleep": null,
                "value": 1.0
            },
            "helpfulness": null,
            "id": 17775989,
            "likes": {
                "disliked": "\u2014 Quality/Price",
                "liked": "\u2014 Location"
            },
            "rating": 1.0,
            "stay_parameters": "Stayed July 2008, traveled on business",
            "text": "I would definitely come back again to this hotel. It is just off Oxford Street, Selfridges is literally two minutes walk away and the nearest tube is just around the corner!",
            "title": "Ali Baba and the Forty Thieves",
            "user": "MadridSibarita"
        },
        {
            "date": "June 24, 2008",
            "detail_rating": {
                "business": 5.0,
                "cleanliness": 5.0,
                "desk": null,
                "front_desk": 5.0,
                "location": 5.0,
                "pool": null,
                "restaurant": null,
                "rooms": 5.0,
                "service": 5.0,
                "sleep": null,
                "value": 5.0
            },
            "helpfulness": 2,
            "id": 17199882,
            "likes": {
                "disliked": null,
                "liked": null
            },
            "rating": 5.0,
            "stay_parameters": "Stayed June 2008, traveled on business",
            "text": "Stayed here on Marriott points, arrived in the morning, and were not impressed at reception being told we could come back later to stay in an inferior room. However, the supervisor sorted it out - and found an already free room for us, which was great. Our room was fairly small and had thin walls, but was very nicely furnished, and looked out onto the Square. The hotel restaurants seemed overpriced - but the street to the North has some decent eateries not far away. The proximity to Oxford St and Bond St is great. For central London, this is a very quiet and pleasant location. We think this hotel compares well to other hotels in Mayfair where we have stayed - and would come back to have such convenience and peace in London.",
            "title": "fantastic",
            "user": "angelcats"
        },
        {
            "date": "February 24, 2008",
            "detail_rating": {
                "business": null,
                "cleanliness": 5.0,
                "desk": null,
                "front_desk": 3.0,
                "location": 5.0,
                "pool": null,
                "restaurant": null,
                "rooms": 4.0,
                "service": 4.0,
                "sleep": null,
                "value": 4.0
            },
            "helpfulness": 1,
            "id": 13816613,
            "likes": {
                "disliked": "\u2014 small lobby area",
                "liked": "\u2014 location, location, location!"
            },
            "rating": 5.0,
            "stay_parameters": "Stayed August 2007, traveled with family",
            "text": "My husband and I, and our two children (8 and 5) stayed here in the summer. We have stayed at many amazing hotels and I must say, we were pleasantly surprised at the fantastic location this hotel is situated in. We walked everywhere from here - all over London to the Eye, Hamleys, straight through the parks to Buckingham Palace etc. The lobby area is not stunning as it is small, but I would prefer it be the rooms that are the best thing rather than the lobby. The bed was the most comfortable I've ever slept in and everyone was very polite and accomodating. Yes it does seem expensive, but for its location I think it validates it. I wouldn't hesitate to stay here again with the children later this year.",
            "title": "Superb location, can't wait to stay again",
            "user": "Lizzi29"
        },
        {
            "date": "February 7, 2008",
            "detail_rating": {
                "business": 5.0,
                "cleanliness": 4.0,
                "desk": null,
                "front_desk": 5.0,
                "location": 5.0,
                "pool": null,
                "restaurant": null,
                "rooms": 4.0,
                "service": 4.0,
                "sleep": null,
                "value": 3.0
            },
            "helpfulness": 4,
            "id": 13348738,
            "likes": {
                "disliked": "\u2014 Cost",
                "liked": "\u2014 Perfect location"
            },
            "rating": 5.0,
            "stay_parameters": "Stayed February 2006, traveled on business",
            "text": "My husband and I have stayed at the Marriott countless times and are schedulled to do so again in May 2008. It is the Marriott's flagship hotel in London and very expensive but well worth it, particulartly if you are only in London for a short time. It is 2 blocks from Oxford Street, Regent Street and Piccadily i.e Selfridges, Marks and Spencer, Fortnum and Masons and every other conceivable store. Buses run directly from around the corner to places like Harrods and Piccadily Circus, both of which you can easily walk to, although it would be a fair hike. Hyde Park is 3 minutes away, so if you like to jog, it is wonderful.",
            "title": "Expensive but worth every penny",
            "user": "exploraToronto"
        },
        {
            "date": "January 23, 2008",
            "detail_rating": {
                "business": 3.0,
                "cleanliness": 4.0,
                "desk": null,
                "front_desk": 5.0,
                "location": 4.0,
                "pool": null,
                "restaurant": null,
                "rooms": 4.0,
                "service": 5.0,
                "sleep": null,
                "value": 4.0
            },
            "helpfulness": 1,
            "id": 12928651,
            "likes": {
                "disliked": null,
                "liked": "\u2014 the location"
            },
            "rating": 5.0,
            "stay_parameters": "Stayed January 2008, traveled as a couple",
            "text": "My husband and I have found that frequently when you stay at upscale hotels in London, if you are not English, they tend to be very snobby. My husband is Canadian and I am English, so we can judge this fairly accurately. One of the wonderful things about the Marriot is that you never encounter this. It is run in a very efficient North American way. The hotel concierges are very helpful and will gladly organize last minute tickets to shows.",
            "title": "Great hotel!",
            "user": "LBsandiego"
        },
        {
            "date": "January 23, 2008",
            "detail_rating": {
                "business": null,
                "cleanliness": 5.0,
                "desk": null,
                "front_desk": 5.0,
                "location": 5.0,
                "pool": null,
                "restaurant": null,
                "rooms": 3.0,
                "service": 5.0,
                "sleep": null,
                "value": 2.0
            },
            "helpfulness": 1,
            "id": 12918692,
            "likes": {
                "disliked": "\u2014 The value for money",
                "liked": "\u2014 The location"
            },
            "rating": 3.0,
            "stay_parameters": "Stayed January 2008, traveled on business",
            "text": "The Marriot has been renovated since our last stay. Previously, the bathrooms were very luxurious and a joy given that bathrooms in most U.K hotels are not up to North American standards. So I am presuming that they still are.",
            "title": "Just okay",
            "user": "FloggerLiverpool"
        },
        {
            "date": "December 30, 2007",
            "detail_rating": {
                "business": 5.0,
                "cleanliness": 5.0,
                "desk": null,
                "front_desk": 5.0,
                "location": 5.0,
                "pool": null,
                "restaurant": null,
                "rooms": 3.0,
                "service": 5.0,
                "sleep": null,
                "value": 2.0
            },
            "helpfulness": 2,
            "id": 12081382,
            "likes": {
                "disliked": "\u2014 The price",
                "liked": "\u2014 Afternoon tea"
            },
            "rating": 4.0,
            "stay_parameters": "Stayed December 2006, traveled as a couple",
            "text": "The following are the negative things I have to say about the hotel: The cost of breakfast is crazy but there are many places close to the hotel to pick up something cheaper to eat. The lobby can be quite busy in the evenings, as the hotels has numerous functions but we have never bee disturbed by the noise. Because of the cost of the hotel, if I am in London alone, as there is no single rate, I usually stay at a cheaper hotel.",
            "title": "Poor price/value",
            "user": "Pramstroker"
        },
        {
            "date": "April 25, 2007",
            "detail_rating": {
                "business": null,
                "cleanliness": null,
                "desk": null,
                "location": null,
                "pool": null,
                "restaurant": null,
                "rooms": null,
                "service": null,
                "sleep": null,
                "value": null
            },
            "helpfulness": 1,
            "id": 7431966,
            "likes": {
                "disliked": null,
                "liked": null
            },
            "rating": 5.0,
            "stay_parameters": null,
            "text": "We stayed at this hotel over Easter break '07 and found it very comfortable for a family of four. The location was excellent. The hotel was very clean and the staff was attentive. The restaurant is VERY VERY expensive (breakfast buffet $48 per person), so eat off-site. I paid about $100 extra per night to have access to the executive lounge for continental breakfast and snacks. I'm not sure that it was worth that much money but we did utilize it. We had the King executive room and our children slept on the pull-out sofa which was made-up for us every night during turn-down service. The sofa mattress was not that great and the executive lounge was not always well-stocked, but otherwise we did not have any complaints.",
            "title": "Very Nice",
            "user": "LDHAVL"
        },
        {
            "date": "April 24, 2007",
            "detail_rating": {
                "business": 5.0,
                "cleanliness": 5.0,
                "desk": null,
                "front_desk": 5.0,
                "location": 5.0,
                "pool": null,
                "restaurant": null,
                "rooms": 5.0,
                "service": 5.0,
                "sleep": null,
                "value": 3.0
            },
            "helpfulness": 1,
            "id": 7429362,
            "likes": {
                "disliked": "\u2014 Price",
                "liked": "\u2014 Rooms/locations"
            },
            "rating": 5.0,
            "stay_parameters": "Stayed April 2007, traveled with family",
            "text": "Stayed here for 5 nights, using my Marriott points. Great location, close to great shopping, good places to eat and close to transportation to Bond Street Tube and all sites. My room on the third floor was modern, small, but very comfortable. Bed was comfortable, bathroom was very small, but again no problem. The hotel",
            "title": "Great location, great hotel, but you pay for it",
            "user": "RJMGreenwich"
        },
        {
            "date": "April 24, 2007",
            "detail_rating": {
                "business": null,
                "cleanliness": 3.0,
                "desk": null,
                "front_desk": 3.0,
                "location": 5.0,
                "pool": null,
                "restaurant": null,
                "rooms": 4.0,
                "service": 3.0,
                "sleep": null,
                "value": 2.0
            },
            "helpfulness": 4,
            "id": 7427423,
            "likes": {
                "disliked": "\u2014 the fact that the shower did not drain",
                "liked": "\u2014 location"
            },
            "rating": 3.0,
            "stay_parameters": "Stayed April 2007",
            "text": "is great, very, very expensive (U.S. $500 + per night), so great place to use points. Watch out for all other charges, like internet charge, phone charge (by the minute) and food charges. At the current",
            "title": "good location, maybe next time stay elsewhere",
            "user": "KatieDavis"
        },
        {
            "date": "April 16, 2007",
            "detail_rating": {
                "business": 5.0,
                "cleanliness": 5.0,
                "desk": null,
                "front_desk": 4.0,
                "location": 4.0,
                "pool": null,
                "restaurant": null,
                "rooms": 5.0,
                "service": 5.0,
                "sleep": null,
                "value": 4.0
            },
            "helpfulness": 2,
            "id": 7377722,
            "likes": {
                "disliked": "\u2014 no pool",
                "liked": "\u2014 Location and restaurants w/i 2 minutes of hotel"
            },
            "rating": 5.0,
            "stay_parameters": "Stayed April 2007, traveled on business",
            "text": "2 to 1 pound to dollar rate, hotel in dollars in not a great value for the dollar paid.",
            "title": "This is a very nice hotel on a great street",
            "user": "frequent_fam_travel"
        },
        {
            "date": "April 9, 2007",
            "detail_rating": {
                "business": 4.0,
                "cleanliness": 4.0,
                "desk": null,
                "front_desk": 5.0,
                "location": 5.0,
                "pool": null,
                "restaurant": null,
                "rooms": 3.0,
                "service": 4.0,
                "sleep": null,
                "value": null
            },
            "helpfulness": 5,
            "id": 7301382,
            "likes": {
                "disliked": "\u2014 Small rooms",
                "liked": "\u2014 Location"
            },
            "rating": 3.0,
            "stay_parameters": "Stayed April 2007, traveled as a couple",
            "text": "The location is wonderful. Couple second walk to the tube, good food in walking distance, and great shopping is all around you. You are very central to almost everything, seems to be a safe part of town. (I hear London is actually not so safe these days, surprised me). I know rooms in London are pricey, but for $500/night, I was a little dissappointed. Breakfast was not included. The coffee kettle in the room did not work. The shower drain did not drain so we had to call someone, but by the time you figure that out, you're usually in the shower. The beds are very very comfy though. Next time I will probably stay at something with a little more character.",
            "title": "Well Appointed but Small Rooms",
            "user": "USExPatinUK"
        }
    ],
    "slim_ranking": 0.230697674419,
    "stars": 4,
    "tripadvisor": {
        "VISITED": false,
        "country_name": null,
        "locality": null,
        "pic_link": null,
        "street_address": null
    },
    "user_rating": 4.0,
    "variance": {
        "average": 86,
        "excellent": 281,
        "poor": 31,
        "terrible": 21,
        "very good": 229
    }
}