{
    "aka": null,
    "description": null,
    "detail_rating": {
        "cleanliness": null,
        "location": null,
        "rooms": null,
        "service": null,
        "sleep": null,
        "value": null
    },
    "location": {
        "city": null,
        "continent": "Europe",
        "country": "Turkey",
        "proposed_city": "Gaziantep",
        "province": null,
        "region": null
    },
    "name": "Hotel Ibis Gaziantep",
    "places": {
        "aka": [],
        "hotel_description": [],
        "hotel_name": [
            "Gaziantep"
        ]
    },
    "review_count": 88,
    "review_count_current": 8,
    "reviews": [
        {
            "date": "October 15, 2011",
            "detail_rating": {
                "business": null,
                "cleanliness": 5.0,
                "desk": null,
                "location": 5.0,
                "pool": null,
                "restaurant": null,
                "rooms": 5.0,
                "service": 5.0,
                "sleep": 5.0,
                "value": 5.0
            },
            "helpfulness": 1,
            "id": 119328942,
            "likes": {
                "disliked": null,
                "liked": null
            },
            "rating": 5.0,
            "stay_parameters": "Stayed October 2011, traveled solo",
            "text": "Great location, friendly cordial staff, very clean and comfortable beds. Close to Gaziantep Museum, Zeugma Mosaic Museum and Gaziantep Citadel.",
            "title": "Great price and comfortable",
            "user": "scott s"
        },
        {
            "date": "October 1, 2011",
            "detail_rating": {
                "business": null,
                "cleanliness": 5.0,
                "desk": null,
                "location": 3.0,
                "pool": null,
                "restaurant": null,
                "rooms": 3.0,
                "service": 4.0,
                "sleep": 4.0,
                "value": 4.0
            },
            "helpfulness": null,
            "id": 118826832,
            "likes": {
                "disliked": null,
                "liked": null
            },
            "rating": 4.0,
            "stay_parameters": "Stayed June 2011, traveled on business",
            "text": "Ibis style , very well managed.",
            "title": "Nice and Clean!",
            "user": "FrancescoDallolio"
        },
        {
            "date": "August 31, 2011",
            "detail_rating": {
                "business": null,
                "cleanliness": 5.0,
                "desk": null,
                "location": null,
                "pool": null,
                "restaurant": null,
                "rooms": null,
                "service": 4.0,
                "sleep": 5.0,
                "value": 5.0
            },
            "helpfulness": null,
            "id": 117479073,
            "likes": {
                "disliked": null,
                "liked": null
            },
            "rating": 5.0,
            "stay_parameters": "Stayed August 2011, traveled as a couple",
            "text": "cleaning and services at the level of 5 stars.",
            "title": "Great value, Comfortable stay",
            "user": "AmanDaAman"
        },
        {
            "date": "June 16, 2011",
            "detail_rating": {
                "business": null,
                "cleanliness": 5.0,
                "desk": null,
                "location": null,
                "pool": null,
                "restaurant": null,
                "rooms": null,
                "service": 5.0,
                "sleep": 5.0,
                "value": 5.0
            },
            "helpfulness": null,
            "id": 113864989,
            "likes": {
                "disliked": null,
                "liked": null
            },
            "rating": 4.0,
            "stay_parameters": "Stayed June 2011, traveled solo",
            "text": "quite and relax position , very near to the center in a safety area.",
            "title": "Ibis at its best affordable!",
            "user": "csant"
        },
        {
            "date": "June 6, 2011",
            "detail_rating": {
                "business": null,
                "cleanliness": 5.0,
                "desk": null,
                "location": null,
                "pool": null,
                "restaurant": null,
                "rooms": null,
                "service": 5.0,
                "sleep": 4.0,
                "value": 5.0
            },
            "helpfulness": 1,
            "id": 111749073,
            "likes": {
                "disliked": null,
                "liked": null
            },
            "rating": 4.0,
            "stay_parameters": "Stayed May 2011, traveled as a couple",
            "text": "We had been to Gaziantep before and wanted to return to the Yesemek Otel. But their website and email are no longer working so we chose to stay at the Ibis. The Ibis is well located and convenient - especially to the new mosaic museum. We arrived on a 1:30am flight -so their 24 hour service desk was great. We were able to stay on a non smoking floor. The hotel is typical Ibis - so not as much local color as at the Yesemek - and the breakfast was just spectacular with lots of choices. Would definitely stay there again.",
            "title": "Great Value and Convenience - would stay there again",
            "user": "MaryCFrance"
        },
        {
            "date": "December 10, 2010",
            "detail_rating": {
                "business": null,
                "cleanliness": 5.0,
                "desk": null,
                "location": 3.0,
                "pool": null,
                "restaurant": null,
                "rooms": 3.0,
                "service": 3.0,
                "sleep": 4.0,
                "value": 4.0
            },
            "helpfulness": 1,
            "id": 89477965,
            "likes": {
                "disliked": null,
                "liked": null
            },
            "rating": 4.0,
            "stay_parameters": "Stayed November 2010, traveled with family",
            "text": "We always visit gaziantep at least once a month and after trying other hotels, Ibis gave us the best place to stay in when we are visiting this city.",
            "title": "Perfect Hop of Hop On",
            "user": "wk747"
        },
        {
            "date": "November 27, 2010",
            "detail_rating": {
                "business": null,
                "cleanliness": 5.0,
                "desk": null,
                "location": 4.0,
                "pool": null,
                "restaurant": null,
                "rooms": 4.0,
                "service": 4.0,
                "sleep": 4.0,
                "value": 4.0
            },
            "helpfulness": null,
            "id": 88361672,
            "likes": {
                "disliked": null,
                "liked": null
            },
            "rating": 4.0,
            "stay_parameters": "Stayed July 2010, traveled solo",
            "text": "check in was perfectly done. they gave us a non smoking floor and offered us a baby bed.",
            "title": "Very comfortable",
            "user": "ambadkar"
        },
        {
            "date": "September 20, 2010",
            "detail_rating": {
                "business": null,
                "cleanliness": 5.0,
                "desk": null,
                "location": 4.0,
                "pool": null,
                "restaurant": null,
                "rooms": 5.0,
                "service": 5.0,
                "sleep": 5.0,
                "value": 5.0
            },
            "helpfulness": null,
            "id": 80336256,
            "likes": {
                "disliked": null,
                "liked": null
            },
            "rating": 4.0,
            "stay_parameters": "Stayed September 2010, traveled solo",
            "text": "free parking is a plus for this hotel, its safe too.",
            "title": "exceptionally friendly, clean and cool.",
            "user": "Shostakovitch"
        }
    ],
    "slim_ranking": 0.0869565217391,
    "stars": 3,
    "tripadvisor": {
        "VISITED": false,
        "country_name": null,
        "locality": null,
        "pic_link": null,
        "street_address": null
    },
    "user_rating": 4.0,
    "variance": {
        "average": 12,
        "excellent": 26,
        "poor": 4,
        "terrible": 2,
        "very good": 44
    }
}