{
    "aka": "Casamagna Marriott Puerto Vallarta Resort And Spa",
    "description": null,
    "detail_rating": {
        "cleanliness": 4.5,
        "location": 4.5,
        "rooms": 4.5,
        "service": 4.5,
        "sleep": 4.5,
        "value": 4.5
    },
    "location": {
        "city": "Puerto Vallarta",
        "continent": null,
        "country": "Mexico",
        "proposed_city": "Magna",
        "province": null,
        "region": null
    },
    "name": "CasaMagna Marriott Puerto Vallarta Resort & Spa",
    "places": {
        "aka": [],
        "hotel_description": [],
        "hotel_name": [
            "Magna"
        ]
    },
    "review_count": 1075,
    "review_count_current": 20,
    "reviews": [
        {
            "date": "May 12, 2008",
            "detail_rating": {
                "business": null,
                "cleanliness": 2.0,
                "desk": null,
                "front_desk": 3.0,
                "location": 5.0,
                "pool": null,
                "restaurant": null,
                "rooms": 2.0,
                "service": 2.0,
                "sleep": null,
                "value": 2.0
            },
            "helpfulness": 2,
            "id": 15963754,
            "likes": {
                "disliked": "\u2014 Lots and lots of children, service too spotty for what you pay",
                "liked": "\u2014 Location, Food"
            },
            "rating": 3.0,
            "stay_parameters": "Stayed May 2008, traveled as a couple",
            "text": "We just returned from our stay here and there are definitely some postives and negatives I thought I would share.",
            "title": "The Good and the Bad",
            "user": "nic326"
        },
        {
            "date": "May 11, 2008",
            "detail_rating": {
                "business": null,
                "cleanliness": 5.0,
                "desk": null,
                "front_desk": 5.0,
                "location": 5.0,
                "pool": null,
                "restaurant": null,
                "rooms": 4.0,
                "service": 4.0,
                "sleep": null,
                "value": 4.0
            },
            "helpfulness": 2,
            "id": 15932964,
            "likes": {
                "disliked": "\u2014 Conference groups",
                "liked": "\u2014 Location"
            },
            "rating": 4.0,
            "stay_parameters": "Stayed April 2008, traveled as a couple",
            "text": "Positives:",
            "title": "Loved CasaMagna",
            "user": "npr_junkie77"
        },
        {
            "date": "May 6, 2008",
            "detail_rating": {
                "business": 4.0,
                "cleanliness": 4.0,
                "desk": null,
                "front_desk": 4.0,
                "location": 4.0,
                "pool": null,
                "restaurant": null,
                "rooms": 3.0,
                "service": 5.0,
                "sleep": null,
                "value": 3.0
            },
            "helpfulness": 2,
            "id": 15729876,
            "likes": {
                "disliked": "\u2014 The expensive/weak drinks and mediocre food",
                "liked": "\u2014 The staff and the pool"
            },
            "rating": 3.0,
            "stay_parameters": "Stayed April 2008",
            "text": "Location - great location, not right downtown but close enough that the $8 cab ride made a trip to town possible. Very expensive cab ride from the airport though ($18!) There are different fares depending on which zone you travel to but coming from the airport is the worst. And the hotel is only a mile away. The property is located right on the beach but I will have more on the beach to follow...",
            "title": "Friendliest staff",
            "user": "bookwormteacher"
        },
        {
            "date": "April 17, 2008",
            "detail_rating": {
                "business": 5.0,
                "cleanliness": 5.0,
                "desk": null,
                "front_desk": 5.0,
                "location": 5.0,
                "pool": null,
                "restaurant": null,
                "rooms": 5.0,
                "service": 5.0,
                "sleep": null,
                "value": 5.0
            },
            "helpfulness": 5,
            "id": 15104320,
            "likes": {
                "disliked": "\u2014 Nothing",
                "liked": "\u2014 Hotel Grounds"
            },
            "rating": 5.0,
            "stay_parameters": "Stayed April 2008, traveled as a couple",
            "text": "Food - the restaurants here are quite good. Good sized portions and the food tasted great. Las Casitas was a great place to have a sunset dinner and cocktails. The sushi restaurant was good as well. We watched a few basketball playoff games in Champions (their bar) but felt like we were in a sportsbar back home.",
            "title": "PERFECT IN EVERY WAY",
            "user": "Ozkay929"
        },
        {
            "date": "April 14, 2008",
            "detail_rating": {
                "business": 2.0,
                "cleanliness": 4.0,
                "desk": null,
                "front_desk": 2.0,
                "location": 5.0,
                "pool": null,
                "restaurant": null,
                "rooms": 4.0,
                "service": 3.0,
                "sleep": null,
                "value": 4.0
            },
            "helpfulness": 3,
            "id": 15017130,
            "likes": {
                "disliked": null,
                "liked": null
            },
            "rating": 4.0,
            "stay_parameters": "Stayed April 2008, traveled with friends",
            "text": "Negatives:",
            "title": "Great place to stay, spa was not good...",
            "user": "tjcheerio"
        },
        {
            "date": "May 27, 2008",
            "detail_rating": {
                "business": null,
                "cleanliness": 4.0,
                "desk": null,
                "front_desk": 5.0,
                "location": 5.0,
                "pool": null,
                "restaurant": null,
                "rooms": 4.0,
                "service": 5.0,
                "sleep": null,
                "value": 3.0
            },
            "helpfulness": 1,
            "id": 16443289,
            "likes": {
                "disliked": null,
                "liked": "\u2014 The location"
            },
            "rating": 5.0,
            "stay_parameters": "Stayed April 2007, traveled as a couple",
            "text": "We stayed for 12 nights at the CasaMagna and thoroughly enjoyed our stay, the hotel staff were freindly and helpful. The room was classed as garden view but you could sea the Ocean. The rooms although faded are spacious and very clean, with a huge comfortable bed and daily maid service.",
            "title": "Excellent location, excellent hotel",
            "user": "Bertie06"
        },
        {
            "date": "May 23, 2008",
            "detail_rating": {
                "business": 5.0,
                "cleanliness": 5.0,
                "desk": null,
                "front_desk": 5.0,
                "location": 5.0,
                "pool": null,
                "restaurant": null,
                "rooms": 5.0,
                "service": 5.0,
                "sleep": null,
                "value": 5.0
            },
            "helpfulness": 4,
            "id": 16350458,
            "likes": {
                "disliked": "\u2014 NA",
                "liked": "\u2014 EVERYTHING! The whole facility was amazing!"
            },
            "rating": 5.0,
            "stay_parameters": "Stayed May 2008, traveled as a couple",
            "text": "The air conditioning was noisy, but we were lucky enough not to really need it on.",
            "title": "BEST Resort in PV!",
            "user": "JF-SLO"
        },
        {
            "date": "May 20, 2008",
            "detail_rating": {
                "business": 5.0,
                "cleanliness": 5.0,
                "desk": null,
                "front_desk": 4.0,
                "location": 5.0,
                "pool": null,
                "restaurant": null,
                "rooms": 4.0,
                "service": 5.0,
                "sleep": null,
                "value": 5.0
            },
            "helpfulness": 2,
            "id": 16240998,
            "likes": {
                "disliked": null,
                "liked": "\u2014 Location, food, atmosphere"
            },
            "rating": 5.0,
            "stay_parameters": "Stayed May 2008, traveled as a couple",
            "text": "We spent most days on the beach, and a polite no thankyou was enough to send the vendors on thier way.",
            "title": "Excellent hotel, excellent location",
            "user": "RL114"
        },
        {
            "date": "May 15, 2008",
            "detail_rating": {
                "business": 5.0,
                "cleanliness": 5.0,
                "desk": null,
                "front_desk": 5.0,
                "location": 5.0,
                "pool": null,
                "restaurant": null,
                "rooms": 5.0,
                "service": 5.0,
                "sleep": null,
                "value": 5.0
            },
            "helpfulness": 3,
            "id": 16068752,
            "likes": {
                "disliked": "\u2014 nothing.",
                "liked": "\u2014 Outstanding Service and Dream Sleep Beds."
            },
            "rating": 5.0,
            "stay_parameters": "Stayed May 2008",
            "text": "The hotel was very busy when we stayed, but we never had a problem with the service,or the cleanliness of the grounds and public areas. We tended to have lunch La Casitas, which served large portions at reasonable value. Most nights (and sometimes for breakfast) we dined at the marina, where there is an amazing choice of restuarants and we never had a bad meal. The lighthouse pub is fantastic for watching the sun set.",
            "title": "Another Wonderful Time at the Marriott!",
            "user": "mecindo"
        },
        {
            "date": "May 13, 2008",
            "detail_rating": {
                "business": 3.0,
                "cleanliness": 3.0,
                "desk": null,
                "front_desk": 2.0,
                "location": 4.0,
                "pool": null,
                "restaurant": null,
                "rooms": 4.0,
                "service": 4.0,
                "sleep": null,
                "value": 4.0
            },
            "helpfulness": 2,
            "id": 16002825,
            "likes": {
                "disliked": null,
                "liked": null
            },
            "rating": 5.0,
            "stay_parameters": "Stayed May 2008, traveled on business",
            "text": "Downtown PV is well worth a visit for the buzzing vibrant atmosphere,.",
            "title": "awesome service and what a beauty!",
            "user": "MissLee007"
        },
        {
            "date": "June 3, 2008",
            "detail_rating": {
                "business": 4.0,
                "cleanliness": 4.0,
                "desk": null,
                "front_desk": 5.0,
                "location": 4.0,
                "pool": null,
                "restaurant": null,
                "rooms": 4.0,
                "service": 4.0,
                "sleep": null,
                "value": 5.0
            },
            "helpfulness": 2,
            "id": 16645884,
            "likes": {
                "disliked": null,
                "liked": null
            },
            "rating": 4.0,
            "stay_parameters": "Stayed May 2008",
            "text": "We stayed here last week. The property is beautiful. The staff is friendly. It is located in the marina area which has some shops and restaurants nearby.",
            "title": "Nice property, but a few issues...",
            "user": "jimglobe"
        },
        {
            "date": "June 3, 2008",
            "detail_rating": {
                "business": 3.0,
                "cleanliness": 4.0,
                "desk": null,
                "front_desk": 5.0,
                "location": 3.0,
                "pool": null,
                "restaurant": null,
                "rooms": 4.0,
                "service": 5.0,
                "sleep": null,
                "value": 3.0
            },
            "helpfulness": 3,
            "id": 16633241,
            "likes": {
                "disliked": "\u2014 nickel and diming",
                "liked": "\u2014 great staff, great food, nice rooms"
            },
            "rating": 3.0,
            "stay_parameters": "Stayed May 2008",
            "text": "We had a few issues:",
            "title": "Marriott CasaMagna: the Ups and Downs",
            "user": "yves1019"
        },
        {
            "date": "June 2, 2008",
            "detail_rating": {
                "business": 3.0,
                "cleanliness": 5.0,
                "desk": null,
                "front_desk": 5.0,
                "location": 5.0,
                "pool": null,
                "restaurant": null,
                "rooms": 5.0,
                "service": 5.0,
                "sleep": null,
                "value": 4.0
            },
            "helpfulness": null,
            "id": 16620061,
            "likes": {
                "disliked": "\u2014 expensive internet access",
                "liked": "\u2014 Superb pool and beach scene"
            },
            "rating": 5.0,
            "stay_parameters": "Stayed March 2008, traveled as a couple",
            "text": "1) HUGE roach (3 inches long) in the bathroom one day",
            "title": "Fantastic property, but expensive",
            "user": "geezer715"
        },
        {
            "date": "May 28, 2008",
            "detail_rating": {
                "business": null,
                "cleanliness": 5.0,
                "desk": null,
                "front_desk": 5.0,
                "location": 5.0,
                "pool": null,
                "restaurant": null,
                "rooms": 4.0,
                "service": 4.0,
                "sleep": null,
                "value": 5.0
            },
            "helpfulness": 6,
            "id": 16468561,
            "likes": {
                "disliked": "\u2014 Not the Hotel's fault, but the brown, murky water was a turn-off",
                "liked": "\u2014 Upscale Marriott with spacious rooms, great pool and beach, pretty grounds and great fitness room"
            },
            "rating": 5.0,
            "stay_parameters": "Stayed May 2008, traveled as a couple",
            "text": "2) Terrible smell coming in the air vent one night. We complained, and they said something like they were cleaing out the stacks. The smell was terrible for about 30 minutes.",
            "title": "Great Hotel, Great Destination",
            "user": "JR17"
        },
        {
            "date": "May 27, 2008",
            "detail_rating": {
                "business": null,
                "cleanliness": 2.0,
                "desk": null,
                "front_desk": 4.0,
                "location": 4.0,
                "pool": null,
                "restaurant": null,
                "rooms": 3.0,
                "service": 4.0,
                "sleep": null,
                "value": 3.0
            },
            "helpfulness": 2,
            "id": 16448210,
            "likes": {
                "disliked": "\u2014 Lounge chairs at pool, towels and bed linen",
                "liked": "\u2014 The hotel property"
            },
            "rating": 3.0,
            "stay_parameters": "Stayed May 2008, traveled with family",
            "text": "3) You have to tell them to use good alcohol at the pool or they use cheap stuff and the drinks are bad. If you tell them to use the good stuff the drinks are fine.",
            "title": "Very nice hotel but issues with cleanliness at pool and with linen and towels",
            "user": "alexrob"
        },
        {
            "date": "April 9, 2008",
            "detail_rating": {
                "business": 4.0,
                "cleanliness": 5.0,
                "desk": null,
                "front_desk": 5.0,
                "location": 4.0,
                "pool": null,
                "restaurant": null,
                "rooms": 5.0,
                "service": 5.0,
                "sleep": null,
                "value": 5.0
            },
            "helpfulness": 5,
            "id": 14926417,
            "likes": {
                "disliked": null,
                "liked": "\u2014 pool, rooms, beach, food"
            },
            "rating": 5.0,
            "stay_parameters": "Stayed February 2008, traveled with friends",
            "text": "Wow! is the best way to sum up our experience at the Marriott! There was a group of 6 of us who stayed from Feb.17 to the 24th. We had booked garden view rooms because we didn't want to spend the extra for ocean view. When we got to our rooms (which were adjoining and that was great!) we walked out onto our balcony and we could see the ocean! We could see the ocean while laying in bed!",
            "title": "Amazing!!",
            "user": "samfina"
        },
        {
            "date": "April 8, 2008",
            "detail_rating": {
                "business": 3.0,
                "cleanliness": 4.0,
                "desk": null,
                "front_desk": 4.0,
                "location": 3.0,
                "pool": null,
                "restaurant": null,
                "rooms": 4.0,
                "service": 4.0,
                "sleep": null,
                "value": 4.0
            },
            "helpfulness": 1,
            "id": 14892616,
            "likes": {
                "disliked": null,
                "liked": "\u2014 The view/grounds"
            },
            "rating": 3.0,
            "stay_parameters": "Stayed March 2007, traveled with family",
            "text": "The pool area was very nice, great pool, the infinity edge was gorgeous, it looked like the pool went out into the ocean! The one bad thing was that we had to get up around 7 each morning to put towels on the chairs that we wanted. Service around the pool depended on where you were sitting, on one side of the pool we didn't have so great of service, on the other side it was much better. The water aerobics in the pool was very fun! The instructor was very funny. The food from the poolside restaurant was excellent and plentiful. We usually shared one order between two people.",
            "title": "Nice Resort",
            "user": "cewltrvl"
        },
        {
            "date": "March 31, 2008",
            "detail_rating": {
                "business": 3.0,
                "cleanliness": 5.0,
                "desk": null,
                "front_desk": 4.0,
                "location": 5.0,
                "pool": null,
                "restaurant": null,
                "rooms": 4.0,
                "service": 5.0,
                "sleep": null,
                "value": 5.0
            },
            "helpfulness": 4,
            "id": 14691933,
            "likes": {
                "disliked": null,
                "liked": "\u2014 Excellent customer service"
            },
            "rating": 5.0,
            "stay_parameters": "Stayed March 2008, traveled with family",
            "text": "The beach in front of the hotel was very nice. A little rocky, but mostly very soft sand. You can also walk very far down the beach from the hotel. I have stayed at a hotel closer to downtown and you cannot walk down the beach, here you could walk for a long time. There were only a few beach vendors, and a simple no gracias would send them on their way, they were not very pushy.",
            "title": "An Excellent Choice",
            "user": "DD2Go"
        },
        {
            "date": "March 28, 2008",
            "detail_rating": {
                "business": null,
                "cleanliness": 4.0,
                "desk": null,
                "front_desk": 4.0,
                "location": 4.0,
                "pool": null,
                "restaurant": null,
                "rooms": 4.0,
                "service": 4.0,
                "sleep": null,
                "value": 4.0
            },
            "helpfulness": 3,
            "id": 14618862,
            "likes": {
                "disliked": "\u2014 Not a stylish hotel, it is more traditional style than contemporary architecture",
                "liked": "\u2014 Food, service, AC, convenience of location"
            },
            "rating": 4.0,
            "stay_parameters": "Stayed May 2007, traveled with family",
            "text": "The maid always did a great job on our room, we tipped about 3 or 4 dollars a day. The turn down service was nice, we got fresh towels in the evening too. The grounds at the hotel were beautiful!!! Very well maintained and absolutely gorgeous!",
            "title": "Wonderful food, service and air conditioning",
            "user": "christineandjeff"
        },
        {
            "date": "March 27, 2008",
            "detail_rating": {
                "business": null,
                "cleanliness": null,
                "desk": null,
                "location": null,
                "pool": null,
                "restaurant": null,
                "rooms": null,
                "service": null,
                "sleep": null,
                "value": null
            },
            "helpfulness": 4,
            "id": 14586806,
            "likes": {
                "disliked": null,
                "liked": null
            },
            "rating": 2.0,
            "stay_parameters": null,
            "text": "The staff were always very friendly, it was nice to return at the end of the day and have the bellmen say \"Welcome home\", it was a nice touch. We used the concierge a couple of times for recommendations and to make us dinner reservations and he was great!",
            "title": "Buyer Beware",
            "user": "nan2St_Louis"
        }
    ],
    "slim_ranking": 0.103448275862,
    "stars": 4,
    "tripadvisor": {
        "VISITED": false,
        "country_name": null,
        "locality": null,
        "pic_link": null,
        "street_address": null
    },
    "user_rating": 4.5,
    "variance": {
        "average": 95,
        "excellent": 566,
        "poor": 40,
        "terrible": 19,
        "very good": 355
    }
}