{
    "aka": "Protea Hotel Cape Town",
    "description": "Situated in the urban landscape of Greenpoint, one of Cape Town\u2019s trendiest suburbs, The Protea Hotel Victoria Junction\u2019s location offers easy access to major Cape Town tourist attractions as well as the CBD, the Cape Town International Convention Centre and the V&A Waterfront for GUESTS staying on business. Our in house, Connexxion Restaurant is the perfect option for guests on the go. The breakfast buffet remains of international standard with a huge variety of items to choose from and for your convenience \u2013 breakfast hours over weekends are extended so you can sleep in! The Hotel provides a new contemporary urban lifestyle where you can live, work and play within a 5 kilometre radius. Walk to the Cape Quarter Lifestyle Centre and the Greenpoint Park or cycle on the new pedestrian and cycle ways. Catch a MyCity bus or the red Cape Town Tourism bus to visit Clifton, Camps Bay beach or as far as Simon\u2019s Town and Constantia! All the bedrooms feature sleek, modern design that offer environmentally friendly lighting, water-saving rain showers and energy efficient entertainment options like the Bravia LCD screens and iPod docking stations. International adapter installations also improve services to our International GUESTS. Protea Hotel Victoria Junction - a contemporary urban lifestyle!",
    "detail_rating": {
        "cleanliness": null,
        "location": null,
        "rooms": null,
        "service": null,
        "sleep": null,
        "value": null
    },
    "location": {
        "city": null,
        "continent": "Africa",
        "country": "South Africa",
        "proposed_city": "Victoria",
        "province": null,
        "region": null
    },
    "name": "Protea Hotel Victoria Junction",
    "places": {
        "aka": [],
        "hotel_description": [
            "Victoria",
            "Clifton",
            "Bay"
        ],
        "hotel_name": [
            "Victoria"
        ]
    },
    "review_count": 182,
    "review_count_current": 12,
    "reviews": [
        {
            "date": "September 15, 2011",
            "detail_rating": {
                "business": null,
                "cleanliness": null,
                "desk": null,
                "location": 5.0,
                "pool": null,
                "restaurant": null,
                "rooms": 5.0,
                "service": 5.0,
                "sleep": null,
                "value": 5.0
            },
            "helpfulness": 1,
            "id": 118173014,
            "likes": {
                "disliked": null,
                "liked": null
            },
            "rating": 5.0,
            "stay_parameters": "Stayed July 2011, traveled with friends",
            "text": "I travel often and found this hotel to be one of the best regarding service. Everyone on staff went overboard to help. The service at breakfast is fantastic, and there is a vast selection of food offered. I was in awe when I walked down the stairs from the first floor to the breakfast room to see a view that was like no other. I could have stayed in a single spot all day. I am eager to return to Capetown and when I do, I plan to stay in this hotel. Proteas overall are a fantastic chain!",
            "title": "Clean, Fantastic Service and Magnificent View",
            "user": "jms31880"
        },
        {
            "date": "September 7, 2011",
            "detail_rating": {
                "business": null,
                "cleanliness": 5.0,
                "desk": null,
                "location": null,
                "pool": null,
                "restaurant": null,
                "rooms": null,
                "service": 5.0,
                "sleep": 5.0,
                "value": 5.0
            },
            "helpfulness": null,
            "id": 117777265,
            "likes": {
                "disliked": null,
                "liked": null
            },
            "rating": 5.0,
            "stay_parameters": "Stayed March 2011, traveled on business",
            "text": "Very comfortable stay, rooms are spacious, breakfast is good. Staff is amazing. Great service. Location is superb. 10 min walk from waterfront.",
            "title": "Wonderful hotel and service",
            "user": "manish3859"
        },
        {
            "date": "October 10, 2011",
            "detail_rating": {
                "business": null,
                "cleanliness": 5.0,
                "desk": null,
                "location": 4.0,
                "pool": null,
                "restaurant": null,
                "rooms": 5.0,
                "service": 5.0,
                "sleep": 4.0,
                "value": 5.0
            },
            "helpfulness": 2,
            "id": 119148535,
            "likes": {
                "disliked": null,
                "liked": null
            },
            "rating": 5.0,
            "stay_parameters": "Stayed October 2011, traveled with friends",
            "text": "I rate very highly this recently upgraded hotel. The staff were helpful , attentive and they were determined to make the stay an enjoyable one. The rooms were spacious and clean and the room safe was an added bonus. Breakfasts were were excellent and the a la carte meals were of a high standard. Nothing was too much trouble. Most people tried the local restaurants. The restaurant had a little bit of a canteen feel - but do not let that fool you as the food is top quality. The Hotel is 15 minutes good walk to the Cape Town Waterfront. Taxis cost about 40 -50 Rand. Make sure you take a metered taxi - there unregistered taxis claiming to be the hotel shuttle. Ignor them as they overcharge.",
            "title": "A Recommended Stop",
            "user": "JohnHull73"
        },
        {
            "date": "October 7, 2011",
            "detail_rating": {
                "business": null,
                "cleanliness": 4.0,
                "desk": null,
                "location": 3.0,
                "pool": null,
                "restaurant": null,
                "rooms": 4.0,
                "service": 4.0,
                "sleep": 3.0,
                "value": 4.0
            },
            "helpfulness": null,
            "id": 119044130,
            "likes": {
                "disliked": null,
                "liked": null
            },
            "rating": 4.0,
            "stay_parameters": "Stayed October 2011, traveled with friends",
            "text": "I think everyone was delighted with the hotel",
            "title": "Good price quality accommodation",
            "user": "bentwhit"
        },
        {
            "date": "October 5, 2011",
            "detail_rating": {
                "business": null,
                "cleanliness": 5.0,
                "desk": null,
                "location": 5.0,
                "pool": null,
                "restaurant": null,
                "rooms": 4.0,
                "service": 4.0,
                "sleep": 5.0,
                "value": 5.0
            },
            "helpfulness": null,
            "id": 118955899,
            "likes": {
                "disliked": null,
                "liked": null
            },
            "rating": 4.0,
            "stay_parameters": "Stayed September 2011, traveled as a couple",
            "text": "First rate rooms if somewhat masculine style but good facilities with nice restaurant facilities, staff very friendly. Close enough to walk to city and or Victoria and Alfred docks.",
            "title": "Newly refurbished hotel offers great value!",
            "user": "DHC8"
        },
        {
            "date": "September 25, 2011",
            "detail_rating": {
                "business": null,
                "cleanliness": 5.0,
                "desk": null,
                "location": 5.0,
                "pool": null,
                "restaurant": null,
                "rooms": 4.0,
                "service": 3.0,
                "sleep": 3.0,
                "value": 5.0
            },
            "helpfulness": 1,
            "id": 118569953,
            "likes": {
                "disliked": null,
                "liked": null
            },
            "rating": 4.0,
            "stay_parameters": "Stayed September 2011, traveled with friends",
            "text": "The hotel re-opened at the beginning of the September and looks great. Our bedroom overlooking the football stadium was large, spotless and had a flatscreen tv with all the sports channels - there were a couple of teething problems, leaking shower and safe which hadn't been wired up. Breakfast was excellent with a huge choice and a large vegetarian section. The hotel is within easy reach of the V&A waterfront and the city centre. We were advised to book a taxi to travel after dark which we did - to be fair we were pestered by beggars during the day when out walking - but, this is my only gripe with the hotel, the 'taxi' would arrive immediately - impressive until you realised it was one of the hotel staff's limos and you were then charged 40 rands for the first passenger and 20 each for the rest of the group, making a short journey for four 100 rand(dearer than London?)",
            "title": "Contemporary Hotel",
            "user": "Shopaholic1980_03"
        },
        {
            "date": "September 16, 2011",
            "detail_rating": {
                "business": null,
                "cleanliness": null,
                "desk": null,
                "location": 4.0,
                "pool": null,
                "restaurant": null,
                "rooms": 5.0,
                "service": 5.0,
                "sleep": null,
                "value": 4.0
            },
            "helpfulness": 2,
            "id": 118191625,
            "likes": {
                "disliked": null,
                "liked": null
            },
            "rating": 5.0,
            "stay_parameters": "Stayed September 2011, traveled as a couple",
            "text": "This hotel had just been open 1 day after extensive renovation and in my opinion still had to find its heart and soul. I cannot fault the rooms - they were urban and hip with desk, ipod dock, flatscreen tv, tea/coffee making facilities, perfect lighting etc. The restuarant lacked atmosphere but was excellent value and the food tasted lovely.",
            "title": "Awesome, newly renovated, contemporary hotel!",
            "user": "pipsquek23"
        },
        {
            "date": "November 4, 2011",
            "detail_rating": {
                "business": null,
                "cleanliness": 5.0,
                "desk": null,
                "location": 5.0,
                "pool": null,
                "restaurant": null,
                "rooms": 5.0,
                "service": 5.0,
                "sleep": 5.0,
                "value": 5.0
            },
            "helpfulness": null,
            "id": 120147668,
            "likes": {
                "disliked": null,
                "liked": null
            },
            "rating": 5.0,
            "stay_parameters": "Stayed October 2011, traveled as a couple",
            "text": "Spent two nights in the most gorgeous loft room in Victoria Junction. It was very unique with the living area being on the lower level with steps leading up to the Mezannine bedroom. Any hitches from the renovation had been sorted out and we had no complaints whatsoever. Loved the Nespresso machine in the room! Staff were great and breakfasts left nothing to be desired. We ate in the restaurant one night. The menu is brief but it does cover all tastes and was delicious.",
            "title": "Fantastic loft rooms",
            "user": "Sauvarin"
        },
        {
            "date": "November 2, 2011",
            "detail_rating": {
                "business": null,
                "cleanliness": 5.0,
                "desk": null,
                "location": 4.0,
                "pool": null,
                "restaurant": null,
                "rooms": 5.0,
                "service": 5.0,
                "sleep": 4.0,
                "value": 4.0
            },
            "helpfulness": null,
            "id": 120065283,
            "likes": {
                "disliked": null,
                "liked": null
            },
            "rating": 5.0,
            "stay_parameters": "Stayed October 2011, traveled as a couple",
            "text": "We will have no problem in recommending Victoria Junnction and will certainly stay there again.",
            "title": "Great Hotel",
            "user": "DGB13"
        },
        {
            "date": "October 31, 2011",
            "detail_rating": {
                "business": null,
                "cleanliness": 4.0,
                "desk": null,
                "location": 4.0,
                "pool": null,
                "restaurant": null,
                "rooms": 4.0,
                "service": 4.0,
                "sleep": 4.0,
                "value": 4.0
            },
            "helpfulness": null,
            "id": 119963412,
            "likes": {
                "disliked": null,
                "liked": null
            },
            "rating": 4.0,
            "stay_parameters": "Stayed September 2011, traveled with friends",
            "text": "I would really recommend this hotel. The rooms were modern well appointed and to a very good standard. Service was great with all staff being helpful and welcoming. Breakfasts were everything you could wish for with a very good selection both hot and cold. The location was ideal as it was walking distance to the waterfront (recommend the use of a taxi after dusk which would cost only R40) We stayed for three nights would certainly stay here again when visiting Cape Town",
            "title": "Good location - beautiful hotel",
            "user": "kimlp3"
        },
        {
            "date": "October 25, 2011",
            "detail_rating": {
                "business": null,
                "cleanliness": 5.0,
                "desk": null,
                "location": 5.0,
                "pool": null,
                "restaurant": null,
                "rooms": 5.0,
                "service": 5.0,
                "sleep": 5.0,
                "value": 5.0
            },
            "helpfulness": null,
            "id": 119729561,
            "likes": {
                "disliked": null,
                "liked": null
            },
            "rating": 5.0,
            "stay_parameters": "Stayed October 2011, traveled as a couple",
            "text": "I thought this Protea was a fabulous place to stay. The hotel is walking distance from the waterfront (although we were told to take a cab in the evenings. The rooms are not very large, but were very clean and modern. The chocolate that was left by our pillow was delicious and the staff was extremely helpful. The breakfast offered was a buffet with a lot of variety. I think the Protea chain is a safe bet throughout South Africa.",
            "title": "Vic Junction is at the center of it all",
            "user": "bsmith45"
        },
        {
            "date": "October 24, 2011",
            "detail_rating": {
                "business": null,
                "cleanliness": 4.0,
                "desk": null,
                "location": 4.0,
                "pool": null,
                "restaurant": null,
                "rooms": 5.0,
                "service": 4.0,
                "sleep": 5.0,
                "value": 4.0
            },
            "helpfulness": null,
            "id": 119659084,
            "likes": {
                "disliked": null,
                "liked": null
            },
            "rating": 4.0,
            "stay_parameters": "Stayed October 2011, traveled as a couple",
            "text": "Our stay at Protea Victoria Junction was part of a Gate1 Travel tour. The hotel room was large, very comfortable and clean. The breakfast buffet would satisfy anyone, with the cook staff preparing eggs & omelets, large selection of hot items, fruits and continental bread, cheese and cold cut selections. The employees of this hotel are friendly, helpful and skilled. The location is within walking distance of the Waterfront, which has become the center of Cape Town's shopping and restaurant venues.",
            "title": "Like the atmosphere and location",
            "user": "JokerNev"
        }
    ],
    "slim_ranking": 0.458333333333,
    "stars": 4,
    "tripadvisor": {
        "VISITED": false,
        "country_name": null,
        "locality": null,
        "pic_link": null,
        "street_address": null
    },
    "user_rating": 4.0,
    "variance": {
        "average": 24,
        "excellent": 59,
        "poor": 7,
        "terrible": 2,
        "very good": 90
    }
}