{
    "aka": null,
    "description": "The Ibis Laon hotel is close to the centre of Laon, 3 km from historic town centre and its cathedral. A little further afield, visit the Caverne Du Dragon war museum (18 km) and the Center Parcs (15 km). Book one of our 72 airconditioned rooms with WiFi Internet (including 3 adapted for guests with limited mobility) and benefit from our amenities, 2 meeting rooms, a restaurant, bar, snacks 24hrs, a terrace area and secure private outdoor parking. Golf and tennis facilities are nearby.",
    "detail_rating": {
        "cleanliness": null,
        "location": null,
        "rooms": null,
        "service": null,
        "sleep": null,
        "value": null
    },
    "location": {
        "city": null,
        "continent": "Europe",
        "country": "France",
        "proposed_city": "Laon",
        "province": null,
        "region": "Picardy"
    },
    "name": "Ibis Laon",
    "places": {
        "aka": [],
        "hotel_description": [
            "Laon"
        ],
        "hotel_name": [
            "Laon"
        ]
    },
    "review_count": 190,
    "review_count_current": 16,
    "reviews": [
        {
            "date": "May 17, 2012",
            "detail_rating": {
                "business": null,
                "cleanliness": 3.0,
                "desk": null,
                "location": 3.0,
                "pool": null,
                "restaurant": null,
                "rooms": 3.0,
                "service": 3.0,
                "sleep": 3.0,
                "value": 4.0
            },
            "helpfulness": null,
            "id": 130093798,
            "likes": {
                "disliked": null,
                "liked": null
            },
            "rating": 3.0,
            "stay_parameters": "Stayed May 2012, traveled with friends",
            "text": "stayed for 3 nights while participating in annual classic car rally. all hotel guests also rally participants. rooms clean, general rooms rather small but we had disabled room as my husband has MS. plenty of space with enormous wet room. food adequate although did run out of several items during breakfast and dinner.",
            "title": "cheap and cheerful",
            "user": "colant"
        },
        {
            "date": "May 15, 2012",
            "detail_rating": {
                "business": null,
                "cleanliness": 5.0,
                "desk": null,
                "location": 4.0,
                "pool": null,
                "restaurant": null,
                "rooms": 5.0,
                "service": 5.0,
                "sleep": 4.0,
                "value": 3.0
            },
            "helpfulness": null,
            "id": 129975283,
            "likes": {
                "disliked": null,
                "liked": null
            },
            "rating": 3.0,
            "stay_parameters": "Stayed May 2012, traveled with friends",
            "text": "safe car park, locked at night.",
            "title": "Does the job and staff are great",
            "user": "Damien_mh"
        },
        {
            "date": "April 2, 2012",
            "detail_rating": {
                "business": null,
                "cleanliness": 5.0,
                "desk": null,
                "location": 3.0,
                "pool": null,
                "restaurant": null,
                "rooms": 4.0,
                "service": 4.0,
                "sleep": 4.0,
                "value": 4.0
            },
            "helpfulness": null,
            "id": 127148368,
            "likes": {
                "disliked": null,
                "liked": null
            },
            "rating": 4.0,
            "stay_parameters": "Stayed March 2012, traveled with friends",
            "text": "good value for money.",
            "title": "good value",
            "user": "frothy"
        },
        {
            "date": "December 13, 2011",
            "detail_rating": {
                "business": null,
                "cleanliness": null,
                "desk": null,
                "location": null,
                "pool": null,
                "restaurant": null,
                "rooms": null,
                "service": null,
                "sleep": null,
                "value": null
            },
            "helpfulness": null,
            "id": 121717260,
            "likes": {
                "disliked": null,
                "liked": null
            },
            "rating": 5.0,
            "stay_parameters": null,
            "text": "We decided to break up our return to Paris with a stop in Laon. What a treasure. The city was beautiful. Our hotel was also a surprise. We stay in Ibis hotels throughout Europe and this was one of the best. The room was larger than our airport hotel and the bed was very comfortable. Recommend it highly. Keep in mind it's not the Savoy an adjust your expectations accordingly",
            "title": "Great surprise",
            "user": "A TripAdvisor user"
        },
        {
            "date": "November 7, 2011",
            "detail_rating": {
                "business": null,
                "cleanliness": 3.0,
                "desk": null,
                "location": 3.0,
                "pool": null,
                "restaurant": null,
                "rooms": 1.0,
                "service": 3.0,
                "sleep": 1.0,
                "value": 3.0
            },
            "helpfulness": null,
            "id": 120296862,
            "likes": {
                "disliked": null,
                "liked": null
            },
            "rating": 2.0,
            "stay_parameters": "Stayed October 2011, traveled as a couple",
            "text": "Fly's in the room when we arrived, the bath was chipped and main problem was the window would not close properly allowing the traffic noise to come into the room. Also tiles were falling off the side of the bath.",
            "title": "Poor majntenance of hotel room",
            "user": "TheoldEnglishman"
        },
        {
            "date": "November 6, 2011",
            "detail_rating": {
                "business": null,
                "cleanliness": null,
                "desk": null,
                "location": null,
                "pool": null,
                "restaurant": null,
                "rooms": null,
                "service": null,
                "sleep": null,
                "value": null
            },
            "helpfulness": null,
            "id": 120220289,
            "likes": {
                "disliked": null,
                "liked": null
            },
            "rating": 4.0,
            "stay_parameters": null,
            "text": "Yes, it's not a 5 star hotel, but it offers easy access by car, very friendly and efficient service, clean standard IBIS rooms and a decent restaurant for a seriously good price. We prefer to stay out of town to avoid traffic and navigation frustrations, so we put up with being in industrial areas. This one's got a car wash next to it and blocks of flats which is ok, and for venturing into Laon old town you could actually walk the back route and leave the car at the hotel. One of our \"regulars\" on our way through France, always giving us a good nights rest.",
            "title": "very good value",
            "user": "A TripAdvisor user"
        },
        {
            "date": "November 3, 2011",
            "detail_rating": {
                "business": null,
                "cleanliness": 5.0,
                "desk": null,
                "location": 3.0,
                "pool": null,
                "restaurant": null,
                "rooms": 2.0,
                "service": 3.0,
                "sleep": 4.0,
                "value": 3.0
            },
            "helpfulness": null,
            "id": 120112368,
            "likes": {
                "disliked": null,
                "liked": null
            },
            "rating": 3.0,
            "stay_parameters": "Stayed October 2011, traveled with friends",
            "text": "Booked eight Ibis hotels at one time. All took booking on credit card exept this one who phoned and said the card would not work and asked for another one. Found out later that first card would not let them charge us in Stirling and so they charged new one in Stirling at enhanced rate.",
            "title": "Book elsewhere",
            "user": "Two_ronnies"
        },
        {
            "date": "October 25, 2011",
            "detail_rating": {
                "business": null,
                "cleanliness": 4.0,
                "desk": null,
                "location": 4.0,
                "pool": null,
                "restaurant": null,
                "rooms": 4.0,
                "service": 4.0,
                "sleep": 5.0,
                "value": 4.0
            },
            "helpfulness": null,
            "id": 119707869,
            "likes": {
                "disliked": null,
                "liked": null
            },
            "rating": 4.0,
            "stay_parameters": "Stayed October 2011, traveled as a couple",
            "text": "Stayed here twice and both times room was very small with no heatng.",
            "title": "Clean, cheap and convenient",
            "user": "Avv1"
        },
        {
            "date": "October 22, 2011",
            "detail_rating": {
                "business": null,
                "cleanliness": 4.0,
                "desk": null,
                "location": 3.0,
                "pool": null,
                "restaurant": null,
                "rooms": 3.0,
                "service": 3.0,
                "sleep": 3.0,
                "value": 4.0
            },
            "helpfulness": null,
            "id": 119575084,
            "likes": {
                "disliked": null,
                "liked": null
            },
            "rating": 3.0,
            "stay_parameters": "Stayed September 2011, traveled as a couple",
            "text": "We stayed here as a stop over on a trip to Italy. It's a bog standard Ibis hotel - straightforward, clean, compact and reasonably priced. It's located on the edge of town and it would be a stiff climb up to the old town and cathedral. We drove up (there's plenty of free parking at the Ramparts) and it's well worth doing so. The cathedral is very impressive and we had a fine meal in town. Breakfast was the usual Ibis buffet - no surprises, all fine. Staff were friendly. The hotel is easy to find with lots of parking for a small charge.",
            "title": "Fine for a stop over",
            "user": "Riflerangeblues"
        },
        {
            "date": "October 17, 2011",
            "detail_rating": {
                "business": null,
                "cleanliness": 3.0,
                "desk": null,
                "location": 3.0,
                "pool": null,
                "restaurant": null,
                "rooms": 3.0,
                "service": 4.0,
                "sleep": 4.0,
                "value": 3.0
            },
            "helpfulness": null,
            "id": 119396602,
            "likes": {
                "disliked": null,
                "liked": null
            },
            "rating": 3.0,
            "stay_parameters": "Stayed October 2011, traveled solo",
            "text": "Arrived mid afternoon and was given a room key for a room that had not yet been cleaned. Very poor meal indeed in restaurant. Really wish I had dined in Laon, but it is a stiff, very steeply uphill 25 minute walk from the Ibis to the town. I was also given a questionnaire about hotel car-park security. Was this a subtle way of telling me that there had been problems? Bathroom fittings were shabby. Shower hose was split. I have stayed many nights in Ibis hotels this year. This was the poorest, by some way.",
            "title": "Average",
            "user": "TeePeeEngland"
        },
        {
            "date": "October 8, 2011",
            "detail_rating": {
                "business": null,
                "cleanliness": null,
                "desk": null,
                "location": null,
                "pool": null,
                "restaurant": null,
                "rooms": null,
                "service": null,
                "sleep": null,
                "value": null
            },
            "helpfulness": null,
            "id": 119081088,
            "likes": {
                "disliked": null,
                "liked": null
            },
            "rating": 3.0,
            "stay_parameters": null,
            "text": "a good stop a couple of houres from calais, the resturant though is ok but the menu is a bit more limited than it used to be. the rooms are tipicle Ibis clean comfortable and compact. I have stayed here before and will stay again as it is a convenient stop on the return to england",
            "title": "Over night stay",
            "user": "A TripAdvisor user"
        },
        {
            "date": "September 27, 2011",
            "detail_rating": {
                "business": null,
                "cleanliness": 3.0,
                "desk": null,
                "location": 2.0,
                "pool": null,
                "restaurant": null,
                "rooms": 3.0,
                "service": 3.0,
                "sleep": 2.0,
                "value": 3.0
            },
            "helpfulness": null,
            "id": 118668786,
            "likes": {
                "disliked": null,
                "liked": null
            },
            "rating": 3.0,
            "stay_parameters": "Stayed August 2011, traveled as a couple",
            "text": "Stayed here on our way South. Laon is a delightful town and worth a visit. The Ibis is outside of the ancient city, but we managed the uphill walk, despite hotel staff saying it would be too far and difficult. It was worth the climb. No restaurants near the hotel so on a Sunday evening hotel dining was necessary, however the meal was good value.",
            "title": "Stop over in Laon",
            "user": "TravellerWiltshire"
        },
        {
            "date": "September 26, 2011",
            "detail_rating": {
                "business": null,
                "cleanliness": null,
                "desk": null,
                "location": null,
                "pool": null,
                "restaurant": null,
                "rooms": null,
                "service": null,
                "sleep": null,
                "value": null
            },
            "helpfulness": null,
            "id": 118600589,
            "likes": {
                "disliked": null,
                "liked": null
            },
            "rating": 4.0,
            "stay_parameters": null,
            "text": "We checked in, but on arriving at our room, found the chambermaid (who didn't seem to understand French) still servicing the room.",
            "title": "Good - with the odd snag.",
            "user": "A TripAdvisor user"
        },
        {
            "date": "March 29, 2012",
            "detail_rating": {
                "business": null,
                "cleanliness": null,
                "desk": null,
                "location": null,
                "pool": null,
                "restaurant": null,
                "rooms": null,
                "service": null,
                "sleep": null,
                "value": null
            },
            "helpfulness": null,
            "id": 126909606,
            "likes": {
                "disliked": null,
                "liked": null
            },
            "rating": 4.0,
            "stay_parameters": null,
            "text": "Very handy place to stop on route through France, with garage nearby to fill up with petrol. Quite location and friendly helpful staff.",
            "title": "OVERNIGHT STOP",
            "user": "A TripAdvisor user"
        },
        {
            "date": "March 17, 2012",
            "detail_rating": {
                "business": null,
                "cleanliness": 4.0,
                "desk": null,
                "location": 3.0,
                "pool": null,
                "restaurant": null,
                "rooms": 3.0,
                "service": 5.0,
                "sleep": 4.0,
                "value": 5.0
            },
            "helpfulness": 1,
            "id": 126237182,
            "likes": {
                "disliked": null,
                "liked": null
            },
            "rating": 4.0,
            "stay_parameters": "Stayed March 2012, traveled as a couple",
            "text": "We wanted to spend a night in Laon on our way home from Burgundy but there didn't seem to be a great choice of hotels. We hadn't stayed in an Ibis before, although we have used other Accor brands. We found the hotel quite easily - or at least the satnav did. The room was fine - everything one needs, decent bed, clean bathroom - without any frills, but for 46 Euros booked a few days in advance the value was excellent.",
            "title": "Very good value",
            "user": "Chau98"
        },
        {
            "date": "February 21, 2012",
            "detail_rating": {
                "business": null,
                "cleanliness": 5.0,
                "desk": null,
                "location": 3.0,
                "pool": null,
                "restaurant": null,
                "rooms": 5.0,
                "service": 5.0,
                "sleep": 5.0,
                "value": 5.0
            },
            "helpfulness": 1,
            "id": 124982030,
            "likes": {
                "disliked": null,
                "liked": null
            },
            "rating": 5.0,
            "stay_parameters": "Stayed February 2012, traveled as a couple",
            "text": "The hotel is some way from the city centre - too far to walk on a March afternoon. However the reception staff gave us very clear directions to a free car park ideally situated in the centre, only a short drive away. We were a bit disappointed by the city, having seen it in the distance from the motorway many times - maybe our expectations were too high (and it was a cool Saturday afternoon in early March). The cathedral is superb though.",
            "title": "Ibis Laon",
            "user": "PaulKStowmarket"
        }
    ],
    "slim_ranking": 0.4,
    "stars": 3,
    "tripadvisor": {
        "VISITED": false,
        "country_name": null,
        "locality": null,
        "pic_link": null,
        "street_address": null
    },
    "user_rating": 3.5,
    "variance": {
        "average": 40,
        "excellent": 28,
        "poor": 18,
        "terrible": 4,
        "very good": 100
    }
}