{
    "aka": "Residence Inn Arlington Courthouse Hotel",
    "description": null,
    "detail_rating": {
        "cleanliness": 5.0,
        "location": 5.0,
        "rooms": 4.5,
        "service": 4.5,
        "sleep": 4.5,
        "value": 4.5
    },
    "location": {
        "city": "Arlington",
        "continent": null,
        "country": "United States",
        "proposed_city": "Arlington",
        "province": null,
        "region": null
    },
    "name": "Residence Inn Arlington Courthouse",
    "places": {
        "aka": [
            "Arlington"
        ],
        "hotel_description": [],
        "hotel_name": [
            "Arlington"
        ]
    },
    "review_count": 250,
    "review_count_current": 20,
    "reviews": [
        {
            "date": "July 6, 2011",
            "detail_rating": {
                "business": null,
                "cleanliness": 5.0,
                "desk": null,
                "location": null,
                "pool": null,
                "restaurant": null,
                "rooms": null,
                "service": 5.0,
                "sleep": 5.0,
                "value": 4.0
            },
            "helpfulness": 1,
            "id": 115104333,
            "likes": {
                "disliked": null,
                "liked": null
            },
            "rating": 5.0,
            "stay_parameters": "Stayed June 2011, traveled with friends",
            "text": "Stayed here to visit with friends in Arlington but also to visit D.C. Perfect location right by the metro so easy to commute to places. The lobby was very nice with a fireplace and a sitting area. Breakfast was a hot breakfast with a lot of variety in the mornings. The room was a suite style with a living area and full kitchenette. Bed was comfortable and the bathroom had granite countertops. The couch in the sitting area was a pull out sleeper sofa so the room would be perfect if traveling with kids. Restaurants all around within walking distance. The property looks like it is a newer property- no signs of wear anywhere that I saw. Very clean. They must allow pets as I saw a couple of people with their dog going on the elevator.",
            "title": "Loved the location",
            "user": "clmtraveler"
        },
        {
            "date": "July 5, 2011",
            "detail_rating": {
                "business": null,
                "cleanliness": 5.0,
                "desk": null,
                "location": null,
                "pool": null,
                "restaurant": null,
                "rooms": null,
                "service": 5.0,
                "sleep": 3.0,
                "value": 4.0
            },
            "helpfulness": 1,
            "id": 115065590,
            "likes": {
                "disliked": null,
                "liked": null
            },
            "rating": 4.0,
            "stay_parameters": "Stayed June 2011, traveled with family",
            "text": "All four of us enjoyed our stay at this hotel in a 1 bedroom king suite with a pull out sofa. The sofa bed was so-so, while the king bed was much more confortable. The room was clean and large enough for our group. The kitchen was great for heating up leftovers and storing food/drink. We always had enough towels for the bathroom and liked that the sink was separate from the shower/toilet. We couldn't figure out the cooling system in the room...it was downright cold below 73 degrees, but upon turning the system up to 74 degrees, the heater came on! We called maintenance once to address the loose handle on the toilet and they fixed it promptly. We ate at the complimentary breakfast buffet most mornings during our 4 night stay which is a plus when on a budget. My son utilized the indoor pool twice during downtime from the day's activities. There are countless restaurants, coffee spots, and shops within walking distance of the hotel. As others have stated, the metro is close to the hotel for our main form of transportation into DC...short ride to all tourist areas. We even took the metro from DCA to the Courthouse metro station...easy and less than a taxi ride to get to the hotel. Finally, the hotel staff was friendly and always willing to give us suggestions on area restaurants or anything else we requested. Overall, a quality hotel in a great area just outside of DC!",
            "title": "Quality hotel close to DC sites",
            "user": "mugabi"
        },
        {
            "date": "July 3, 2011",
            "detail_rating": {
                "business": null,
                "cleanliness": 4.0,
                "desk": null,
                "location": null,
                "pool": null,
                "restaurant": null,
                "rooms": null,
                "service": 4.0,
                "sleep": 5.0,
                "value": 3.0
            },
            "helpfulness": 1,
            "id": 114972813,
            "likes": {
                "disliked": null,
                "liked": null
            },
            "rating": 4.0,
            "stay_parameters": "Stayed June 2011, traveled with family",
            "text": "After seeing the prices for two rooms in DC, we chose to get the two-bedroom suite at the Residence Inn in Arlington instead. One king bed in a private bedroom with bathroom, one queen bed in a private bedroom with bathroom, then a pull-out sofa. The sofa also has a large one piece cushion - my 20 year old sons used the sofa and the cushion and let their sister have the queen bedroom. Small four seat dining table with ethernet at the edge for the computers. Wi-fi was spotty so it was great having the ethernet. The kitchen was clean and basic utensils; very nice for a four day stay.",
            "title": "Comfortable for a Family of Five Adults",
            "user": "TripleToys"
        },
        {
            "date": "June 25, 2011",
            "detail_rating": {
                "business": null,
                "cleanliness": 5.0,
                "desk": null,
                "location": 5.0,
                "pool": null,
                "restaurant": null,
                "rooms": 5.0,
                "service": 5.0,
                "sleep": null,
                "value": 5.0
            },
            "helpfulness": 1,
            "id": 114734130,
            "likes": {
                "disliked": null,
                "liked": null
            },
            "rating": 5.0,
            "stay_parameters": "Stayed June 2011",
            "text": "The breakfast was great - hot choices daily, fruit, cereals, oatmeal, the ubiquitos waffle maker, etc.",
            "title": "Gem in Arlington!",
            "user": "jazzy1224"
        },
        {
            "date": "June 20, 2011",
            "detail_rating": {
                "business": null,
                "cleanliness": 5.0,
                "desk": null,
                "location": null,
                "pool": null,
                "restaurant": null,
                "rooms": null,
                "service": 5.0,
                "sleep": 5.0,
                "value": 5.0
            },
            "helpfulness": null,
            "id": 114522341,
            "likes": {
                "disliked": null,
                "liked": null
            },
            "rating": 5.0,
            "stay_parameters": "Stayed May 2011, traveled on business",
            "text": "It was a very short five to ten minute walk to the Courthouse Metro station through a nice office complex.",
            "title": "Best hotel from top to bottom",
            "user": "HomeLessZeroSix"
        },
        {
            "date": "August 4, 2011",
            "detail_rating": {
                "business": null,
                "cleanliness": 5.0,
                "desk": null,
                "location": 5.0,
                "pool": null,
                "restaurant": null,
                "rooms": 5.0,
                "service": 5.0,
                "sleep": null,
                "value": 5.0
            },
            "helpfulness": 1,
            "id": 116285995,
            "likes": {
                "disliked": null,
                "liked": null
            },
            "rating": 5.0,
            "stay_parameters": "Stayed August 2011",
            "text": "Close to metro, great location, great rooms... Highly recommend!",
            "title": "Great family hotel for DC visit",
            "user": "CheerMom95"
        },
        {
            "date": "August 4, 2011",
            "detail_rating": {
                "business": null,
                "cleanliness": 5.0,
                "desk": null,
                "location": null,
                "pool": null,
                "restaurant": null,
                "rooms": null,
                "service": 5.0,
                "sleep": 5.0,
                "value": 5.0
            },
            "helpfulness": 1,
            "id": 116262704,
            "likes": {
                "disliked": null,
                "liked": null
            },
            "rating": 5.0,
            "stay_parameters": "Stayed July 2011, traveled with family",
            "text": "My wife and I stayed here and were very happy with our stay. Front desk personnel were very friendly and explained all the facillities and amenities. You will not be disappointed staying here.",
            "title": "Great location, hospitality, super neat and clean",
            "user": "KBG_NY"
        },
        {
            "date": "August 2, 2011",
            "detail_rating": {
                "business": null,
                "cleanliness": 4.0,
                "desk": null,
                "location": null,
                "pool": null,
                "restaurant": null,
                "rooms": null,
                "service": 3.0,
                "sleep": 5.0,
                "value": 2.0
            },
            "helpfulness": null,
            "id": 116191531,
            "likes": {
                "disliked": null,
                "liked": null
            },
            "rating": 3.0,
            "stay_parameters": "Stayed July 2011, traveled with family",
            "text": "We stayed here for three weeks while relocating. We had a suite with 2 brms and small kitchenette, living room area. It is hard to put my finger on why I did not like this place much, afterall included is: free breakfasts, good gym, pool, clean laundry room, etc. But somehow it is missing something; it felt impersonal, decor is like walking into Marshals store, there are free meals 2-3 times a week which I found almost inedible- overcooked, tasteless mass produced gruel. The breakfast is fine but little variation from week to week. The location is good near metro, restaurants and movies. Staff were also friendly and professional. In summary, fine for a short stay but don't overstay!",
            "title": "Very functional but charmless",
            "user": "domfreire"
        },
        {
            "date": "August 2, 2011",
            "detail_rating": {
                "business": null,
                "cleanliness": 5.0,
                "desk": null,
                "location": null,
                "pool": null,
                "restaurant": null,
                "rooms": null,
                "service": 5.0,
                "sleep": 5.0,
                "value": 4.0
            },
            "helpfulness": 1,
            "id": 116139881,
            "likes": {
                "disliked": null,
                "liked": null
            },
            "rating": 5.0,
            "stay_parameters": "Stayed September 2010, traveled on business",
            "text": "I was looking at a long stay in Northern Virginia and was happy I got a room at the RI Arlington Courthouse. The hotel is brand new, which means everything is in great working order, clean, and in good repair.",
            "title": "Excellent location, nice hotel",
            "user": "nickleec"
        },
        {
            "date": "August 1, 2011",
            "detail_rating": {
                "business": null,
                "cleanliness": 5.0,
                "desk": null,
                "location": null,
                "pool": null,
                "restaurant": null,
                "rooms": null,
                "service": 5.0,
                "sleep": 4.0,
                "value": 4.0
            },
            "helpfulness": 1,
            "id": 116107153,
            "likes": {
                "disliked": null,
                "liked": null
            },
            "rating": 5.0,
            "stay_parameters": "Stayed July 2011, traveled with family",
            "text": "To start with the location cannot be beat. The Metro is very close, and was great for business or pleasure outings. There are a number of great restaurants (chains and independents) within a mile of the hotel, and a Safeway and Whole Foods each about a 1/2 mile away (in opposite directions). For running, the streets are safe and populated with like-minded people. The area is all hills, but that just makes you stronger. I found a nice loop to the Marine Memorial (Iwo Jima Memorial) that was about 2.8 miles.",
            "title": "Great Property Right Outside of DC",
            "user": "disneydad331"
        },
        {
            "date": "July 29, 2011",
            "detail_rating": {
                "business": null,
                "cleanliness": 5.0,
                "desk": null,
                "location": null,
                "pool": null,
                "restaurant": null,
                "rooms": null,
                "service": 5.0,
                "sleep": 5.0,
                "value": 5.0
            },
            "helpfulness": null,
            "id": 115953405,
            "likes": {
                "disliked": null,
                "liked": null
            },
            "rating": 5.0,
            "stay_parameters": "Stayed July 2011, traveled with family",
            "text": "Loved it could move in!",
            "title": "Great hotel !",
            "user": "flamingoPat"
        },
        {
            "date": "July 26, 2011",
            "detail_rating": {
                "business": null,
                "cleanliness": 5.0,
                "desk": null,
                "location": null,
                "pool": null,
                "restaurant": null,
                "rooms": null,
                "service": 4.0,
                "sleep": 5.0,
                "value": 5.0
            },
            "helpfulness": 3,
            "id": 115824433,
            "likes": {
                "disliked": null,
                "liked": null
            },
            "rating": 5.0,
            "stay_parameters": "Stayed July 2011, traveled as a couple",
            "text": "Great room",
            "title": "WOW!!!",
            "user": "SydneyB"
        },
        {
            "date": "July 26, 2011",
            "detail_rating": {
                "business": null,
                "cleanliness": 5.0,
                "desk": null,
                "location": null,
                "pool": null,
                "restaurant": null,
                "rooms": null,
                "service": 4.0,
                "sleep": 5.0,
                "value": 4.0
            },
            "helpfulness": null,
            "id": 115816035,
            "likes": {
                "disliked": null,
                "liked": null
            },
            "rating": 5.0,
            "stay_parameters": "Stayed July 2011, traveled with family",
            "text": "Great breakfast",
            "title": "What a fabulous hotel!",
            "user": "Kat1999"
        },
        {
            "date": "July 22, 2011",
            "detail_rating": {
                "business": null,
                "cleanliness": 4.0,
                "desk": null,
                "location": null,
                "pool": null,
                "restaurant": null,
                "rooms": null,
                "service": 4.0,
                "sleep": 2.0,
                "value": 4.0
            },
            "helpfulness": 1,
            "id": 115652328,
            "likes": {
                "disliked": null,
                "liked": null
            },
            "rating": 4.0,
            "stay_parameters": "Stayed July 2011, traveled on business",
            "text": "Great location",
            "title": "Top of the Line and it shows",
            "user": "herring4"
        },
        {
            "date": "July 21, 2011",
            "detail_rating": {
                "business": null,
                "cleanliness": 5.0,
                "desk": null,
                "location": null,
                "pool": null,
                "restaurant": null,
                "rooms": null,
                "service": 5.0,
                "sleep": 5.0,
                "value": 5.0
            },
            "helpfulness": 1,
            "id": 115634955,
            "likes": {
                "disliked": null,
                "liked": null
            },
            "rating": 5.0,
            "stay_parameters": "Stayed July 2011, traveled on business",
            "text": "WOW! This HAS to be the nicest Residence Inn I've ever stayed in! Very modern and updated furnishings, and the largest breakfast buffet I've ever seen at a Residence Inn! You can park right around the corner at the lot for the mall (free on Sundays and holidays!) and save on parking. Lots of restaurants within walking distance....and very close to the Metro. Travel quite frequently to DC for a weekend getaway, and would definitely stay here again!",
            "title": "Fantastic Residence Inn-- new, clean, great location!",
            "user": "Dondequiera"
        },
        {
            "date": "August 21, 2011",
            "detail_rating": {
                "business": null,
                "cleanliness": 2.0,
                "desk": null,
                "location": null,
                "pool": null,
                "restaurant": null,
                "rooms": null,
                "service": 4.0,
                "sleep": 4.0,
                "value": 4.0
            },
            "helpfulness": 1,
            "id": 117026677,
            "likes": {
                "disliked": null,
                "liked": null
            },
            "rating": 3.0,
            "stay_parameters": "Stayed July 2011, traveled on business",
            "text": "Here's the pros on this hotel:",
            "title": "Above Average for the area",
            "user": "badwaiter"
        },
        {
            "date": "August 16, 2011",
            "detail_rating": {
                "business": null,
                "cleanliness": null,
                "desk": null,
                "location": null,
                "pool": null,
                "restaurant": null,
                "rooms": null,
                "service": null,
                "sleep": null,
                "value": null
            },
            "helpfulness": 1,
            "id": 116799878,
            "likes": {
                "disliked": null,
                "liked": null
            },
            "rating": 5.0,
            "stay_parameters": null,
            "text": "Close to DC and the Metro",
            "title": "Must be the best value in the DC area",
            "user": "cow1213"
        },
        {
            "date": "August 16, 2011",
            "detail_rating": {
                "business": null,
                "cleanliness": 5.0,
                "desk": null,
                "location": null,
                "pool": null,
                "restaurant": null,
                "rooms": null,
                "service": 5.0,
                "sleep": 5.0,
                "value": 5.0
            },
            "helpfulness": 1,
            "id": 116793771,
            "likes": {
                "disliked": null,
                "liked": null
            },
            "rating": 5.0,
            "stay_parameters": "Stayed August 2011, traveled with family",
            "text": "Great area for walking around and dining out",
            "title": "Great hotel, great staff, fantastic location",
            "user": "PackTheBagAndGo"
        },
        {
            "date": "August 11, 2011",
            "detail_rating": {
                "business": null,
                "cleanliness": null,
                "desk": null,
                "location": null,
                "pool": null,
                "restaurant": null,
                "rooms": null,
                "service": null,
                "sleep": null,
                "value": null
            },
            "helpfulness": null,
            "id": 116560037,
            "likes": {
                "disliked": null,
                "liked": null
            },
            "rating": 4.0,
            "stay_parameters": null,
            "text": "Inexpensive for DC Area",
            "title": "Nice Hotel in great location",
            "user": "tammilip"
        },
        {
            "date": "August 7, 2011",
            "detail_rating": {
                "business": null,
                "cleanliness": 5.0,
                "desk": null,
                "location": null,
                "pool": null,
                "restaurant": null,
                "rooms": null,
                "service": 5.0,
                "sleep": 4.0,
                "value": 4.0
            },
            "helpfulness": null,
            "id": 116396020,
            "likes": {
                "disliked": null,
                "liked": null
            },
            "rating": 4.0,
            "stay_parameters": "Stayed March 2011, traveled on business",
            "text": "Free Breakfast",
            "title": "Nice Newer Hotel",
            "user": "StevenVA"
        }
    ],
    "slim_ranking": 0.0625,
    "stars": 3,
    "tripadvisor": {
        "VISITED": false,
        "country_name": null,
        "locality": null,
        "pic_link": null,
        "street_address": null
    },
    "user_rating": 4.5,
    "variance": {
        "average": 16,
        "excellent": 168,
        "poor": 3,
        "terrible": 0,
        "very good": 63
    }
}