{
    "aka": "Sheraton Portsmouth",
    "description": "Portsmouth Harborside Hotel is near the University of New Hampshire, shopping, dining, recreation and museums. Our accommodation has 13,000 square feet of event space for your next meeting or wedding.",
    "detail_rating": {
        "cleanliness": 4.5,
        "location": 4.5,
        "rooms": 4.0,
        "service": 4.5,
        "sleep": 4.0,
        "value": 4.5
    },
    "location": {
        "city": "Portsmouth",
        "continent": null,
        "country": "United States",
        "proposed_city": "Portsmouth",
        "province": null,
        "region": null
    },
    "name": "Sheraton Harborside Hotel Portsmouth",
    "places": {
        "aka": [
            "Portsmouth"
        ],
        "hotel_description": [
            "Portsmouth",
            "University"
        ],
        "hotel_name": [
            "Portsmouth"
        ]
    },
    "review_count": 604,
    "review_count_current": 12,
    "reviews": [
        {
            "date": "February 19, 2007",
            "detail_rating": {
                "business": null,
                "cleanliness": null,
                "desk": null,
                "location": null,
                "pool": null,
                "restaurant": null,
                "rooms": null,
                "service": null,
                "sleep": null,
                "value": null
            },
            "helpfulness": 2,
            "id": 6811505,
            "likes": {
                "disliked": null,
                "liked": null
            },
            "rating": 4.0,
            "stay_parameters": null,
            "text": "My family decided to go away for a few days the week of Chirstmas break, just for a few days to get away. We have three children, 7, 5, and 2. We decided to stay at the Sheraton, b/c it is close to Kittery and it is close to the water...not like we were swimming, but we are New England ocean people, even in the winter. Anyway, the rates we received were a great value for the hotel. We paid about a $100 a night, and we've stayed in other hotels for more money that weren't nearly as nice as this place.",
            "title": "Happy with Stay",
            "user": "JSRI"
        },
        {
            "date": "January 8, 2007",
            "detail_rating": {
                "business": null,
                "cleanliness": 5.0,
                "desk": null,
                "front_desk": 5.0,
                "location": 5.0,
                "pool": null,
                "restaurant": null,
                "rooms": 4.0,
                "service": null,
                "sleep": null,
                "value": 5.0
            },
            "helpfulness": 2,
            "id": 6564757,
            "likes": {
                "disliked": "\u2014 noise",
                "liked": "\u2014 Location, size"
            },
            "rating": 4.0,
            "stay_parameters": "Stayed January 2007",
            "text": "Pros? Bed was fabulous, room was clean, clean, clean. Service was fantastic. Cute shops/restaurants. Close to kittery outlets!",
            "title": "Had a good stay",
            "user": "leftwing"
        },
        {
            "date": "July 27, 2007",
            "detail_rating": {
                "business": null,
                "cleanliness": 4.0,
                "desk": null,
                "front_desk": 4.0,
                "location": 5.0,
                "pool": null,
                "restaurant": null,
                "rooms": 3.0,
                "service": 4.0,
                "sleep": null,
                "value": 4.0
            },
            "helpfulness": 3,
            "id": 8241644,
            "likes": {
                "disliked": "\u2014 smell in the room",
                "liked": "\u2014 location"
            },
            "rating": 4.0,
            "stay_parameters": "Stayed July 2007, traveled on business",
            "text": "I recently stayed at this hotel for my future sister-in-law's wedding. I had never been to Portsmouth, and upon arrival, I thought the view and location were perfect for the nautical theme of the occasion. The hotel is in a perfect location to downtown Portsmouth. The lobby, restaurant, and banquet rooms are spacious and inviting. Views of the water can be seen from the hotel and are beautiful. The hotel is an odd shape, so it was a little challenging to find the rooms. Also, the suites have a private entrance to the hallway, which is a nice touch if you are paying the money, but when you are in a wedding party, it is a major pain. People had to go to the front desk to be admitted to the private elevator, and the same staff, though they saw me 15 times in one day, continued to ask for my ID for \"security\" reasons. The rooms are very small, and somewhat outdated unless you are staying on the 4th floor. I could have sworn that my room was a smoking room, but the hotel is a non-smoking hotel. Perhaps it was recently converted. Also, beware if you have a waterfront view. The sunrise, though incredible, will awaken you at 5am. Also, some of the wedding party had a parking lot light shining through the room the entire night. Just figure out how to close the curtains if you can, and you'll be fine. I am being very picky in this review, but I feel that people have a right to know the details of what they are getting into. For the occasion, the hotel was ideal in terms of location, wedding, cost, and convenience to the activities downtown. Just know that this hotel is obviously a little older, and might need some updates here and there. Also, if you are interested in working out, there is a gym downstairs with one treadmill, bike, and efx each, and a weight system. Finally, there is no convenient store within walking distance but a small one located at the front desk in the lobby, and vending machines downstairs. I definitely recommend this hotel if you want to stay in downtown Portsmouth. As well, it made for a beautiful wedding reception location.",
            "title": "Sheraton Portsmouth - Great Location",
            "user": "AngelMel"
        },
        {
            "date": "July 20, 2007",
            "detail_rating": {
                "business": null,
                "cleanliness": 3.0,
                "desk": null,
                "front_desk": 1.0,
                "location": 5.0,
                "pool": null,
                "restaurant": null,
                "rooms": 3.0,
                "service": 2.0,
                "sleep": null,
                "value": 1.0
            },
            "helpfulness": 4,
            "id": 8194269,
            "likes": {
                "disliked": "\u2014 service",
                "liked": "\u2014 location"
            },
            "rating": 2.0,
            "stay_parameters": "Stayed August 2003, traveled as a couple",
            "text": "I'm planning another trip through the area so I checked out this place on Tripadvisor. It reminded me that I stayed here back in 2003 for one night on the club level. All the reviews here are absolutely accurate.",
            "title": "What a shame.",
            "user": "uigedail"
        },
        {
            "date": "June 2, 2007",
            "detail_rating": {
                "business": 3.0,
                "cleanliness": 1.0,
                "desk": null,
                "front_desk": 3.0,
                "location": 5.0,
                "pool": null,
                "restaurant": null,
                "rooms": 1.0,
                "service": 3.0,
                "sleep": null,
                "value": 1.0
            },
            "helpfulness": 2,
            "id": 7740691,
            "likes": {
                "disliked": "\u2014 Rooms",
                "liked": "\u2014 Location"
            },
            "rating": 1.0,
            "stay_parameters": "Stayed May 2007, traveled with family",
            "text": "The front desk 'experience' was like the twilight zone, unfriendly, like a deposition the two clerks answered only specific questions, it was like pulling teeth. The club floor club lounge was very small and luckily we caught the guy setting up, he had one tray of warm munchies and a small selection of drinks. We skipped in favor of dinner.",
            "title": "Just a veneer",
            "user": "ChicagoNorm"
        },
        {
            "date": "May 21, 2007",
            "detail_rating": {
                "business": 5.0,
                "cleanliness": 4.0,
                "desk": null,
                "front_desk": 2.0,
                "location": 4.0,
                "pool": null,
                "restaurant": null,
                "rooms": 4.0,
                "service": 3.0,
                "sleep": null,
                "value": 3.0
            },
            "helpfulness": 3,
            "id": 7669132,
            "likes": {
                "disliked": "\u2014 Front Desk Staff",
                "liked": "\u2014 location"
            },
            "rating": 3.0,
            "stay_parameters": "Stayed April 2007, traveled solo",
            "text": "The room was ok, it had a view over the central parking area to the water.",
            "title": "a little rough",
            "user": "hero7"
        },
        {
            "date": "February 19, 2007",
            "detail_rating": {
                "business": null,
                "cleanliness": null,
                "desk": null,
                "location": null,
                "pool": null,
                "restaurant": null,
                "rooms": null,
                "service": null,
                "sleep": null,
                "value": null
            },
            "helpfulness": 1,
            "id": 6814110,
            "likes": {
                "disliked": null,
                "liked": null
            },
            "rating": 4.0,
            "stay_parameters": null,
            "text": "The breakfast in the bar was another surreal experience, the server was in her own little world and we had to track her down for everything, and we were the only ones having breakfast.",
            "title": "nice hotel",
            "user": "shvtraveler"
        },
        {
            "date": "November 25, 2007",
            "detail_rating": {
                "business": 2.0,
                "cleanliness": 4.0,
                "desk": null,
                "front_desk": 3.0,
                "location": 4.0,
                "pool": null,
                "restaurant": null,
                "rooms": 3.0,
                "service": 3.0,
                "sleep": null,
                "value": 3.0
            },
            "helpfulness": null,
            "id": 11047182,
            "likes": {
                "disliked": "\u2014 Slowest lift in the world, sneaky charges to credit card...",
                "liked": "\u2014 Location was spot-on"
            },
            "rating": 3.0,
            "stay_parameters": "Stayed October 2007, traveled as a couple",
            "text": "Stayed for 2 nights in October. Reasonable enough, but not perfect. Hotel was very clean, and in a great location which earns it some extra marks. We were upgraded to a Club room, which seemed nice enough but not exceptional. Downside of this was we had to use 'the slowest lift in the world!'(tm) to get to our romm. Waiting was like water torture. Also, we were given dubious instructions about breakfast, and ended up charged $40+ that we shouldn't have been. This was scrubbed from our bill but has just re-appeared on my credit-card statement. Very sneaky...",
            "title": "Fine - nothing exceptional though!",
            "user": "Fife_traveller"
        },
        {
            "date": "September 1, 2007",
            "detail_rating": {
                "business": 5.0,
                "cleanliness": 4.0,
                "desk": null,
                "front_desk": 5.0,
                "location": 5.0,
                "pool": null,
                "restaurant": null,
                "rooms": 4.0,
                "service": 4.0,
                "sleep": null,
                "value": null
            },
            "helpfulness": 1,
            "id": 8604072,
            "likes": {
                "disliked": null,
                "liked": "\u2014 Location"
            },
            "rating": 4.0,
            "stay_parameters": "Stayed August 2007, traveled with family",
            "text": "This property is wonderful. Staff was exceptional and the location can not be beat.",
            "title": "Will return!",
            "user": "busnbay"
        },
        {
            "date": "August 30, 2007",
            "detail_rating": {
                "business": 3.0,
                "cleanliness": 3.0,
                "desk": null,
                "front_desk": 3.0,
                "location": null,
                "pool": null,
                "restaurant": null,
                "rooms": 3.0,
                "service": 4.0,
                "sleep": null,
                "value": 3.0
            },
            "helpfulness": 3,
            "id": 8575826,
            "likes": {
                "disliked": "\u2014 Club Level",
                "liked": "\u2014 Location"
            },
            "rating": 4.0,
            "stay_parameters": "Stayed August 2007, traveled with family",
            "text": "Rooms were a good size and bed was extrememly comfortable.",
            "title": "It's safe to stay here.",
            "user": "Fawn07"
        },
        {
            "date": "August 20, 2007",
            "detail_rating": {
                "business": null,
                "cleanliness": 4.0,
                "desk": null,
                "front_desk": 5.0,
                "location": 5.0,
                "pool": null,
                "restaurant": null,
                "rooms": 4.0,
                "service": 5.0,
                "sleep": null,
                "value": 4.0
            },
            "helpfulness": 1,
            "id": 8460509,
            "likes": {
                "disliked": null,
                "liked": "\u2014 Service from the staff"
            },
            "rating": 4.0,
            "stay_parameters": "Stayed August 2007, traveled as a couple",
            "text": "The hotel just recently converted to non smoking. Our room smelled like smoke. The front desk offered us another room. That room also smelled a bit like smoke . We chose to have them spray our original room since we were only staying for one night. That night a voucher for 4 people for breakfast was left under our door.",
            "title": "Great service made for a great holiday",
            "user": "Scott408"
        },
        {
            "date": "August 5, 2007",
            "detail_rating": {
                "business": 3.0,
                "cleanliness": 3.0,
                "desk": null,
                "front_desk": 1.0,
                "location": 4.0,
                "pool": null,
                "restaurant": null,
                "rooms": 3.0,
                "service": 1.0,
                "sleep": null,
                "value": 3.0
            },
            "helpfulness": 3,
            "id": 8356703,
            "likes": {
                "disliked": "\u2014 managment and poor customer service",
                "liked": "\u2014 location"
            },
            "rating": 1.0,
            "stay_parameters": "Stayed June 2007, traveled on business",
            "text": "They will do what they can to make your stay enjoyable.",
            "title": "Awful Customer Service",
            "user": "sparkling_cyanide"
        }
    ],
    "slim_ranking": 0.375,
    "stars": 3.5,
    "tripadvisor": {
        "VISITED": false,
        "country_name": null,
        "locality": null,
        "pic_link": null,
        "street_address": null
    },
    "user_rating": 4.0,
    "variance": {
        "average": 105,
        "excellent": 265,
        "poor": 31,
        "terrible": 20,
        "very good": 183
    }
}