{
    "aka": "Hotel Regal Pacific",
    "description": null,
    "detail_rating": {
        "cleanliness": null,
        "location": null,
        "rooms": null,
        "service": null,
        "sleep": null,
        "value": null
    },
    "location": {
        "city": "Santiago",
        "continent": "South America",
        "country": "Chile",
        "proposed_city": null,
        "province": null,
        "region": "Santiago Metropolitan Region"
    },
    "name": "Regal Pacific Hotel",
    "places": {
        "aka": [],
        "hotel_description": [],
        "hotel_name": []
    },
    "review_count": 197,
    "review_count_current": 20,
    "reviews": [
        {
            "date": "May 12, 2011",
            "detail_rating": {
                "business": null,
                "cleanliness": 5.0,
                "desk": null,
                "location": 5.0,
                "pool": null,
                "restaurant": null,
                "rooms": 5.0,
                "service": 5.0,
                "sleep": 5.0,
                "value": 5.0
            },
            "helpfulness": 1,
            "id": 107953679,
            "likes": {
                "disliked": null,
                "liked": null
            },
            "rating": 5.0,
            "stay_parameters": "Stayed May 2011, traveled on business",
            "text": "I strongly recommend staying at Regal Pacific Chile if you need to go to that country for pleasure or business.",
            "title": "Excellence",
            "user": "spezzi"
        },
        {
            "date": "May 9, 2011",
            "detail_rating": {
                "business": null,
                "cleanliness": 5.0,
                "desk": null,
                "location": 4.0,
                "pool": null,
                "restaurant": null,
                "rooms": 5.0,
                "service": 5.0,
                "sleep": 5.0,
                "value": 4.0
            },
            "helpfulness": null,
            "id": 107583240,
            "likes": {
                "disliked": null,
                "liked": null
            },
            "rating": 5.0,
            "stay_parameters": "Stayed April 2011, traveled on business",
            "text": "Employees respect and attention are wonderful.",
            "title": "A hotel that I would definitely come back",
            "user": "yanina_mb"
        },
        {
            "date": "March 25, 2011",
            "detail_rating": {
                "business": null,
                "cleanliness": 5.0,
                "desk": null,
                "location": 5.0,
                "pool": null,
                "restaurant": null,
                "rooms": 4.0,
                "service": 5.0,
                "sleep": 5.0,
                "value": 5.0
            },
            "helpfulness": null,
            "id": 101573438,
            "likes": {
                "disliked": null,
                "liked": null
            },
            "rating": 5.0,
            "stay_parameters": "Stayed December 2010, traveled on business",
            "text": "I specially suggest having a lunch or dinner at the restorant. I am complete sure that it has the better chef in the City.",
            "title": "Very Good place to stay",
            "user": "toprasad"
        },
        {
            "date": "January 2, 2011",
            "detail_rating": {
                "business": null,
                "cleanliness": 5.0,
                "desk": null,
                "location": 4.0,
                "pool": null,
                "restaurant": null,
                "rooms": 4.0,
                "service": 5.0,
                "sleep": 4.0,
                "value": 5.0
            },
            "helpfulness": null,
            "id": 91445917,
            "likes": {
                "disliked": null,
                "liked": null
            },
            "rating": 5.0,
            "stay_parameters": "Stayed December 2010, traveled on business",
            "text": "Sergio Pezzi",
            "title": "One of the Nicest Hotels I haved stayed at in the World",
            "user": "DiamondJim08"
        },
        {
            "date": "November 30, 2010",
            "detail_rating": {
                "business": null,
                "cleanliness": 5.0,
                "desk": null,
                "location": 5.0,
                "pool": null,
                "restaurant": null,
                "rooms": 5.0,
                "service": 4.0,
                "sleep": 5.0,
                "value": 5.0
            },
            "helpfulness": null,
            "id": 88704465,
            "likes": {
                "disliked": null,
                "liked": null
            },
            "rating": 4.0,
            "stay_parameters": "Stayed November 2010, traveled as a couple",
            "text": "The rooms are very clean, food is excellent, service is very good.The location is very good. I've been twice already to this hotel and I would definitely return.",
            "title": "Exellent location with large rooms",
            "user": "vw97"
        },
        {
            "date": "November 16, 2011",
            "detail_rating": {
                "business": null,
                "cleanliness": 4.0,
                "desk": null,
                "location": 5.0,
                "pool": null,
                "restaurant": null,
                "rooms": 3.0,
                "service": 5.0,
                "sleep": 5.0,
                "value": 4.0
            },
            "helpfulness": null,
            "id": 120649799,
            "likes": {
                "disliked": null,
                "liked": null
            },
            "rating": 5.0,
            "stay_parameters": "Stayed October 2011, traveled on business",
            "text": "As other travelers have noted, the Regal Pacific is somewhat outdated. The rooms could use a design refresh, and the restaurant's 1980's decor is straight out of a Duran Duran music video.",
            "title": "Unparalleled service more than makes up for outdated design",
            "user": "WilliamSNichols"
        },
        {
            "date": "November 11, 2011",
            "detail_rating": {
                "business": null,
                "cleanliness": 5.0,
                "desk": null,
                "location": 5.0,
                "pool": null,
                "restaurant": null,
                "rooms": 4.0,
                "service": 5.0,
                "sleep": 4.0,
                "value": 4.0
            },
            "helpfulness": 1,
            "id": 120470022,
            "likes": {
                "disliked": null,
                "liked": null
            },
            "rating": 4.0,
            "stay_parameters": "Stayed October 2011, traveled on business",
            "text": "But in spite of its aesthetic shortcomings, the Regal Pacific is an excellent place to stay in Santiago. The service was nothing short of perfect, with staff glad to help with anything and everything. The breakfast spread is fantastic -- including fresh blackberries and strawberries -- and the hotel restaurant serves a mean Chilean sea bass.",
            "title": "Excellent Service",
            "user": "MSM1685"
        },
        {
            "date": "September 18, 2011",
            "detail_rating": {
                "business": null,
                "cleanliness": 5.0,
                "desk": null,
                "location": 5.0,
                "pool": null,
                "restaurant": null,
                "rooms": 3.0,
                "service": 4.0,
                "sleep": null,
                "value": 4.0
            },
            "helpfulness": null,
            "id": 118290805,
            "likes": {
                "disliked": null,
                "liked": null
            },
            "rating": 4.0,
            "stay_parameters": "Stayed May 2011",
            "text": "So, if you're after some old fashioned charm and don't mind stepping back in time to the mid-1980's, give the R.P a try.",
            "title": "A good location, attentive staff and good rooms and resturant",
            "user": "fiafia"
        },
        {
            "date": "August 28, 2011",
            "detail_rating": {
                "business": null,
                "cleanliness": 4.0,
                "desk": null,
                "location": null,
                "pool": null,
                "restaurant": null,
                "rooms": null,
                "service": 4.0,
                "sleep": 4.0,
                "value": 4.0
            },
            "helpfulness": 1,
            "id": 117371931,
            "likes": {
                "disliked": null,
                "liked": null
            },
            "rating": 4.0,
            "stay_parameters": "Stayed April 2011, traveled on business",
            "text": "It should be noted, however, that the Regal Pacific's beds/mattresses are very comfortable and do appear to have been replaced since Bon Jovi's heyday.",
            "title": "Great location for business: competitive rates",
            "user": "gutobrasil"
        },
        {
            "date": "August 17, 2011",
            "detail_rating": {
                "business": null,
                "cleanliness": null,
                "desk": null,
                "location": null,
                "pool": null,
                "restaurant": null,
                "rooms": null,
                "service": null,
                "sleep": null,
                "value": null
            },
            "helpfulness": null,
            "id": 116875006,
            "likes": {
                "disliked": null,
                "liked": null
            },
            "rating": 5.0,
            "stay_parameters": null,
            "text": "I stayed at the Regal Pacific while traveling on business in October. While this hotel is not super modern, I must say that the service was outstanding. The staff at the hotel is really friendly and always aiming to please their guests. The food at the hotel restaurant was also fantastic!",
            "title": "We stayed in July 2009 and loved it.",
            "user": "chilemomma"
        },
        {
            "date": "August 29, 2012",
            "detail_rating": {
                "business": null,
                "cleanliness": 4.0,
                "desk": null,
                "location": 3.0,
                "pool": null,
                "restaurant": null,
                "rooms": 4.0,
                "service": 5.0,
                "sleep": 4.0,
                "value": 3.0
            },
            "helpfulness": 4,
            "id": 138786047,
            "likes": {
                "disliked": null,
                "liked": null
            },
            "rating": 4.0,
            "stay_parameters": "Stayed July 2012, traveled on business",
            "text": "I do not know if the owners of the Regal Pacific chose \"being\" in Las Condes and not in \"Santiago\" on purpose to reach a higher position in the rankings. They are in the same area of other hotels (like the Hyatt), against which they do not compete. Las Condes, being probably a different municipality, is definitely Santiago...",
            "title": "They are in Santiago, should compare themselves with Santiago hotels...",
            "user": "ARUANO"
        },
        {
            "date": "July 29, 2012",
            "detail_rating": {
                "business": null,
                "cleanliness": 5.0,
                "desk": null,
                "location": 4.0,
                "pool": null,
                "restaurant": null,
                "rooms": 5.0,
                "service": 4.0,
                "sleep": 5.0,
                "value": 4.0
            },
            "helpfulness": 3,
            "id": 135742976,
            "likes": {
                "disliked": null,
                "liked": null
            },
            "rating": 4.0,
            "stay_parameters": "Stayed July 2012, traveled on business",
            "text": "That said, the hotel is a nice one, in need of some refurbishing. The rooms are ample and the breakfast is fine (i do not know the price, but don\u00b4t expect a five stars buffet). The service is very attentive.",
            "title": "Older in style - but very comfortable",
            "user": "Lee63255068"
        },
        {
            "date": "May 29, 2012",
            "detail_rating": {
                "business": null,
                "cleanliness": 5.0,
                "desk": null,
                "location": 5.0,
                "pool": null,
                "restaurant": null,
                "rooms": 5.0,
                "service": 4.0,
                "sleep": 4.0,
                "value": 4.0
            },
            "helpfulness": 1,
            "id": 130910605,
            "likes": {
                "disliked": null,
                "liked": null
            },
            "rating": 4.0,
            "stay_parameters": "Stayed May 2012, traveled on business",
            "text": "So, if you find it for a good price, and need to be in Las Condes area of Santiago (where many companies have their headquarters), it can be a good option.",
            "title": "Very comfortable and cozy",
            "user": "Cibele P"
        },
        {
            "date": "March 11, 2012",
            "detail_rating": {
                "business": null,
                "cleanliness": 5.0,
                "desk": null,
                "location": 5.0,
                "pool": null,
                "restaurant": null,
                "rooms": 5.0,
                "service": 5.0,
                "sleep": 5.0,
                "value": 5.0
            },
            "helpfulness": 1,
            "id": 125924918,
            "likes": {
                "disliked": null,
                "liked": null
            },
            "rating": 5.0,
            "stay_parameters": "Stayed February 2012, traveled as a couple",
            "text": "This hotel has obviously been around for a while, but the rooms were large and very comfortable. I had a suite that had a small kitchen/bar area, lounge areas seperate from the bed, which when travelling for business as I was made a big difference. The conference facilities while good were standard. Its in a good location, opposite a large multi story shopping complex and within walking distance of main restaurant area.",
            "title": "Good hotel good food good value",
            "user": "El-Tel2003"
        },
        {
            "date": "February 23, 2012",
            "detail_rating": {
                "business": null,
                "cleanliness": 4.0,
                "desk": null,
                "location": 3.0,
                "pool": null,
                "restaurant": null,
                "rooms": null,
                "service": null,
                "sleep": 4.0,
                "value": null
            },
            "helpfulness": 1,
            "id": 125090992,
            "likes": {
                "disliked": null,
                "liked": null
            },
            "rating": 4.0,
            "stay_parameters": "Stayed February 2012, traveled as a couple",
            "text": "Regal Pacific is a very colonial style with good and sympathetic staff, with comfortable rooms and all business support.",
            "title": "Upstairs, down stairs?",
            "user": "noonan101"
        },
        {
            "date": "January 27, 2012",
            "detail_rating": {
                "business": null,
                "cleanliness": 5.0,
                "desk": null,
                "location": 4.0,
                "pool": null,
                "restaurant": null,
                "rooms": 4.0,
                "service": 5.0,
                "sleep": 5.0,
                "value": 4.0
            },
            "helpfulness": 1,
            "id": 123691882,
            "likes": {
                "disliked": null,
                "liked": null
            },
            "rating": 5.0,
            "stay_parameters": "Stayed January 2012, traveled on business",
            "text": "I had the pleasure of spending a week here in January, the staff are all friendly with a good level of English. The food in the restaurant is great quality and beautifully presented. Rooms could do with a bit of an update, but they are clean and comfortable.",
            "title": "Excellent food, service and staff. Location not great for sightseeing.",
            "user": "Richsawsedges"
        },
        {
            "date": "January 12, 2012",
            "detail_rating": {
                "business": null,
                "cleanliness": 4.0,
                "desk": null,
                "location": 5.0,
                "pool": null,
                "restaurant": null,
                "rooms": 3.0,
                "service": 4.0,
                "sleep": 4.0,
                "value": 5.0
            },
            "helpfulness": null,
            "id": 122953594,
            "likes": {
                "disliked": null,
                "liked": null
            },
            "rating": 4.0,
            "stay_parameters": "Stayed January 2012, traveled as a couple",
            "text": "The hotel is great if you are on business at the nearby Offices, not a place to stay for sightseeing, it's a bit of a trip to the city.",
            "title": "Excellent location, dated decor, great service",
            "user": "whimsical_sd"
        },
        {
            "date": "January 10, 2012",
            "detail_rating": {
                "business": null,
                "cleanliness": 3.0,
                "desk": null,
                "location": 3.0,
                "pool": null,
                "restaurant": null,
                "rooms": 3.0,
                "service": 2.0,
                "sleep": 3.0,
                "value": 3.0
            },
            "helpfulness": 1,
            "id": 122897709,
            "likes": {
                "disliked": null,
                "liked": null
            },
            "rating": 3.0,
            "stay_parameters": "Stayed February 2011, traveled as a couple",
            "text": "It was the first time we visited Santiago. This hotel is literally right next to the subway/metro station. It's very convenient if you are the explorer type and don't mind getting around using the subway. Across the street of the hotel have a couple of decent shopping malls and little stores/cafes. One block from the hotel is a large supermarket (Lider). Very convenient location. However, it's not very close to all the tourist attractions, which are mostly located in the Santiago downtown area. It was fine for us as it's only about US$1 for one way subway ticket to go anywhere...",
            "title": "Good Location and Room - Poor service",
            "user": "Vlad-CWB"
        },
        {
            "date": "January 6, 2012",
            "detail_rating": {
                "business": null,
                "cleanliness": 5.0,
                "desk": null,
                "location": 3.0,
                "pool": null,
                "restaurant": null,
                "rooms": 5.0,
                "service": 5.0,
                "sleep": 5.0,
                "value": 5.0
            },
            "helpfulness": null,
            "id": 122689118,
            "likes": {
                "disliked": null,
                "liked": null
            },
            "rating": 5.0,
            "stay_parameters": "Stayed January 2012, traveled as a couple",
            "text": "The hotel itself is a bit small. Lobby is small. Reception area is small. It's also a bit dated. It still has excellent service though - like, they still have nightly turn down service that most hotels don't have.... or give you a shoe cloth to clean your shoes... which I rarely see in hotels nowadays. Hotel breakfast is okay. They have a few hot items (eggs, pancakes, sausages, bacon), some fruits (strawberries will not be replaced once it's emptied... which other fruits will be replaced), toasts, some ham, juice, tea, coffee, etc.",
            "title": "Fabulous room",
            "user": "keentravellerNotts"
        },
        {
            "date": "December 18, 2011",
            "detail_rating": {
                "business": null,
                "cleanliness": 3.0,
                "desk": null,
                "location": 4.0,
                "pool": null,
                "restaurant": null,
                "rooms": 3.0,
                "service": 3.0,
                "sleep": 4.0,
                "value": 3.0
            },
            "helpfulness": 1,
            "id": 121869859,
            "likes": {
                "disliked": null,
                "liked": null
            },
            "rating": 3.0,
            "stay_parameters": "Stayed December 2011, traveled as a couple",
            "text": "We do not speak spanish and fortunately that is 1 staff on duty that can speak OK english, and we were able to communicate with her well.",
            "title": "The 4.5 star rating is misleading. It is a good 3 star hotel.",
            "user": "Farhad A"
        }
    ],
    "slim_ranking": 0.168674698795,
    "stars": 4.5,
    "tripadvisor": {
        "VISITED": false,
        "country_name": null,
        "locality": null,
        "pic_link": null,
        "street_address": null
    },
    "user_rating": 4.5,
    "variance": {
        "average": 23,
        "excellent": 96,
        "poor": 5,
        "terrible": 3,
        "very good": 70
    }
}