{
    "aka": "Marriott Warsaw",
    "description": "Located in the heart of Poland\u2019s capital city, Warsaw Marriott Hotel offers not only easy access to all major sightseeing attractions and financial district but mostly elegant and comfortable interiors.The hotel offers 518 beautifully appointed guest rooms, including 95 suites, 3 Concierge levels; on-site parking and shopping area. In each room guest will find new bed from Marriott, with down comforters, designer duvets and fluffier pillows and amenities like tea and coffee maker, spacious work area and Wi-Fi in rooms.The hotel is also a home to chic shopping gallery and tempting dining options, including the enchanting Parmizzano's Restaurant, famous for its fine Italian cuisine and 40th floor Panorama Bar & Lounge with magnificent views over Warsaw.The World Class Health Academy provides state of the art equipment for a thorough workout, swimming pool, sauna, steam bath and newly opened Euphoria Spa.For business and social events, the Warsaw Marriott Hotel offers over 2,600 sq m of flexible meeting and exhibition venue including 19 meeting rooms.",
    "detail_rating": {
        "cleanliness": 4.5,
        "location": 4.5,
        "rooms": 4.5,
        "service": 4.5,
        "sleep": 4.5,
        "value": 4.5
    },
    "location": {
        "city": null,
        "continent": "Europe",
        "country": "Poland",
        "proposed_city": "Warsaw",
        "province": null,
        "region": "Central Poland"
    },
    "name": "Marriott Hotel",
    "places": {
        "aka": [
            "Warsaw"
        ],
        "hotel_description": [
            "Warsaw",
            "Bar"
        ],
        "hotel_name": []
    },
    "review_count": 943,
    "review_count_current": 20,
    "reviews": [
        {
            "date": "March 2, 2007",
            "detail_rating": {
                "business": null,
                "cleanliness": 5.0,
                "desk": null,
                "front_desk": 5.0,
                "location": 5.0,
                "pool": null,
                "restaurant": null,
                "rooms": 5.0,
                "service": 5.0,
                "sleep": null,
                "value": 5.0
            },
            "helpfulness": 6,
            "id": 6900798,
            "likes": {
                "disliked": "\u2014 Expensive bar!",
                "liked": "\u2014 Clean hotel, great location"
            },
            "rating": 4.0,
            "stay_parameters": "Stayed February 2007, traveled with family",
            "text": "We arrived in Poland in February to snow and Warsaw looked just like a postcard!",
            "title": "Winter Postcard",
            "user": "HertsHappytraveller"
        },
        {
            "date": "March 1, 2007",
            "detail_rating": {
                "business": 5.0,
                "cleanliness": 4.0,
                "desk": null,
                "front_desk": 5.0,
                "location": 5.0,
                "pool": null,
                "restaurant": null,
                "rooms": 4.0,
                "service": 4.0,
                "sleep": null,
                "value": 5.0
            },
            "helpfulness": 2,
            "id": 6898758,
            "likes": {
                "disliked": null,
                "liked": null
            },
            "rating": 4.0,
            "stay_parameters": "Stayed November 2006, traveled on business",
            "text": "We had a terrific view from our room on the 24th floor overlooking the Science and Culture museum. We stayed at the Marriott for five days with our two children in a family room. The hotel was what you would expect from a 5* hotel - beautiful hotel, very clean and friendly staff.",
            "title": "Great Location and service",
            "user": "tornado78"
        },
        {
            "date": "February 13, 2007",
            "detail_rating": {
                "business": null,
                "cleanliness": null,
                "desk": null,
                "location": null,
                "pool": null,
                "restaurant": null,
                "rooms": null,
                "service": null,
                "sleep": null,
                "value": null
            },
            "helpfulness": 3,
            "id": 6786749,
            "likes": {
                "disliked": null,
                "liked": null
            },
            "rating": 5.0,
            "stay_parameters": null,
            "text": "The hotel is in a great location for exploring the city and for those of you who love shopping, and more importantly those of you who love designer wear, this is the city for you!!",
            "title": "Great place to visit",
            "user": "dhoward8"
        },
        {
            "date": "February 7, 2007",
            "detail_rating": {
                "business": null,
                "cleanliness": null,
                "desk": null,
                "location": null,
                "pool": null,
                "restaurant": null,
                "rooms": null,
                "service": null,
                "sleep": null,
                "value": null
            },
            "helpfulness": 2,
            "id": 6752372,
            "likes": {
                "disliked": null,
                "liked": null
            },
            "rating": 5.0,
            "stay_parameters": null,
            "text": "The bars in the hotel are expensive - before going to the Panoramic Bar first check that you don't already have the same view from your bedroom window as the bar prices here are not cheap! The Lobby Bar is also expensive so we would suggest drinking outside of the hotel.",
            "title": "Fantastic Place",
            "user": "TheChapman"
        },
        {
            "date": "February 3, 2007",
            "detail_rating": {
                "business": null,
                "cleanliness": null,
                "desk": null,
                "location": null,
                "pool": null,
                "restaurant": null,
                "rooms": null,
                "service": null,
                "sleep": null,
                "value": null
            },
            "helpfulness": 4,
            "id": 6737417,
            "likes": {
                "disliked": null,
                "liked": null
            },
            "rating": 4.0,
            "stay_parameters": null,
            "text": "The Champions Sports Bar, which is owned by the hotel, is far less expensive and serves good food. The staff were very friendly with the majority speaking very good English. \"Happy hour\" is from 5-7 pm weekdays and from Friday night to Sunday closing. Beer prices approx 7.5 szl at happy hour rate and 12 szl at other times.",
            "title": "Very good location",
            "user": "PawelL"
        },
        {
            "date": "November 28, 2006",
            "detail_rating": {
                "business": 3.0,
                "cleanliness": 4.0,
                "desk": null,
                "front_desk": 3.0,
                "location": 3.0,
                "pool": null,
                "restaurant": null,
                "rooms": 3.0,
                "service": 3.0,
                "sleep": null,
                "value": 3.0
            },
            "helpfulness": 3,
            "id": 6230447,
            "likes": {
                "disliked": "\u2014 Over-priced, small rooms and breakfast was just crazy!",
                "liked": "\u2014 The location - right in the centre of town"
            },
            "rating": 3.0,
            "stay_parameters": "Stayed November 2006, traveled on business",
            "text": "I`ve visited most of the hotels in central Warsaw over the years, but never the Marriott. The Champions bar downstairs is great to watch the live sports ( they show most of the Champions League, Premiership and La liga games) and I`m afraid that`s about it.",
            "title": "Dissapointing",
            "user": "Liam F"
        },
        {
            "date": "November 15, 2006",
            "detail_rating": {
                "business": null,
                "cleanliness": 5.0,
                "desk": null,
                "front_desk": 5.0,
                "location": 5.0,
                "pool": null,
                "restaurant": null,
                "rooms": 5.0,
                "service": 5.0,
                "sleep": null,
                "value": 5.0
            },
            "helpfulness": 8,
            "id": 6132999,
            "likes": {
                "disliked": null,
                "liked": null
            },
            "rating": 5.0,
            "stay_parameters": "Stayed November 2006",
            "text": "Breakfast is what can only be described as a free-for-all - that`s if you can get a seat. The breakfast is passable and if you have 20 mins to wait on coffee ..",
            "title": "Highly recommended...",
            "user": "cruisedoctor"
        },
        {
            "date": "September 20, 2006",
            "detail_rating": {
                "business": 4.0,
                "cleanliness": 5.0,
                "desk": null,
                "front_desk": 4.0,
                "location": 4.0,
                "pool": null,
                "restaurant": null,
                "rooms": 5.0,
                "service": 5.0,
                "sleep": null,
                "value": 4.0
            },
            "helpfulness": 4,
            "id": 5818808,
            "likes": {
                "disliked": null,
                "liked": null
            },
            "rating": 4.0,
            "stay_parameters": "Stayed May 2006, traveled as a couple",
            "text": "The rooms ( I booked an executive room ) are very small with large enough bed, tv, steam-iron and ironing board. They could do with a lick of paint too..",
            "title": "Great",
            "user": "angelicface11"
        },
        {
            "date": "August 30, 2006",
            "detail_rating": {
                "business": null,
                "cleanliness": 5.0,
                "desk": null,
                "front_desk": 5.0,
                "location": 5.0,
                "pool": null,
                "restaurant": null,
                "rooms": 5.0,
                "service": 5.0,
                "sleep": null,
                "value": 5.0
            },
            "helpfulness": 8,
            "id": 5728771,
            "likes": {
                "disliked": null,
                "liked": null
            },
            "rating": 5.0,
            "stay_parameters": "Stayed August 2006, traveled as a couple",
            "text": "Bathroom was very small, with a shower over the bath, but it was clean.",
            "title": "Nice hotel, great location",
            "user": "wfejk3"
        },
        {
            "date": "August 27, 2006",
            "detail_rating": {
                "business": null,
                "cleanliness": 5.0,
                "desk": null,
                "front_desk": 5.0,
                "location": 4.0,
                "pool": null,
                "restaurant": null,
                "rooms": 4.0,
                "service": null,
                "sleep": null,
                "value": 5.0
            },
            "helpfulness": 1,
            "id": 5712453,
            "likes": {
                "disliked": "\u2014 Small room",
                "liked": "\u2014 Great service"
            },
            "rating": 4.0,
            "stay_parameters": "Stayed August 2006, traveled with friends",
            "text": "Overall, dissapointing, Wished I paid the extra \u00a320 and went back to the Westin",
            "title": "Good value",
            "user": "Wyndsong"
        },
        {
            "date": "May 4, 2007",
            "detail_rating": {
                "business": null,
                "cleanliness": 5.0,
                "desk": null,
                "front_desk": 5.0,
                "location": 5.0,
                "pool": null,
                "restaurant": null,
                "rooms": 4.0,
                "service": 5.0,
                "sleep": null,
                "value": 4.0
            },
            "helpfulness": 1,
            "id": 7545483,
            "likes": {
                "disliked": null,
                "liked": null
            },
            "rating": 4.0,
            "stay_parameters": "Stayed May 2007, traveled with friends",
            "text": "Beautiful Hotel, excellent location and extremely helpful staff",
            "title": "Above Average",
            "user": "DublinBiggs"
        },
        {
            "date": "May 4, 2007",
            "detail_rating": {
                "business": 3.0,
                "cleanliness": 4.0,
                "desk": null,
                "front_desk": 3.0,
                "location": 4.0,
                "pool": null,
                "restaurant": null,
                "rooms": 2.0,
                "service": 1.0,
                "sleep": null,
                "value": 1.0
            },
            "helpfulness": 5,
            "id": 7544708,
            "likes": {
                "disliked": "\u2014 The service and staff attitude",
                "liked": "\u2014 The view from the window."
            },
            "rating": 1.0,
            "stay_parameters": "Stayed January 2007, traveled with family",
            "text": "My mother and I were there for a week, for the European Ice Skating Championships.",
            "title": "Was not impressed!",
            "user": "Sumpurka"
        },
        {
            "date": "April 12, 2007",
            "detail_rating": {
                "business": 3.0,
                "cleanliness": 5.0,
                "desk": null,
                "front_desk": 4.0,
                "location": 3.0,
                "pool": null,
                "restaurant": null,
                "rooms": 5.0,
                "service": 4.0,
                "sleep": null,
                "value": 4.0
            },
            "helpfulness": 3,
            "id": 7339152,
            "likes": {
                "disliked": "\u2014 Walking distance to local sites(?)",
                "liked": "\u2014 Comfortable Rooms"
            },
            "rating": 4.0,
            "stay_parameters": "Stayed April 2007, traveled on business",
            "text": "There were several problems with this hotel:",
            "title": "Nice Hotel",
            "user": "Jeremy F"
        },
        {
            "date": "March 26, 2007",
            "detail_rating": {
                "business": 3.0,
                "cleanliness": 4.0,
                "desk": null,
                "front_desk": 4.0,
                "location": 5.0,
                "pool": null,
                "restaurant": null,
                "rooms": 4.0,
                "service": 3.0,
                "sleep": null,
                "value": 4.0
            },
            "helpfulness": 1,
            "id": 7225153,
            "likes": {
                "disliked": "\u2014 The city!",
                "liked": "\u2014 The pool! and the view!"
            },
            "rating": 4.0,
            "stay_parameters": "Stayed March 2007, traveled on business",
            "text": "1. The staff was not friendly at all...for example we asked for bath robes (there weren't any in our room) and the lady at the reception told us that only executive rooms get bath robes! She seemed to have forgotten that she works in a 5 star hotel. Finally they provided us with some, but they acted like they were doing us a huge favour.",
            "title": "Great hotel, no so great city!",
            "user": "jimroger17767"
        },
        {
            "date": "March 11, 2007",
            "detail_rating": {
                "business": 5.0,
                "cleanliness": 5.0,
                "desk": null,
                "front_desk": 5.0,
                "location": 5.0,
                "pool": null,
                "restaurant": null,
                "rooms": 5.0,
                "service": 5.0,
                "sleep": null,
                "value": 5.0
            },
            "helpfulness": 1,
            "id": 7011664,
            "likes": {
                "disliked": "\u2014 Nothing",
                "liked": "\u2014 The Rooms, The Beds, Free Internet, Breakfast, Health Club"
            },
            "rating": 5.0,
            "stay_parameters": "Stayed March 2007, traveled on business",
            "text": "2. The room was tiny, there were two double beds which took up the whole room. On every bed there were 6(!) pillows. Every night we had to put aside 10 out of the 12 pillows and every day the cleaning lady would put them back.",
            "title": "A Fantastic Hotel",
            "user": "sb5000"
        },
        {
            "date": "July 10, 2007",
            "detail_rating": {
                "business": 3.0,
                "cleanliness": 5.0,
                "desk": null,
                "front_desk": 5.0,
                "location": 4.0,
                "pool": null,
                "restaurant": null,
                "rooms": 5.0,
                "service": 5.0,
                "sleep": null,
                "value": 5.0
            },
            "helpfulness": 2,
            "id": 8096533,
            "likes": {
                "disliked": "\u2014 Nothing",
                "liked": "\u2014 Room, service."
            },
            "rating": 5.0,
            "stay_parameters": "Stayed November 2006, traveled on business",
            "text": "I stayed two weeks in this hotel twice for business. My experience was great. The hotel staff is very efficient. The rooms are very comfortable and spacious. The view from the room is very nice also.",
            "title": "Excellent business trip",
            "user": "Gremio"
        },
        {
            "date": "June 25, 2007",
            "detail_rating": {
                "business": 5.0,
                "cleanliness": 5.0,
                "desk": null,
                "front_desk": 5.0,
                "location": 4.0,
                "pool": null,
                "restaurant": null,
                "rooms": 5.0,
                "service": 4.0,
                "sleep": null,
                "value": 5.0
            },
            "helpfulness": 4,
            "id": 7989717,
            "likes": {
                "disliked": "\u2014 location",
                "liked": "\u2014 great value"
            },
            "rating": 5.0,
            "stay_parameters": "Stayed June 2007, traveled solo",
            "text": "The hotel breakfast is delicious. There is also a good Italian restaurant and some bars, besides the casino. The gym is very good, swimming pool and saunas also.",
            "title": "Escellent hotel in Warsaw",
            "user": "lipnica"
        },
        {
            "date": "May 22, 2007",
            "detail_rating": {
                "business": null,
                "cleanliness": 5.0,
                "desk": null,
                "front_desk": 3.0,
                "location": 4.0,
                "pool": null,
                "restaurant": null,
                "rooms": 5.0,
                "service": 4.0,
                "sleep": null,
                "value": 5.0
            },
            "helpfulness": 1,
            "id": 7671694,
            "likes": {
                "disliked": null,
                "liked": "\u2014 Room was very comfortable."
            },
            "rating": 5.0,
            "stay_parameters": "Stayed May 2007, traveled with friends",
            "text": "The hotel location is very good, next to the Palace of Culture.",
            "title": "Comfort in Warsaw",
            "user": "MsKim"
        },
        {
            "date": "May 21, 2007",
            "detail_rating": {
                "business": null,
                "cleanliness": null,
                "desk": null,
                "location": null,
                "pool": null,
                "restaurant": null,
                "rooms": null,
                "service": null,
                "sleep": null,
                "value": null
            },
            "helpfulness": 3,
            "id": 7666315,
            "likes": {
                "disliked": null,
                "liked": null
            },
            "rating": 5.0,
            "stay_parameters": null,
            "text": "I recommend this hotel not only for business but also for pleasure.",
            "title": "Warsaw - Stag w/end",
            "user": "BestyLondon"
        },
        {
            "date": "May 13, 2007",
            "detail_rating": {
                "business": 5.0,
                "cleanliness": 5.0,
                "desk": null,
                "front_desk": 5.0,
                "location": 5.0,
                "pool": null,
                "restaurant": null,
                "rooms": 5.0,
                "service": 5.0,
                "sleep": null,
                "value": 5.0
            },
            "helpfulness": 1,
            "id": 7593727,
            "likes": {
                "disliked": "\u2014 Nothing",
                "liked": "\u2014 Location"
            },
            "rating": 5.0,
            "stay_parameters": "Stayed May 2007, traveled on business",
            "text": "I stayed at the Marriott 3 days in early June. The hotel deserves its 5 stars rating with quiet and comfortable rooms, friendly staff and very good breakfast buffet. They also have their own taxi drivers with brand new Mercedes. The hotel is quite central (in front of the train station) but about a 15 minute walk to the old town. On the ground floor there is a lot of services such as cafe, restaurant, ATM, Budget rent a car and Avis.",
            "title": "The place to stay in Warsaw",
            "user": "byuby5"
        }
    ],
    "slim_ranking": 0.137614678899,
    "stars": 5,
    "tripadvisor": {
        "VISITED": false,
        "country_name": null,
        "locality": null,
        "pic_link": null,
        "street_address": null
    },
    "user_rating": 4.5,
    "variance": {
        "average": 114,
        "excellent": 454,
        "poor": 18,
        "terrible": 12,
        "very good": 345
    }
}