{
    "aka": "Tivoli Jardim Lisbon",
    "description": "Tivoli Jardim reopens totally remodeled with new bright and contemporary decoration where the lines are based on fresh and natural themes. This oasis in the centre of Lisbon meets the most demanding of tastes with new rooms and exceptional facilities for both business and pleasure. The new colours of this welcoming 4 star hotel, are warm and comfortable but with a balance which creates soothing and restful settings.",
    "detail_rating": {
        "cleanliness": 4.5,
        "location": 4.5,
        "rooms": 4.0,
        "service": 4.0,
        "sleep": 4.0,
        "value": 4.0
    },
    "location": {
        "city": null,
        "continent": null,
        "country": null,
        "proposed_city": "Jardim",
        "province": null,
        "region": null
    },
    "name": "Tivoli Jardim Hotel",
    "places": {
        "aka": [
            "Tivoli",
            "Jardim",
            "Lisbon"
        ],
        "hotel_description": [
            "Tivoli",
            "Jardim",
            "Lisbon"
        ],
        "hotel_name": [
            "Tivoli",
            "Jardim"
        ]
    },
    "review_count": 330,
    "review_count_current": 25,
    "reviews": [
        {
            "date": "July 10, 2011",
            "detail_rating": {
                "business": null,
                "cleanliness": null,
                "desk": null,
                "location": null,
                "pool": null,
                "restaurant": null,
                "rooms": null,
                "service": null,
                "sleep": null,
                "value": null
            },
            "helpfulness": null,
            "id": 115207427,
            "likes": {
                "disliked": null,
                "liked": null
            },
            "rating": 2.0,
            "stay_parameters": null,
            "text": "first impression: dirty room. furniture is not in good condition.",
            "title": "not as i expected",
            "user": "faricas"
        },
        {
            "date": "May 15, 2011",
            "detail_rating": {
                "business": null,
                "cleanliness": null,
                "desk": null,
                "location": null,
                "pool": null,
                "restaurant": null,
                "rooms": null,
                "service": null,
                "sleep": null,
                "value": null
            },
            "helpfulness": null,
            "id": 108332762,
            "likes": {
                "disliked": null,
                "liked": null
            },
            "rating": 3.0,
            "stay_parameters": null,
            "text": "bed was small and not very comfortable. we asked for a king size bed but they gave us a twin. the room service is the worst i have tried. waited more than 1h30 for them to pick up the phone.. not professional at all.",
            "title": "Mixed feelings",
            "user": "iliasv"
        },
        {
            "date": "May 13, 2011",
            "detail_rating": {
                "business": null,
                "cleanliness": null,
                "desk": null,
                "location": null,
                "pool": null,
                "restaurant": null,
                "rooms": null,
                "service": null,
                "sleep": null,
                "value": null
            },
            "helpfulness": null,
            "id": 108139780,
            "likes": {
                "disliked": null,
                "liked": null
            },
            "rating": 3.0,
            "stay_parameters": null,
            "text": "we had dinner in our room but the menu is not what i was expecting. just a few options with no interest at all and very, but very expensive. you simply can go around the corner and find some nice restaurants with wonderful food at a reasonable price.",
            "title": "Compact but Clean",
            "user": "worldgypse"
        },
        {
            "date": "May 13, 2011",
            "detail_rating": {
                "business": null,
                "cleanliness": null,
                "desk": null,
                "location": null,
                "pool": null,
                "restaurant": null,
                "rooms": null,
                "service": null,
                "sleep": null,
                "value": null
            },
            "helpfulness": null,
            "id": 108113815,
            "likes": {
                "disliked": null,
                "liked": null
            },
            "rating": 3.0,
            "stay_parameters": null,
            "text": "staff has a lot to learn when it's there...",
            "title": "Some good, some bad",
            "user": "ScotinNorway"
        },
        {
            "date": "May 11, 2011",
            "detail_rating": {
                "business": null,
                "cleanliness": null,
                "desk": null,
                "location": null,
                "pool": null,
                "restaurant": null,
                "rooms": null,
                "service": null,
                "sleep": null,
                "value": null
            },
            "helpfulness": null,
            "id": 107769342,
            "likes": {
                "disliked": null,
                "liked": null
            },
            "rating": 2.0,
            "stay_parameters": null,
            "text": "breakfast is nice and plenty.",
            "title": "Disappointing",
            "user": "BarrieDunnLondon"
        },
        {
            "date": "April 4, 2011",
            "detail_rating": {
                "business": null,
                "cleanliness": null,
                "desk": null,
                "location": null,
                "pool": null,
                "restaurant": null,
                "rooms": null,
                "service": null,
                "sleep": null,
                "value": null
            },
            "helpfulness": null,
            "id": 102720538,
            "likes": {
                "disliked": null,
                "liked": null
            },
            "rating": 5.0,
            "stay_parameters": null,
            "text": "We stayed at Tivoli Jardim for a weekend in April. I had chosen this hotel for the location and it was perfect. We could walk to the square of Restauradores, and there were plenty of buses and a metro station to take us everywhere else, including to the airport, on the main avenue.",
            "title": "Great location, very good service",
            "user": "Neuforce"
        },
        {
            "date": "December 29, 2010",
            "detail_rating": {
                "business": null,
                "cleanliness": null,
                "desk": null,
                "location": null,
                "pool": null,
                "restaurant": null,
                "rooms": null,
                "service": null,
                "sleep": null,
                "value": null
            },
            "helpfulness": null,
            "id": 91020035,
            "likes": {
                "disliked": null,
                "liked": null
            },
            "rating": 3.0,
            "stay_parameters": null,
            "text": "The hotel is a no-surprise 4 star hotel, with the typical equipment (wi fi, tv, coffee maker, etc), a pleasant balcony, and the typical features of such hotels. Clean, bright, modern.",
            "title": "Disappointed",
            "user": "emliju"
        },
        {
            "date": "December 6, 2010",
            "detail_rating": {
                "business": null,
                "cleanliness": null,
                "desk": null,
                "location": null,
                "pool": null,
                "restaurant": null,
                "rooms": null,
                "service": null,
                "sleep": null,
                "value": null
            },
            "helpfulness": null,
            "id": 89193054,
            "likes": {
                "disliked": null,
                "liked": null
            },
            "rating": 3.0,
            "stay_parameters": null,
            "text": "The staff was very friendly and welcoming.",
            "title": "50/50 experience",
            "user": "jb1933"
        },
        {
            "date": "December 5, 2010",
            "detail_rating": {
                "business": null,
                "cleanliness": null,
                "desk": null,
                "location": null,
                "pool": null,
                "restaurant": null,
                "rooms": null,
                "service": null,
                "sleep": null,
                "value": null
            },
            "helpfulness": null,
            "id": 89106666,
            "likes": {
                "disliked": null,
                "liked": null
            },
            "rating": 5.0,
            "stay_parameters": null,
            "text": "Having stayed here many times in the past we were most disappointed - the recent refurbishment has made the hotel modern to the point of being stark and cold. The room was miniscule - maybe we were unlucky with that. The room was also fvery cold and did not warm up even by the next morning leaving the bathroom so cold you had to be extremely brave to shed clothes and take a shower. What a shame as this used to be a great place to stay - we will no be booking this one again.",
            "title": "Very nice hotel.",
            "user": "Nil A"
        },
        {
            "date": "November 10, 2010",
            "detail_rating": {
                "business": null,
                "cleanliness": null,
                "desk": null,
                "location": null,
                "pool": null,
                "restaurant": null,
                "rooms": null,
                "service": null,
                "sleep": null,
                "value": null
            },
            "helpfulness": null,
            "id": 86623813,
            "likes": {
                "disliked": null,
                "liked": null
            },
            "rating": 4.0,
            "stay_parameters": null,
            "text": "My husband and I stayed at Tivoli Jardim while in Portugal on our vacation after Thanksgiving. We spent two nights there at the end of November and enjoyed our experience very much - kind and helpful staff, super comfortable bed and pillows, a fun and trendy good restaurant/bar, great location for touring the city, etc.",
            "title": "Smart hotel in a good position and the pool was a big plus",
            "user": "KernowTraveller9"
        },
        {
            "date": "November 25, 2011",
            "detail_rating": {
                "business": null,
                "cleanliness": null,
                "desk": null,
                "location": null,
                "pool": null,
                "restaurant": null,
                "rooms": null,
                "service": null,
                "sleep": null,
                "value": null
            },
            "helpfulness": null,
            "id": 121017486,
            "likes": {
                "disliked": null,
                "liked": null
            },
            "rating": 4.0,
            "stay_parameters": null,
            "text": "I have stayed several times in this hotel, so there were no surprises.",
            "title": "central friendly and confortable",
            "user": "edgarsz"
        },
        {
            "date": "October 24, 2011",
            "detail_rating": {
                "business": null,
                "cleanliness": null,
                "desk": null,
                "location": null,
                "pool": null,
                "restaurant": null,
                "rooms": null,
                "service": null,
                "sleep": null,
                "value": null
            },
            "helpfulness": null,
            "id": 119691769,
            "likes": {
                "disliked": null,
                "liked": null
            },
            "rating": 3.0,
            "stay_parameters": null,
            "text": "The hotel is modern, rooms are nice and comfortable.",
            "title": "Well located, average room, staff could be more friendly.",
            "user": "Planetorexplor"
        },
        {
            "date": "October 18, 2011",
            "detail_rating": {
                "business": null,
                "cleanliness": null,
                "desk": null,
                "location": null,
                "pool": null,
                "restaurant": null,
                "rooms": null,
                "service": null,
                "sleep": null,
                "value": null
            },
            "helpfulness": null,
            "id": 119443180,
            "likes": {
                "disliked": null,
                "liked": null
            },
            "rating": 4.0,
            "stay_parameters": null,
            "text": "The location is ideal, just off one of the central avenues of Lisbon , but not on the avenue itself sparing you the noise of the incessant traffic.",
            "title": "Convenient and well-kept",
            "user": "Anders_Sto"
        },
        {
            "date": "September 28, 2011",
            "detail_rating": {
                "business": null,
                "cleanliness": null,
                "desk": null,
                "location": null,
                "pool": null,
                "restaurant": null,
                "rooms": null,
                "service": null,
                "sleep": null,
                "value": null
            },
            "helpfulness": null,
            "id": 118697885,
            "likes": {
                "disliked": null,
                "liked": null
            },
            "rating": 4.0,
            "stay_parameters": null,
            "text": "On the other hand part of the rooms facing the front of the hotel , when their windows are open, can hear the workings of some huge air conditioner compressors of the building next door.",
            "title": "good room, great location",
            "user": "peterinholland"
        },
        {
            "date": "August 22, 2011",
            "detail_rating": {
                "business": null,
                "cleanliness": null,
                "desk": null,
                "location": null,
                "pool": null,
                "restaurant": null,
                "rooms": null,
                "service": null,
                "sleep": null,
                "value": null
            },
            "helpfulness": null,
            "id": 117084073,
            "likes": {
                "disliked": null,
                "liked": null
            },
            "rating": 4.0,
            "stay_parameters": null,
            "text": ".",
            "title": "Great location. Great value. Would rec it.",
            "user": "milestogo26"
        },
        {
            "date": "August 15, 2011",
            "detail_rating": {
                "business": null,
                "cleanliness": null,
                "desk": null,
                "location": null,
                "pool": null,
                "restaurant": null,
                "rooms": null,
                "service": null,
                "sleep": null,
                "value": null
            },
            "helpfulness": null,
            "id": 116762919,
            "likes": {
                "disliked": null,
                "liked": null
            },
            "rating": 4.0,
            "stay_parameters": null,
            "text": "Review - Hotel Tivoli Jardim",
            "title": "Nice hotel, small but modern rooms, tiny lobby, good breakfast.",
            "user": "sunluva7"
        },
        {
            "date": "August 1, 2011",
            "detail_rating": {
                "business": null,
                "cleanliness": null,
                "desk": null,
                "location": null,
                "pool": null,
                "restaurant": null,
                "rooms": null,
                "service": null,
                "sleep": null,
                "value": null
            },
            "helpfulness": null,
            "id": 116121149,
            "likes": {
                "disliked": null,
                "liked": null
            },
            "rating": 4.0,
            "stay_parameters": null,
            "text": "This hotel in central Lisbon was the first stop of several on a family vacation through Portugal. Hotel Tivoli Jardim is the little sister hotel of the larger and grander Hotel Tivoli Lisboa next door. \u00a0The hotel was clean and modern, and the staff was pleasant and helpful. \u00a0Standard rooms are modern, nicely decorated, but a little small by American standards. \u00a0The lobby area is also very small. \u00a0With the exception of two clamshell hanging chairs located beside the reception desk, there was no place to sit and relax. \u00a0However, one flight up is a small lounge/bar with additional seating. \u00a0Our stay included breakfast, which offered a nice selection of fruit, cereal, yogurt, bacon, scrambled eggs, sausage and pastry. \u00a0Guests staying at Hotel Tivoli Jardim are welcomed to use the facilities at Tivoli Lisboa next door, including a pretty outdoor pool, but with a somewhat inconvenient hike up several levels of steps, but well worth the walk. \u00a0This lovely, inviting pool is round, surrounded by trees and greenery and includes bar service, and is a popular place to relax for guests from both hotels and, as such, lounge chairs are scarce during the mid-day hours. \u00a0Consequently, it was difficult at times to find a vacant chair or lounger. \u00a0Otherwise, it's a lovely hotel oasis. \u00a0For guests who don't mind small rooms and a less than inviting lobby, the hotel is a fine stopover for a short stay in Lisbon.",
            "title": "Good Hotel, Great Location",
            "user": "Sloan_Chace"
        },
        {
            "date": "July 25, 2011",
            "detail_rating": {
                "business": null,
                "cleanliness": null,
                "desk": null,
                "location": null,
                "pool": null,
                "restaurant": null,
                "rooms": null,
                "service": null,
                "sleep": null,
                "value": null
            },
            "helpfulness": null,
            "id": 115744301,
            "likes": {
                "disliked": null,
                "liked": null
            },
            "rating": 2.0,
            "stay_parameters": null,
            "text": "Had seven nights here at the end of July. The balcony rooms were \"a must\" for us and those at the Tivoli Jardim are usable (table and two chairs) and in the shade in the hot afternoons. Our room was clean and comfortable though we had to live out of suitcases for the week, as there are no drawers in the room (at least we didn't find any) and there is limited hanging space.",
            "title": "Ants all over the Dining Room",
            "user": "james23London"
        },
        {
            "date": "July 20, 2011",
            "detail_rating": {
                "business": null,
                "cleanliness": null,
                "desk": null,
                "location": null,
                "pool": null,
                "restaurant": null,
                "rooms": null,
                "service": null,
                "sleep": null,
                "value": null
            },
            "helpfulness": null,
            "id": 115566447,
            "likes": {
                "disliked": null,
                "liked": null
            },
            "rating": 5.0,
            "stay_parameters": null,
            "text": "The room is equipped with a Nespresso coffee maker and it's a 1E charge per cup (it's an extension to the mini-bar). It will make hot water too.",
            "title": "A Prazer",
            "user": "AndrewCrown"
        },
        {
            "date": "July 10, 2011",
            "detail_rating": {
                "business": null,
                "cleanliness": null,
                "desk": null,
                "location": null,
                "pool": null,
                "restaurant": null,
                "rooms": null,
                "service": null,
                "sleep": null,
                "value": null
            },
            "helpfulness": null,
            "id": 115210580,
            "likes": {
                "disliked": null,
                "liked": null
            },
            "rating": 4.0,
            "stay_parameters": null,
            "text": "The staff are friendly and helpful, our breakfast was included and was of a high standard with a good range of fresh food on offer.",
            "title": "Great location and very nice hotel",
            "user": "Hoya91"
        },
        {
            "date": "November 16, 2013",
            "detail_rating": {
                "business": null,
                "cleanliness": 5.0,
                "desk": null,
                "location": 5.0,
                "pool": null,
                "restaurant": null,
                "rooms": 4.0,
                "service": 5.0,
                "sleep": 5.0,
                "value": 5.0
            },
            "helpfulness": null,
            "id": 184883754,
            "likes": {
                "disliked": null,
                "liked": null
            },
            "rating": 5.0,
            "stay_parameters": "Stayed November 2013, traveled as a couple",
            "text": "I have stayed in this hotel several times and reviewed it as well. I has kept its very high standards.",
            "title": "location , confort and value for money",
            "user": "edgarsz"
        },
        {
            "date": "November 2, 2013",
            "detail_rating": {
                "business": null,
                "cleanliness": 4.0,
                "desk": null,
                "location": 4.0,
                "pool": null,
                "restaurant": null,
                "rooms": 4.0,
                "service": 3.0,
                "sleep": 4.0,
                "value": 4.0
            },
            "helpfulness": null,
            "id": 183254417,
            "likes": {
                "disliked": null,
                "liked": null
            },
            "rating": 4.0,
            "stay_parameters": "Stayed October 2013, traveled with friends",
            "text": "It is very well located, off one of the main avenues, but not on it, so much quieter. Rooms are comfortable and very well maintained . Staff is very friendly and helpful. Wifi is free for members of their frequent stayer program and you can join for free on the spot.",
            "title": "Nice hotel",
            "user": "Kokkaria"
        },
        {
            "date": "October 23, 2013",
            "detail_rating": {
                "business": null,
                "cleanliness": 4.0,
                "desk": null,
                "location": 3.0,
                "pool": null,
                "restaurant": null,
                "rooms": 3.0,
                "service": 3.0,
                "sleep": 4.0,
                "value": 3.0
            },
            "helpfulness": 1,
            "id": 182143532,
            "likes": {
                "disliked": null,
                "liked": null
            },
            "rating": 3.0,
            "stay_parameters": "Stayed October 2013, traveled as a couple",
            "text": "Try to stay on a high floor facing the back, far away from the air condition machines on the front of the hotel. Very good value at the rate offered at this time.",
            "title": "Not bad ,not great!",
            "user": "Anvers"
        },
        {
            "date": "October 8, 2013",
            "detail_rating": {
                "business": null,
                "cleanliness": 4.0,
                "desk": null,
                "location": 5.0,
                "pool": null,
                "restaurant": null,
                "rooms": 4.0,
                "service": 4.0,
                "sleep": 4.0,
                "value": 4.0
            },
            "helpfulness": 1,
            "id": 180196139,
            "likes": {
                "disliked": null,
                "liked": null
            },
            "rating": 4.0,
            "stay_parameters": "Stayed September 2013, traveled with friends",
            "text": "Nice hotel in a good area. Clean, comfortable, rather small room but we had an extra bed in it. Balcony and pool in a nice garden. Expensive breakfast.",
            "title": "A Good Hotel in the Centre of Lisbon",
            "user": "RonnieI48"
        },
        {
            "date": "October 5, 2013",
            "detail_rating": {
                "business": null,
                "cleanliness": 5.0,
                "desk": null,
                "location": 5.0,
                "pool": null,
                "restaurant": null,
                "rooms": 4.0,
                "service": 4.0,
                "sleep": 5.0,
                "value": 4.0
            },
            "helpfulness": null,
            "id": 179841801,
            "likes": {
                "disliked": null,
                "liked": null
            },
            "rating": 4.0,
            "stay_parameters": "Stayed September 2013, traveled on business",
            "text": "The hotel is very quiet as it\u00b4s on a dead-end street just behind the \"sister-hotel\" Tivoli on the main street.",
            "title": "Convenient location, quiet backstreet, small bathrooms.",
            "user": "Alan K"
        }
    ],
    "slim_ranking": 0.413636363636,
    "stars": 4,
    "tripadvisor": {
        "VISITED": false,
        "country_name": null,
        "locality": null,
        "pic_link": null,
        "street_address": null
    },
    "user_rating": 4.0,
    "variance": {
        "average": 59,
        "excellent": 93,
        "poor": 20,
        "terrible": 4,
        "very good": 154
    }
}