{
    "aka": "Mamaison Riverside Prague",
    "description": "Uniquely located and boasting award-winning Art Nouveau-style design, the upscale Mamaison Boutique Hotel Riverside Prague provides ideal accommodation for both leisure and business travellers in the trendy Smichov district of Prague. Charming and sophisticated, Mamaison Hotel Riverside Prague enjoys close connections to the city\u2019s business districts, the airport and its main cultural attractions. With elegant accommodation, views and top facilities, the hotel offers fantastic rates for city stays in stylish and historic surroundings, making it one of the most charming boutique hotels in Prague and number one for your Prague hotel reservation.",
    "detail_rating": {
        "cleanliness": 5.0,
        "location": 4.0,
        "rooms": 4.5,
        "service": 4.5,
        "sleep": 4.5,
        "value": 4.5
    },
    "location": {
        "city": "Prague",
        "continent": "Europe",
        "country": "Czech Republic",
        "proposed_city": null,
        "province": null,
        "region": "Bohemia"
    },
    "name": "Mamaison Riverside Hotel Prague",
    "places": {
        "aka": [
            "Riverside",
            "Prague"
        ],
        "hotel_description": [
            "Riverside",
            "Prague"
        ],
        "hotel_name": [
            "Riverside",
            "Prague"
        ]
    },
    "review_count": 815,
    "review_count_current": 20,
    "reviews": [
        {
            "date": "December 15, 2008",
            "detail_rating": {
                "business": null,
                "cleanliness": 3.0,
                "desk": null,
                "front_desk": 5.0,
                "location": 5.0,
                "pool": null,
                "restaurant": null,
                "rooms": 3.0,
                "service": 5.0,
                "sleep": null,
                "value": 4.0
            },
            "helpfulness": 2,
            "id": 22736117,
            "likes": {
                "disliked": "\u2014 The room space..",
                "liked": "\u2014 The bed!"
            },
            "rating": 4.0,
            "stay_parameters": "Stayed November 2008, traveled as a couple",
            "text": "We had a great time at this place!!",
            "title": "Beautiful Hotel",
            "user": "freid"
        },
        {
            "date": "October 30, 2008",
            "detail_rating": {
                "business": 3.0,
                "cleanliness": 5.0,
                "desk": null,
                "front_desk": 5.0,
                "location": 4.0,
                "pool": null,
                "restaurant": null,
                "rooms": 4.0,
                "service": 4.0,
                "sleep": null,
                "value": 5.0
            },
            "helpfulness": null,
            "id": 21404936,
            "likes": {
                "disliked": null,
                "liked": null
            },
            "rating": 5.0,
            "stay_parameters": "Stayed October 2008, traveled as a couple",
            "text": "The stuff was really nice and helpful. Even if they did not have our reservation when we arrived, we were allocated in a very nice room. It was not luxurious but cozy and with nice view to the river!",
            "title": "Excellent Stay!",
            "user": "Luv2Travel247"
        },
        {
            "date": "October 25, 2008",
            "detail_rating": {
                "business": 5.0,
                "cleanliness": 5.0,
                "desk": null,
                "front_desk": 5.0,
                "location": 4.0,
                "pool": null,
                "restaurant": null,
                "rooms": 5.0,
                "service": 5.0,
                "sleep": null,
                "value": 5.0
            },
            "helpfulness": 1,
            "id": 21194711,
            "likes": {
                "disliked": "\u2014 Location",
                "liked": "\u2014 Junior Suite room, free mini-bar"
            },
            "rating": 5.0,
            "stay_parameters": "Stayed October 2008, traveled with friends",
            "text": "The breakfast was nice but not rich for a SLH and the dinner that we had in our room was tasty and not very expensive.",
            "title": "So good for the price, I thought there was a catch...",
            "user": "NSI_Innerloop"
        },
        {
            "date": "October 21, 2008",
            "detail_rating": {
                "business": null,
                "cleanliness": 2.0,
                "desk": null,
                "front_desk": 3.0,
                "location": 5.0,
                "pool": null,
                "restaurant": null,
                "rooms": 4.0,
                "service": 1.0,
                "sleep": null,
                "value": 3.0
            },
            "helpfulness": 1,
            "id": 21070653,
            "likes": {
                "disliked": "\u2014 Location",
                "liked": "\u2014 Decor & Location"
            },
            "rating": 3.0,
            "stay_parameters": "Stayed October 2008, traveled as a couple",
            "text": "The place is not in the middle of the noizy city, but still just 10 min walk to the old city..",
            "title": "A bit disappointing",
            "user": "Shiregirl"
        },
        {
            "date": "October 1, 2008",
            "detail_rating": {
                "business": 5.0,
                "cleanliness": 5.0,
                "desk": null,
                "front_desk": 5.0,
                "location": 3.0,
                "pool": null,
                "restaurant": null,
                "rooms": 4.0,
                "service": 5.0,
                "sleep": null,
                "value": 4.0
            },
            "helpfulness": null,
            "id": 20528714,
            "likes": {
                "disliked": null,
                "liked": null
            },
            "rating": 4.0,
            "stay_parameters": "Stayed September 2008, traveled as a couple",
            "text": "We recommend this hotel to as many as possible who wants to have a nice short stay at Prague.",
            "title": "Really good!",
            "user": "wheely123"
        },
        {
            "date": "April 14, 2009",
            "detail_rating": {
                "business": null,
                "cleanliness": 5.0,
                "desk": null,
                "location": 3.0,
                "pool": null,
                "restaurant": null,
                "rooms": 2.0,
                "service": 2.0,
                "sleep": null,
                "value": 2.0
            },
            "helpfulness": null,
            "id": 27978970,
            "likes": {
                "disliked": null,
                "liked": null
            },
            "rating": 2.0,
            "stay_parameters": "Stayed April 2009, traveled as a couple",
            "text": "The only good thing I can say about Mamaison Riverside Prague is that it\u2019s clean and has a nice river view.",
            "title": "Majorly disappointing",
            "user": "stroffs"
        },
        {
            "date": "April 10, 2009",
            "detail_rating": {
                "business": null,
                "cleanliness": 5.0,
                "desk": null,
                "location": 3.0,
                "pool": null,
                "restaurant": null,
                "rooms": 4.0,
                "service": 4.0,
                "sleep": null,
                "value": 3.0
            },
            "helpfulness": null,
            "id": 27742535,
            "likes": {
                "disliked": null,
                "liked": null
            },
            "rating": 4.0,
            "stay_parameters": "Stayed April 2009, traveled with family",
            "text": "Beside of that:",
            "title": "Nice hotel but wouldn't stay there if I was paying full price.",
            "user": "dscottmsw"
        },
        {
            "date": "April 6, 2009",
            "detail_rating": {
                "business": null,
                "cleanliness": 5.0,
                "desk": null,
                "location": 5.0,
                "pool": null,
                "restaurant": null,
                "rooms": 5.0,
                "service": 5.0,
                "sleep": null,
                "value": 4.0
            },
            "helpfulness": null,
            "id": 27486874,
            "likes": {
                "disliked": null,
                "liked": null
            },
            "rating": 4.0,
            "stay_parameters": "Stayed December 2008, traveled as a couple",
            "text": "- Staffs\u2019 English is scratching basic, the hotel has no concierge and receptionists have no knowledge of the city (\u201dI don\u2019t drink coffee\u201d was the answer we got when asking for a recommendation for our morning coffee...).",
            "title": "Fantastic Hotel - Terrific New Years Eve!",
            "user": "TheQuietObserver"
        },
        {
            "date": "April 2, 2009",
            "detail_rating": {
                "business": null,
                "cleanliness": 5.0,
                "desk": null,
                "location": 4.0,
                "pool": null,
                "restaurant": null,
                "rooms": 5.0,
                "service": 5.0,
                "sleep": null,
                "value": 5.0
            },
            "helpfulness": 1,
            "id": 27286588,
            "likes": {
                "disliked": null,
                "liked": null
            },
            "rating": 5.0,
            "stay_parameters": "Stayed March 2009, traveled as a couple",
            "text": "- The tiny room is lacking basic contrivances, the hotel has no fitness center and we are still looking for the promised bathrobes.",
            "title": "Excellent hotel",
            "user": "MLWPaisley_Scotland"
        },
        {
            "date": "March 11, 2009",
            "detail_rating": {
                "business": null,
                "cleanliness": 5.0,
                "desk": null,
                "location": 4.0,
                "pool": null,
                "restaurant": null,
                "rooms": 5.0,
                "service": 4.0,
                "sleep": null,
                "value": 5.0
            },
            "helpfulness": null,
            "id": 26017752,
            "likes": {
                "disliked": null,
                "liked": null
            },
            "rating": 5.0,
            "stay_parameters": "Stayed January 2009, traveled as a couple",
            "text": "- Since the hotel had no late check out option, we ended up paying a full day rate for 7 hours use... (the hotel wasn\u2019t in full capacity so they wouldn\u2019t have lost a dime being a little bit more flexible).",
            "title": "Cant wait to go back!",
            "user": "mandyryan"
        },
        {
            "date": "March 8, 2009",
            "detail_rating": {
                "business": null,
                "cleanliness": 5.0,
                "desk": null,
                "location": 4.0,
                "pool": null,
                "restaurant": null,
                "rooms": 5.0,
                "service": 5.0,
                "sleep": null,
                "value": 5.0
            },
            "helpfulness": null,
            "id": 25787508,
            "likes": {
                "disliked": null,
                "liked": null
            },
            "rating": 5.0,
            "stay_parameters": "Stayed February 2009, traveled with family",
            "text": "We stayed at the Riverside at the end of February and could not be more pleased with our stay. We stayed in the Family Suite, which is a Riverview Suite and Standard room (with a view of the river as well, but smaller) connected with the door open. It was HUGE. We could have made it work in the Suite, but we loved the two bathrooms (excellent for families like ours: 4 yr old and 2 yr old). The staff was excellent and helped us travel via the trams and walking around. Its a great 20 minute walk up to Old Town, the Castle, everything that you need to see when visiting Prague. Go to the Black Rooster restaurant as they recommend, excellent taste of Czech cuisine. I could go on and on for this place, we loved it. If we return to Prague, this place is it!",
            "title": "Simply Fantastic",
            "user": "gaberock"
        },
        {
            "date": "February 18, 2009",
            "detail_rating": {
                "business": null,
                "cleanliness": 5.0,
                "desk": null,
                "location": 4.0,
                "pool": null,
                "restaurant": null,
                "rooms": 4.0,
                "service": 4.0,
                "sleep": null,
                "value": 4.0
            },
            "helpfulness": null,
            "id": 24738574,
            "likes": {
                "disliked": null,
                "liked": null
            },
            "rating": 4.0,
            "stay_parameters": "Stayed February 2009, traveled as a couple",
            "text": "Receptionists the most helpful and courteous at all times we have ever found,, even greater when you arrive at 11.00pm. Hotel clean with some rooms with a balcony and great view to the castle and across the river to the Old Town. Beds are very comfortable, rooms well furnished , bathroom superb with robes, good soaps etc but no slippers.We had just one breakfast which is served in the windowless basement but with a live cam feed of the exterior played on one of the walls.Food was fine but hot buffet very limited....do not pay 20 euros for breakfast...we paid 15 and that was for convenience on day 1....walk for 5 mins on the hotel side of the river and at the next bridge turn left on a main road and you will see the Restaurace Savoy and buy the Savoy special for a super meal at a great price.",
            "title": "Most helpful reception staff, comfortable clean room",
            "user": "acerL0ndon"
        },
        {
            "date": "February 17, 2009",
            "detail_rating": {
                "business": null,
                "cleanliness": null,
                "desk": null,
                "location": null,
                "pool": null,
                "restaurant": null,
                "rooms": null,
                "service": null,
                "sleep": null,
                "value": null
            },
            "helpfulness": null,
            "id": 24674792,
            "likes": {
                "disliked": null,
                "liked": null
            },
            "rating": 2.0,
            "stay_parameters": null,
            "text": "It is a good 20 mins to Charles Bridge walking but very pleasant, trams are frequent either side of the river and get some 24 hour tickets from the hotel for 3 crowns.",
            "title": "MaMaison Riverside Hotel Prague - not up to its reviews!",
            "user": "dciaccounting"
        },
        {
            "date": "January 30, 2009",
            "detail_rating": {
                "business": 2.0,
                "cleanliness": 5.0,
                "desk": null,
                "front_desk": 5.0,
                "location": 3.0,
                "pool": null,
                "restaurant": null,
                "rooms": 5.0,
                "service": 4.0,
                "sleep": null,
                "value": 5.0
            },
            "helpfulness": null,
            "id": 24043088,
            "likes": {
                "disliked": null,
                "liked": null
            },
            "rating": 5.0,
            "stay_parameters": "Stayed December 2008, traveled as a couple",
            "text": "No dining room in the hotel, it has a small bar which doubles as a lounge but closes at 12.00. We had good value in a junior suite for \u00a376 a night...there are lots of bargains to be had in Prague at present so do not book here for silly money...it is comfortable but you will find as good at present .",
            "title": "great hotel- highly recommended",
            "user": "debitoronto"
        },
        {
            "date": "January 18, 2009",
            "detail_rating": {
                "business": 3.0,
                "cleanliness": 5.0,
                "desk": null,
                "front_desk": 5.0,
                "location": 3.0,
                "pool": null,
                "restaurant": null,
                "rooms": 5.0,
                "service": 5.0,
                "sleep": null,
                "value": 5.0
            },
            "helpfulness": 1,
            "id": 23674366,
            "likes": {
                "disliked": "\u2014 Felt isolated from historic and commercial core.",
                "liked": "\u2014 Great atmosphere and staff. Great breakfast."
            },
            "rating": 5.0,
            "stay_parameters": "Stayed September 2008, traveled as a couple",
            "text": "Due to the abundant number of high reviews, we stayed at the hotel from 12th February with friends and my comments are in the context that this is a 5 star rated hotel..",
            "title": "A great hotel in Prague",
            "user": "logcolb"
        },
        {
            "date": "September 9, 2008",
            "detail_rating": {
                "business": 5.0,
                "cleanliness": 5.0,
                "desk": null,
                "front_desk": 5.0,
                "location": 4.0,
                "pool": null,
                "restaurant": null,
                "rooms": 5.0,
                "service": 5.0,
                "sleep": null,
                "value": 5.0
            },
            "helpfulness": null,
            "id": 19935385,
            "likes": {
                "disliked": "\u2014 Breakfast room can get full and noisy (due to its small size)",
                "liked": "\u2014 Location (away from crowds!), bar, room, service"
            },
            "rating": 5.0,
            "stay_parameters": "Stayed August 2008, traveled as a couple",
            "text": "My girlfriend & i stayed here for 4 nights in the middle of August.",
            "title": "Highly recommended",
            "user": "eisen77"
        },
        {
            "date": "September 3, 2008",
            "detail_rating": {
                "business": null,
                "cleanliness": 5.0,
                "desk": null,
                "front_desk": 4.0,
                "location": 5.0,
                "pool": null,
                "restaurant": null,
                "rooms": 5.0,
                "service": 5.0,
                "sleep": null,
                "value": 5.0
            },
            "helpfulness": null,
            "id": 19719758,
            "likes": {
                "disliked": "\u2014 Nothing to not like",
                "liked": "\u2014 Location"
            },
            "rating": 5.0,
            "stay_parameters": "Stayed August 2008, traveled as a couple",
            "text": "Needless to say that the Riverside lived up to its excellent reviews and reputation.",
            "title": "Excellent location",
            "user": "Vegasking"
        },
        {
            "date": "August 17, 2008",
            "detail_rating": {
                "business": 5.0,
                "cleanliness": 5.0,
                "desk": null,
                "front_desk": 5.0,
                "location": 4.0,
                "pool": null,
                "restaurant": null,
                "rooms": 4.0,
                "service": 5.0,
                "sleep": null,
                "value": 4.0
            },
            "helpfulness": null,
            "id": 19035946,
            "likes": {
                "disliked": null,
                "liked": "\u2014 attentive staff,view from the room"
            },
            "rating": 4.0,
            "stay_parameters": "Stayed August 2008, traveled as a couple",
            "text": "Check-in was fast, friendly and effortless. The staff were really helpful & made us feel right at home.",
            "title": "loved the walk",
            "user": "yentocs"
        },
        {
            "date": "August 12, 2008",
            "detail_rating": {
                "business": null,
                "cleanliness": 5.0,
                "desk": null,
                "front_desk": 4.0,
                "location": 5.0,
                "pool": null,
                "restaurant": null,
                "rooms": 5.0,
                "service": 5.0,
                "sleep": null,
                "value": 5.0
            },
            "helpfulness": null,
            "id": 18895250,
            "likes": {
                "disliked": null,
                "liked": "\u2014 The room"
            },
            "rating": 5.0,
            "stay_parameters": "Stayed August 2008, traveled as a couple",
            "text": "Our room (the riverside suite) was well appointed, spacious, airy and the bed was sooo comfortable (i rarely sleep well in any hotel, so this is a BIG compliment)",
            "title": "A real great experience",
            "user": "Kaesar_and_Topo"
        },
        {
            "date": "August 11, 2008",
            "detail_rating": {
                "business": null,
                "cleanliness": 5.0,
                "desk": null,
                "front_desk": 1.0,
                "location": 2.0,
                "pool": null,
                "restaurant": null,
                "rooms": 1.0,
                "service": 3.0,
                "sleep": null,
                "value": 1.0
            },
            "helpfulness": 2,
            "id": 18832429,
            "likes": {
                "disliked": "\u2014 Almost everything else",
                "liked": "\u2014 The cleanliness"
            },
            "rating": 1.0,
            "stay_parameters": "Stayed August 2008, traveled as a couple",
            "text": "The bar next to the lobby is small, homely and serves quality alcohol. Perfect!",
            "title": "Don't trust this hotel",
            "user": "JackHandy"
        }
    ],
    "slim_ranking": 0.0967261904762,
    "stars": 4.5,
    "tripadvisor": {
        "VISITED": false,
        "country_name": null,
        "locality": null,
        "pic_link": null,
        "street_address": null
    },
    "user_rating": 4.5,
    "variance": {
        "average": 50,
        "excellent": 538,
        "poor": 12,
        "terrible": 4,
        "very good": 211
    }
}