{
    "aka": "Elite Hotel Malm\u00f6",
    "description": "With an intriguing history dating back to the 14th century, the carefully restored Elite Hotel Savoy is well positioned in the heart of Malm\u00f6, opposite the Central Train Station. The restaurant Caf\u00e9 le fil du Rasoir at Hotel Savoy is a French style steakhouse and at the Bishop\u2019s Arms pub guests can experience a wide selection of genuine British whiskies and beers. Elite Hotel Savoy is well known for its beautiful and carefully restored rooms, comfortably equipped with many facilities including cable TV. All guests can enjoy complimentary wireless internet throughout the hotel.",
    "detail_rating": {
        "cleanliness": null,
        "location": null,
        "rooms": null,
        "service": null,
        "sleep": null,
        "value": null
    },
    "location": {
        "city": "Malmo",
        "continent": "Europe",
        "country": "Sweden",
        "proposed_city": "Malm\u00f6",
        "province": null,
        "region": "Skane County"
    },
    "name": "Elite Hotel Savoy",
    "places": {
        "aka": [
            "Malm\u00f6"
        ],
        "hotel_description": [
            "Malm\u00f6",
            "Central"
        ],
        "hotel_name": []
    },
    "review_count": 215,
    "review_count_current": 20,
    "reviews": [
        {
            "date": "June 28, 2010",
            "detail_rating": {
                "business": null,
                "cleanliness": 5.0,
                "desk": null,
                "location": 5.0,
                "pool": null,
                "restaurant": null,
                "rooms": 5.0,
                "service": 5.0,
                "sleep": 5.0,
                "value": 5.0
            },
            "helpfulness": null,
            "id": 68946087,
            "likes": {
                "disliked": null,
                "liked": null
            },
            "rating": 5.0,
            "stay_parameters": "Stayed June 2010, traveled on business",
            "text": "I stayed in this lovely hotel for one night on 15th June, 2010. I was on a business trip to Malmo. I stayed in a business suite and it was worth the amount paid for my stay there. The elegant hotel has all the facilities for business meetings, though I had a meeting at different place. I would recommend this hotel for both business as well as leisure stay.",
            "title": ". I would recommend this hotel for both business as well as leisure stay.",
            "user": "BossMumbai"
        },
        {
            "date": "May 16, 2010",
            "detail_rating": {
                "business": null,
                "cleanliness": 4.0,
                "desk": null,
                "location": 4.0,
                "pool": null,
                "restaurant": null,
                "rooms": 2.0,
                "service": 3.0,
                "sleep": 3.0,
                "value": 2.0
            },
            "helpfulness": 1,
            "id": 64253220,
            "likes": {
                "disliked": null,
                "liked": null
            },
            "rating": 3.0,
            "stay_parameters": "Stayed August 2008, traveled on business",
            "text": "The staff was very courteous and cooperative.",
            "title": "For being an Elite, it does not live up to its name",
            "user": "t0309999"
        },
        {
            "date": "April 26, 2010",
            "detail_rating": {
                "business": null,
                "cleanliness": 5.0,
                "desk": null,
                "location": 5.0,
                "pool": null,
                "restaurant": null,
                "rooms": 5.0,
                "service": 5.0,
                "sleep": 5.0,
                "value": 5.0
            },
            "helpfulness": null,
            "id": 62488341,
            "likes": {
                "disliked": null,
                "liked": null
            },
            "rating": 5.0,
            "stay_parameters": "Stayed April 2010, traveled as a couple",
            "text": "Great location. Across the street is the train station. Around the corner and you are on your way to downtown so it is walking distance, The rooms are ok.Very average. expected much more since it is Elite Hotel. Some floors are in between the floors that have elevator stops so you have to carry your suitcase and it is couple of stairs to carry. Hopefully you know what i mean. its like the elevator stops every other floor.Remember however this is an old building so i guess this is the best they could do.",
            "title": "Fantastic hotel",
            "user": "Kel1278"
        },
        {
            "date": "August 13, 2009",
            "detail_rating": {
                "business": null,
                "cleanliness": 5.0,
                "desk": null,
                "location": 5.0,
                "pool": null,
                "restaurant": null,
                "rooms": 4.0,
                "service": 4.0,
                "sleep": null,
                "value": 5.0
            },
            "helpfulness": null,
            "id": 37549402,
            "likes": {
                "disliked": null,
                "liked": null
            },
            "rating": 4.0,
            "stay_parameters": "Stayed July 2009, traveled with family",
            "text": "I stayed here for one night in one of the junior suites and thought it was fantastic. The staff were very helpful and the room was amazing. The location is perfect for meandering through the centre. I will definitely be coming back to stay, couldn't have asked for more.",
            "title": "Great place",
            "user": "Carl016"
        },
        {
            "date": "July 24, 2009",
            "detail_rating": {
                "business": null,
                "cleanliness": null,
                "desk": null,
                "location": null,
                "pool": null,
                "restaurant": null,
                "rooms": null,
                "service": 1.0,
                "sleep": null,
                "value": null
            },
            "helpfulness": 1,
            "id": 35633458,
            "likes": {
                "disliked": null,
                "liked": null
            },
            "rating": 1.0,
            "stay_parameters": "Stayed July 2009, traveled as a couple",
            "text": "I've stayed at the Savoy about 10 times the past years, both in business and together with my family.",
            "title": "Tried to book but they had weird policys!",
            "user": "Christine_JR"
        },
        {
            "date": "November 24, 2008",
            "detail_rating": {
                "business": 3.0,
                "cleanliness": 4.0,
                "desk": null,
                "front_desk": 4.0,
                "location": 5.0,
                "pool": null,
                "restaurant": null,
                "rooms": 4.0,
                "service": 4.0,
                "sleep": null,
                "value": 4.0
            },
            "helpfulness": null,
            "id": 22136000,
            "likes": {
                "disliked": null,
                "liked": null
            },
            "rating": 4.0,
            "stay_parameters": "Stayed November 2008",
            "text": "I stayed at the Savoy for a business trip. It was perfectly located within walking distance from the Central train station...even in the snow :-). It was a clean hotel with a friendly staff. Staying with colleagues, it seemed the room sizes weren't consistent even though we all booked the same class of room. My room was comfortable and roomy and I was pleased. It is centrally located to a lot of things you can do in Malmo and walkable from pretty much everywhere.",
            "title": "Great hotel convenient in Malmo",
            "user": "timheuer"
        },
        {
            "date": "July 7, 2008",
            "detail_rating": {
                "business": 4.0,
                "cleanliness": 5.0,
                "desk": null,
                "front_desk": 5.0,
                "location": 5.0,
                "pool": null,
                "restaurant": null,
                "rooms": 4.0,
                "service": 4.0,
                "sleep": null,
                "value": 5.0
            },
            "helpfulness": null,
            "id": 17632183,
            "likes": {
                "disliked": "\u2014 Some of the rooms have a maze of hallways to get there.",
                "liked": "\u2014 It felt like a high class hotel with a small hotel charm to it."
            },
            "rating": 5.0,
            "stay_parameters": "Stayed July 2008, traveled as a couple",
            "text": "This hotel was an unexpected surprise. I booked it strictly because it is across the street from the train station and we needed a place to stay for a night when coming back on the train from Stockholm. It was lovely.",
            "title": "Charming little getaway",
            "user": "dancininthestr"
        },
        {
            "date": "November 20, 2007",
            "detail_rating": {
                "business": 3.0,
                "cleanliness": 3.0,
                "desk": null,
                "front_desk": 3.0,
                "location": 4.0,
                "pool": null,
                "restaurant": null,
                "rooms": 3.0,
                "service": 3.0,
                "sleep": null,
                "value": 4.0
            },
            "helpfulness": 3,
            "id": 10939112,
            "likes": {
                "disliked": "\u2014 Small bathroom",
                "liked": "\u2014 Location"
            },
            "rating": 4.0,
            "stay_parameters": "Stayed September 2007, traveled as a couple",
            "text": "The rooms were very clean and had a reasonable amount of space in them. If you know you will be there, there are definite deals available on their website too.",
            "title": "Old World Charm in Malmo",
            "user": "Dec105"
        },
        {
            "date": "November 20, 2007",
            "detail_rating": {
                "business": null,
                "cleanliness": 3.0,
                "desk": null,
                "front_desk": 1.0,
                "location": 4.0,
                "pool": null,
                "restaurant": null,
                "rooms": 3.0,
                "service": null,
                "sleep": null,
                "value": 2.0
            },
            "helpfulness": 1,
            "id": 10937376,
            "likes": {
                "disliked": "\u2014 Lack of customer service",
                "liked": "\u2014 The location"
            },
            "rating": 2.0,
            "stay_parameters": "Stayed November 2007, traveled as a couple",
            "text": "Malmo was a nice town to visit and this was a great location and hotel to stay in while there. The breakfast was also very nice and the room was large and inviting.",
            "title": "No Romance at the Savoy",
            "user": "thomas96c"
        },
        {
            "date": "August 19, 2007",
            "detail_rating": {
                "business": null,
                "cleanliness": 4.0,
                "desk": null,
                "front_desk": 5.0,
                "location": 5.0,
                "pool": null,
                "restaurant": null,
                "rooms": 4.0,
                "service": 4.0,
                "sleep": null,
                "value": 5.0
            },
            "helpfulness": 2,
            "id": 8452893,
            "likes": {
                "disliked": "\u2014 A little dated",
                "liked": "\u2014 Location"
            },
            "rating": 4.0,
            "stay_parameters": "Stayed August 2007, traveled solo",
            "text": "A weekend away in Malmo is now a much more attractive and affordable option thanks to easy access from Ryanair flights and the marvelous train connection to and from Copenhagen.",
            "title": "Stompin' at the Savoy",
            "user": "citybeagle"
        },
        {
            "date": "July 13, 2009",
            "detail_rating": {
                "business": null,
                "cleanliness": 5.0,
                "desk": null,
                "location": 5.0,
                "pool": null,
                "restaurant": null,
                "rooms": 3.0,
                "service": 4.0,
                "sleep": null,
                "value": 4.0
            },
            "helpfulness": null,
            "id": 34637560,
            "likes": {
                "disliked": null,
                "liked": null
            },
            "rating": 4.0,
            "stay_parameters": "Stayed July 2009, traveled solo",
            "text": "I stayed at the the Savoy for two nights and it evokes an air of days-gone-by, and dates back to the nineteenth century. It's a bit of a rabbit warren to the bedroom, and mine was quite small with two cupboards - one containing the shower, the other the WC and basin.",
            "title": "Quirky charm, excellent location",
            "user": "Deejaysee"
        },
        {
            "date": "July 11, 2009",
            "detail_rating": {
                "business": null,
                "cleanliness": 5.0,
                "desk": null,
                "location": 5.0,
                "pool": null,
                "restaurant": null,
                "rooms": 4.0,
                "service": 5.0,
                "sleep": null,
                "value": 5.0
            },
            "helpfulness": null,
            "id": 34451550,
            "likes": {
                "disliked": null,
                "liked": null
            },
            "rating": 5.0,
            "stay_parameters": "Stayed July 2009, traveled solo",
            "text": "The breakfast was - I was going to say \"served\" - but it's buffet style in the brasserie.",
            "title": "Probably one of the best sleeps in my life!",
            "user": "RedHotLugNut"
        },
        {
            "date": "May 23, 2009",
            "detail_rating": {
                "business": null,
                "cleanliness": 4.0,
                "desk": null,
                "location": 5.0,
                "pool": null,
                "restaurant": null,
                "rooms": 3.0,
                "service": 5.0,
                "sleep": null,
                "value": 5.0
            },
            "helpfulness": null,
            "id": 30582813,
            "likes": {
                "disliked": null,
                "liked": null
            },
            "rating": 4.0,
            "stay_parameters": "Stayed May 2009, traveled as a couple",
            "text": "Staff were friendly and helpful.",
            "title": "Perfect location for shopping",
            "user": "mikkelbech"
        },
        {
            "date": "April 15, 2009",
            "detail_rating": {
                "business": null,
                "cleanliness": 5.0,
                "desk": null,
                "location": 5.0,
                "pool": null,
                "restaurant": null,
                "rooms": 5.0,
                "service": 5.0,
                "sleep": null,
                "value": 5.0
            },
            "helpfulness": null,
            "id": 28073040,
            "likes": {
                "disliked": null,
                "liked": null
            },
            "rating": 5.0,
            "stay_parameters": "Stayed April 2009, traveled on business",
            "text": "Location is perfect - opposite the station, and midway between the old town with its lovely squares and parks, and the up and coming ex-docklands with its interesting architecture and walks along the water's edge. From 2011, the train journey from Copenhagen will be cut by 20 minutes as a major tunnelling project is under way.",
            "title": "Excellent hotel both for business and for pleasure!",
            "user": "Jake30"
        },
        {
            "date": "February 23, 2009",
            "detail_rating": {
                "business": null,
                "cleanliness": 5.0,
                "desk": null,
                "location": 5.0,
                "pool": null,
                "restaurant": null,
                "rooms": 4.0,
                "service": 5.0,
                "sleep": null,
                "value": 4.0
            },
            "helpfulness": null,
            "id": 25041535,
            "likes": {
                "disliked": null,
                "liked": null
            },
            "rating": 4.0,
            "stay_parameters": "Stayed February 2009, traveled as a couple",
            "text": "I would have liked to have stayed another day - there was so much to explore. Will definitely go back.",
            "title": "Great place, really great location!",
            "user": "laurameee26"
        },
        {
            "date": "July 17, 2011",
            "detail_rating": {
                "business": null,
                "cleanliness": 5.0,
                "desk": null,
                "location": null,
                "pool": null,
                "restaurant": null,
                "rooms": null,
                "service": 5.0,
                "sleep": 5.0,
                "value": 5.0
            },
            "helpfulness": null,
            "id": 115459353,
            "likes": {
                "disliked": null,
                "liked": null
            },
            "rating": 5.0,
            "stay_parameters": "Stayed July 2011, traveled with friends",
            "text": "I throughly enjoyed my stay at the Elite Savoy. It could use a little TLC in a few places but overall it is very nice. The staff were all excellent and spoke very good English. It is located directly across from the Central train station. Just have to cross the bridge at the light and walk half a block to the front door. The departure point for the canal tour is also directly across the street. The breakfast was excellent. What I liked best was the fresh fruit. It still had the rind on the watermelon and pineapple so you knew it did not come from a can. The beds were very comfortable. The bathroom was nicely outfitted. The room was not a bad size. And surprise, surprise you were not limited to watching CNN or BBC world in the evening after a long day of sightseeing. There are a number of channels that are in English subtitled in Swedish. Most all sights are within easy walking distance of the hotel. The hotel offers free wifi you just have to get a code from the front desk. It is good for 3 hours from the time you login. If you need more time you just have to get another code from the front desk. I would definitely not hesitate in recommending this hotel.",
            "title": "Excellent Location and an excellent boutique style hotel",
            "user": "DeanCalgary_Alberta"
        },
        {
            "date": "February 23, 2011",
            "detail_rating": {
                "business": null,
                "cleanliness": 4.0,
                "desk": null,
                "location": 5.0,
                "pool": null,
                "restaurant": null,
                "rooms": 4.0,
                "service": 5.0,
                "sleep": null,
                "value": 5.0
            },
            "helpfulness": null,
            "id": 97715055,
            "likes": {
                "disliked": null,
                "liked": null
            },
            "rating": 4.0,
            "stay_parameters": "Stayed February 2011",
            "text": "Nice and fiendly staff with service in there minds all the time.",
            "title": "Splendid",
            "user": "tompatiger"
        },
        {
            "date": "December 18, 2010",
            "detail_rating": {
                "business": null,
                "cleanliness": 5.0,
                "desk": null,
                "location": 5.0,
                "pool": null,
                "restaurant": null,
                "rooms": 5.0,
                "service": 5.0,
                "sleep": 5.0,
                "value": 5.0
            },
            "helpfulness": null,
            "id": 90185750,
            "likes": {
                "disliked": null,
                "liked": null
            },
            "rating": 5.0,
            "stay_parameters": "Stayed May 2010, traveled as a couple",
            "text": "I had the suit....",
            "title": "Elegant and very comfortable",
            "user": "Lochiel"
        },
        {
            "date": "August 7, 2010",
            "detail_rating": {
                "business": null,
                "cleanliness": 4.0,
                "desk": null,
                "location": 5.0,
                "pool": null,
                "restaurant": null,
                "rooms": 3.0,
                "service": 4.0,
                "sleep": 4.0,
                "value": 4.0
            },
            "helpfulness": null,
            "id": 74144112,
            "likes": {
                "disliked": null,
                "liked": null
            },
            "rating": 4.0,
            "stay_parameters": "Stayed August 2010, traveled as a couple",
            "text": "The french brasserie was splendid",
            "title": "Great location, friendly staff. Top marks.",
            "user": "nomi4"
        },
        {
            "date": "July 18, 2010",
            "detail_rating": {
                "business": null,
                "cleanliness": 5.0,
                "desk": null,
                "location": 5.0,
                "pool": null,
                "restaurant": null,
                "rooms": 4.0,
                "service": 4.0,
                "sleep": 4.0,
                "value": 4.0
            },
            "helpfulness": null,
            "id": 71342155,
            "likes": {
                "disliked": null,
                "liked": null
            },
            "rating": 4.0,
            "stay_parameters": "Stayed June 2010, traveled as a couple",
            "text": "My wife and I stayed here for two nights and it was wonderful.",
            "title": "Good Hotel with Odd Layout",
            "user": "ShortBreakNorthWest"
        }
    ],
    "slim_ranking": 0.457142857143,
    "stars": 4,
    "tripadvisor": {
        "VISITED": false,
        "country_name": null,
        "locality": null,
        "pic_link": null,
        "street_address": null
    },
    "user_rating": 4.0,
    "variance": {
        "average": 38,
        "excellent": 50,
        "poor": 19,
        "terrible": 6,
        "very good": 102
    }
}