{
  "id": "023",
  "title": "hotel with gym in amsterdam",
  "description": "Searching for a hotel in Amsterdam that need to have a gym inside.",
  "narrative": "The relevant search results should be in Amsterdam and have a gym within the hotel.",
  "relevances": [
    {
      "hotelId": -237875170,
      "reviewId": 8500343,
      "isRelevant": 0
    },
    {
      "hotelId": -237875170,
      "reviewId": 19200272,
      "isRelevant": 0
    },
    {
      "hotelId": -237875170,
      "reviewId": 8440039,
      "isRelevant": 0
    },
    {
      "hotelId": -237875170,
      "reviewId": 4461187,
      "isRelevant": 0
    },
    {
      "hotelId": -237875170,
      "reviewId": 17907898,
      "isRelevant": 0
    },
    {
      "hotelId": -237875170,
      "reviewId": 8470976,
      "isRelevant": 0
    },
    {
      "hotelId": -237875170,
      "reviewId": 10137879,
      "isRelevant": 0
    },
    {
      "hotelId": -237875170,
      "reviewId": 5005410,
      "isRelevant": 0
    },
    {
      "hotelId": -237875170,
      "reviewId": 19607214,
      "isRelevant": 0
    },
    {
      "hotelId": -237875170,
      "reviewId": 10827771,
      "isRelevant": 0
    },
    {
      "hotelId": -1434576601,
      "reviewId": 7434375,
      "isRelevant": 0
    },
    {
      "hotelId": -1434576601,
      "reviewId": 4826568,
      "isRelevant": 0
    },
    {
      "hotelId": -1434576601,
      "reviewId": 5479516,
      "isRelevant": 0
    },
    {
      "hotelId": -1434576601,
      "reviewId": 7634664,
      "isRelevant": 0
    },
    {
      "hotelId": -1434576601,
      "reviewId": 25743430,
      "isRelevant": 0
    },
    {
      "hotelId": -1434576601,
      "reviewId": 5007547,
      "isRelevant": 0
    },
    {
      "hotelId": -1434576601,
      "reviewId": 24612930,
      "isRelevant": 0
    },
    {
      "hotelId": -1434576601,
      "reviewId": 25718163,
      "isRelevant": 0
    },
    {
      "hotelId": -1434576601,
      "reviewId": 5038292,
      "isRelevant": 0
    },
    {
      "hotelId": -1434576601,
      "reviewId": 7012109,
      "isRelevant": 0
    },
    {
      "hotelId": -1356595055,
      "reviewId": 10055430,
      "isRelevant": 0
    },
    {
      "hotelId": -1356595055,
      "reviewId": 6539935,
      "isRelevant": 0
    },
    {
      "hotelId": -1356595055,
      "reviewId": 21104411,
      "isRelevant": 0
    },
    {
      "hotelId": -1356595055,
      "reviewId": 105802459,
      "isRelevant": 0
    },
    {
      "hotelId": -1356595055,
      "reviewId": 108664861,
      "isRelevant": 0
    },
    {
      "hotelId": -1356595055,
      "reviewId": 7546161,
      "isRelevant": 0
    },
    {
      "hotelId": -1356595055,
      "reviewId": 22275654,
      "isRelevant": 0
    },
    {
      "hotelId": -1356595055,
      "reviewId": 8823371,
      "isRelevant": 0
    },
    {
      "hotelId": -1356595055,
      "reviewId": 109418658,
      "isRelevant": 0
    },
    {
      "hotelId": -1356595055,
      "reviewId": 7969510,
      "isRelevant": 0
    },
    {
      "hotelId": -2080072315,
      "reviewId": 38316324,
      "isRelevant": 1
    },
    {
      "hotelId": -2080072315,
      "reviewId": 63244636,
      "isRelevant": 0
    },
    {
      "hotelId": -2080072315,
      "reviewId": 47479788,
      "isRelevant": 0
    },
    {
      "hotelId": -2080072315,
      "reviewId": 7740004,
      "isRelevant": 0
    },
    {
      "hotelId": -2080072315,
      "reviewId": 7752250,
      "isRelevant": 0
    },
    {
      "hotelId": -2080072315,
      "reviewId": 8349602,
      "isRelevant": 0
    },
    {
      "hotelId": -2080072315,
      "reviewId": 10080406,
      "isRelevant": 0
    },
    {
      "hotelId": -2080072315,
      "reviewId": 12516837,
      "isRelevant": 0
    },
    {
      "hotelId": -2080072315,
      "reviewId": 49586856,
      "isRelevant": 0
    },
    {
      "hotelId": -2080072315,
      "reviewId": 6892407,
      "isRelevant": 0
    },
    {
      "hotelId": -1589476313,
      "reviewId": 119320992,
      "isRelevant": 0
    },
    {
      "hotelId": -1589476313,
      "reviewId": 14573036,
      "isRelevant": 0
    },
    {
      "hotelId": -1589476313,
      "reviewId": 49298545,
      "isRelevant": 0
    },
    {
      "hotelId": -1589476313,
      "reviewId": 10268357,
      "isRelevant": 0
    },
    {
      "hotelId": -1589476313,
      "reviewId": 11214483,
      "isRelevant": 0
    },
    {
      "hotelId": -1589476313,
      "reviewId": 7326882,
      "isRelevant": 0
    },
    {
      "hotelId": -1589476313,
      "reviewId": 33375027,
      "isRelevant": 0
    },
    {
      "hotelId": -1589476313,
      "reviewId": 45854722,
      "isRelevant": 0
    },
    {
      "hotelId": -1589476313,
      "reviewId": 119018176,
      "isRelevant": 0
    },
    {
      "hotelId": -1589476313,
      "reviewId": 115159715,
      "isRelevant": 0
    },
    {
      "hotelId": 1226555068,
      "reviewId": 141143466,
      "isRelevant": 0
    },
    {
      "hotelId": 1226555068,
      "reviewId": 136423908,
      "isRelevant": 0
    },
    {
      "hotelId": 1226555068,
      "reviewId": 130215799,
      "isRelevant": 0
    },
    {
      "hotelId": 1226555068,
      "reviewId": 143967025,
      "isRelevant": 0
    },
    {
      "hotelId": 1226555068,
      "reviewId": 141169712,
      "isRelevant": 0
    },
    {
      "hotelId": 1226555068,
      "reviewId": 153025028,
      "isRelevant": 0
    },
    {
      "hotelId": 1226555068,
      "reviewId": 146139062,
      "isRelevant": 0
    },
    {
      "hotelId": 1226555068,
      "reviewId": 150821839,
      "isRelevant": 0
    },
    {
      "hotelId": 1226555068,
      "reviewId": 145625267,
      "isRelevant": 0
    },
    {
      "hotelId": 1226555068,
      "reviewId": 129387015,
      "isRelevant": 0
    },
    {
      "hotelId": -179886612,
      "reviewId": 180546138,
      "isRelevant": 0
    },
    {
      "hotelId": -179886612,
      "reviewId": 159757460,
      "isRelevant": 0
    },
    {
      "hotelId": -179886612,
      "reviewId": 159975400,
      "isRelevant": 0
    },
    {
      "hotelId": -179886612,
      "reviewId": 159459666,
      "isRelevant": 0
    },
    {
      "hotelId": -179886612,
      "reviewId": 144780029,
      "isRelevant": 0
    },
    {
      "hotelId": -179886612,
      "reviewId": 159376665,
      "isRelevant": 0
    },
    {
      "hotelId": -179886612,
      "reviewId": 159899137,
      "isRelevant": 0
    },
    {
      "hotelId": -179886612,
      "reviewId": 180362077,
      "isRelevant": 0
    },
    {
      "hotelId": -179886612,
      "reviewId": 159668031,
      "isRelevant": 0
    },
    {
      "hotelId": -179886612,
      "reviewId": 151050244,
      "isRelevant": 0
    },
    {
      "hotelId": 979401350,
      "reviewId": 58548478,
      "isRelevant": 0
    },
    {
      "hotelId": 979401350,
      "reviewId": 61771150,
      "isRelevant": 0
    },
    {
      "hotelId": 979401350,
      "reviewId": 143560764,
      "isRelevant": 0
    },
    {
      "hotelId": 979401350,
      "reviewId": 47955978,
      "isRelevant": 0
    },
    {
      "hotelId": 979401350,
      "reviewId": 67415698,
      "isRelevant": 0
    },
    {
      "hotelId": 979401350,
      "reviewId": 139294935,
      "isRelevant": 0
    },
    {
      "hotelId": 979401350,
      "reviewId": 145581026,
      "isRelevant": 0
    },
    {
      "hotelId": 979401350,
      "reviewId": 64046536,
      "isRelevant": 1
    },
    {
      "hotelId": 979401350,
      "reviewId": 142088911,
      "isRelevant": 1
    },
    {
      "hotelId": 979401350,
      "reviewId": 12763084,
      "isRelevant": 1
    },
    {
      "hotelId": -333733724,
      "reviewId": 7276169,
      "isRelevant": 0
    },
    {
      "hotelId": -333733724,
      "reviewId": 5968685,
      "isRelevant": 0
    },
    {
      "hotelId": -333733724,
      "reviewId": 12009592,
      "isRelevant": 0
    },
    {
      "hotelId": -333733724,
      "reviewId": 6164878,
      "isRelevant": 0
    },
    {
      "hotelId": -333733724,
      "reviewId": 10596102,
      "isRelevant": 0
    },
    {
      "hotelId": -333733724,
      "reviewId": 6809603,
      "isRelevant": 0
    },
    {
      "hotelId": -333733724,
      "reviewId": 5722815,
      "isRelevant": 0
    },
    {
      "hotelId": -333733724,
      "reviewId": 5539569,
      "isRelevant": 0
    },
    {
      "hotelId": -333733724,
      "reviewId": 14450575,
      "isRelevant": 0
    },
    {
      "hotelId": -333733724,
      "reviewId": 8663974,
      "isRelevant": 0
    },
    {
      "hotelId": -1796516326,
      "reviewId": 42485167,
      "isRelevant": 0
    },
    {
      "hotelId": -1796516326,
      "reviewId": 20627459,
      "isRelevant": 0
    },
    {
      "hotelId": -1796516326,
      "reviewId": 45380115,
      "isRelevant": 0
    },
    {
      "hotelId": -1796516326,
      "reviewId": 20426957,
      "isRelevant": 0
    },
    {
      "hotelId": -1796516326,
      "reviewId": 20584779,
      "isRelevant": 0
    },
    {
      "hotelId": -1796516326,
      "reviewId": 42998774,
      "isRelevant": 0
    },
    {
      "hotelId": -1796516326,
      "reviewId": 20593678,
      "isRelevant": 0
    },
    {
      "hotelId": -1796516326,
      "reviewId": 21456686,
      "isRelevant": 0
    },
    {
      "hotelId": -1796516326,
      "reviewId": 45503028,
      "isRelevant": 0
    },
    {
      "hotelId": -1796516326,
      "reviewId": 20475863,
      "isRelevant": 0
    }
  ]
}