{
    "aka": "Hotel Johann Strauss",
    "description": null,
    "detail_rating": {
        "cleanliness": null,
        "location": null,
        "rooms": null,
        "service": null,
        "sleep": null,
        "value": null
    },
    "location": {
        "city": null,
        "continent": "Europe",
        "country": "Austria",
        "proposed_city": null,
        "province": null,
        "region": null
    },
    "name": "Johann Strauss Hotel",
    "places": {
        "aka": [],
        "hotel_description": [],
        "hotel_name": []
    },
    "review_count": 165,
    "review_count_current": 20,
    "reviews": [
        {
            "date": "August 28, 2009",
            "detail_rating": {
                "business": null,
                "cleanliness": 4.0,
                "desk": null,
                "location": 5.0,
                "pool": null,
                "restaurant": null,
                "rooms": 4.0,
                "service": 5.0,
                "sleep": null,
                "value": 5.0
            },
            "helpfulness": null,
            "id": 39073317,
            "likes": {
                "disliked": null,
                "liked": null
            },
            "rating": 5.0,
            "stay_parameters": "Stayed August 2009, traveled with family",
            "text": "Of the three Austrian hotels, this was the family favorite. Old world charm. The staff is superb! They could not have been more helpful and make you feel as if you are their only guest. The ariconditioning functioned well enough for my very picky husband duing a very hot spell in Vienna. If you prefer big hotel chain accomodations, then this is not the place for you. But we absolutely loved it and think fondly of it as our flat in Vienna.",
            "title": "Our favorite Austrian Hotel",
            "user": "PhDpassport"
        },
        {
            "date": "August 18, 2009",
            "detail_rating": {
                "business": null,
                "cleanliness": 3.0,
                "desk": null,
                "location": 3.0,
                "pool": null,
                "restaurant": null,
                "rooms": 3.0,
                "service": 5.0,
                "sleep": null,
                "value": 3.0
            },
            "helpfulness": null,
            "id": 38091758,
            "likes": {
                "disliked": null,
                "liked": null
            },
            "rating": 3.0,
            "stay_parameters": "Stayed July 2009, traveled with family",
            "text": "We are a family of 5 with three teenage boys. This was our 2nd stop of a 21 day trip throughout Eastern Europe. We rented 2 rooms at this hotel. The hotel was pleasant, and the rooms were large. One room had carpeting, but the other did not. Thankfully, we were on a non-smoking floor. The staff couldn't have been any nicer or more helpful. They were eager to please and to make our 4-night stay wonderful. The breakfast was lovely although the breakfast room is in the basement. That said, the room was bright and cheery. The room was spacious but bare-bones. Nothing was of high quality and I must say that the towels were extremely thin and very rough. The bedding was comfortable but the linens have seen better days. There is one elevator in the hotel and it is rather small. The location was definitely off the beaten path. We quickly learned the subway system and took it everywhere. There is a subway station 1/2 block from the hotel which made it extremely convenient to travel via the subway. I would probably stay here again, given that the hospitality of the staff was so outstanding.",
            "title": "Nice Hotel",
            "user": "EmmaShultz"
        },
        {
            "date": "April 22, 2009",
            "detail_rating": {
                "business": null,
                "cleanliness": 4.0,
                "desk": null,
                "location": 5.0,
                "pool": null,
                "restaurant": null,
                "rooms": 4.0,
                "service": 4.0,
                "sleep": null,
                "value": 4.0
            },
            "helpfulness": null,
            "id": 28568164,
            "likes": {
                "disliked": null,
                "liked": null
            },
            "rating": 4.0,
            "stay_parameters": "Stayed April 2009, traveled as a couple",
            "text": "My husband and I stayed over the Easter break with the main aim of visiting lots of museums. We were both very pleased with the the room which was clean and of good decoration (though the air conditioning wasn't effective). There was an excellent breakfast buffet that offered a good variety of food, both Austrian and English. We would definitely go to the Johann Strauss again when visiting Vienna.",
            "title": "Friendly, comfortable and a great location.",
            "user": "Beeb0p3"
        },
        {
            "date": "March 10, 2009",
            "detail_rating": {
                "business": null,
                "cleanliness": 5.0,
                "desk": null,
                "location": 4.0,
                "pool": null,
                "restaurant": null,
                "rooms": 4.0,
                "service": 5.0,
                "sleep": null,
                "value": 4.0
            },
            "helpfulness": null,
            "id": 25928771,
            "likes": {
                "disliked": null,
                "liked": null
            },
            "rating": 5.0,
            "stay_parameters": "Stayed February 2009, traveled as a couple",
            "text": "We find excellent traditional hospitality in this bed-and-breakfast hotel on the fringes of the Embassy District, near Karlskirche, the Belvedere art gallery and the Technical University. The city centre is fifteen minutes' walk away, or five minutes by subway. The friendly check-in clerk offers further help with recommendations for restaurants and entertainments.",
            "title": "Restful stay and fine Viennese hospitality",
            "user": "Fermi-Dirac"
        },
        {
            "date": "February 23, 2009",
            "detail_rating": {
                "business": null,
                "cleanliness": 5.0,
                "desk": null,
                "location": 5.0,
                "pool": null,
                "restaurant": null,
                "rooms": 5.0,
                "service": 5.0,
                "sleep": null,
                "value": 5.0
            },
            "helpfulness": null,
            "id": 25032534,
            "likes": {
                "disliked": null,
                "liked": null
            },
            "rating": 5.0,
            "stay_parameters": "Stayed February 2009, traveled as a couple",
            "text": "Plentiful staff keep the whole hotel spotlessly clean, with shining mirrors and glasses. Even Swiss guests must be impressed.",
            "title": "Helpful staff",
            "user": "mjmLeicester_England"
        },
        {
            "date": "April 9, 2011",
            "detail_rating": {
                "business": null,
                "cleanliness": 5.0,
                "desk": null,
                "location": 5.0,
                "pool": null,
                "restaurant": null,
                "rooms": 4.0,
                "service": 5.0,
                "sleep": 3.0,
                "value": 4.0
            },
            "helpfulness": 1,
            "id": 103398809,
            "likes": {
                "disliked": null,
                "liked": null
            },
            "rating": 4.0,
            "stay_parameters": "Stayed April 2011, traveled on business",
            "text": "I stayed here for five nights earlier this month, and my experience accords with those of most other reviewers. The Johann Strauss is a smallish hotel (about 60 rooms) very well located on a relatively quiet street near the Technical University, about 1km south of the Stephansdom. It is practically on top of a U-Bahn station, and the trams run along a parallel street about a hundred metres away, so connections are excellent. A typical continental breakfast with a good range of quality produce (including smoked salmon and sparkling wine) is served in a well-decorated basement room. There is a small bar, but no evening restaurant service. That last is no loss, as Vienna is in no way short of restaurants!",
            "title": "Good hotel in traditional style, exceptional staff",
            "user": "John987654321"
        },
        {
            "date": "February 13, 2011",
            "detail_rating": {
                "business": null,
                "cleanliness": 5.0,
                "desk": null,
                "location": 4.0,
                "pool": null,
                "restaurant": null,
                "rooms": 5.0,
                "service": 5.0,
                "sleep": 5.0,
                "value": 4.0
            },
            "helpfulness": 2,
            "id": 96395989,
            "likes": {
                "disliked": null,
                "liked": null
            },
            "rating": 4.0,
            "stay_parameters": "Stayed January 2011, traveled with family",
            "text": "The room I was allocated was pleasant and spotlessly clean. Free WiFi and safe facilities were provided, along with a pay-for minibar. I found the bed a little hard (but that is true of many hotel beds) and wasn't able to get the air conditioning to keep me as cool as I like, so I didn't sleep particularly well.",
            "title": "We didn't choose to stay here - but they went out of their way to be helpful.",
            "user": "lolly61"
        },
        {
            "date": "January 1, 2011",
            "detail_rating": {
                "business": null,
                "cleanliness": 5.0,
                "desk": null,
                "location": 5.0,
                "pool": null,
                "restaurant": null,
                "rooms": 4.0,
                "service": 5.0,
                "sleep": 4.0,
                "value": 5.0
            },
            "helpfulness": null,
            "id": 91341301,
            "likes": {
                "disliked": null,
                "liked": null
            },
            "rating": 5.0,
            "stay_parameters": "Stayed July 2010, traveled solo",
            "text": "All of the staff were exceptionally friendly and helpful. My every request was met with \"certainly\" and a prompt response. Whenever I got to the limit of my German (all too quickly, I fear), every member of staff readily switched without comment to fluent English.",
            "title": "Good location, awesome breakfast, small room.",
            "user": "tumido"
        },
        {
            "date": "September 30, 2010",
            "detail_rating": {
                "business": null,
                "cleanliness": 4.0,
                "desk": null,
                "location": 5.0,
                "pool": null,
                "restaurant": null,
                "rooms": 4.0,
                "service": 5.0,
                "sleep": 4.0,
                "value": 4.0
            },
            "helpfulness": null,
            "id": 81569552,
            "likes": {
                "disliked": null,
                "liked": null
            },
            "rating": 5.0,
            "stay_parameters": "Stayed September 2010, traveled on business",
            "text": "We were very rudely shunted out of Hotel Erzherzog Rainer after the hotel supposedly double booked our rooms - and we were taken to this hotel Johann Strauss. The management here did a very fine job of looking after us as we were very grumpy and unhappy at being so summarily dumped by Erzherzog Rainer!",
            "title": "conference visit plus some spare time",
            "user": "smarchitect"
        },
        {
            "date": "September 2, 2010",
            "detail_rating": {
                "business": null,
                "cleanliness": 3.0,
                "desk": null,
                "location": 4.0,
                "pool": null,
                "restaurant": null,
                "rooms": 2.0,
                "service": 2.0,
                "sleep": 3.0,
                "value": 3.0
            },
            "helpfulness": 1,
            "id": 78000115,
            "likes": {
                "disliked": null,
                "liked": null
            },
            "rating": 3.0,
            "stay_parameters": "Stayed August 2010, traveled as a couple",
            "text": "We found the hotel to be a 2 minute walk to an underground station, as well as having a selection of restaurants and a supermarket nearby. The breakfast was average - one morning they ran out of tea bags, they only ever had 1 or 2 croissants - but breakfast isn't everything. The staff were all amazing - we would spend a bit of time in the bar area - they have a fantastic aquarium you can watch while having drink - and the waiters were great.",
            "title": "convenient location but needs improvement",
            "user": "ambier"
        },
        {
            "date": "November 16, 2008",
            "detail_rating": {
                "business": 3.0,
                "cleanliness": 5.0,
                "desk": null,
                "front_desk": 4.0,
                "location": 5.0,
                "pool": null,
                "restaurant": null,
                "rooms": 4.0,
                "service": 4.0,
                "sleep": null,
                "value": 5.0
            },
            "helpfulness": null,
            "id": 21893374,
            "likes": {
                "disliked": null,
                "liked": "\u2014 location"
            },
            "rating": 5.0,
            "stay_parameters": "Stayed November 2008, traveled as a couple",
            "text": "We stayed for 3 days early november. We liked the hotel very much because of the following reasons:",
            "title": "perfect location",
            "user": "cko_64"
        },
        {
            "date": "November 4, 2008",
            "detail_rating": {
                "business": null,
                "cleanliness": 4.0,
                "desk": null,
                "front_desk": 3.0,
                "location": 2.0,
                "pool": null,
                "restaurant": null,
                "rooms": 3.0,
                "service": 4.0,
                "sleep": null,
                "value": 3.0
            },
            "helpfulness": null,
            "id": 21528114,
            "likes": {
                "disliked": null,
                "liked": "\u2014 The breakfast and the friendly staff at breakfast..."
            },
            "rating": 3.0,
            "stay_parameters": "Stayed October 2008, traveled as a couple",
            "text": "- perfect location. Really close to subway and tram, opera and city center on walking distance.",
            "title": "Mixed...",
            "user": "arusco"
        },
        {
            "date": "October 20, 2008",
            "detail_rating": {
                "business": 5.0,
                "cleanliness": 5.0,
                "desk": null,
                "front_desk": 5.0,
                "location": 5.0,
                "pool": null,
                "restaurant": null,
                "rooms": 5.0,
                "service": 5.0,
                "sleep": null,
                "value": 5.0
            },
            "helpfulness": null,
            "id": 21031102,
            "likes": {
                "disliked": "\u2014 nothing",
                "liked": "\u2014 clean and friendly"
            },
            "rating": 5.0,
            "stay_parameters": "Stayed September 2008, traveled as a couple",
            "text": "- clean room, pleasant smell",
            "title": "wonderfull hotel",
            "user": "kanuk08"
        },
        {
            "date": "August 25, 2008",
            "detail_rating": {
                "business": 3.0,
                "cleanliness": 5.0,
                "desk": null,
                "front_desk": 5.0,
                "location": 5.0,
                "pool": null,
                "restaurant": null,
                "rooms": 5.0,
                "service": 5.0,
                "sleep": null,
                "value": 4.0
            },
            "helpfulness": 4,
            "id": 19340046,
            "likes": {
                "disliked": "\u2014 No in-room interenet",
                "liked": "\u2014 location"
            },
            "rating": 5.0,
            "stay_parameters": "Stayed August 2008, traveled with family",
            "text": "- hospitable, friendly staff",
            "title": "Great Hotel and Location",
            "user": "MButler"
        },
        {
            "date": "July 28, 2008",
            "detail_rating": {
                "business": 4.0,
                "cleanliness": 5.0,
                "desk": null,
                "front_desk": 4.0,
                "location": 4.0,
                "pool": null,
                "restaurant": null,
                "rooms": 5.0,
                "service": 4.0,
                "sleep": null,
                "value": 5.0
            },
            "helpfulness": null,
            "id": 18333033,
            "likes": {
                "disliked": "\u2014 the maintanance crew was quite loud",
                "liked": "\u2014 the rooms and the breakfast"
            },
            "rating": 5.0,
            "stay_parameters": "Stayed December 2007, traveled as a couple",
            "text": "- first class breakfast, including austrian champagne.",
            "title": "great experince",
            "user": "irinuk_2002"
        },
        {
            "date": "August 23, 2010",
            "detail_rating": {
                "business": null,
                "cleanliness": 3.0,
                "desk": null,
                "location": 5.0,
                "pool": null,
                "restaurant": null,
                "rooms": 3.0,
                "service": 5.0,
                "sleep": 2.0,
                "value": 4.0
            },
            "helpfulness": 1,
            "id": 76416414,
            "likes": {
                "disliked": null,
                "liked": null
            },
            "rating": 3.0,
            "stay_parameters": "Stayed August 2010, traveled solo",
            "text": "I needed a place to stay for two weeks after a previous holiday plan fell by the wayside.",
            "title": "A bit 'meh'",
            "user": "ParisHL"
        },
        {
            "date": "June 30, 2010",
            "detail_rating": {
                "business": null,
                "cleanliness": 5.0,
                "desk": null,
                "location": 5.0,
                "pool": null,
                "restaurant": null,
                "rooms": 4.0,
                "service": 5.0,
                "sleep": 4.0,
                "value": 5.0
            },
            "helpfulness": 2,
            "id": 69175036,
            "likes": {
                "disliked": null,
                "liked": null
            },
            "rating": 5.0,
            "stay_parameters": "Stayed May 2010, traveled on business",
            "text": "Whilst the location was excellent; literally a minutes walk to the U-Bahn station. I found the hotel to be a little disappointing. The free Wi-Fi barely worked, and regularly lost connectivity and I was literally upstairs from the reception.",
            "title": "Excellent Value in a Great Location",
            "user": "j_snowrider"
        },
        {
            "date": "March 30, 2010",
            "detail_rating": {
                "business": null,
                "cleanliness": 5.0,
                "desk": null,
                "location": 3.0,
                "pool": null,
                "restaurant": null,
                "rooms": 5.0,
                "service": 5.0,
                "sleep": 4.0,
                "value": 5.0
            },
            "helpfulness": 3,
            "id": 59953537,
            "likes": {
                "disliked": null,
                "liked": null
            },
            "rating": 5.0,
            "stay_parameters": "Stayed March 2010, traveled with family",
            "text": "The breakfast was also quite poor, with very little in terms of selection. The eggs and bacon were usually always cold too.",
            "title": "A lucky find in Vienna",
            "user": "D0ra_The_Expl0rer"
        },
        {
            "date": "October 17, 2009",
            "detail_rating": {
                "business": null,
                "cleanliness": 5.0,
                "desk": null,
                "location": 4.0,
                "pool": null,
                "restaurant": null,
                "rooms": 1.0,
                "service": 5.0,
                "sleep": null,
                "value": 3.0
            },
            "helpfulness": 1,
            "id": 47080327,
            "likes": {
                "disliked": null,
                "liked": null
            },
            "rating": 3.0,
            "stay_parameters": "Stayed September 2009, traveled as a couple",
            "text": "The rooms weren't awful, but the bed certainly was. The pillows were about as thick as the pillow case cover and the bed was quite lumpy.",
            "title": "Comfortable",
            "user": "Jane1244"
        },
        {
            "date": "October 6, 2009",
            "detail_rating": {
                "business": null,
                "cleanliness": 4.0,
                "desk": null,
                "location": 4.0,
                "pool": null,
                "restaurant": null,
                "rooms": 3.0,
                "service": 4.0,
                "sleep": null,
                "value": 4.0
            },
            "helpfulness": null,
            "id": 46044347,
            "likes": {
                "disliked": null,
                "liked": null
            },
            "rating": 3.0,
            "stay_parameters": "Stayed September 2009, traveled as a couple",
            "text": "One excellent positive however is the courteous staff working there. Especially the very attractive blonde behind the reception that had a smile to die for!",
            "title": "Quirky place; good in parts",
            "user": "Jude_Starr_69"
        }
    ],
    "slim_ranking": 0.33514986376,
    "stars": 4,
    "tripadvisor": {
        "VISITED": false,
        "country_name": null,
        "locality": null,
        "pic_link": null,
        "street_address": null
    },
    "user_rating": 4.0,
    "variance": {
        "average": 32,
        "excellent": 55,
        "poor": 4,
        "terrible": 1,
        "very good": 73
    }
}