{
    "aka": "Radisson Blu Carlton Hotel, Bratislava Hotel Bratislava",
    "description": null,
    "detail_rating": {
        "cleanliness": null,
        "location": null,
        "rooms": null,
        "service": null,
        "sleep": null,
        "value": null
    },
    "location": {
        "city": "Bratislava",
        "continent": "Europe",
        "country": "Slovakia",
        "proposed_city": "Bratislava",
        "province": null,
        "region": "Bratislava Region"
    },
    "name": "Radisson Blu Carlton Hotel, Bratislava",
    "places": {
        "aka": [
            "Bratislava"
        ],
        "hotel_description": [],
        "hotel_name": [
            "Bratislava"
        ]
    },
    "review_count": 327,
    "review_count_current": 13,
    "reviews": [
        {
            "date": "June 20, 2006",
            "detail_rating": {
                "business": null,
                "cleanliness": null,
                "desk": null,
                "location": null,
                "pool": null,
                "restaurant": null,
                "rooms": null,
                "service": null,
                "sleep": null,
                "value": null
            },
            "helpfulness": 2,
            "id": 5366411,
            "likes": {
                "disliked": null,
                "liked": null
            },
            "rating": 5.0,
            "stay_parameters": null,
            "text": "Just came back from Bratislava. Had a really lovely time . Stayed at the SAS Raddisson , it was excellent. We had booked a double room and for an extra 30 Euros a night we upgraded to a business class room. It was excellent value as the breakfast was included ( that was usually 18 euros each) and our room had a fantastic balcony, all films were free and the usual bathrobes and slippers.",
            "title": "Fantastic Hotel",
            "user": "Diwinny"
        },
        {
            "date": "April 19, 2006",
            "detail_rating": {
                "business": null,
                "cleanliness": 3.0,
                "desk": null,
                "location": null,
                "pool": null,
                "restaurant": null,
                "rooms": 2.0,
                "service": 3.0,
                "sleep": null,
                "value": 2.0
            },
            "helpfulness": 1,
            "id": 4987678,
            "likes": {
                "disliked": null,
                "liked": null
            },
            "rating": 3.0,
            "stay_parameters": "Stayed April 2006",
            "text": "Breakfast was really good , with every thing you could think of, cooked meats, cerals , fruits, cheese the list goes on.",
            "title": "Could have been better",
            "user": "JanBerlin"
        },
        {
            "date": "April 17, 2006",
            "detail_rating": {
                "business": null,
                "cleanliness": null,
                "desk": null,
                "location": null,
                "pool": null,
                "restaurant": null,
                "rooms": null,
                "service": null,
                "sleep": null,
                "value": null
            },
            "helpfulness": 2,
            "id": 4978629,
            "likes": {
                "disliked": null,
                "liked": null
            },
            "rating": 5.0,
            "stay_parameters": null,
            "text": "The staff were always helpful and even presented my husband with a box of chocolates as we checked out because it was his birthday.",
            "title": "Great Hotel",
            "user": "Shoolbraids"
        },
        {
            "date": "February 23, 2006",
            "detail_rating": {
                "business": null,
                "cleanliness": 5.0,
                "desk": null,
                "location": null,
                "pool": null,
                "restaurant": null,
                "rooms": 5.0,
                "service": 5.0,
                "sleep": null,
                "value": 5.0
            },
            "helpfulness": 5,
            "id": 4498138,
            "likes": {
                "disliked": null,
                "liked": null
            },
            "rating": 5.0,
            "stay_parameters": "Stayed January 2006",
            "text": "The hotel is very centrally located on Hviezdoslavovo Square, the most prominent square of Bratislava, right across the Opera House.",
            "title": "very affordable luxury",
            "user": "remixed_05"
        },
        {
            "date": "January 31, 2006",
            "detail_rating": {
                "business": null,
                "cleanliness": null,
                "desk": null,
                "location": null,
                "pool": null,
                "restaurant": null,
                "rooms": null,
                "service": null,
                "sleep": null,
                "value": null
            },
            "helpfulness": null,
            "id": 4399714,
            "likes": {
                "disliked": null,
                "liked": null
            },
            "rating": 5.0,
            "stay_parameters": null,
            "text": "The hotel's historic building is beautifully renovated on the outside, our Business Class room was, however, concerning its appearence a little sober and cold (we had one of the \"contemporary\" rooms). Towels, bathrobes, blanket and cushions were not especially fluffy, but a little on the thin side.",
            "title": "Fantastic Hotel",
            "user": "Diwinny"
        },
        {
            "date": "June 14, 2005",
            "detail_rating": {
                "business": null,
                "cleanliness": null,
                "desk": null,
                "location": null,
                "pool": null,
                "restaurant": null,
                "rooms": null,
                "service": null,
                "sleep": null,
                "value": null
            },
            "helpfulness": 3,
            "id": 3550226,
            "likes": {
                "disliked": null,
                "liked": null
            },
            "rating": 3.0,
            "stay_parameters": null,
            "text": "This hotel is suitable for business travelers - clean and efficient but nothing spectacular. The pillows were lumpy and the beds a bit soft but it was clean. I would not say this is a \"destination\" hotel. If you need to be in Bratislava then it is fine but I wouldn't make a special trip.",
            "title": "Adequate hotel",
            "user": "pickytravelerVT"
        },
        {
            "date": "May 29, 2005",
            "detail_rating": {
                "business": null,
                "cleanliness": 4.0,
                "desk": null,
                "location": null,
                "pool": null,
                "restaurant": null,
                "rooms": 4.0,
                "service": 4.0,
                "sleep": null,
                "value": 5.0
            },
            "helpfulness": 3,
            "id": 3507589,
            "likes": {
                "disliked": null,
                "liked": null
            },
            "rating": 5.0,
            "stay_parameters": "Stayed May 2005",
            "text": "I spent 2 night at the Radisson of Bratislava and I must confess it is the right hotel in the right place. Of course it will improve in the years to come, but has already high european standards.",
            "title": "The right hotel in the right place",
            "user": "jportela"
        },
        {
            "date": "March 20, 2005",
            "detail_rating": {
                "business": null,
                "cleanliness": 5.0,
                "desk": null,
                "location": null,
                "pool": null,
                "restaurant": null,
                "rooms": 5.0,
                "service": 5.0,
                "sleep": null,
                "value": 4.0
            },
            "helpfulness": 9,
            "id": 3289891,
            "likes": {
                "disliked": null,
                "liked": null
            },
            "rating": 5.0,
            "stay_parameters": "Stayed November 2004",
            "text": "We stayed in the hotel several times in November and December 2004. The hotel has a great location; in the center of the old city Bratislava, where most attractions are within walking distance. The hotel itself is very nice. The rooms are clean, spacious and look newly furbished. The bathrooms are also clean and spacious. Our stay was also pleasant because of the helpful staff, whenever we called the housekeeping to ask for something they would get it in impressive speed, the concierge offered to park our rented car in the car-park near by, and the receptionist upgraded our room at our third stay in the hotel. If you decide to stay at the hotel, do not miss their breakfast, it was one of the best we have had in Europe. I'd say the hotel deserves 5 stars. For best rates, book the Radisson SAS web-site at least a week ahead",
            "title": "The Best in The Country",
            "user": "Sanooy"
        },
        {
            "date": "January 11, 2006",
            "detail_rating": {
                "business": null,
                "cleanliness": 5.0,
                "desk": null,
                "location": null,
                "pool": null,
                "restaurant": null,
                "rooms": 5.0,
                "service": 4.0,
                "sleep": null,
                "value": 4.0
            },
            "helpfulness": 1,
            "id": 4346096,
            "likes": {
                "disliked": null,
                "liked": null
            },
            "rating": 5.0,
            "stay_parameters": "Stayed December 2005",
            "text": "We were offered the chance to upgrade from a cheap internet booking of a standard room without breakfast to a junior suite with some extra amenities and including breakfast for a very reasonable price.",
            "title": "Great stay",
            "user": "Hans_Staden"
        },
        {
            "date": "November 27, 2005",
            "detail_rating": {
                "business": null,
                "cleanliness": 5.0,
                "desk": null,
                "location": null,
                "pool": null,
                "restaurant": null,
                "rooms": 5.0,
                "service": 5.0,
                "sleep": null,
                "value": 3.0
            },
            "helpfulness": 4,
            "id": 4146560,
            "likes": {
                "disliked": null,
                "liked": null
            },
            "rating": 4.0,
            "stay_parameters": "Stayed November 2005, traveled on business",
            "text": "Great room under the roof, spectacular view of the central square, opera house, castle etc. The bed was a little soft, otherwise the room was perfect, as was the bar in the lobby, the steam bath in the gym area (together with a reasonably priced and very ompetent massage) and the very generous and well done breakfast in the morning. Enjoyed every minute of our stay, even the momentas we had to work.",
            "title": "Excellent Service",
            "user": "dicanio10"
        },
        {
            "date": "October 19, 2005",
            "detail_rating": {
                "business": null,
                "cleanliness": 4.0,
                "desk": null,
                "location": null,
                "pool": null,
                "restaurant": null,
                "rooms": 4.0,
                "service": 3.0,
                "sleep": null,
                "value": 2.0
            },
            "helpfulness": 4,
            "id": 4035447,
            "likes": {
                "disliked": null,
                "liked": null
            },
            "rating": 3.0,
            "stay_parameters": "Stayed October 2005, traveled on business",
            "text": "Just stayed three nights at the Radisson SAS and contrary to previous reviews, I found the staff extremely helpful and friendly, the larger than standard rooms maintained in excellent condition and the prices not that expensive for a top class hotel. Little things impressed like the weekly cocktail hour with the management team for canapes and drinks where you can discuss improvements and problems and they were quite disappointed that I didn't have any comments other than very impressed.",
            "title": "adequate but overpriced and nothing special",
            "user": "ridgebackfan"
        },
        {
            "date": "July 25, 2005",
            "detail_rating": {
                "business": null,
                "cleanliness": null,
                "desk": null,
                "location": null,
                "pool": null,
                "restaurant": null,
                "rooms": null,
                "service": null,
                "sleep": null,
                "value": null
            },
            "helpfulness": 6,
            "id": 3698459,
            "likes": {
                "disliked": null,
                "liked": null
            },
            "rating": 4.0,
            "stay_parameters": null,
            "text": "Apparently, the hotel fell into ruin for 6 years until it was completely rebuilt leaving the historic old facia intact and has now become probably the best hotel in Bratislava. The location couldn't be better, two blocks from the Danube and across the road from the Old Town. The historic centre is tiny, you could walk one end to the other in 5 minutes but it is really cute and there are a few good bars and restaurants there although it isn't overdone like, say, Prague. The Slang pub opposite the hotel does the best ribs I have ever had and all the restaurants are extremely good value. Watch out for the draught beer, it is mostly 10 or 12 per cent!",
            "title": "Excellent location",
            "user": "airwav"
        },
        {
            "date": "June 26, 2005",
            "detail_rating": {
                "business": null,
                "cleanliness": 4.0,
                "desk": null,
                "location": null,
                "pool": null,
                "restaurant": null,
                "rooms": 5.0,
                "service": 4.0,
                "sleep": null,
                "value": 5.0
            },
            "helpfulness": 6,
            "id": 3612696,
            "likes": {
                "disliked": null,
                "liked": null
            },
            "rating": 5.0,
            "stay_parameters": "Stayed June 2005",
            "text": "I was staying here for a conference which was being held at the hotel and this also was very well organised and very successful.",
            "title": "Excellent hotel in good location",
            "user": "ashleypair"
        }
    ],
    "slim_ranking": 0.272727272727,
    "stars": 4,
    "tripadvisor": {
        "VISITED": false,
        "country_name": null,
        "locality": null,
        "pic_link": null,
        "street_address": null
    },
    "user_rating": 4.0,
    "variance": {
        "average": 41,
        "excellent": 131,
        "poor": 13,
        "terrible": 4,
        "very good": 138
    }
}