{
    "aka": null,
    "description": null,
    "detail_rating": {
        "cleanliness": null,
        "location": null,
        "rooms": null,
        "service": null,
        "sleep": null,
        "value": null
    },
    "location": {
        "city": null,
        "continent": "Europe",
        "country": "Ireland",
        "proposed_city": null,
        "province": null,
        "region": null
    },
    "name": "Blarney Vale Bed and Breakfast",
    "places": {
        "aka": [],
        "hotel_description": [],
        "hotel_name": []
    },
    "review_count": 236,
    "review_count_current": 20,
    "reviews": [
        {
            "date": "August 24, 2008",
            "detail_rating": {
                "business": null,
                "cleanliness": 5.0,
                "desk": null,
                "front_desk": 5.0,
                "location": 5.0,
                "pool": null,
                "restaurant": null,
                "rooms": 5.0,
                "service": 5.0,
                "sleep": null,
                "value": 5.0
            },
            "helpfulness": null,
            "id": 19302392,
            "likes": {
                "disliked": null,
                "liked": null
            },
            "rating": 5.0,
            "stay_parameters": "Stayed August 2008, traveled as a couple",
            "text": "Stayed for one night as just a flying visit however, if we're down this way again we would certainly go back. An extremely friendly welcome and everything you could want from a b&b...",
            "title": "very very good",
            "user": "Horsesock"
        },
        {
            "date": "August 6, 2008",
            "detail_rating": {
                "business": 3.0,
                "cleanliness": 5.0,
                "desk": null,
                "front_desk": 5.0,
                "location": 4.0,
                "pool": null,
                "restaurant": null,
                "rooms": 4.0,
                "service": 5.0,
                "sleep": null,
                "value": 4.0
            },
            "helpfulness": null,
            "id": 18677643,
            "likes": {
                "disliked": null,
                "liked": "\u2014 Breakfast!"
            },
            "rating": 4.0,
            "stay_parameters": "Stayed October 2007",
            "text": "This is a very nice B&B to stay at. The rooms are very clean and a good size. The bathroom is typical size of most B&Bs. The beds are quite comfortable to sleep. The views aren't the best, but you are looking at country side. It's a bit of a walk, about 10 minutes to get to Blarney Castle, but the town is nice to walk through. The owners are very sweet and helpful. They can provide information about the sites, driving directions, and excellent places to eat. The owners are also very good cooks because breakfast was delicious!",
            "title": "Nice Place, Good Food",
            "user": "WrldTrvlGrl"
        },
        {
            "date": "July 31, 2008",
            "detail_rating": {
                "business": null,
                "cleanliness": 5.0,
                "desk": null,
                "front_desk": 5.0,
                "location": 5.0,
                "pool": null,
                "restaurant": null,
                "rooms": 5.0,
                "service": null,
                "sleep": null,
                "value": 5.0
            },
            "helpfulness": null,
            "id": 18472716,
            "likes": {
                "disliked": "\u2014 can't think of a thing",
                "liked": "\u2014 Ann's friendliness and marvelous breakfast, nearness to Town Center"
            },
            "rating": 5.0,
            "stay_parameters": "Stayed June 2008, traveled with family",
            "text": "Our family had and awesome stay at the Blarney Vale B&B. I agree with all other posters that Ann was genuinely the friendliest B&B owner we had the pleasure of visiting. And, that's saying much, for we were blessed at all our B&Bs. It is a short walk to Blarney town center. Ann's breakfasts were wonderful, cheerily served; and our family room was neat, clean and comfy. We would certainly return on another trip. You will NOT be disappointed. Most highly recommended.",
            "title": "Perfect B&B choice in Blarney.",
            "user": "Cargar"
        },
        {
            "date": "July 29, 2008",
            "detail_rating": {
                "business": 5.0,
                "cleanliness": 5.0,
                "desk": null,
                "front_desk": 5.0,
                "location": 5.0,
                "pool": null,
                "restaurant": null,
                "rooms": 5.0,
                "service": 5.0,
                "sleep": null,
                "value": 5.0
            },
            "helpfulness": 1,
            "id": 18404759,
            "likes": {
                "disliked": "\u2014 Didnt stay longer",
                "liked": "\u2014 Anne's Hospitality"
            },
            "rating": 5.0,
            "stay_parameters": "Stayed July 2008, traveled as a couple",
            "text": "My girlfriend and I are in our 20s and found this place to be an absolute treasure! Anne's hospitality was what made this B&B the best place we stayed during our 8 day stay all over Ireland. Anne was so nice and even took us down in to town to let our legs do some resting after the walk around Blarney castle. She is by far the nicest B&B owner we have run in to in Ireland. Breakfast was great and the room was awesome! Take it from me, if you want a good place to stay in walking distance from the city and not a really long drive from some great cities and islands, this is the place to stay. My girlfriend still misses staying at Anne's.",
            "title": "Best kept secret in Blarney!!",
            "user": "psension"
        },
        {
            "date": "July 20, 2008",
            "detail_rating": {
                "business": null,
                "cleanliness": 5.0,
                "desk": null,
                "front_desk": 5.0,
                "location": 5.0,
                "pool": null,
                "restaurant": null,
                "rooms": 5.0,
                "service": 5.0,
                "sleep": null,
                "value": 5.0
            },
            "helpfulness": null,
            "id": 18064710,
            "likes": {
                "disliked": "\u2014 nothing!",
                "liked": "\u2014 clean, nicely decorated rooms, friendly hostess, great breakfast"
            },
            "rating": 5.0,
            "stay_parameters": "Stayed July 2008, traveled with family",
            "text": "Blarney Vale House is a beautiful b&b with lovely, clean rooms. Anne, the owner, was friendly and helpful with whatever we needed. Breakfast was delicious - especially the pancakes! It is conveniently located near the Blarney village. Staying here was a wonderful experience; we would highly recommend it!",
            "title": "Blarney Vale is a beautiful b&b",
            "user": "luvtotravel85"
        },
        {
            "date": "September 24, 2009",
            "detail_rating": {
                "business": null,
                "cleanliness": null,
                "desk": null,
                "location": null,
                "pool": null,
                "restaurant": null,
                "rooms": null,
                "service": null,
                "sleep": null,
                "value": null
            },
            "helpfulness": null,
            "id": 44120506,
            "likes": {
                "disliked": null,
                "liked": null
            },
            "rating": 5.0,
            "stay_parameters": null,
            "text": "We booked here because family had stayed here before us and had very nice comments. We were not disappointed. The room was perfect and the whole family made us feel welcome. Ann had lots of good information for us, making our time there very enjoyable.",
            "title": "Wonderful Stay",
            "user": "NrsMary"
        },
        {
            "date": "September 16, 2009",
            "detail_rating": {
                "business": null,
                "cleanliness": 5.0,
                "desk": null,
                "location": 5.0,
                "pool": null,
                "restaurant": null,
                "rooms": 5.0,
                "service": 5.0,
                "sleep": null,
                "value": 5.0
            },
            "helpfulness": null,
            "id": 42149619,
            "likes": {
                "disliked": null,
                "liked": null
            },
            "rating": 5.0,
            "stay_parameters": "Stayed August 2009, traveled with family",
            "text": "No need to look elsewhere.",
            "title": "Nice time at a nice place!",
            "user": "herein"
        },
        {
            "date": "August 9, 2009",
            "detail_rating": {
                "business": null,
                "cleanliness": 5.0,
                "desk": null,
                "location": 4.0,
                "pool": null,
                "restaurant": null,
                "rooms": 4.0,
                "service": 4.0,
                "sleep": null,
                "value": 4.0
            },
            "helpfulness": null,
            "id": 37163943,
            "likes": {
                "disliked": null,
                "liked": null
            },
            "rating": 4.0,
            "stay_parameters": "Stayed August 2009, traveled as a couple",
            "text": "Cozy and clean rooms, a great breakfast - an own menue card! - and a very friendly and helpfull hostess. We had a nice stay.",
            "title": "Warm and friendly B+B",
            "user": "MikeOstr"
        },
        {
            "date": "August 6, 2009",
            "detail_rating": {
                "business": null,
                "cleanliness": 5.0,
                "desk": null,
                "location": 5.0,
                "pool": null,
                "restaurant": null,
                "rooms": 5.0,
                "service": 5.0,
                "sleep": null,
                "value": 5.0
            },
            "helpfulness": null,
            "id": 36880265,
            "likes": {
                "disliked": null,
                "liked": null
            },
            "rating": 5.0,
            "stay_parameters": "Stayed July 2009, traveled with friends",
            "text": "Greetings from Germany",
            "title": "One of my favorites!",
            "user": "allisonperry82"
        },
        {
            "date": "August 5, 2009",
            "detail_rating": {
                "business": null,
                "cleanliness": 5.0,
                "desk": null,
                "location": 5.0,
                "pool": null,
                "restaurant": null,
                "rooms": 5.0,
                "service": 5.0,
                "sleep": null,
                "value": 5.0
            },
            "helpfulness": null,
            "id": 36812447,
            "likes": {
                "disliked": null,
                "liked": null
            },
            "rating": 5.0,
            "stay_parameters": "Stayed August 2009, traveled with friends",
            "text": "Stayed 2 nights at this B+B near Blarney Castle; also very convenient to Cork and Midleton (Jameson distillery). Ann Hennessy is an extremely friendly, warm proprietor who cares greatly about her guests. The rooms are bright and clean and offer sufficient space to rest after a busy day. Ann offers a variety of breakfast choices; her full Irish breakfast is delicious. Slightly larger or more plush towels would be a nice addition, but this B+B offers a great value in a very quiet location.",
            "title": "Great Stay",
            "user": "OJ07"
        },
        {
            "date": "July 30, 2009",
            "detail_rating": {
                "business": null,
                "cleanliness": 5.0,
                "desk": null,
                "location": 5.0,
                "pool": null,
                "restaurant": null,
                "rooms": 5.0,
                "service": 5.0,
                "sleep": null,
                "value": 4.0
            },
            "helpfulness": null,
            "id": 36207642,
            "likes": {
                "disliked": null,
                "liked": null
            },
            "rating": 5.0,
            "stay_parameters": "Stayed July 2009, traveled with friends",
            "text": "Blarney Vale Bed and Breakfast is beautifully done out and offered a very warm and genuine welcome from Anne and her son. The B&B has large rooms, ensuites, and very comfortable beds and don't miss the amazing breakfasts cooked by Anne - they're superb! It is a very short stroll into the centre of the village which offers some lovely restaurants, and entertainment, but the B&B itself is set far enough back from the road to be peaceful. I have to say that this was by far one of the warmest welcomes and most helpful B&B's we stayed at during our trip. Thoroughly recommended.",
            "title": "Home away from home",
            "user": "jandalsdxb"
        },
        {
            "date": "July 6, 2009",
            "detail_rating": {
                "business": null,
                "cleanliness": 4.0,
                "desk": null,
                "location": 5.0,
                "pool": null,
                "restaurant": null,
                "rooms": 4.0,
                "service": 4.0,
                "sleep": null,
                "value": 3.0
            },
            "helpfulness": null,
            "id": 34074809,
            "likes": {
                "disliked": null,
                "liked": null
            },
            "rating": 4.0,
            "stay_parameters": "Stayed June 2009, traveled as a couple",
            "text": "We only stayed one night at the Blarney Vale B&B but it was a fine place to stay. Well located (about an 8 minute walk to the town green and Castle area) and quiet. We were able to get pancakes for breakfast, which was a nice break since most B&Bs we stayed at only had different variations on eggs! Innkeepers were nice but we didn't interact with them much.",
            "title": "Nice B&B well located close to Blarney Castle and village",
            "user": "Traveller22022"
        },
        {
            "date": "June 25, 2009",
            "detail_rating": {
                "business": null,
                "cleanliness": 5.0,
                "desk": null,
                "location": 5.0,
                "pool": null,
                "restaurant": null,
                "rooms": 5.0,
                "service": 5.0,
                "sleep": null,
                "value": 5.0
            },
            "helpfulness": null,
            "id": 33131943,
            "likes": {
                "disliked": null,
                "liked": null
            },
            "rating": 5.0,
            "stay_parameters": "Stayed June 2009, traveled as a couple",
            "text": "My husband and I spent two full weeks travelling all through Ireland. The Blarney Vale House was one of the few places we stayed for more than one night. Out of the many different Bed and Breakfasts we stayed in, this was the BEST. It had the most extensive menu and really offered a lot for everyone. It was an easy walk to the Blarney Castle and the town was adorable. I fell in love with Blarney Woolen Mills and the Muskery Pub. Ann was always willing to give us her opinion and help us with directions or just ideas of what to do! I wish all my experiences could have been like this one! It is a MUST stay if you are even remotely close to the area.",
            "title": "Fabulous Vaca!",
            "user": "aron650"
        },
        {
            "date": "June 7, 2009",
            "detail_rating": {
                "business": null,
                "cleanliness": 5.0,
                "desk": null,
                "location": 5.0,
                "pool": null,
                "restaurant": null,
                "rooms": 5.0,
                "service": 5.0,
                "sleep": null,
                "value": 5.0
            },
            "helpfulness": null,
            "id": 31768741,
            "likes": {
                "disliked": null,
                "liked": null
            },
            "rating": 5.0,
            "stay_parameters": "Stayed May 2009, traveled with family",
            "text": "Anne Hennessey, the owner, was very sweet and welcoming. We only stayed one night, but this home is very pretty, and the rooms are spacious and very comfortable. It is very near town and you can walk on sidewalks to get there in about 5 minutes. The Muskerry Arms pub was very good too.",
            "title": "Blarney Vale is a pretty home located in walking distance of the castle.",
            "user": "WashingtonDCGardenia"
        },
        {
            "date": "June 1, 2009",
            "detail_rating": {
                "business": null,
                "cleanliness": 5.0,
                "desk": null,
                "location": 5.0,
                "pool": null,
                "restaurant": null,
                "rooms": 5.0,
                "service": 5.0,
                "sleep": null,
                "value": 5.0
            },
            "helpfulness": null,
            "id": 31299074,
            "likes": {
                "disliked": null,
                "liked": null
            },
            "rating": 5.0,
            "stay_parameters": "Stayed May 2009, traveled with friends",
            "text": "We stayed at this B & B for two nights May 17th - 19th, 2009 and we absolutely loved it!",
            "title": "Best Bed and Breakfast in Blarney!! (travel agent review)",
            "user": "Jooolz1976"
        },
        {
            "date": "May 25, 2009",
            "detail_rating": {
                "business": null,
                "cleanliness": 5.0,
                "desk": null,
                "location": 5.0,
                "pool": null,
                "restaurant": null,
                "rooms": 5.0,
                "service": 5.0,
                "sleep": null,
                "value": 5.0
            },
            "helpfulness": 1,
            "id": 30755639,
            "likes": {
                "disliked": null,
                "liked": null
            },
            "rating": 5.0,
            "stay_parameters": "Stayed May 2009, traveled with family",
            "text": "Loved this B.& B. !! Super warm friendly people !! Large clean pretty rooms Comfortable beds!! Yummy breakfasts!! Best pancakes I've ever had!!! Anne was extremely helpful helping us plan our day Restaurants, Places to see Etc... Anyone near Blarney should try this B&B!! 2 thumbs up!!! We Used plublic transportation this whole trip and Blarneyvale was within walking distance to Blarney Castle the Blarney woolen Mills, Lots of restaurants, pubs, shopping and really close to bus stop to catch a bus to Cork City!! Also very good price not expensive at all!!!",
            "title": "Wonderful,Warm friendly,Had a absolute super time!!",
            "user": "Pjrkittycat"
        },
        {
            "date": "May 11, 2009",
            "detail_rating": {
                "business": null,
                "cleanliness": 5.0,
                "desk": null,
                "location": 5.0,
                "pool": null,
                "restaurant": null,
                "rooms": 5.0,
                "service": 5.0,
                "sleep": null,
                "value": 5.0
            },
            "helpfulness": 1,
            "id": 29770350,
            "likes": {
                "disliked": null,
                "liked": null
            },
            "rating": 5.0,
            "stay_parameters": "Stayed April 2009, traveled as a couple",
            "text": "My wife and I stayed at Blarney Vale B&B and had a delightful time. The owners are lovely people, the physical facilities are absolutely first cabin and the food was marvelous. We cannot recommend this B&B highly enough.",
            "title": "Completely Wonderful Experience",
            "user": "Robert072"
        },
        {
            "date": "December 12, 2008",
            "detail_rating": {
                "business": null,
                "cleanliness": 5.0,
                "desk": null,
                "location": 5.0,
                "pool": null,
                "restaurant": null,
                "rooms": 5.0,
                "service": 5.0,
                "sleep": null,
                "value": 5.0
            },
            "helpfulness": 1,
            "id": 22679693,
            "likes": {
                "disliked": null,
                "liked": "\u2014 Huge rooms"
            },
            "rating": 5.0,
            "stay_parameters": "Stayed July 2006, traveled with friends",
            "text": "A beautiful place to stay. The rooms were huge, clean, and well maintained. A nice walk into the center of Blarney. The owner was very helpful on where to go and by what time we needed to be there. If you ever stay in Blarney, this is the place.",
            "title": "A Gem of a B&B",
            "user": "lksmith33"
        },
        {
            "date": "September 8, 2008",
            "detail_rating": {
                "business": null,
                "cleanliness": 5.0,
                "desk": null,
                "front_desk": 5.0,
                "location": 5.0,
                "pool": null,
                "restaurant": null,
                "rooms": 5.0,
                "service": 5.0,
                "sleep": null,
                "value": 5.0
            },
            "helpfulness": 1,
            "id": 19883547,
            "likes": {
                "disliked": null,
                "liked": null
            },
            "rating": 5.0,
            "stay_parameters": "Stayed August 2008, traveled as a couple",
            "text": "This would have to be the best B&B I've stayed in so far. My husband and I stayed at Blarney Vale for 3 nights on a trip around Ireland and really loved this B&B. The double room was spacious and comfortable. The breakfast was delicious with an excellent selection (my husband loved the 'Blarney Vale Special'!). The Blarney villiage square was a nice 5-10mins walk and has plenty of restaurants/bars to choose from. Blarney castle is a 'must' and is only 10mins walk away from Blarney Vale B&B. Anne was most very helpful in advising us on places to visit and we enjoyed a great day trip to nearby Cobh and Kinsale.",
            "title": "Excellent B&B",
            "user": "TravellerChelsea"
        },
        {
            "date": "September 7, 2008",
            "detail_rating": {
                "business": null,
                "cleanliness": 5.0,
                "desk": null,
                "front_desk": 5.0,
                "location": 5.0,
                "pool": null,
                "restaurant": null,
                "rooms": 5.0,
                "service": 5.0,
                "sleep": null,
                "value": 5.0
            },
            "helpfulness": null,
            "id": 19855612,
            "likes": {
                "disliked": "\u2014 The weather - but not much they could have done about that!",
                "liked": "\u2014 The atmosphere and spacious comfort"
            },
            "rating": 5.0,
            "stay_parameters": "Stayed August 2008, traveled with family",
            "text": "I highly recommend this B&B. There's lots to see and do in the area. I only wish I could've stayed longer!",
            "title": "Fantastic Place to Stay with the Family, only 5 min walk from Blarney Village",
            "user": "The_Bullett"
        }
    ],
    "slim_ranking": 0.0416666666667,
    "stars": null,
    "tripadvisor": {
        "VISITED": false,
        "country_name": null,
        "locality": null,
        "pic_link": null,
        "street_address": null
    },
    "user_rating": 5.0,
    "variance": {
        "average": 2,
        "excellent": 214,
        "poor": 1,
        "terrible": 1,
        "very good": 18
    }
}