{
    "aka": "Hostellerie De l Abbaye",
    "description": "L'Hostellerie de l'Abbaye is a charming hotel nestled within an ancestral pine forest on the edge of the village of Le Thoronet.Our premier facilities will make your stay comfortable and memorable.Located in the heart of \"Provence verte\"\" our Inn features 23 spacious ans comfortable rooms, a beautiful gourmet restaurant overlooking a landscaped garden and a swimming pool with a waterfall.Many activities are available at the Inn and nearby.",
    "detail_rating": {
        "cleanliness": null,
        "location": null,
        "rooms": null,
        "service": null,
        "sleep": null,
        "value": null
    },
    "location": {
        "city": null,
        "continent": "Europe",
        "country": "France",
        "proposed_city": null,
        "province": null,
        "region": "Provence"
    },
    "name": "Hostellerie de l'Abbaye",
    "places": {
        "aka": [],
        "hotel_description": [],
        "hotel_name": []
    },
    "review_count": 52,
    "review_count_current": 5,
    "reviews": [
        {
            "date": "July 12, 2013",
            "detail_rating": {
                "business": null,
                "cleanliness": 5.0,
                "desk": null,
                "location": 4.0,
                "pool": null,
                "restaurant": null,
                "rooms": 5.0,
                "service": 4.0,
                "sleep": 5.0,
                "value": 5.0
            },
            "helpfulness": null,
            "id": 167346023,
            "likes": {
                "disliked": null,
                "liked": null
            },
            "rating": 4.0,
            "stay_parameters": "Stayed June 2013, traveled as a couple",
            "text": "The hotel is just a Michelin one house hotel, so we didn't expect much, but it was just fine. Not posh, but very pleasant and well-kept. Our room is actually two -- a very large room with a large bed and a second room with three twin beds. The people at the reception desk were not exactly charming, but they were polite.",
            "title": "A simple, but excellent hotel",
            "user": "Chandolin"
        },
        {
            "date": "October 7, 2012",
            "detail_rating": {
                "business": null,
                "cleanliness": 5.0,
                "desk": null,
                "location": 5.0,
                "pool": null,
                "restaurant": null,
                "rooms": 5.0,
                "service": 4.0,
                "sleep": 5.0,
                "value": 4.0
            },
            "helpfulness": null,
            "id": 142220915,
            "likes": {
                "disliked": null,
                "liked": null
            },
            "rating": 4.0,
            "stay_parameters": "Stayed September 2012, traveled as a couple",
            "text": "We ate dinner outside, our first on this trip because of the cool weather, and it was a really excellent meal! Slices of scallop with greens, followed by saut\u00e9ed veal chop with morels and potatoes. Chevre with cooked onions on it. Molten chocolate cake with vanilla ice cream -- just terrible!!! This turned out to be one of the best dinners we had in our month in the south of France!",
            "title": "Logis's mistake our gain",
            "user": "MikeJL59"
        },
        {
            "date": "September 23, 2012",
            "detail_rating": {
                "business": null,
                "cleanliness": 4.0,
                "desk": null,
                "location": 4.0,
                "pool": null,
                "restaurant": null,
                "rooms": 4.0,
                "service": 3.0,
                "sleep": 3.0,
                "value": 4.0
            },
            "helpfulness": null,
            "id": 141017661,
            "likes": {
                "disliked": null,
                "liked": null
            },
            "rating": 4.0,
            "stay_parameters": "Stayed September 2012, traveled as a couple",
            "text": "When we looked through the Logis book this place is listed as a single chimney and a single marmite pot..not right! The website correctly identifies it as a 3 chimney and three pot.",
            "title": "A nice hotel in the Var",
            "user": "johnbGilberdyke"
        },
        {
            "date": "September 12, 2012",
            "detail_rating": {
                "business": null,
                "cleanliness": 2.0,
                "desk": null,
                "location": 4.0,
                "pool": null,
                "restaurant": null,
                "rooms": 2.0,
                "service": 1.0,
                "sleep": 3.0,
                "value": 3.0
            },
            "helpfulness": 1,
            "id": 140062978,
            "likes": {
                "disliked": null,
                "liked": null
            },
            "rating": 2.0,
            "stay_parameters": "Stayed August 2012, traveled as a couple",
            "text": "It is a modern building with very good sized rooms with excellent air con. The hotel is set back from the main road through the town in a quiet residential location. There is a nice refreshing (sic cold) pool and sun terrace to the rear which is shaded by surrounding trees.",
            "title": "Staff in need of charm school training",
            "user": "janesuffolk"
        },
        {
            "date": "August 27, 2012",
            "detail_rating": {
                "business": null,
                "cleanliness": 5.0,
                "desk": null,
                "location": 5.0,
                "pool": null,
                "restaurant": null,
                "rooms": 5.0,
                "service": 3.0,
                "sleep": 5.0,
                "value": 4.0
            },
            "helpfulness": 1,
            "id": 138524674,
            "likes": {
                "disliked": null,
                "liked": null
            },
            "rating": 4.0,
            "stay_parameters": "Stayed August 2012, traveled as a couple",
            "text": "On arrival we were given the disappointing room that the restaurant would have a limited selection that evening because of a fire a few days previously and that we would have to have breakfast in the restaurant. In neither instances did this detract in any way from our enjoyment.",
            "title": "Good rooms and lovely restaurant",
            "user": "Travelling1girl"
        }
    ],
    "slim_ranking": 1.0,
    "stars": 3,
    "tripadvisor": {
        "VISITED": false,
        "country_name": null,
        "locality": null,
        "pic_link": null,
        "street_address": null
    },
    "user_rating": 3.5,
    "variance": {
        "average": 8,
        "excellent": 12,
        "poor": 6,
        "terrible": 2,
        "very good": 24
    }
}