{
    "aka": "Spanish Villa Hotel St. Helena",
    "description": null,
    "detail_rating": {
        "cleanliness": null,
        "location": null,
        "rooms": null,
        "service": null,
        "sleep": null,
        "value": null
    },
    "location": {
        "city": null,
        "continent": null,
        "country": "United States",
        "proposed_city": "Helena",
        "province": null,
        "region": null
    },
    "name": "Spanish Villa Inn",
    "places": {
        "aka": [
            "Helena"
        ],
        "hotel_description": [],
        "hotel_name": []
    },
    "review_count": 72,
    "review_count_current": 3,
    "reviews": [
        {
            "date": "September 6, 2005",
            "detail_rating": {
                "business": null,
                "cleanliness": 4.0,
                "desk": null,
                "location": null,
                "pool": null,
                "restaurant": null,
                "rooms": 4.0,
                "service": 4.0,
                "sleep": null,
                "value": 4.0
            },
            "helpfulness": 2,
            "id": 3845992,
            "likes": {
                "disliked": null,
                "liked": null
            },
            "rating": 4.0,
            "stay_parameters": "Stayed September 2005",
            "text": "I stayed at the Spanish Villa in St. Helena over Labor Day weekend with my husband. The B&B was full but it was remarkably quiet and well kept. It is tucked about a mile away from the highway. The house is just adorable with large and well kept grounds. The bed in our room was sooo comfortable. All rooms had private bathrooms and private patios which was a nice feature too. The breakfast Tracy made was very nice - Fresh baked muffins, fruit with yogurt, tea, coffee and quiche or oatmeal. Tracy also had hair dryers and irons available if necessary. She offered suggestions of local wineries and things to do in the area. I would definitely stay here again.",
            "title": "Spanish Villa, a Cute and Quiet B&B",
            "user": "jbritton78"
        },
        {
            "date": "May 27, 2005",
            "detail_rating": {
                "business": null,
                "cleanliness": 5.0,
                "desk": null,
                "location": null,
                "pool": null,
                "restaurant": null,
                "rooms": 5.0,
                "service": 5.0,
                "sleep": null,
                "value": 5.0
            },
            "helpfulness": 4,
            "id": 3503819,
            "likes": {
                "disliked": null,
                "liked": null
            },
            "rating": 4.0,
            "stay_parameters": "Stayed February 2005",
            "text": "Our experience was good at this cute cozy place. The rooms were beautiful and clean as well as the grounds. Each room has a patio which was nice. It's tucked away in the wooded hills near St. Helena, so the area was quiet and off the busy roads. A romantic restaurant with great food is the Culinary Institute which is near the Inn.",
            "title": "Nice place...great B&B value...friendly service",
            "user": "klp300"
        },
        {
            "date": "April 29, 2005",
            "detail_rating": {
                "business": null,
                "cleanliness": null,
                "desk": null,
                "location": null,
                "pool": null,
                "restaurant": null,
                "rooms": null,
                "service": null,
                "sleep": null,
                "value": null
            },
            "helpfulness": 8,
            "id": 3423968,
            "likes": {
                "disliked": null,
                "liked": null
            },
            "rating": 3.0,
            "stay_parameters": null,
            "text": "At the Inn, Tracey's homemade Italian style quiche was to die for! The breakfast was excellent. Tracey and her husband are wonderful and very warm people.",
            "title": "Cute little inn in Napa",
            "user": "A TripAdvisor user"
        }
    ],
    "slim_ranking": 0.153846153846,
    "stars": null,
    "tripadvisor": {
        "VISITED": false,
        "country_name": null,
        "locality": null,
        "pic_link": null,
        "street_address": null
    },
    "user_rating": 4.5,
    "variance": {
        "average": 3,
        "excellent": 55,
        "poor": 4,
        "terrible": 1,
        "very good": 9
    }
}