{
    "aka": "Ionian Sun Apartments And Villas Hotel",
    "description": null,
    "detail_rating": {
        "cleanliness": null,
        "location": null,
        "rooms": null,
        "service": null,
        "sleep": null,
        "value": null
    },
    "location": {
        "city": null,
        "continent": "Europe",
        "country": "Greece",
        "proposed_city": null,
        "province": null,
        "region": null
    },
    "name": "Ionian Sun Apartments and Villas",
    "places": {
        "aka": [],
        "hotel_description": [],
        "hotel_name": []
    },
    "review_count": 109,
    "review_count_current": 8,
    "reviews": [
        {
            "date": "July 4, 2010",
            "detail_rating": {
                "business": null,
                "cleanliness": 1.0,
                "desk": null,
                "location": 4.0,
                "pool": null,
                "restaurant": null,
                "rooms": 2.0,
                "service": 1.0,
                "sleep": 1.0,
                "value": 2.0
            },
            "helpfulness": null,
            "id": 69674004,
            "likes": {
                "disliked": null,
                "liked": null
            },
            "rating": 2.0,
            "stay_parameters": "Stayed June 2010, traveled as a couple",
            "text": "Just returned from a stay at the Ionian Sun.",
            "title": "Lourdas Lovely - Ionian Sun Not So",
            "user": "ChavFinches"
        },
        {
            "date": "February 10, 2010",
            "detail_rating": {
                "business": null,
                "cleanliness": 4.0,
                "desk": null,
                "location": 5.0,
                "pool": null,
                "restaurant": null,
                "rooms": 3.0,
                "service": 4.0,
                "sleep": 4.0,
                "value": 5.0
            },
            "helpfulness": 1,
            "id": 55672058,
            "likes": {
                "disliked": null,
                "liked": null
            },
            "rating": 5.0,
            "stay_parameters": "Stayed July 2009, traveled with friends",
            "text": "To start on a positive the resort is a lovely quiet place with nice places to eat = La Mer, Olive Lounge etc, avoid Lorraines bizarre menu and average food and Lithero at the end of the beach nice views but poor food, atmosphere and costly for it, although great views.",
            "title": "Beautiful place - a family favourite",
            "user": "journo2710"
        },
        {
            "date": "October 1, 2009",
            "detail_rating": {
                "business": null,
                "cleanliness": 5.0,
                "desk": null,
                "location": 5.0,
                "pool": null,
                "restaurant": null,
                "rooms": 5.0,
                "service": 5.0,
                "sleep": null,
                "value": 5.0
            },
            "helpfulness": 1,
            "id": 45560166,
            "likes": {
                "disliked": null,
                "liked": null
            },
            "rating": 5.0,
            "stay_parameters": "Stayed September 2009, traveled as a couple",
            "text": "The apartmenst were a big let down, the staff firstly are unwelcoming and often rude. The lady in the bar is a mix of nice today, awful tomorrow and very opinionated, she needs some lessons in customer service and plain good manners.",
            "title": "Ionian Sun, Kefalonia - Great Holiday !",
            "user": "Hobbit_9"
        },
        {
            "date": "August 31, 2010",
            "detail_rating": {
                "business": null,
                "cleanliness": 5.0,
                "desk": null,
                "location": 5.0,
                "pool": null,
                "restaurant": null,
                "rooms": 5.0,
                "service": 5.0,
                "sleep": 5.0,
                "value": 4.0
            },
            "helpfulness": 4,
            "id": 77637522,
            "likes": {
                "disliked": null,
                "liked": null
            },
            "rating": 4.0,
            "stay_parameters": "Stayed August 2010, traveled with family",
            "text": "I stayed at the Ionian Sands villa, part of the Ionian Sun complex, for 2 weeks in August 2010. I went with my husband, 18-month old son, mother-in-law, and then my brother and his wife and 3 children stayed in the adjoining Ionian Beach villa.",
            "title": "Ionian Sands villa - lovely place, I miss it already!",
            "user": "DianeM32"
        },
        {
            "date": "August 3, 2010",
            "detail_rating": {
                "business": null,
                "cleanliness": 5.0,
                "desk": null,
                "location": 4.0,
                "pool": null,
                "restaurant": null,
                "rooms": 4.0,
                "service": 3.0,
                "sleep": 4.0,
                "value": 4.0
            },
            "helpfulness": 4,
            "id": 73585470,
            "likes": {
                "disliked": null,
                "liked": null
            },
            "rating": 4.0,
            "stay_parameters": "Stayed July 2010, traveled with family",
            "text": "The villa was better than I expected. It was clean, modern, nicely decorated, with all the amenities you would need. The air conditioning worked perfectly. The cleaners came every few days to clean and also change the sheets and towels, which was great. But the best thing was the outside space. It is awesome. Lots of loungers with parasols, a lounge area with sofa and chairs, a table and chairs, and an infinity pool. The view out over Lourdas bay is breathtaking. It was such a nice place to hang out. It was plenty big enough as well. The Ionian Beach villa was very nice as well. It has less shade but a slightly better view over the bay. I preferred Ionian Sands as I liked all the greenery and there was more shade.",
            "title": "A quiet chilled out location.",
            "user": "busylizzieRomford"
        },
        {
            "date": "July 22, 2010",
            "detail_rating": {
                "business": null,
                "cleanliness": 4.0,
                "desk": null,
                "location": 4.0,
                "pool": null,
                "restaurant": null,
                "rooms": 4.0,
                "service": 5.0,
                "sleep": 5.0,
                "value": 4.0
            },
            "helpfulness": 4,
            "id": 71959417,
            "likes": {
                "disliked": null,
                "liked": null
            },
            "rating": 4.0,
            "stay_parameters": "Stayed July 2010, traveled with family",
            "text": "There are steps through the trees down to the Ionian Sun pool area with bar. If you have any degree of fitness these are no problem, going up or down. Good to get the calf muscles working! But really, if you can't manage these, you need to think about how unfit you are. And as it's through the trees it's nice and shady.",
            "title": "Young children are welcome too!",
            "user": "friedcourgettes"
        },
        {
            "date": "July 22, 2010",
            "detail_rating": {
                "business": null,
                "cleanliness": 2.0,
                "desk": null,
                "location": 2.0,
                "pool": null,
                "restaurant": null,
                "rooms": 2.0,
                "service": 1.0,
                "sleep": 2.0,
                "value": 2.0
            },
            "helpfulness": 2,
            "id": 71882043,
            "likes": {
                "disliked": null,
                "liked": null
            },
            "rating": 2.0,
            "stay_parameters": "Stayed July 2010, traveled with family",
            "text": "The pool area is fine, not amazing, but fine. We often went in the morning to have a coffee and the kids would play in the pool. It's a good sized pool, and there always seemed to be loungers available, it wasn't too busy. We never had food there so I can't comment on that. They also serve drinks and have ice creams. Belle behind the bar was very nice, yes, she can be moody but she's a nice lady. In general we preferred the pool in our villa as it was more private and relaxing. Also, in the second week the pool bar pool looked a bit green and was too warm.",
            "title": "No 53, Ionian Gloom, and rodents",
            "user": "grayfam"
        },
        {
            "date": "July 15, 2010",
            "detail_rating": {
                "business": null,
                "cleanliness": 5.0,
                "desk": null,
                "location": 5.0,
                "pool": null,
                "restaurant": null,
                "rooms": 5.0,
                "service": 5.0,
                "sleep": 4.0,
                "value": 4.0
            },
            "helpfulness": 3,
            "id": 71031698,
            "likes": {
                "disliked": null,
                "liked": null
            },
            "rating": 4.0,
            "stay_parameters": "Stayed June 2010, traveled as a couple",
            "text": "From the pool bar it's just some steps down to Lourdas beach. The beach is very wide, and there was never a problem getting loungers or anything, it's not too busy. It's a bit pebbly, and there was some kind of fish in the shallow water which kept nipping at my ankles! But not leaving marks or anything, just annoying. However, by far a better beach is Trapezeki beach, which is just around the corner, a short drive. It is gorgeous, all sandy, shallow water for very far out, and a really cool beach bar with great music. It is such a better beach - forget Lourdas beach, go to Trapezeki, trust me! You can park your car just by the beach. There may be a way to walk there around the headland as well, I'm not sure.",
            "title": "Ionian Sun - Lovely place!",
            "user": "Chillaxilicious"
        }
    ],
    "slim_ranking": 0.166666666667,
    "stars": null,
    "tripadvisor": {
        "VISITED": false,
        "country_name": null,
        "locality": null,
        "pic_link": null,
        "street_address": null
    },
    "user_rating": 4.5,
    "variance": {
        "average": 4,
        "excellent": 78,
        "poor": 3,
        "terrible": 0,
        "very good": 24
    }
}