{
    "aka": "Selous Safari Camp Hotel Selous Game Reserve",
    "description": "The Selous Safari Camp is delightfully situated within an open palm forest on the shores of Lake Nzerakera, a massive lake adjoining the Great Rufiji River. All safari tents are widely spaced along the lake shore ensuring maximum privacy and wonderful views. Blending in superbly with its natural surroundings in what is one of the most photogenic areas of the Selous Game Reserve, with incredible game viewing including the rare African Wild Dog.",
    "detail_rating": {
        "cleanliness": null,
        "location": null,
        "rooms": null,
        "service": null,
        "sleep": null,
        "value": null
    },
    "location": {
        "city": null,
        "continent": "Africa",
        "country": "Tanzania",
        "proposed_city": null,
        "province": null,
        "region": "Lindi Region"
    },
    "name": "Siwandu",
    "places": {
        "aka": [],
        "hotel_description": [],
        "hotel_name": []
    },
    "review_count": 141,
    "review_count_current": 16,
    "reviews": [
        {
            "date": "December 17, 2006",
            "detail_rating": {
                "business": null,
                "cleanliness": 5.0,
                "desk": null,
                "front_desk": 4.0,
                "location": 5.0,
                "pool": null,
                "restaurant": null,
                "rooms": 5.0,
                "service": 5.0,
                "sleep": null,
                "value": 4.0
            },
            "helpfulness": 2,
            "id": 6453025,
            "likes": {
                "disliked": null,
                "liked": null
            },
            "rating": 5.0,
            "stay_parameters": "Stayed November 2006",
            "text": "We spent 3 days of our honeymoon at the Selous Safari camp. We had an amazing experience. The wildlife was excellent while we were there. We were luck enough to see lions, african hunting dogs, hippos, elephants, girafes, etc. The food was excellent and the service was amazing. It was the perfect place to spend part of our honeymoon.",
            "title": "An Amazing Place",
            "user": "Ranza76"
        },
        {
            "date": "October 22, 2006",
            "detail_rating": {
                "business": null,
                "cleanliness": 5.0,
                "desk": null,
                "front_desk": 5.0,
                "location": 5.0,
                "pool": null,
                "restaurant": null,
                "rooms": 5.0,
                "service": 5.0,
                "sleep": null,
                "value": 4.0
            },
            "helpfulness": 2,
            "id": 5983448,
            "likes": {
                "disliked": "\u2014 Go the the private camp rather than the mian camp if you can",
                "liked": "\u2014 The amazing 5 star tents"
            },
            "rating": 5.0,
            "stay_parameters": "Stayed October 2006, traveled as a couple",
            "text": "We just returned from a two week trip to Tanzania and spent three nights on safari at the Selous Private Camp. It has only four tented safari villas (the main camp has 9).",
            "title": "Fantastic Place to Stay",
            "user": "georgewalker"
        },
        {
            "date": "August 15, 2006",
            "detail_rating": {
                "business": null,
                "cleanliness": null,
                "desk": null,
                "location": null,
                "pool": null,
                "restaurant": null,
                "rooms": null,
                "service": null,
                "sleep": null,
                "value": null
            },
            "helpfulness": 6,
            "id": 5613762,
            "likes": {
                "disliked": null,
                "liked": null
            },
            "rating": 5.0,
            "stay_parameters": null,
            "text": "We loved it there, amazing 5 star tented accommodation, outstanding food and superb service. It way exceeded our expectations. We would definitely advise that is worth paying the extra to stay at the Private Camp vs. the Main Camp. It is just that bit extra special with only 8 guests max., inclusive of all drinks and personal butler service.",
            "title": "Brilliant Safari Option in Southern Tanzania",
            "user": "benjiwoody"
        },
        {
            "date": "March 15, 2006",
            "detail_rating": {
                "business": null,
                "cleanliness": null,
                "desk": null,
                "location": null,
                "pool": null,
                "restaurant": null,
                "rooms": null,
                "service": null,
                "sleep": null,
                "value": null
            },
            "helpfulness": 4,
            "id": 4623352,
            "likes": {
                "disliked": null,
                "liked": null
            },
            "rating": 5.0,
            "stay_parameters": null,
            "text": "The camp offers walking, driving and boating safari options. We would highly recommend this place vs. others that can only offer driving safari. The variety was wonderful, with great guides and loads of animals to see. On a morning walking safari we came round a corner to find a \"bush breakfast\" all set up for the 6 in our group. It was amazing to sit there in the bush eating a full breakfast and drinking fresh tea and juice.",
            "title": "Very Special",
            "user": "A TripAdvisor user"
        },
        {
            "date": "January 19, 2006",
            "detail_rating": {
                "business": null,
                "cleanliness": 5.0,
                "desk": null,
                "location": null,
                "pool": null,
                "restaurant": null,
                "rooms": 5.0,
                "service": 5.0,
                "sleep": null,
                "value": 5.0
            },
            "helpfulness": 5,
            "id": 4363035,
            "likes": {
                "disliked": null,
                "liked": null
            },
            "rating": 5.0,
            "stay_parameters": "Stayed January 2006",
            "text": "All in all we would highly rate this camp.",
            "title": "A very special experience",
            "user": "Otoman"
        },
        {
            "date": "October 30, 2007",
            "detail_rating": {
                "business": null,
                "cleanliness": 5.0,
                "desk": null,
                "front_desk": 5.0,
                "location": 5.0,
                "pool": null,
                "restaurant": null,
                "rooms": 5.0,
                "service": 5.0,
                "sleep": null,
                "value": 5.0
            },
            "helpfulness": null,
            "id": 10457517,
            "likes": {
                "disliked": null,
                "liked": null
            },
            "rating": 5.0,
            "stay_parameters": "Stayed October 2006, traveled as a couple",
            "text": "Almost dont want to recommend it as wed like to keep it to ourselves but it was superb. Yes we were there for our honeymoon too along with most couples it has to be said but god it was good. Amazing wildlife and luxurious accommodation with phenominally caring and attentive staff. One day I sincerely hope we will go back. We will be lucky indeed if we do.",
            "title": "Very Very Special",
            "user": "wipeout75"
        },
        {
            "date": "October 22, 2007",
            "detail_rating": {
                "business": null,
                "cleanliness": 5.0,
                "desk": null,
                "front_desk": 5.0,
                "location": 5.0,
                "pool": null,
                "restaurant": null,
                "rooms": 5.0,
                "service": 5.0,
                "sleep": null,
                "value": 5.0
            },
            "helpfulness": 1,
            "id": 10214110,
            "likes": {
                "disliked": "\u2014 Nothing",
                "liked": "\u2014 Spacious, clean Airy"
            },
            "rating": 5.0,
            "stay_parameters": "Stayed October 2007, traveled as a couple",
            "text": "We stayed at Selous for 3 nights, the accomadation is really great, large tents well equipped with good sized veranda.",
            "title": "Luxary in a Wild Setting",
            "user": "EastofEngland"
        },
        {
            "date": "October 1, 2007",
            "detail_rating": {
                "business": 2.0,
                "cleanliness": 4.0,
                "desk": null,
                "front_desk": 2.0,
                "location": 4.0,
                "pool": null,
                "restaurant": null,
                "rooms": 4.0,
                "service": 4.0,
                "sleep": null,
                "value": 2.0
            },
            "helpfulness": 4,
            "id": 10027722,
            "likes": {
                "disliked": null,
                "liked": "\u2014 Guided walks with Molly are an adventure of a life time - don't miss out on it!"
            },
            "rating": 2.0,
            "stay_parameters": "Stayed September 2007, traveled with family",
            "text": "Food was good and served in a nice building.",
            "title": "Not up to our expectations...",
            "user": "swiss_darwin"
        },
        {
            "date": "September 23, 2007",
            "detail_rating": {
                "business": null,
                "cleanliness": 5.0,
                "desk": null,
                "front_desk": 4.0,
                "location": 3.0,
                "pool": null,
                "restaurant": null,
                "rooms": null,
                "service": 4.0,
                "sleep": null,
                "value": 5.0
            },
            "helpfulness": 1,
            "id": 8865277,
            "likes": {
                "disliked": null,
                "liked": "\u2014 Size (small) and the careful attention to details"
            },
            "rating": 5.0,
            "stay_parameters": "Stayed August 2007, traveled with friends",
            "text": "Staff were friendly and tried to help as much as possible.",
            "title": "Wonderful",
            "user": "Lutecia"
        },
        {
            "date": "September 19, 2007",
            "detail_rating": {
                "business": 2.0,
                "cleanliness": 4.0,
                "desk": null,
                "front_desk": 5.0,
                "location": 5.0,
                "pool": null,
                "restaurant": null,
                "rooms": 5.0,
                "service": 5.0,
                "sleep": null,
                "value": 5.0
            },
            "helpfulness": 3,
            "id": 8754776,
            "likes": {
                "disliked": null,
                "liked": null
            },
            "rating": 5.0,
            "stay_parameters": "Stayed September 2007, traveled as a couple",
            "text": "The Safari guides were very accomadating always trying to find the unusual, we saw three packs of wild dog.",
            "title": "Fantastic stay in Selous",
            "user": "Hockers"
        },
        {
            "date": "September 7, 2007",
            "detail_rating": {
                "business": null,
                "cleanliness": 5.0,
                "desk": null,
                "front_desk": 5.0,
                "location": 5.0,
                "pool": null,
                "restaurant": null,
                "rooms": 4.0,
                "service": 5.0,
                "sleep": null,
                "value": 4.0
            },
            "helpfulness": 5,
            "id": 8672012,
            "likes": {
                "disliked": "\u2014 Lack of alone-time",
                "liked": "\u2014 Great game viewing, lovely staff"
            },
            "rating": 4.0,
            "stay_parameters": "Stayed August 2007, traveled as a couple",
            "text": "My husband and I stayed at Selous Safari Camp for 4 nights in August. We had a lovely time and saw tons of animals up close - including an amazing pride of lions. For first-time safari-ers like us it was a great introduction to the wild!",
            "title": "Really enjoyed our stay",
            "user": "Vixedcat"
        },
        {
            "date": "August 2, 2007",
            "detail_rating": {
                "business": 3.0,
                "cleanliness": 5.0,
                "desk": null,
                "front_desk": 5.0,
                "location": 5.0,
                "pool": null,
                "restaurant": null,
                "rooms": 5.0,
                "service": 5.0,
                "sleep": null,
                "value": 4.0
            },
            "helpfulness": 1,
            "id": 8279418,
            "likes": {
                "disliked": "\u2014 The food",
                "liked": "\u2014 The tent"
            },
            "rating": 5.0,
            "stay_parameters": "Stayed July 2007, traveled as a couple",
            "text": "The staff were wonderful, particularly Justin, the main guide at Private camp, and Kiedege who does the boating safaris.",
            "title": "Loved it - perfect stay!",
            "user": "sianajones01"
        },
        {
            "date": "April 2, 2007",
            "detail_rating": {
                "business": null,
                "cleanliness": 3.0,
                "desk": null,
                "front_desk": 2.0,
                "location": 4.0,
                "pool": null,
                "restaurant": null,
                "rooms": 5.0,
                "service": 3.0,
                "sleep": null,
                "value": 3.0
            },
            "helpfulness": 2,
            "id": 7269492,
            "likes": {
                "disliked": null,
                "liked": null
            },
            "rating": 3.0,
            "stay_parameters": "Stayed March 2007, traveled as a couple",
            "text": "The tents are luxurious and come with their own butler. The animals from the lake regularly come up and graze right next to the tents in the night, which makes for some pretty amazing night viewing from the comfort of your bed!",
            "title": "Doesn't quite hit the mark",
            "user": "1801"
        },
        {
            "date": "January 28, 2007",
            "detail_rating": {
                "business": null,
                "cleanliness": null,
                "desk": null,
                "location": null,
                "pool": null,
                "restaurant": null,
                "rooms": null,
                "service": null,
                "sleep": null,
                "value": null
            },
            "helpfulness": 1,
            "id": 6709426,
            "likes": {
                "disliked": null,
                "liked": null
            },
            "rating": 5.0,
            "stay_parameters": null,
            "text": "The food is very good, especially considering the remoteness of the location. Better yet, the restaurant overlooks the lake-side, and animals from elephants to giraffe to baboons regulalrly cruise past EXTREMELY CLOSE during meals (see attached pic).",
            "title": "Great Experience all in all",
            "user": "maddyIstanbul"
        },
        {
            "date": "December 20, 2006",
            "detail_rating": {
                "business": null,
                "cleanliness": 5.0,
                "desk": null,
                "front_desk": 5.0,
                "location": 5.0,
                "pool": null,
                "restaurant": null,
                "rooms": 5.0,
                "service": 5.0,
                "sleep": null,
                "value": 5.0
            },
            "helpfulness": 1,
            "id": 6476105,
            "likes": {
                "disliked": "\u2014 Nothing",
                "liked": "\u2014 The safaris"
            },
            "rating": 5.0,
            "stay_parameters": "Stayed July 2006, traveled with family",
            "text": "We stayed at the Private camp which has only 4 tents, and is self-contained from the main camp. This makes for a very personal level of service from the staff which is great. However, it also means that everyone at Private camp (normally 4 couples and guides) all dine together in the evening. On the one hand this is good, (if you like the other people!), but for a honeymoon it was quite an intense level of contact to have with other guests, given that you also spend large parts of your day out viewing with the same individuals. We met some great people, but could also have used some more alone-time...",
            "title": "The most amazing place ever",
            "user": "sarah.farnan"
        },
        {
            "date": "October 11, 2005",
            "detail_rating": {
                "business": null,
                "cleanliness": 5.0,
                "desk": null,
                "location": null,
                "pool": null,
                "restaurant": null,
                "rooms": 5.0,
                "service": 5.0,
                "sleep": null,
                "value": 4.0
            },
            "helpfulness": 9,
            "id": 4007426,
            "likes": {
                "disliked": null,
                "liked": null
            },
            "rating": 5.0,
            "stay_parameters": "Stayed July 2005",
            "text": "Waking up to two elephants outside your tent munching on trees is an incredable experience. We were lucky enough to stay at Selous private which is a four tent private camp adjacent to the main camp - which has about 12 tents. Staff were astonishing especially as my new wife had what they affectionality called 'runny tummy.' Guides are really good and on ride from airstrip to camp we saw giraffe, impala, hyena and many birds. Its a really lovely place and very isolated which means no crowds as on many Kenyan safaris. Kinda feels like something from early colonial days. game drives are awesome but make sure you do a sunset river trip too. that is truly breathtaking. bring a good camera with 300mm lens. Fulfilled all our dreams and hopes for what a safari would be. Its expensive but honeslty worth every penny. early July seemed like great time to go too. the hardest part was leaving. Cool thing here is that they buy and give seeds to a local village who then grows all their produce. nice way of suporting locals as well as assuring fresh fruit and veg! Food is very good.",
            "title": "Decedant luxury and lots and lots of wildwife",
            "user": "pipster12"
        }
    ],
    "slim_ranking": 0.105263157895,
    "stars": null,
    "tripadvisor": {
        "VISITED": false,
        "country_name": null,
        "locality": null,
        "pic_link": null,
        "street_address": null
    },
    "user_rating": 5.0,
    "variance": {
        "average": 2,
        "excellent": 130,
        "poor": 1,
        "terrible": 0,
        "very good": 8
    }
}