{
    "aka": null,
    "description": "A stately and distinguished National Landmark, the Patterson Inn is situated on a quarter acre of exquisitely landscaped grounds in the heart of one of Denver\u2019s original high-end neighborhoods. Historically intriguing yet complete with all the comforts of modern amenities, it offers a luxurious reprieve from the stresses of everyday life.",
    "detail_rating": {
        "cleanliness": null,
        "location": null,
        "rooms": null,
        "service": null,
        "sleep": null,
        "value": null
    },
    "location": {
        "city": "Denver",
        "continent": null,
        "country": "United States",
        "proposed_city": "Patterson",
        "province": null,
        "region": null
    },
    "name": "Patterson Inn",
    "places": {
        "aka": [],
        "hotel_description": [
            "Patterson",
            "Denver"
        ],
        "hotel_name": [
            "Patterson"
        ]
    },
    "review_count": 31,
    "review_count_current": 15,
    "reviews": [
        {
            "date": "September 26, 2012",
            "detail_rating": {
                "business": null,
                "cleanliness": 5.0,
                "desk": null,
                "location": 4.0,
                "pool": null,
                "restaurant": null,
                "rooms": 5.0,
                "service": 5.0,
                "sleep": 4.0,
                "value": 4.0
            },
            "helpfulness": 1,
            "id": 141364754,
            "likes": {
                "disliked": null,
                "liked": null
            },
            "rating": 4.0,
            "stay_parameters": "Stayed September 2012, traveled as a couple",
            "text": "A couple of months ago, I heard about this newly restored mansion-turned-into-inn on Capital Hill, and immediately booked a room even though the website wasn't fully functional and did not have room pictures yet. The owners preserved many interior architectural details, though some are no longer in their original locations. The innkeepers on duty gave us a tour of the house: all the rooms are beautiful, though some have better views than others. We stayed in No. 9, the smallest room in the inn, on the third floor tucked under the roof. It faced front with a view of the Capital dome. Though small, it was comfortable and well-furnished, and had a large, beautiful bathroom with a cast iron clawfoot tub, thick towels, and plenty of storage space with the double vanity. The bed, being new, was very comfortable, with good pillows and nice linens.",
            "title": "Wonderful historic inn",
            "user": "toesmalone"
        },
        {
            "date": "September 17, 2012",
            "detail_rating": {
                "business": null,
                "cleanliness": 5.0,
                "desk": null,
                "location": 5.0,
                "pool": null,
                "restaurant": null,
                "rooms": 5.0,
                "service": 5.0,
                "sleep": 5.0,
                "value": 5.0
            },
            "helpfulness": null,
            "id": 140507026,
            "likes": {
                "disliked": null,
                "liked": null
            },
            "rating": 5.0,
            "stay_parameters": "Stayed September 2012, traveled as a couple",
            "text": "The inn is in the final stages before its official launch, so there are some bugs to work out. The good: the innkeepers on duty were really friendly, loved the afternoon wine and nibbles, the hot/cold water dispenser and ice machine on each landing, the air conditioning, the eco toilet. The inn also served a delicious (and generous) continental breakfast of coffee, juice, fresh fruit, pastries, granola, and yogurt. The (minor) peeves: given that there were the hot/cold water dispensers, it would have been nice to have had an accompanying selection of tea also on hand, if not on the landings, then in the dining room. As for the AC, it would have been good to have room control -- AC was not needed on the cool fall evening, and we would have loved to have slept with the window open for some fresh air. It would also be nice to have a lighter blanket alternative available in the closet -- I love goose down comforters, but it was not cold enough for down and not warm enough for sleeping under just a sheet. Finally, we really liked the location of the inn, but parking was a bit of a nightmare, not surprising given the age of the neighborhood and its very narrow streets. The B&B does have 3 off-street parking spots but when we arrived all three were occupied by staff.",
            "title": "We celebrated our Anniversary at the Patterson and we loved it!",
            "user": "Ted Z"
        },
        {
            "date": "September 7, 2012",
            "detail_rating": {
                "business": null,
                "cleanliness": 5.0,
                "desk": null,
                "location": 5.0,
                "pool": null,
                "restaurant": null,
                "rooms": 5.0,
                "service": 5.0,
                "sleep": 5.0,
                "value": 5.0
            },
            "helpfulness": 1,
            "id": 139700326,
            "likes": {
                "disliked": null,
                "liked": null
            },
            "rating": 5.0,
            "stay_parameters": "Stayed August 2012, traveled with family",
            "text": "Over all, we enjoyed our stay, and look forward to coming back in the near future to try out the other rooms.",
            "title": "You won't be disappointed!",
            "user": "TravelGleek"
        },
        {
            "date": "August 9, 2012",
            "detail_rating": {
                "business": null,
                "cleanliness": 5.0,
                "desk": null,
                "location": 5.0,
                "pool": null,
                "restaurant": null,
                "rooms": 5.0,
                "service": 5.0,
                "sleep": 5.0,
                "value": 5.0
            },
            "helpfulness": 3,
            "id": 136729353,
            "likes": {
                "disliked": null,
                "liked": null
            },
            "rating": 5.0,
            "stay_parameters": "Stayed August 2012, traveled as a couple",
            "text": "Great stay last weekend: here's our review from bedandbreakfast.com: Having already been given a tour of the Inn, we were excited to book a room (The Prague) for our anniversary. It is a beautiful place and the innkeepers were very nice and accommodating. We were given another brief tour and told about some of the history of the building and the renovation. The bed was very comfortable and the shower was great. Overall, a very comfortable, enjoyable and historically interesting place to stay. Definitely recommended! For those interested in the \"haunted history,\" I think I saw one (friendly)!",
            "title": "Absolutely Beautiful Project",
            "user": "Paul M"
        },
        {
            "date": "July 27, 2012",
            "detail_rating": {
                "business": null,
                "cleanliness": null,
                "desk": null,
                "location": null,
                "pool": null,
                "restaurant": null,
                "rooms": null,
                "service": null,
                "sleep": null,
                "value": null
            },
            "helpfulness": 2,
            "id": 135533410,
            "likes": {
                "disliked": null,
                "liked": null
            },
            "rating": 5.0,
            "stay_parameters": null,
            "text": "Stayed at the newly remodeled Patterson Inn for 4 nights in late August. The hosts were incredibly nice and helpful. When we arrived we were greeted promptly and shown to our room. We were also given a tour of this remarkable Inn and I can honestly say there is not a single room I would have been disappointed to have. We stayed in the Antoinette, which was on the main floor. I never heard any noise from any other guest and the room was very spacious. The room Davinci is also on the main floor and the next time we are there, I will be staying in that room. Incredible. The bed was incredibly comfortable. Breakfast was always fresh and there were plenty of options. There are three parking spots reserved for guests on the property, but there is also street parking. We didn't really walk to anywhere but we drove all over Colorado and the location of the Inn is perfect. Easy access to everything. I wouldn't stay anywhere else in Denver and I would recommend it to friends and family.",
            "title": "Just Gorgeous.....Historical",
            "user": "LEMmy17"
        },
        {
            "date": "June 21, 2013",
            "detail_rating": {
                "business": null,
                "cleanliness": 5.0,
                "desk": null,
                "location": 5.0,
                "pool": null,
                "restaurant": null,
                "rooms": 4.0,
                "service": 5.0,
                "sleep": 4.0,
                "value": 4.0
            },
            "helpfulness": null,
            "id": 164727848,
            "likes": {
                "disliked": null,
                "liked": null
            },
            "rating": 5.0,
            "stay_parameters": "Stayed June 2013, traveled as a couple",
            "text": "This is a gorgeous old mansion, beautifully renovated into a new B&B. The architecture inside and out is a treat to behold. Each room is unique--we were in the Prague suite for 3 nights. Comfy king bed, HUGE bathroom with a spacious shower stall and a separate tub with hand-held shower. Nice toiletries and towels. Hair dryer (but not a very powerful one). In the summer there's a lot of morning light that comes thru the highest windows, so late sleepers might prefer a different room. Would have liked a sitting area in the room--some other rooms have one--but we enjoyed the comfortable seating in the basement pub.",
            "title": "Comfortable, lovely and friendly",
            "user": "wunderwoof"
        },
        {
            "date": "May 28, 2013",
            "detail_rating": {
                "business": null,
                "cleanliness": 5.0,
                "desk": null,
                "location": 5.0,
                "pool": null,
                "restaurant": null,
                "rooms": 5.0,
                "service": 5.0,
                "sleep": 5.0,
                "value": 3.0
            },
            "helpfulness": 1,
            "id": 162213082,
            "likes": {
                "disliked": null,
                "liked": null
            },
            "rating": 4.0,
            "stay_parameters": "Stayed May 2013, traveled with family",
            "text": "Complimentary wine in the late afternoon. Lovely, sunny breakfast room and patio off it. Elevator to the 2nd floor but not the 3rd. Limited off-street parking on site, but unrestricted street parking and, in a pinch, complimentary spots at a garage a block away. Very convenient area--walk to restaurants, bars and a Whole Foods. About a mile to downtown area. The entire staff was welcoming and friendly, but must give special thanks to Kendyl and Doug! S&T",
            "title": "Beautiful 'home away from home' !!!",
            "user": "meg043"
        },
        {
            "date": "May 5, 2013",
            "detail_rating": {
                "business": null,
                "cleanliness": 5.0,
                "desk": null,
                "location": 5.0,
                "pool": null,
                "restaurant": null,
                "rooms": 5.0,
                "service": 5.0,
                "sleep": 5.0,
                "value": 5.0
            },
            "helpfulness": 1,
            "id": 159740187,
            "likes": {
                "disliked": null,
                "liked": null
            },
            "rating": 5.0,
            "stay_parameters": "Stayed April 2013, traveled as a couple",
            "text": "We recently stayed 2 nights in the Chesire room at the Patterson Inn in Denver. We had three people in our party, and this is there only room that can accommodate three. The room was beautifully decorated, spotless, and the bathroom was big and gorgeous. There was PLENTY of room for three. The beds were outstanding. I was able to peak into a few other rooms, which were all unique and perfectly decorated.",
            "title": "1st time in a B&B",
            "user": "Elizabeth W"
        },
        {
            "date": "April 29, 2013",
            "detail_rating": {
                "business": null,
                "cleanliness": 5.0,
                "desk": null,
                "location": 4.0,
                "pool": null,
                "restaurant": null,
                "rooms": 5.0,
                "service": 3.0,
                "sleep": 5.0,
                "value": 3.0
            },
            "helpfulness": null,
            "id": 159174009,
            "likes": {
                "disliked": null,
                "liked": null
            },
            "rating": 4.0,
            "stay_parameters": "Stayed April 2013, traveled with friends",
            "text": "The location is great, easy to get to all the fun parts of Denver.",
            "title": "LARGE ROOMS!",
            "user": "Jane H"
        },
        {
            "date": "April 25, 2013",
            "detail_rating": {
                "business": null,
                "cleanliness": 5.0,
                "desk": null,
                "location": 4.0,
                "pool": null,
                "restaurant": null,
                "rooms": 5.0,
                "service": 5.0,
                "sleep": 5.0,
                "value": 4.0
            },
            "helpfulness": 1,
            "id": 158755379,
            "likes": {
                "disliked": null,
                "liked": null
            },
            "rating": 5.0,
            "stay_parameters": "Stayed April 2013, traveled solo",
            "text": "The hosts make you feel very comfortable and were incredibly nice! We loved our stay at the Patterson Inn, and will hopefully be back!",
            "title": "Perfection in the Prague Suite",
            "user": "DCginger01"
        },
        {
            "date": "February 11, 2013",
            "detail_rating": {
                "business": null,
                "cleanliness": 5.0,
                "desk": null,
                "location": 5.0,
                "pool": null,
                "restaurant": null,
                "rooms": 5.0,
                "service": 5.0,
                "sleep": 5.0,
                "value": 4.0
            },
            "helpfulness": null,
            "id": 151908444,
            "likes": {
                "disliked": null,
                "liked": null
            },
            "rating": 5.0,
            "stay_parameters": "Stayed February 2013, traveled as a couple",
            "text": "Enough with the stuffy and musty Victorian B & B image. The Patterson is a unique, Chateauesque boutique-like bed and breakfast, tucked in Denver's hip, urban Capitol Hill area. I can't wait to return in the summer or fall so we can go out and explore the neighborhood's eateries or even walk downtown. We were in the Antoinette room on the first floor and were delighted with it (the most inexpensive of the rooms). The attention to details are unbelievable; the decorator did an fantastic job in coordinating each room's ambience. The use of films to inspire each room's theme is done in a clever and classy sort of way--no tackiness here! The Patterson is an immense house, but specs of dust were few and far between. We loved the plush linens, bedding, and towels. The breakfast spread was laid out buffet style, but it was a notch above a typical continental (quiche and french toast casserole were included). I always appreciate a substantial and hot breakfst--something more than I what I would do at home. The onsite hosts, Mike and Melissa, went beyond the call of duty and were clearly enjoying their roles (Mike spent over an hour giving us an insider's tour of the renovation, Melissa shared a recipe). Most B & B's are pricey anymore, and not a \"cheap way to go\". Still, we received so much more individual attention than one would get at an upscale hotel. It was a fun, romantic, way to have a special weekend. Plus, we were supporting an historically preserved property! This place has great potential as a venue for weddings, catered events, etc. I'm hoping it will be a success; it is a relatively new business and is finding its stride. The money spent restoring this place was phenomenal, I'm sure. Anyone staying here should appreciate that the Patterson is one more priceless mansion that has been saved from demolition.",
            "title": "Not your usual B & B",
            "user": "marvinandrew"
        },
        {
            "date": "January 25, 2013",
            "detail_rating": {
                "business": null,
                "cleanliness": 5.0,
                "desk": null,
                "location": 5.0,
                "pool": null,
                "restaurant": null,
                "rooms": 5.0,
                "service": 5.0,
                "sleep": 5.0,
                "value": 4.0
            },
            "helpfulness": null,
            "id": 150583257,
            "likes": {
                "disliked": null,
                "liked": null
            },
            "rating": 5.0,
            "stay_parameters": "Stayed October 2012, traveled as a couple",
            "text": "We visited the Inn while in town to watch Saints vs Broncos game. We prefer to stay in b & b's whenever possible and this inn was truly special. The renovation is excellent and the inn is conveniently located near restaurants, shops, etc.",
            "title": "Patterson Inn Perfection...",
            "user": "AnnetteUtah"
        },
        {
            "date": "December 20, 2012",
            "detail_rating": {
                "business": null,
                "cleanliness": 5.0,
                "desk": null,
                "location": 5.0,
                "pool": null,
                "restaurant": null,
                "rooms": 5.0,
                "service": 5.0,
                "sleep": 5.0,
                "value": 5.0
            },
            "helpfulness": 1,
            "id": 147795136,
            "likes": {
                "disliked": null,
                "liked": null
            },
            "rating": 5.0,
            "stay_parameters": "Stayed November 2012, traveled on business",
            "text": "We were pleased by the friendly and attentive staff who were more than capable at dealing with our various requests/needs. My hubby and I were in the middle of 2 stressful moves so we came to the inn in desperate need of quiet time. I'm so happy to report that the inn did not disappoint.",
            "title": "Wonderful library room!",
            "user": "pealet"
        },
        {
            "date": "December 4, 2012",
            "detail_rating": {
                "business": null,
                "cleanliness": 5.0,
                "desk": null,
                "location": 5.0,
                "pool": null,
                "restaurant": null,
                "rooms": 4.0,
                "service": 2.0,
                "sleep": null,
                "value": 2.0
            },
            "helpfulness": null,
            "id": 146751932,
            "likes": {
                "disliked": null,
                "liked": null
            },
            "rating": 3.0,
            "stay_parameters": "Stayed November 2012",
            "text": "Our room had enormously high ceilings and gorgeous furnishings. The towels & linens were plush and soft. We had such a relaxing weekend (minus losing our football game-lol) that we were refreshed & ready to face our ongoing moves.",
            "title": "Over-priced and doesn't possess that B&B ambiance yet",
            "user": "Kanicane"
        },
        {
            "date": "November 10, 2012",
            "detail_rating": {
                "business": null,
                "cleanliness": 5.0,
                "desk": null,
                "location": 5.0,
                "pool": null,
                "restaurant": null,
                "rooms": 5.0,
                "service": 5.0,
                "sleep": 5.0,
                "value": 5.0
            },
            "helpfulness": null,
            "id": 145103983,
            "likes": {
                "disliked": null,
                "liked": null
            },
            "rating": 5.0,
            "stay_parameters": "Stayed October 2012, traveled with family",
            "text": "We were so pleased with our stay that we wouldn't hesitate staying at the Patterson Inn the next time we visit Denver. We can also highly recommend that anyone else do the same.",
            "title": "The Amazing Patterson Inn",
            "user": "Gloversvillian"
        }
    ],
    "slim_ranking": 0.4,
    "stars": 3.5,
    "tripadvisor": {
        "VISITED": false,
        "country_name": null,
        "locality": null,
        "pic_link": null,
        "street_address": null
    },
    "user_rating": 4.5,
    "variance": {
        "average": 2,
        "excellent": 21,
        "poor": 0,
        "terrible": 0,
        "very good": 8
    }
}