{
    "aka": "Nordic Light Stockholm",
    "description": "Nordic Light Hotel is Stockholm's design hotel, with an interior inspired by the northern light. The hotel is located in the city centre of Stockholm right next to the best shopping, nightlife and the express-train to Arlanda airport. All 175 rooms share the same well thought-out design and the atmosphere in our restaurant and bar is both cool and inviting. At the hotel, our friendly staff guides you to the best restaurants, clubs and shops.",
    "detail_rating": {
        "cleanliness": 4.0,
        "location": 4.5,
        "rooms": 4.0,
        "service": 4.0,
        "sleep": 4.0,
        "value": 4.0
    },
    "location": {
        "city": null,
        "continent": "Europe",
        "country": "Sweden",
        "proposed_city": "Stockholm",
        "province": null,
        "region": null
    },
    "name": "Nordic Light Hotel",
    "places": {
        "aka": [
            "Stockholm"
        ],
        "hotel_description": [
            "Stockholm"
        ],
        "hotel_name": []
    },
    "review_count": 478,
    "review_count_current": 20,
    "reviews": [
        {
            "date": "January 21, 2008",
            "detail_rating": {
                "business": 4.0,
                "cleanliness": 5.0,
                "desk": null,
                "front_desk": 5.0,
                "location": 5.0,
                "pool": null,
                "restaurant": null,
                "rooms": 5.0,
                "service": null,
                "sleep": null,
                "value": 3.0
            },
            "helpfulness": null,
            "id": 12847833,
            "likes": {
                "disliked": null,
                "liked": null
            },
            "rating": 4.0,
            "stay_parameters": "Stayed November 2007, traveled on business",
            "text": "True the lights are a bit gimmicky and you'll either love them or hate them, but this hotel was just what I was looking for at the end of a long flight.",
            "title": "Pretty Good",
            "user": "littleleys"
        },
        {
            "date": "December 10, 2007",
            "detail_rating": {
                "business": 3.0,
                "cleanliness": 2.0,
                "desk": null,
                "front_desk": 3.0,
                "location": 3.0,
                "pool": null,
                "restaurant": null,
                "rooms": 1.0,
                "service": 3.0,
                "sleep": null,
                "value": 1.0
            },
            "helpfulness": 1,
            "id": 11461644,
            "likes": {
                "disliked": null,
                "liked": null
            },
            "rating": 2.0,
            "stay_parameters": "Stayed December 2007, traveled as a couple",
            "text": "It's situated right at the end of the platform for the Arlanda Express and was a five / ten minute walk to the main business district. My flight arrived at 23:00 into Arlanda and I was settled into my room within an hour.",
            "title": "Choose another place to stay!",
            "user": "Mr_Lotus"
        },
        {
            "date": "December 6, 2007",
            "detail_rating": {
                "business": null,
                "cleanliness": null,
                "desk": null,
                "location": null,
                "pool": null,
                "restaurant": null,
                "rooms": null,
                "service": null,
                "sleep": null,
                "value": null
            },
            "helpfulness": null,
            "id": 11277163,
            "likes": {
                "disliked": null,
                "liked": null
            },
            "rating": 5.0,
            "stay_parameters": null,
            "text": "Check in and out was friendly and efficient, the room was a decent size and clean. There were lots of traces of that famous Scandanavian design flair aside from the lights.",
            "title": "we loved this hotel",
            "user": "Nickoteeta"
        },
        {
            "date": "November 14, 2007",
            "detail_rating": {
                "business": null,
                "cleanliness": 5.0,
                "desk": null,
                "front_desk": 5.0,
                "location": 5.0,
                "pool": null,
                "restaurant": null,
                "rooms": 5.0,
                "service": 5.0,
                "sleep": null,
                "value": 5.0
            },
            "helpfulness": 3,
            "id": 10823188,
            "likes": {
                "disliked": "\u2014 Nothing.",
                "liked": "\u2014 Comfortable bed with mood lighting."
            },
            "rating": 5.0,
            "stay_parameters": "Stayed September 2006, traveled as a couple",
            "text": "Can't fault it",
            "title": "Great hotel - really comfortable beds.",
            "user": "AdrianGlasgow"
        },
        {
            "date": "November 11, 2007",
            "detail_rating": {
                "business": 4.0,
                "cleanliness": 5.0,
                "desk": null,
                "front_desk": 2.0,
                "location": 5.0,
                "pool": null,
                "restaurant": null,
                "rooms": 5.0,
                "service": 3.0,
                "sleep": null,
                "value": 3.0
            },
            "helpfulness": null,
            "id": 10744267,
            "likes": {
                "disliked": "\u2014 Front desk service was poor",
                "liked": "\u2014 Great design"
            },
            "rating": 4.0,
            "stay_parameters": "Stayed September 2007, traveled on business",
            "text": "We payed 2450 swedish SEK for one night in a Superior Mood Queen Room. Their second best room. The room was small, the beds where horrible, felt like speeping on a rock. Crappy old TV. No I didnt likes this place at all!",
            "title": "Unique and enjoyable",
            "user": "DenJenK"
        },
        {
            "date": "January 1, 2009",
            "detail_rating": {
                "business": 4.0,
                "cleanliness": 4.0,
                "desk": null,
                "front_desk": 5.0,
                "location": 5.0,
                "pool": null,
                "restaurant": null,
                "rooms": 2.0,
                "service": 5.0,
                "sleep": null,
                "value": 4.0
            },
            "helpfulness": null,
            "id": 23163209,
            "likes": {
                "disliked": "\u2014 flooding bathroom",
                "liked": "\u2014 location and breakfast"
            },
            "rating": 4.0,
            "stay_parameters": "Stayed July 2008, traveled as a couple",
            "text": "This is a really cute hotel in downtown Stockholm. My husband and I picked it for our honeymoon based on a variety of factors: They were voted \"sexiest hotel in the world\" by Elle Magazine, they got a great review on TripAdvisor, and they advertised in the GayStockholm travel guide.",
            "title": "Good hotel, but not what it was hyped up to be...",
            "user": "tapdancer77"
        },
        {
            "date": "December 13, 2008",
            "detail_rating": {
                "business": null,
                "cleanliness": 4.0,
                "desk": null,
                "front_desk": 4.0,
                "location": 3.0,
                "pool": null,
                "restaurant": null,
                "rooms": 4.0,
                "service": 4.0,
                "sleep": null,
                "value": 3.0
            },
            "helpfulness": null,
            "id": 22693874,
            "likes": {
                "disliked": "\u2014 Highish price for small room",
                "liked": "\u2014 Breakfast"
            },
            "rating": 4.0,
            "stay_parameters": "Stayed December 2008, traveled on business",
            "text": "First, the pluses: GREAT location. Literally across the street from the Arlanda Express Train Station downtown. The staff was helpful (they sent us to a great restaurant, Ulla Windbladh, on Djurgarden for our last night in town), and the breakfast was both tasty and of a wide selection.",
            "title": "Probably the best choice in the area",
            "user": "JT14"
        },
        {
            "date": "November 18, 2008",
            "detail_rating": {
                "business": 4.0,
                "cleanliness": 4.0,
                "desk": null,
                "front_desk": 1.0,
                "location": 5.0,
                "pool": null,
                "restaurant": null,
                "rooms": 3.0,
                "service": 3.0,
                "sleep": null,
                "value": 3.0
            },
            "helpfulness": null,
            "id": 21978396,
            "likes": {
                "disliked": "\u2014 Front office staff with bad attitude and incompetent administration staff",
                "liked": "\u2014 Location and design."
            },
            "rating": 2.0,
            "stay_parameters": "Stayed November 2008, traveled with friends",
            "text": "Next, the minuses: While my husband and I weren't expecting a large room (we travel in Europe often and are familiar with the size of European hotel rooms), this was quite small, even by European standards. The bathroom shower did not drain well and we had to pile up extra towels by the floor of the shower in order to keep the bathroom from flooding.",
            "title": "What a disaster ...",
            "user": "GVAworld"
        },
        {
            "date": "November 3, 2008",
            "detail_rating": {
                "business": 2.0,
                "cleanliness": 5.0,
                "desk": null,
                "front_desk": 4.0,
                "location": 5.0,
                "pool": null,
                "restaurant": null,
                "rooms": 4.0,
                "service": 4.0,
                "sleep": null,
                "value": 4.0
            },
            "helpfulness": null,
            "id": 21497338,
            "likes": {
                "disliked": "\u2014 torn and worn bedsheets",
                "liked": "\u2014 Location"
            },
            "rating": 4.0,
            "stay_parameters": "Stayed June 2008, traveled on business",
            "text": "All in all, it was definitely fun, but not what I would call groundbreakingly sexy. But still, a good hotel, fairly competitively priced, and worth the trip.",
            "title": "Good, but expensive",
            "user": "travelbee2008"
        },
        {
            "date": "September 8, 2008",
            "detail_rating": {
                "business": 5.0,
                "cleanliness": 5.0,
                "desk": null,
                "front_desk": 5.0,
                "location": 5.0,
                "pool": null,
                "restaurant": null,
                "rooms": 3.0,
                "service": 5.0,
                "sleep": null,
                "value": 4.0
            },
            "helpfulness": null,
            "id": 19882429,
            "likes": {
                "disliked": "\u2014 Room was a bit small as was the bathroom.",
                "liked": "\u2014 The beautiful bar and reception. Very cool feel to the place."
            },
            "rating": 5.0,
            "stay_parameters": "Stayed September 2008, traveled as a couple",
            "text": "I have stayed at most of the hotels around Stockholm Central Station and I would probably say this is the best. You would really only choose to be here to be near the Arlanda Express or a meeting venue. It's not the most beautiful strip of a very beautiful city.",
            "title": "Really liked it especially the public areas",
            "user": "libero7"
        },
        {
            "date": "September 3, 2008",
            "detail_rating": {
                "business": null,
                "cleanliness": null,
                "desk": null,
                "location": null,
                "pool": null,
                "restaurant": null,
                "rooms": null,
                "service": null,
                "sleep": null,
                "value": 3.0
            },
            "helpfulness": 1,
            "id": 19720005,
            "likes": {
                "disliked": null,
                "liked": null
            },
            "rating": 4.0,
            "stay_parameters": "Stayed August 2008",
            "text": "The Nordic Light hotel is now ten years old and I think, frankly, showing its age in a few tiny ways. For a (reasonably expensive) boutique hotel it lacks some of the little touches that one might expect. For example the TV is a chunky old thing, there's no iPod docking station to play your tunes, and the lighting effects in the Superior Queen room we stayed in were not as spectacular as one is led to believe - although it plays some interesting tricks on your clothing.",
            "title": "Good but not spectacular",
            "user": "getdown"
        },
        {
            "date": "September 2, 2008",
            "detail_rating": {
                "business": 4.0,
                "cleanliness": 5.0,
                "desk": null,
                "front_desk": 5.0,
                "location": 5.0,
                "pool": null,
                "restaurant": null,
                "rooms": 5.0,
                "service": 5.0,
                "sleep": null,
                "value": 5.0
            },
            "helpfulness": 1,
            "id": 19644577,
            "likes": {
                "disliked": null,
                "liked": "\u2014 Cocktails were out of this world!"
            },
            "rating": 5.0,
            "stay_parameters": "Stayed August 2008, traveled solo",
            "text": "Nonetheless the staff were helpful, the bed is comfortable, the room spacious and clean, the bathroom well equipped and there is free fixed internet in the room plus a laptop-sized room safe. Breakfast was excellent, overall, although some of the pastries were a day old. And the wardrobes are very small.",
            "title": "Chic Design Hotel in central Stockholm",
            "user": "AudreyO"
        },
        {
            "date": "July 27, 2008",
            "detail_rating": {
                "business": 4.0,
                "cleanliness": 2.0,
                "desk": null,
                "front_desk": 4.0,
                "location": 3.0,
                "pool": null,
                "restaurant": null,
                "rooms": 4.0,
                "service": 4.0,
                "sleep": null,
                "value": 3.0
            },
            "helpfulness": null,
            "id": 18298192,
            "likes": {
                "disliked": null,
                "liked": null
            },
            "rating": 4.0,
            "stay_parameters": "Stayed June 2007, traveled as a couple",
            "text": "Thinking about it, the fact that I'm complaining about the age of the pastries shows that it's not a bad place to stay. But there are some newer, interesting hotels that have opened nearby such as the Clarion Sign. Consider checking for deals there as well as visiting the Nordic Light website.",
            "title": "Cool and trendy but expensive - even for STHLM",
            "user": "h2p-europe"
        },
        {
            "date": "July 24, 2008",
            "detail_rating": {
                "business": null,
                "cleanliness": 4.0,
                "desk": null,
                "front_desk": 3.0,
                "location": 3.0,
                "pool": null,
                "restaurant": null,
                "rooms": 5.0,
                "service": 3.0,
                "sleep": null,
                "value": 4.0
            },
            "helpfulness": null,
            "id": 18197084,
            "likes": {
                "disliked": "\u2014 Exterior",
                "liked": "\u2014 Lighting therapy concept"
            },
            "rating": 4.0,
            "stay_parameters": "Stayed April 2006, traveled with friends",
            "text": "And if you are visiting Stockholm, earn less than $250,000 a year and like more than one alcoholic drink a night, I *highly* recommend stopping in the Duty Free shop before leaving your departure airport. Otherwise you will be very thirsty. Learn from our mistake...",
            "title": "Innovative, awful neighbour",
            "user": "Thousandeurist"
        },
        {
            "date": "July 21, 2008",
            "detail_rating": {
                "business": 4.0,
                "cleanliness": 4.0,
                "desk": null,
                "front_desk": 3.0,
                "location": 3.0,
                "pool": null,
                "restaurant": null,
                "rooms": 3.0,
                "service": 3.0,
                "sleep": null,
                "value": 3.0
            },
            "helpfulness": null,
            "id": 18092531,
            "likes": {
                "disliked": null,
                "liked": null
            },
            "rating": 3.0,
            "stay_parameters": "Stayed July 2008, traveled as a couple",
            "text": "(Having re-read the reviews here, a final thought: the fact that the hotel manager reads the reviews and responds to them is worth an extra star in itself. Good on you, Martin \u00c5kesson. If only all hotels were so reactive to their customers' comments.)",
            "title": "A Bit Too Minimalist Chic",
            "user": "jdr27"
        },
        {
            "date": "July 14, 2008",
            "detail_rating": {
                "business": null,
                "cleanliness": 4.0,
                "desk": null,
                "front_desk": 4.0,
                "location": 4.0,
                "pool": null,
                "restaurant": null,
                "rooms": 4.0,
                "service": 4.0,
                "sleep": null,
                "value": 3.0
            },
            "helpfulness": 2,
            "id": 17861100,
            "likes": {
                "disliked": "\u2014 Limited dinner menu",
                "liked": "\u2014 Friendly, helpful staff"
            },
            "rating": 4.0,
            "stay_parameters": "Stayed July 2008, traveled on business",
            "text": "Nordic Light sells itself on its design credentials but though it is stylish I didn't feel it was particularly special in this respect. However, it is a comfortable, clean and well-thought out hotel in a great location adjacent to Stockholm's Central Station, right next to the Arlanda Express rail link to the airport.",
            "title": "Stylish and Convenient",
            "user": "Greekophile13"
        },
        {
            "date": "June 12, 2008",
            "detail_rating": {
                "business": null,
                "cleanliness": 5.0,
                "desk": null,
                "front_desk": 5.0,
                "location": 5.0,
                "pool": null,
                "restaurant": null,
                "rooms": 5.0,
                "service": 5.0,
                "sleep": null,
                "value": 5.0
            },
            "helpfulness": null,
            "id": 16887133,
            "likes": {
                "disliked": "\u2014 nope",
                "liked": "\u2014 Location, design concepts"
            },
            "rating": 5.0,
            "stay_parameters": "Stayed April 2008, traveled as a couple",
            "text": "My room was simple but comfortable with an exceptionally comfortable bed and some nice touches like an umbrella and shoe horn. The wardrobes were amongst the smallest I have ever experienced; fine for the weekend that I was there but if you were staying longer it might be a problem.",
            "title": "Love the hotel !! Modern simplicity hotel",
            "user": "Gl0be_Tr0tter88"
        },
        {
            "date": "March 30, 2008",
            "detail_rating": {
                "business": 5.0,
                "cleanliness": 5.0,
                "desk": null,
                "front_desk": 5.0,
                "location": 4.0,
                "pool": null,
                "restaurant": null,
                "rooms": 3.0,
                "service": 4.0,
                "sleep": null,
                "value": 3.0
            },
            "helpfulness": 1,
            "id": 14662335,
            "likes": {
                "disliked": null,
                "liked": null
            },
            "rating": 4.0,
            "stay_parameters": "Stayed March 2008, traveled on business",
            "text": "The bar/restaurant is stylish though again not exceptional for a modern city hotel. The breakfast buffet was great; lots of choice and good quality. Dinner was less satisfactory with a very limited and not very classy choice, though the food was perfectly adequate and of good quality and the service was fine.",
            "title": "Becoming more and more disappointed..",
            "user": "B.Com"
        },
        {
            "date": "March 14, 2008",
            "detail_rating": {
                "business": null,
                "cleanliness": 5.0,
                "desk": null,
                "front_desk": 5.0,
                "location": 4.0,
                "pool": null,
                "restaurant": null,
                "rooms": 4.0,
                "service": null,
                "sleep": null,
                "value": 3.0
            },
            "helpfulness": null,
            "id": 14287575,
            "likes": {
                "disliked": "\u2014 Small room",
                "liked": "\u2014 Cleanliness"
            },
            "rating": 3.0,
            "stay_parameters": "Stayed March 2008, traveled on business",
            "text": "The best aspect of the hotel are the staff who were all helpful, multi-lingual, polite and efficient.",
            "title": "Swedish Modern",
            "user": "15may06"
        },
        {
            "date": "February 11, 2008",
            "detail_rating": {
                "business": null,
                "cleanliness": 5.0,
                "desk": null,
                "front_desk": 5.0,
                "location": 4.0,
                "pool": null,
                "restaurant": null,
                "rooms": 4.0,
                "service": 5.0,
                "sleep": null,
                "value": 5.0
            },
            "helpfulness": null,
            "id": 13477142,
            "likes": {
                "disliked": "\u2014 N/a",
                "liked": "\u2014 Style"
            },
            "rating": 5.0,
            "stay_parameters": "Stayed January 2008, traveled solo",
            "text": "A modern simplistic hotel in Stockholm, representing Nordic designs in the hotel - from the brochures to the magazines, breakfast and eating utensils.",
            "title": "Slick.....",
            "user": "WanderlustDenver"
        }
    ],
    "slim_ranking": 0.310559006211,
    "stars": 4,
    "tripadvisor": {
        "VISITED": false,
        "country_name": null,
        "locality": null,
        "pic_link": null,
        "street_address": null
    },
    "user_rating": 4.0,
    "variance": {
        "average": 72,
        "excellent": 147,
        "poor": 32,
        "terrible": 11,
        "very good": 216
    }
}