{
    "aka": null,
    "description": null,
    "detail_rating": {
        "cleanliness": null,
        "location": null,
        "rooms": null,
        "service": null,
        "sleep": null,
        "value": null
    },
    "location": {
        "city": null,
        "continent": "Europe",
        "country": "France",
        "proposed_city": "Pertuis",
        "province": null,
        "region": "Provence"
    },
    "name": "Ibis Styles Pertuis",
    "places": {
        "aka": [],
        "hotel_description": [],
        "hotel_name": [
            "Pertuis"
        ]
    },
    "review_count": 127,
    "review_count_current": 5,
    "reviews": [
        {
            "date": "July 12, 2013",
            "detail_rating": {
                "business": null,
                "cleanliness": 5.0,
                "desk": null,
                "location": 4.0,
                "pool": null,
                "restaurant": null,
                "rooms": 4.0,
                "service": 5.0,
                "sleep": 5.0,
                "value": 5.0
            },
            "helpfulness": null,
            "id": 167349012,
            "likes": {
                "disliked": null,
                "liked": null
            },
            "rating": 4.0,
            "stay_parameters": "Stayed June 2013, traveled as a couple",
            "text": "We booked at this hotel when we couldn't book at the local Best Western (which turned out to be full of fellow Porsche owners who were on a club journey) and we were pleasantly surprised. All the facilities were modern, the room was small but functional, the staff were very helpful. Breakfast was a typical Accor Hotels breakfast.",
            "title": "A surprisingly nice hotel",
            "user": "Chandolin"
        },
        {
            "date": "May 27, 2013",
            "detail_rating": {
                "business": null,
                "cleanliness": 5.0,
                "desk": null,
                "location": 4.0,
                "pool": null,
                "restaurant": null,
                "rooms": 4.0,
                "service": 4.0,
                "sleep": 5.0,
                "value": 5.0
            },
            "helpfulness": null,
            "id": 161988922,
            "likes": {
                "disliked": null,
                "liked": null
            },
            "rating": 4.0,
            "stay_parameters": "Stayed January 2013, traveled on business",
            "text": "I use this hotel for my business trips to Provence and it is a good match between price and services.",
            "title": "Nice hotel, good prices",
            "user": "DavidJ01"
        },
        {
            "date": "May 17, 2013",
            "detail_rating": {
                "business": null,
                "cleanliness": 5.0,
                "desk": null,
                "location": 3.0,
                "pool": null,
                "restaurant": null,
                "rooms": 5.0,
                "service": 4.0,
                "sleep": 5.0,
                "value": 4.0
            },
            "helpfulness": null,
            "id": 161019986,
            "likes": {
                "disliked": null,
                "liked": null
            },
            "rating": 4.0,
            "stay_parameters": "Stayed July 2012, traveled with family",
            "text": "They have an internal restaurant with a simple but good menu and a full breakfast service, rooms furniture are modern, simple but functional.",
            "title": "Good deal and very clean, nicely design Hotel",
            "user": "OlivierABQ"
        },
        {
            "date": "October 16, 2012",
            "detail_rating": {
                "business": null,
                "cleanliness": 5.0,
                "desk": null,
                "location": 5.0,
                "pool": null,
                "restaurant": null,
                "rooms": 5.0,
                "service": 5.0,
                "sleep": 5.0,
                "value": 5.0
            },
            "helpfulness": null,
            "id": 142993963,
            "likes": {
                "disliked": null,
                "liked": null
            },
            "rating": 5.0,
            "stay_parameters": "Stayed October 2012, traveled with family",
            "text": "There are also a couple of nice restaurants nearby for a night outing.",
            "title": "Good location for exploring Provence",
            "user": "araska"
        },
        {
            "date": "August 31, 2012",
            "detail_rating": {
                "business": null,
                "cleanliness": 3.0,
                "desk": null,
                "location": 3.0,
                "pool": null,
                "restaurant": null,
                "rooms": 3.0,
                "service": 1.0,
                "sleep": 3.0,
                "value": 3.0
            },
            "helpfulness": null,
            "id": 138951850,
            "likes": {
                "disliked": null,
                "liked": null
            },
            "rating": 3.0,
            "stay_parameters": "Stayed August 2012, traveled with friends",
            "text": "Easy connection to Aix en Provence by motorway (entrance nearby the hotel), the hotel lies in a quiet country place in the north of Aix, 15 min by motorway.",
            "title": "Just another IBIS",
            "user": "LLeoLL"
        }
    ],
    "slim_ranking": 0.5,
    "stars": 3,
    "tripadvisor": {
        "VISITED": false,
        "country_name": null,
        "locality": null,
        "pic_link": null,
        "street_address": null
    },
    "user_rating": 4.0,
    "variance": {
        "average": 21,
        "excellent": 38,
        "poor": 2,
        "terrible": 1,
        "very good": 65
    }
}