{
    "aka": "Shilo Inn Palm Springs Hotel",
    "description": "The Garden Vista Hotel Palm Springs, a 100 percent smoke free hotel, offers affordable rooms and suites in Palm Springs, home of over 100 golf courses. For onsite recreation, guests will find an outdoor adults only pool, outdoor family pool, two whirlpools, a sauna, steam room, and fitness room. Guests receive a complimentary continental breakfast with their room rate. While there is not a full service restaurant inside the hotel, there are dining destinations nearby. Guests will find Billy Reeds Restaurant and Lounge across the street, Bakers Square in one block, and many more restaurants within a short drive. Conveniently located on Highway 111 close to downtown Palm Springs and the aerial tramway. You will find yourself surrounded by luxury in each of the 124 exquisitely appointed suites at this lovely hotel situated amidst beautifully landscaped courtyards and pools. Children 12 and under stay free with an adult. Dogs welcome with nominal fee. The Palm Springs airport is approximately four miles from the hotel. There are 124 rooms, including suites, on two floors. Standard amenities include air conditioning, alarm clock radio, microwave, mini refrigerator, coffeemaker, hairdryer, iron, ironing board, telephone, free local calls, and television with ShowTime",
    "detail_rating": {
        "cleanliness": null,
        "location": null,
        "rooms": null,
        "service": null,
        "sleep": null,
        "value": null
    },
    "location": {
        "city": null,
        "continent": null,
        "country": "United States",
        "proposed_city": "Springs",
        "province": null,
        "region": null
    },
    "name": "The Garden Vista Hotel Palm Springs",
    "places": {
        "aka": [
            "Palm",
            "Springs"
        ],
        "hotel_description": [
            "Vista",
            "Palm",
            "Springs"
        ],
        "hotel_name": [
            "Vista",
            "Palm",
            "Springs"
        ]
    },
    "review_count": 259,
    "review_count_current": 12,
    "reviews": [
        {
            "date": "February 18, 2007",
            "detail_rating": {
                "business": null,
                "cleanliness": null,
                "desk": null,
                "location": null,
                "pool": null,
                "restaurant": null,
                "rooms": null,
                "service": null,
                "sleep": null,
                "value": null
            },
            "helpfulness": 1,
            "id": 6810049,
            "likes": {
                "disliked": null,
                "liked": null
            },
            "rating": 4.0,
            "stay_parameters": null,
            "text": "The biggest perk about this hotel are the grounds. The courtyard is absolutely gorgeous, with a jawdropping view of the San Jacinto mountains, and impeccably maintained gardens. Two big pools and two hot tubs, one set adult only, and one for families with children. Very lush!",
            "title": "Gorgeous grounds, updated rooms",
            "user": "palapi"
        },
        {
            "date": "November 20, 2006",
            "detail_rating": {
                "business": null,
                "cleanliness": 5.0,
                "desk": null,
                "front_desk": 5.0,
                "location": 5.0,
                "pool": null,
                "restaurant": null,
                "rooms": 5.0,
                "service": 5.0,
                "sleep": null,
                "value": 5.0
            },
            "helpfulness": 7,
            "id": 6157951,
            "likes": {
                "disliked": "\u2014 Outside cooridors, no elevators.",
                "liked": "\u2014 Separate adult and family pools; complimentary breakfast available"
            },
            "rating": 5.0,
            "stay_parameters": "Stayed November 2006, traveled solo",
            "text": "The rooms are also fairly recently renovated, in tip tpo shape, super cozy beds, very spacious and clean.",
            "title": "Hotel in the shadow of Mt San Jacinto",
            "user": "LadyTravel"
        },
        {
            "date": "November 18, 2006",
            "detail_rating": {
                "business": 2.0,
                "cleanliness": 3.0,
                "desk": null,
                "front_desk": 3.0,
                "location": 2.0,
                "pool": null,
                "restaurant": null,
                "rooms": 2.0,
                "service": 2.0,
                "sleep": null,
                "value": 2.0
            },
            "helpfulness": 5,
            "id": 6150317,
            "likes": {
                "disliked": "\u2014 ratty beddings, tile floors, thin walls, noise, not a good neighborhood for walking,",
                "liked": "\u2014 The Bakers Square restaurant across the street"
            },
            "rating": 2.0,
            "stay_parameters": "Stayed November 2006, traveled on business",
            "text": "Although the location is not good if you want to be able to walk anywhere, it is convnient for getting around the city via car. It's a five minute drive to downtown, a 10 minute drive to the indian canyons, 5 minutes to the tram.",
            "title": "Fine if you have no neighbors...",
            "user": "dmc10662"
        },
        {
            "date": "May 30, 2006",
            "detail_rating": {
                "business": null,
                "cleanliness": 5.0,
                "desk": null,
                "location": null,
                "pool": null,
                "restaurant": null,
                "rooms": 4.0,
                "service": 5.0,
                "sleep": null,
                "value": 4.0
            },
            "helpfulness": 12,
            "id": 5235749,
            "likes": {
                "disliked": null,
                "liked": null
            },
            "rating": 4.0,
            "stay_parameters": "Stayed May 2006",
            "text": "I arrived at the Shilo Inn Palm Springs (Nov. 14th) after a flight from the east coast to LAX, and a drive out to Palm Springs. The hotel was relatively easy to find. It was dark when I arrived. The front desk person was friendly and gave me a map of the property where parking and my room would be located. Parking was not a problem.",
            "title": "Enjoyed our stay",
            "user": "Gioia1976"
        },
        {
            "date": "April 28, 2006",
            "detail_rating": {
                "business": null,
                "cleanliness": null,
                "desk": null,
                "location": null,
                "pool": null,
                "restaurant": null,
                "rooms": null,
                "service": null,
                "sleep": null,
                "value": null
            },
            "helpfulness": 4,
            "id": 5016989,
            "likes": {
                "disliked": null,
                "liked": null
            },
            "rating": 5.0,
            "stay_parameters": null,
            "text": "The room was very clean. It was almost a \"U\" shape to it... with the door, bathroom door/area, bedroom, TV on one side; breakfast nook and kitchenette on the other. The balcony door was at the end of the U. The air conditioning seemed to work very well. The view from my balcony was a wall, and the view from my front door was the parking lot and the place next door. But the view didn't matter as much to me as room cleanliness did. And I found it very clean.",
            "title": "Outstanding!",
            "user": "A TripAdvisor user"
        },
        {
            "date": "April 22, 2006",
            "detail_rating": {
                "business": null,
                "cleanliness": 4.0,
                "desk": null,
                "location": null,
                "pool": null,
                "restaurant": null,
                "rooms": 4.0,
                "service": null,
                "sleep": null,
                "value": 4.0
            },
            "helpfulness": 8,
            "id": 4995241,
            "likes": {
                "disliked": null,
                "liked": null
            },
            "rating": 5.0,
            "stay_parameters": "Stayed April 2006",
            "text": "My boyfriend and I stayed here after reading the reviews. The grounds are beatiful, it is close to the downtown area, they provide continental breakfast, they have a fitness room with sauna and steam room, they have a quiet adult pool and a \"loud\" pool for kids, the rooms are clean and big....What else could you ask for??? Since it is spring break the rate was $150 which is still reasonable. The pool even provides large towels for lounging. I don't have any complaints. I love the tiled floors in the room and the decor is nice. We got the room with the \"pool patio\". Some of the patios have grass out front, unfortunately our patio has rocks in front of it and we really do not have a view of the pool. Personally, that does not matter to me, and I like being on the ground level with a few chairs to sit on outside. I would reccomend the ground floor, but ask for a room with grass outside the patio. Also, make sure your patio does not face the kid pool. Especially if you want some peace and quiet.",
            "title": "We will be back!!",
            "user": "egen"
        },
        {
            "date": "April 9, 2006",
            "detail_rating": {
                "business": null,
                "cleanliness": null,
                "desk": null,
                "location": null,
                "pool": null,
                "restaurant": null,
                "rooms": null,
                "service": null,
                "sleep": null,
                "value": null
            },
            "helpfulness": 7,
            "id": 4953342,
            "likes": {
                "disliked": null,
                "liked": null
            },
            "rating": 4.0,
            "stay_parameters": null,
            "text": "The grounds are beautiful, the rooms are nice and the service is good. The hotel is on the north end of town, so it's less noisy. Great for families.",
            "title": "Great place at a good price",
            "user": "MplsDon"
        },
        {
            "date": "April 11, 2007",
            "detail_rating": {
                "business": 3.0,
                "cleanliness": 3.0,
                "desk": null,
                "front_desk": 2.0,
                "location": 4.0,
                "pool": null,
                "restaurant": null,
                "rooms": 3.0,
                "service": 2.0,
                "sleep": null,
                "value": 2.0
            },
            "helpfulness": 1,
            "id": 7331420,
            "likes": {
                "disliked": "\u2014 smoking every where",
                "liked": "\u2014 quiet large room, good family pool"
            },
            "rating": 2.0,
            "stay_parameters": "Stayed April 2007, traveled with family",
            "text": "I booked a room at Shilo Inn based on reviews and location. We were stopping overnight on the way back from Arizona and wanted to take the kids up the tramway. Location was great and Billy Reeds across the street was very good for dinner (nothing overly fancy, but good food at good prices)",
            "title": "Not what I expected",
            "user": "juxie"
        },
        {
            "date": "April 2, 2007",
            "detail_rating": {
                "business": 3.0,
                "cleanliness": 5.0,
                "desk": null,
                "front_desk": 5.0,
                "location": 5.0,
                "pool": null,
                "restaurant": null,
                "rooms": 4.0,
                "service": 5.0,
                "sleep": null,
                "value": 4.0
            },
            "helpfulness": 1,
            "id": 7271990,
            "likes": {
                "disliked": null,
                "liked": "\u2014 location"
            },
            "rating": 5.0,
            "stay_parameters": "Stayed October 2006, traveled with family",
            "text": "When we went to check in - there were 5 people in line checking in / checking out, one frowning lady working and four employees standing behind her talking to each other not acknowledging a single guest. Eventually another employee came out to help. We check in to our room - it was \"okay\" - very. very dated, had a funny smell to it, dents in the door (obviously a spring breakers fist fight or something), the bath room was \"clean???\" it was old and discolored, but I think it was overall clean).",
            "title": "Great",
            "user": "sewinginny"
        },
        {
            "date": "March 8, 2007",
            "detail_rating": {
                "business": 4.0,
                "cleanliness": 4.0,
                "desk": null,
                "front_desk": 5.0,
                "location": 3.0,
                "pool": null,
                "restaurant": null,
                "rooms": 3.0,
                "service": 3.0,
                "sleep": null,
                "value": 4.0
            },
            "helpfulness": null,
            "id": 6936556,
            "likes": {
                "disliked": "\u2014 The tile floor in the room",
                "liked": "\u2014 that no one in our group complained!"
            },
            "rating": 4.0,
            "stay_parameters": "Stayed March 2007, traveled on business",
            "text": "We had to ask for the roll-away bed 3 times before it arrived and they brought it without a pillow (another 2 calls) - and they do charge $15 a night for it so it isn't a free service. bed okay - a little on the firm side, a little lumpy too, pillows typical hotel pillows, towels for the pool a joke (bring your own), it wasn't even big enough to wrap my 1 year old in and they were worn thin in many places.",
            "title": "Great Family Place",
            "user": "SoccerMom1059"
        },
        {
            "date": "March 4, 2007",
            "detail_rating": {
                "business": null,
                "cleanliness": null,
                "desk": null,
                "location": null,
                "pool": null,
                "restaurant": null,
                "rooms": null,
                "service": null,
                "sleep": null,
                "value": null
            },
            "helpfulness": null,
            "id": 6911578,
            "likes": {
                "disliked": null,
                "liked": null
            },
            "rating": 3.0,
            "stay_parameters": null,
            "text": "Complimentary breakfast - it's free so I won't complain and it worked for the kids. The had bagels, mini apple danishes, cream cheese, butter, jam (that they ran out of), a juice machine, milk and yuban coffee. There was only one couch, two chair and a window bench area to eat at",
            "title": "Only one problem . . .",
            "user": "BirdOnTheGo"
        },
        {
            "date": "February 20, 2007",
            "detail_rating": {
                "business": 4.0,
                "cleanliness": 3.0,
                "desk": null,
                "front_desk": 4.0,
                "location": 4.0,
                "pool": null,
                "restaurant": null,
                "rooms": 4.0,
                "service": 3.0,
                "sleep": null,
                "value": 5.0
            },
            "helpfulness": 1,
            "id": 6819860,
            "likes": {
                "disliked": null,
                "liked": null
            },
            "rating": 4.0,
            "stay_parameters": "Stayed February 2007",
            "text": "MAIN COMPLAINT",
            "title": "Definitely would go back again",
            "user": "Chrisaf"
        }
    ],
    "slim_ranking": 0.742857142857,
    "stars": 2.5,
    "tripadvisor": {
        "VISITED": false,
        "country_name": null,
        "locality": null,
        "pic_link": null,
        "street_address": null
    },
    "user_rating": 3.5,
    "variance": {
        "average": 31,
        "excellent": 75,
        "poor": 23,
        "terrible": 29,
        "very good": 101
    }
}