{
    "aka": "Hoposa Pollensamar Apartments Hotel Port De Pollenca",
    "description": null,
    "detail_rating": {
        "cleanliness": null,
        "location": null,
        "rooms": null,
        "service": null,
        "sleep": null,
        "value": null
    },
    "location": {
        "city": null,
        "continent": "Europe",
        "country": "Spain",
        "proposed_city": null,
        "province": null,
        "region": null
    },
    "name": "Hoposa Pollensamar Apartments",
    "places": {
        "aka": [],
        "hotel_description": [],
        "hotel_name": []
    },
    "review_count": 56,
    "review_count_current": 8,
    "reviews": [
        {
            "date": "June 20, 2011",
            "detail_rating": {
                "business": null,
                "cleanliness": 2.0,
                "desk": null,
                "location": null,
                "pool": null,
                "restaurant": null,
                "rooms": null,
                "service": 1.0,
                "sleep": 2.0,
                "value": null
            },
            "helpfulness": 6,
            "id": 114556346,
            "likes": {
                "disliked": null,
                "liked": null
            },
            "rating": 1.0,
            "stay_parameters": "Stayed June 2011, traveled as a couple",
            "text": "My advice would be, don't stay here. We were robbed on Day 6 of our 2 week holiday. Entry appears to have been gained into our room by key, there was no other means of gaining entry, and no damage to our room door, and the 24 hour camera surveillance, keypad entry door, and double locked door, was no deterrant. The room was secure when we left it, no open windows, everything locked up. In fact, no evidence of the break in was found anywhere!! We asked the Management about the 'surveillance footage', and were first told this had been 'checked through but nothing was found'. On request that we viewed it, there were excuses every day, for not being able to see it. The locks were never changed, which suggests that this could happen again if you get our room number, or another one who's key was left outside the building in an unmarked box for at least two days when we returned it to them personally. You won't get support from anyone, except the Reception Staff if this happens to you. It might also be worth checking the crime statistics for the area, as this appears to be happening frequently in Puerto Pollenca and for obvious reasons, the travel industry are not highlighting it to tourists. Knowing what we do now and being left to sort things out for the next 7 days of our holiday, we would never return to this hotel again in the future. Please avoid any heartache and stay somewhere else. It has destroyed our holiday, we have lost some valuable personal items, and now come home to pick up the pieces for our Travel Insurers and Banks. But hey, they might offer you a free meal for your inconvenience!",
            "title": "We were robbed! And no signs of a break in.....",
            "user": "MariaSteve S"
        },
        {
            "date": "May 4, 2011",
            "detail_rating": {
                "business": null,
                "cleanliness": 3.0,
                "desk": null,
                "location": 4.0,
                "pool": null,
                "restaurant": null,
                "rooms": 2.0,
                "service": 5.0,
                "sleep": 1.0,
                "value": 3.0
            },
            "helpfulness": 3,
            "id": 106878056,
            "likes": {
                "disliked": null,
                "liked": null
            },
            "rating": 2.0,
            "stay_parameters": "Stayed April 2011, traveled as a couple",
            "text": "We used to love it here but sadly these apartments have not been upgraded for many years and everything is faded, chipped and worn. Yes, as the other review states, do not accept one of the apartments on the 4th floor; they are indeed like caves. Watch too if you are on the third floor because at least one of these apartments was badly flooded and stinks of damp with mould and black marks throughout. I will repeat the message that you have to go to the Hostal Bahia, 800m away, to collect your keys on arrival or if you need to speak to reception staff. They are not quiet - the area is nice and quiet but there is no soundproofing between apartments and some have adjoining doors - bad luck if you are stuck between screaming kids (forget a romantic breakfast/lunch/dinner/drink on your balcony) or under folk who like to rearrange the furniture at night. There is also a constant mechanical/electrical hum all day and night which might keep you awake or drive you nuts.",
            "title": "Our third visit but definitely our last - jaded & worn",
            "user": "Fiona_and_Ian"
        },
        {
            "date": "October 15, 2010",
            "detail_rating": {
                "business": null,
                "cleanliness": 3.0,
                "desk": null,
                "location": 2.0,
                "pool": null,
                "restaurant": null,
                "rooms": 3.0,
                "service": 2.0,
                "sleep": 1.0,
                "value": 2.0
            },
            "helpfulness": 1,
            "id": 83606721,
            "likes": {
                "disliked": null,
                "liked": null
            },
            "rating": 3.0,
            "stay_parameters": "Stayed September 2010, traveled as a couple",
            "text": "The linen and towels whilst clean and refreshed are thin and worn and the beds sagging.",
            "title": "Beware the fourth floor!!!!",
            "user": "HOLIDAYSRUS1"
        },
        {
            "date": "October 8, 2010",
            "detail_rating": {
                "business": null,
                "cleanliness": 5.0,
                "desk": null,
                "location": 4.0,
                "pool": null,
                "restaurant": null,
                "rooms": 3.0,
                "service": 5.0,
                "sleep": 3.0,
                "value": 5.0
            },
            "helpfulness": null,
            "id": 82590471,
            "likes": {
                "disliked": null,
                "liked": null
            },
            "rating": 4.0,
            "stay_parameters": "Stayed September 2010, traveled as a couple",
            "text": "It needs some money, not much, spent on it to refresh it and make it more comfortable but having stayed in three different apartmements in the block in one week, we will not be back to an old favourite. The staff in Hostal Bahia and the maintenance man are lovely; cheerful, helpful and get things done; the point is that they should not need to be done in the first place.",
            "title": "Comfortable quiet and relaxing",
            "user": "CSMcL_10"
        },
        {
            "date": "May 16, 2010",
            "detail_rating": {
                "business": null,
                "cleanliness": 5.0,
                "desk": null,
                "location": 5.0,
                "pool": null,
                "restaurant": null,
                "rooms": 5.0,
                "service": 5.0,
                "sleep": 5.0,
                "value": 5.0
            },
            "helpfulness": 1,
            "id": 64289015,
            "likes": {
                "disliked": null,
                "liked": null
            },
            "rating": 4.0,
            "stay_parameters": "Stayed May 2010, traveled as a couple",
            "text": "We stayed here in September for 5 days. Looking forward to staying in an apartment as shown in the brochure and on the web site. However, we were in one of two apartments on the 4th fllor. It is like being in a cave!!! Right at the top of the building, no window in the bedroom only a velux. When sitting on the balcony all you can see is the wall in front of you and behind you are the air condtioning motors for other apartments! There was never any mention of some apartments being like this. We complained at the Hotel Bahia and were eventually moved for the last 2 nights. The receptionist at the hotel did all she could to help us and seemed embarrased at our plight. The apartments on the other floors are lovely so just make sure you dont get the 4th floor!",
            "title": "Ideal base",
            "user": "CJFluff"
        },
        {
            "date": "September 9, 2009",
            "detail_rating": {
                "business": null,
                "cleanliness": 4.0,
                "desk": null,
                "location": 4.0,
                "pool": null,
                "restaurant": null,
                "rooms": 3.0,
                "service": 4.0,
                "sleep": null,
                "value": 5.0
            },
            "helpfulness": null,
            "id": 40412718,
            "likes": {
                "disliked": null,
                "liked": null
            },
            "rating": 4.0,
            "stay_parameters": "Stayed September 2009, traveled as a couple",
            "text": "We spent a week here in a one bedroom apartment and loved it. The apartment was clean and fresh and all the important things were present: good beds, strong hot shower, sea view balcony and a cute, well-equipped little kitchen (apartment was cleaned and towels changed every other day). The pool was clean and nice too with sufficient space for residents to share and enjoy. Location is lovely and quiet but close to the beach and a nice little cafe/minimarket.",
            "title": "Spot on location, comfort and value",
            "user": "Fiona_and_Ian"
        },
        {
            "date": "June 8, 2009",
            "detail_rating": {
                "business": null,
                "cleanliness": null,
                "desk": null,
                "location": null,
                "pool": null,
                "restaurant": null,
                "rooms": null,
                "service": null,
                "sleep": null,
                "value": null
            },
            "helpfulness": 1,
            "id": 31902346,
            "likes": {
                "disliked": null,
                "liked": null
            },
            "rating": 2.0,
            "stay_parameters": null,
            "text": "Now, we may have been lucky - there are 20 apartments all with a sea-facing balcony but some are studios so space would be tighter in them. \"The children\" arrived towards the end of our holiday so we only had one rude awakening due to inconsiderate parents letting their kids run riot in the stairwell.",
            "title": "not the worst, but could do better",
            "user": "markeportstewart"
        },
        {
            "date": "May 14, 2008",
            "detail_rating": {
                "business": null,
                "cleanliness": 4.0,
                "desk": null,
                "front_desk": 1.0,
                "location": 2.0,
                "pool": null,
                "restaurant": null,
                "rooms": 3.0,
                "service": 3.0,
                "sleep": null,
                "value": null
            },
            "helpfulness": 2,
            "id": 16027223,
            "likes": {
                "disliked": "\u2014 Having to go to a different place to pick up the key",
                "liked": "\u2014 quiet area, only 1 bar close by"
            },
            "rating": 3.0,
            "stay_parameters": "Stayed April 2008, traveled as a couple",
            "text": "One point worth repeating is the fact that you will have to collect your keys from the Hostal Bahia, a good 20 min walk away and if you wish to use the safe in your room it costs \u20ac15 per week! Otherwise... go for it if the price is right.",
            "title": "Hard to find",
            "user": "buddyCoDown"
        }
    ],
    "slim_ranking": 0.176470588235,
    "stars": 3,
    "tripadvisor": {
        "VISITED": false,
        "country_name": null,
        "locality": null,
        "pic_link": null,
        "street_address": null
    },
    "user_rating": 4.5,
    "variance": {
        "average": 4,
        "excellent": 28,
        "poor": 2,
        "terrible": 1,
        "very good": 21
    }
}