{
    "aka": "Hilton Garden Inn Tulsa Airport Hotel",
    "description": "The Hilton Garden Inn Tulsa Airport hotel is located at the main entrance of Tulsa International Airport (TUL). Take advantage of our complimentary airport shuttle service. Explore new species of mammals, reptiles and birds at Tulsa Zoo, or enjoy a round of golf at the Mohawk Park golf course. Find bargains at one of many nearby shopping malls. Stay in a spacious guest room at this Tulsa hotel and enjoy thoughtful amenities, including a mini-refrigerator and a 32-inch LCD HDTV.",
    "detail_rating": {
        "cleanliness": null,
        "location": null,
        "rooms": null,
        "service": null,
        "sleep": null,
        "value": null
    },
    "location": {
        "city": "Tulsa",
        "continent": null,
        "country": "United States",
        "proposed_city": "Tulsa",
        "province": null,
        "region": null
    },
    "name": "Hilton Garden Inn Tulsa Airport",
    "places": {
        "aka": [
            "Tulsa"
        ],
        "hotel_description": [
            "Tulsa"
        ],
        "hotel_name": [
            "Tulsa"
        ]
    },
    "review_count": 129,
    "review_count_current": 20,
    "reviews": [
        {
            "date": "April 12, 2006",
            "detail_rating": {
                "business": null,
                "cleanliness": 4.0,
                "desk": null,
                "location": null,
                "pool": null,
                "restaurant": null,
                "rooms": 3.0,
                "service": 4.0,
                "sleep": null,
                "value": 4.0
            },
            "helpfulness": null,
            "id": 4971850,
            "likes": {
                "disliked": null,
                "liked": null
            },
            "rating": 3.0,
            "stay_parameters": "Stayed April 2006, traveled on business",
            "text": "This hotel is undergoing some renovations. Our room needed some paint and the beds were somewhat uncomfortable. The continental breakfast was OK but lacked nonfat milk, juices other than OJ, and more bread options. In addition, the pool & spa were closed.",
            "title": "Below average for a Hilton Garden Inn",
            "user": "cneumann"
        },
        {
            "date": "February 12, 2006",
            "detail_rating": {
                "business": null,
                "cleanliness": 4.0,
                "desk": null,
                "location": null,
                "pool": null,
                "restaurant": null,
                "rooms": 4.0,
                "service": 5.0,
                "sleep": null,
                "value": 4.0
            },
            "helpfulness": null,
            "id": 4454982,
            "likes": {
                "disliked": null,
                "liked": null
            },
            "rating": 5.0,
            "stay_parameters": "Stayed February 2006, traveled on business",
            "text": "Convenient to Tulsa airport. I left the hotel one hour before my flight was scheduled to leave. I dropped off my rental, went through ticketing and security and still had plenty of time to spare. Not too bad.",
            "title": "Very good airport hotel",
            "user": "ewoo"
        },
        {
            "date": "August 2, 2005",
            "detail_rating": {
                "business": null,
                "cleanliness": 5.0,
                "desk": null,
                "location": null,
                "pool": null,
                "restaurant": null,
                "rooms": 5.0,
                "service": 4.0,
                "sleep": null,
                "value": 4.0
            },
            "helpfulness": 1,
            "id": 3728876,
            "likes": {
                "disliked": null,
                "liked": null
            },
            "rating": 4.0,
            "stay_parameters": "Stayed July 2005, traveled on business",
            "text": "The rooms are clean and well appointed. Mine also had a mini-fridge and microwave. Not sure if that's standard.",
            "title": "A Very Good Airport Hotel",
            "user": "rapbtp"
        },
        {
            "date": "July 23, 2005",
            "detail_rating": {
                "business": null,
                "cleanliness": null,
                "desk": null,
                "location": null,
                "pool": null,
                "restaurant": null,
                "rooms": null,
                "service": null,
                "sleep": null,
                "value": null
            },
            "helpfulness": 4,
            "id": 3694922,
            "likes": {
                "disliked": null,
                "liked": null
            },
            "rating": 5.0,
            "stay_parameters": null,
            "text": "Didn't stay there long, but was very pleased with my brief stay.",
            "title": "Very nice hotel near Tulsa Int'l",
            "user": "splitlog2"
        },
        {
            "date": "September 1, 2004",
            "detail_rating": {
                "business": null,
                "cleanliness": null,
                "desk": null,
                "location": null,
                "pool": null,
                "restaurant": null,
                "rooms": null,
                "service": null,
                "sleep": null,
                "value": null
            },
            "helpfulness": 3,
            "id": 2507806,
            "likes": {
                "disliked": null,
                "liked": null
            },
            "rating": 4.0,
            "stay_parameters": null,
            "text": "I was very impressed with this hotel. I stayed two nights while in town to attend a funeral. My room was a nice size, and extremely clean which is all that really matters to me. The staff was friendly and accomodating. I would recommend this hotel to any business traveler. The room rate was very reasonable. By airport hotel standards, the Hilton Garden is well above average.",
            "title": "Very Nice Hotel",
            "user": "dmb4"
        },
        {
            "date": "August 6, 2009",
            "detail_rating": {
                "business": null,
                "cleanliness": null,
                "desk": null,
                "location": null,
                "pool": null,
                "restaurant": null,
                "rooms": null,
                "service": null,
                "sleep": null,
                "value": null
            },
            "helpfulness": null,
            "id": 36940236,
            "likes": {
                "disliked": null,
                "liked": null
            },
            "rating": 4.0,
            "stay_parameters": null,
            "text": "This hotel is incredibly convenient to the airport which was exactly what I needed. Its a fairly typical Garden Inn, but not quite as nice as some. Its a little older and some of the amenities often at HGI's are missing. The bed is comfy and the room is spacious and well equipped. The lighting is not great, to the point that makeup application is a bit tricky. Check in was fast and friendly. Nothing wrong with the place and you will enjoy your stay. Still, just not quite on the same level as other Hilton Garden Inns. I would stay here again to catch an early morning flight, but I would not stay here if I needed a hotel for more than one night.",
            "title": "Great location for an early morning flight",
            "user": "AnotherHoustonian"
        },
        {
            "date": "June 10, 2009",
            "detail_rating": {
                "business": null,
                "cleanliness": null,
                "desk": null,
                "location": null,
                "pool": null,
                "restaurant": null,
                "rooms": null,
                "service": null,
                "sleep": null,
                "value": null
            },
            "helpfulness": null,
            "id": 32066006,
            "likes": {
                "disliked": null,
                "liked": null
            },
            "rating": 5.0,
            "stay_parameters": null,
            "text": "Good Rooms",
            "title": "Good Spacious Rooms",
            "user": "tanuj_arneja"
        },
        {
            "date": "April 30, 2009",
            "detail_rating": {
                "business": null,
                "cleanliness": 4.0,
                "desk": null,
                "location": 5.0,
                "pool": null,
                "restaurant": null,
                "rooms": 4.0,
                "service": 5.0,
                "sleep": null,
                "value": 5.0
            },
            "helpfulness": null,
            "id": 29081922,
            "likes": {
                "disliked": null,
                "liked": null
            },
            "rating": 4.0,
            "stay_parameters": "Stayed April 2009, traveled on business",
            "text": "Spacious and Nice TV",
            "title": "excellent service",
            "user": "BafX"
        },
        {
            "date": "January 23, 2009",
            "detail_rating": {
                "business": null,
                "cleanliness": null,
                "desk": null,
                "location": null,
                "pool": null,
                "restaurant": null,
                "rooms": null,
                "service": null,
                "sleep": null,
                "value": 1.0
            },
            "helpfulness": null,
            "id": 23844790,
            "likes": {
                "disliked": "\u2014 all bad",
                "liked": "\u2014 nothing"
            },
            "rating": 1.0,
            "stay_parameters": "Stayed January 2009, traveled on business",
            "text": "Also food is good but have to pay for that it is not complimentory",
            "title": "Manager made insulting remarks to guest",
            "user": "Carrib_diver"
        },
        {
            "date": "August 12, 2008",
            "detail_rating": {
                "business": 5.0,
                "cleanliness": 5.0,
                "desk": null,
                "front_desk": 5.0,
                "location": 2.0,
                "pool": null,
                "restaurant": null,
                "rooms": 3.0,
                "service": 5.0,
                "sleep": null,
                "value": 4.0
            },
            "helpfulness": null,
            "id": 18900048,
            "likes": {
                "disliked": "\u2014 Upstairs noise, and breakfast was not kept hot",
                "liked": "\u2014 Close to the airport and on-site restaurant"
            },
            "rating": 4.0,
            "stay_parameters": "Stayed August 2008, traveled on business",
            "text": "Clean rooms, new beds, very helpful staff. There was a problem with my TV, fixed same day I reported it and they gave me a free meal in the hotel restaurant for my troubles. Everyone I dealt with at the hotel was friendly and helpful - directions to local places to eat, check in, business center support. Will be staying there when I come back for a training conference in 2010.",
            "title": "Not great, but good",
            "user": "CaliforniaTraveler19"
        },
        {
            "date": "January 25, 2011",
            "detail_rating": {
                "business": null,
                "cleanliness": 4.0,
                "desk": null,
                "location": 5.0,
                "pool": null,
                "restaurant": null,
                "rooms": 3.0,
                "service": 5.0,
                "sleep": 3.0,
                "value": 3.0
            },
            "helpfulness": null,
            "id": 94431832,
            "likes": {
                "disliked": null,
                "liked": null
            },
            "rating": 3.0,
            "stay_parameters": "Stayed January 2011, traveled solo",
            "text": "As I travel about, HGIs are my chain hotel of choice, but not this one. It is the rattiest HGI I've ever seen. Lower quality bath fixtures/furniture than most; worn; needs paint, new tiles, etc. Great staff; excellent location if you have an early flight; otherwise, you have better choices.",
            "title": "Needs an update",
            "user": "Twoprofs"
        },
        {
            "date": "November 4, 2010",
            "detail_rating": {
                "business": null,
                "cleanliness": 4.0,
                "desk": null,
                "location": 5.0,
                "pool": null,
                "restaurant": null,
                "rooms": 4.0,
                "service": 4.0,
                "sleep": 1.0,
                "value": 4.0
            },
            "helpfulness": null,
            "id": 85982685,
            "likes": {
                "disliked": null,
                "liked": null
            },
            "rating": 3.0,
            "stay_parameters": "Stayed October 2010, traveled as a couple",
            "text": "To walk into the Hilton Garden Inn, you will find it to be one of the best appointed anywhere. The lobby is comfortable and well firnished, the restaurant is right there and the decor is warm.",
            "title": "Excellent...but",
            "user": "CoasterWarrior"
        },
        {
            "date": "May 12, 2010",
            "detail_rating": {
                "business": null,
                "cleanliness": 2.0,
                "desk": null,
                "location": 4.0,
                "pool": null,
                "restaurant": null,
                "rooms": 3.0,
                "service": 4.0,
                "sleep": 4.0,
                "value": 4.0
            },
            "helpfulness": null,
            "id": 64003693,
            "likes": {
                "disliked": null,
                "liked": null
            },
            "rating": 3.0,
            "stay_parameters": "Stayed May 2010, traveled on business",
            "text": "The room is much like every Garden Inn, so we were looking forward to a restful night's sleep in advance of our flight early the next morning. We were in room #350, and it was very cozy.",
            "title": "Good service ... but beaten up property",
            "user": "surreyuk"
        },
        {
            "date": "May 6, 2010",
            "detail_rating": {
                "business": null,
                "cleanliness": 5.0,
                "desk": null,
                "location": 1.0,
                "pool": null,
                "restaurant": null,
                "rooms": 3.0,
                "service": 5.0,
                "sleep": 1.0,
                "value": 3.0
            },
            "helpfulness": null,
            "id": 63460556,
            "likes": {
                "disliked": null,
                "liked": null
            },
            "rating": 3.0,
            "stay_parameters": "Stayed May 2010, traveled on business",
            "text": "Unfortunately, the AC system was so loud we could not sleep. Like many people, we find it hard to sleep with complete silence, so we had the AC fan running. That was fine until the cooling kicked in. It rattled and made so much noise our sleep was ruined.",
            "title": "If you want sleep, stay in Downtown Tulsa... would have been worth the morning drive",
            "user": "caseynetolicky"
        },
        {
            "date": "March 19, 2010",
            "detail_rating": {
                "business": null,
                "cleanliness": 3.0,
                "desk": null,
                "location": 5.0,
                "pool": null,
                "restaurant": null,
                "rooms": 3.0,
                "service": 4.0,
                "sleep": 3.0,
                "value": 3.0
            },
            "helpfulness": null,
            "id": 59007045,
            "likes": {
                "disliked": null,
                "liked": null
            },
            "rating": 3.0,
            "stay_parameters": "Stayed March 2010, traveled on business",
            "text": "The hotel is very beaten up -- in the rooms, the ceiling looks like it has been partly patched and there are cracks everywhere. The property needs a facelift/refresh.",
            "title": "Starting to show its age.",
            "user": "infiniti0"
        },
        {
            "date": "March 28, 2008",
            "detail_rating": {
                "business": null,
                "cleanliness": null,
                "desk": null,
                "location": null,
                "pool": null,
                "restaurant": null,
                "rooms": null,
                "service": null,
                "sleep": null,
                "value": null
            },
            "helpfulness": 1,
            "id": 14617780,
            "likes": {
                "disliked": null,
                "liked": null
            },
            "rating": 4.0,
            "stay_parameters": null,
            "text": "Its always the same, friendly staff and clean room. Nothing special but a good place to stay when your flight is at 6am. Have two stays booked next month.",
            "title": "Typical Hilton Garden",
            "user": "tablerockin"
        },
        {
            "date": "October 31, 2007",
            "detail_rating": {
                "business": 5.0,
                "cleanliness": 4.0,
                "desk": null,
                "front_desk": 3.0,
                "location": 5.0,
                "pool": null,
                "restaurant": null,
                "rooms": 4.0,
                "service": 4.0,
                "sleep": null,
                "value": 4.0
            },
            "helpfulness": null,
            "id": 10480685,
            "likes": {
                "disliked": null,
                "liked": null
            },
            "rating": 4.0,
            "stay_parameters": "Stayed October 2007, traveled as a couple",
            "text": "Next to the Airport, clean nice beds, great shower, good Breakfast for and 2 min. from the check in. You will not go wrong if you are flying out of Tulsa and do not want to wake up at 5am to catch an early flight.",
            "title": "Great for the place and price",
            "user": "Cook"
        },
        {
            "date": "June 3, 2007",
            "detail_rating": {
                "business": null,
                "cleanliness": null,
                "desk": null,
                "location": null,
                "pool": null,
                "restaurant": null,
                "rooms": null,
                "service": null,
                "sleep": null,
                "value": null
            },
            "helpfulness": null,
            "id": 7751830,
            "likes": {
                "disliked": null,
                "liked": null
            },
            "rating": 3.0,
            "stay_parameters": null,
            "text": "Decent airport hotel. Let me check in early, all service from employees I received was very good. The room was nice - good sized and with all the tools I need to work. The hallways were a bit dirty (used Q-tip in the same place in the hall for both days I was there) and the outdoor areas looked like they weren't cleaned that often - but the actual room was clean. Pretty good cafe - which is nice, there aren't many eating choices around. Airport is close enough to walk to - but the shuttle was efficient (I walked back after returning a rental car one day).",
            "title": "Good Airport Hotel",
            "user": "ILnative"
        },
        {
            "date": "April 26, 2007",
            "detail_rating": {
                "business": null,
                "cleanliness": null,
                "desk": null,
                "location": null,
                "pool": null,
                "restaurant": null,
                "rooms": null,
                "service": null,
                "sleep": null,
                "value": null
            },
            "helpfulness": null,
            "id": 7438743,
            "likes": {
                "disliked": null,
                "liked": null
            },
            "rating": 3.0,
            "stay_parameters": null,
            "text": "This hotel, recently decorated, is in much better condition than it was before. The rooms are large and well appointed.",
            "title": "Very fair at the airport",
            "user": "RedSpyder"
        },
        {
            "date": "March 8, 2007",
            "detail_rating": {
                "business": 4.0,
                "cleanliness": 4.0,
                "desk": null,
                "front_desk": 4.0,
                "location": 5.0,
                "pool": null,
                "restaurant": null,
                "rooms": 4.0,
                "service": 5.0,
                "sleep": null,
                "value": 4.0
            },
            "helpfulness": 1,
            "id": 6935163,
            "likes": {
                "disliked": "\u2014 The food",
                "liked": "\u2014 Location & staff"
            },
            "rating": 4.0,
            "stay_parameters": "Stayed March 2007, traveled on business",
            "text": "There is an in-house restaurant but it's not very good (including for breakfast). There is little in the area around the airport but there is one good seafood restaurant, White River Fish Market (1708 North Sheridan), a short distance from the hotel.",
            "title": "Nice Airport Hotel",
            "user": "Superbuyer"
        }
    ],
    "slim_ranking": 0.438775510204,
    "stars": 3,
    "tripadvisor": {
        "VISITED": false,
        "country_name": null,
        "locality": null,
        "pic_link": null,
        "street_address": null
    },
    "user_rating": 3.5,
    "variance": {
        "average": 42,
        "excellent": 30,
        "poor": 15,
        "terrible": 7,
        "very good": 35
    }
}