{
    "aka": "Hampton Inn Milford Hotel Milford",
    "description": "Welcome to the Hampton Inn Milford, an inlet for culture, business, history, and entertainment\u2026You'll find the historic and charming seaside town of Milford offers dozens of activities for business travelers, families and couples alike. Many of the town's most popular destinations are just minutes from the Hampton Inn\u00ae hotel in Milford. Set sail on Long Island Sound from one of Milford's two boat launches. Visit Yales Peabody Museum for everything from Egypt to Dinosaurs. Take a cruise through the coves and islands that Captain Kidd sailed in 1665. While you're here, you'll also be near Yale University, the University of Bridgeport, Sacred Heart University and the University of New Haven. When you're looking for entertainment, the Cabaret Theatre, Shubert and Palace Theatre, and Oakdale Theatre beckon with excellent productions year-round. It's all just a short drive from our hotel in Milford.",
    "detail_rating": {
        "cleanliness": null,
        "location": null,
        "rooms": null,
        "service": null,
        "sleep": null,
        "value": null
    },
    "location": {
        "city": "Milford",
        "continent": null,
        "country": "United States",
        "proposed_city": "Milford",
        "province": null,
        "region": null
    },
    "name": "Hampton Inn Milford",
    "places": {
        "aka": [
            "Hampton",
            "Milford"
        ],
        "hotel_description": [
            "Hampton",
            "Milford",
            "Peabody",
            "University",
            "Bridgeport",
            "Oakdale"
        ],
        "hotel_name": [
            "Hampton",
            "Milford"
        ]
    },
    "review_count": 197,
    "review_count_current": 20,
    "reviews": [
        {
            "date": "October 23, 2011",
            "detail_rating": {
                "business": null,
                "cleanliness": 4.0,
                "desk": null,
                "location": 5.0,
                "pool": null,
                "restaurant": null,
                "rooms": 4.0,
                "service": 4.0,
                "sleep": 4.0,
                "value": 5.0
            },
            "helpfulness": 1,
            "id": 119617236,
            "likes": {
                "disliked": null,
                "liked": null
            },
            "rating": 4.0,
            "stay_parameters": "Stayed October 2011, traveled with family",
            "text": "We started staying here when we decided last minute to stay overnight when dropping our daughter off freshman year at Yale. At that last minute none of the hotels closer to Yale were available so we stayed here. It is now our usual spot,as it is far less expensive than the places close in. And given that if you're not staying right on top of the Yale campus, you're going to have to get in your car and drive anyway, it hardly seems worth it to spend $50 more to be a few miles closer. This Hampton is 11 miles south on 95 from the New Haven exit. The place is simple, but we found it clean and comfortable, with the usual Hampton Inn free breakfast, and free parking. Extremely easy on easy off Rt. 95.",
            "title": "convenient to Yale",
            "user": "NewY0rkTraveler"
        },
        {
            "date": "September 12, 2011",
            "detail_rating": {
                "business": null,
                "cleanliness": 4.0,
                "desk": null,
                "location": null,
                "pool": null,
                "restaurant": null,
                "rooms": null,
                "service": 5.0,
                "sleep": 3.0,
                "value": 4.0
            },
            "helpfulness": 2,
            "id": 118000553,
            "likes": {
                "disliked": null,
                "liked": null
            },
            "rating": 3.0,
            "stay_parameters": "Stayed August 2011, traveled with family",
            "text": "Like many families in my area, my wife and I sough out hotel accommodations while we were without power during Hurricane Irene. Most of the hotels in the area were filled to capacity as was this Hampton Inn.",
            "title": "Stayed during Hurricane Irene Power Outage",
            "user": "plciii"
        },
        {
            "date": "September 10, 2011",
            "detail_rating": {
                "business": null,
                "cleanliness": 5.0,
                "desk": null,
                "location": null,
                "pool": null,
                "restaurant": null,
                "rooms": null,
                "service": 5.0,
                "sleep": 5.0,
                "value": 5.0
            },
            "helpfulness": 5,
            "id": 117905375,
            "likes": {
                "disliked": null,
                "liked": null
            },
            "rating": 5.0,
            "stay_parameters": "Stayed August 2011, traveled with family",
            "text": "The staff at this property is without equal. Each and every staff person I encountered during my three day stay was friendly and courteous. The folks at the front desk were kind and thoughful, aware of the fact that we had been displaced from our home. The staff people who tended to the daily breakfast were cheerful and attentive. They made certain that the breakfast area was spotlessly clean and breakfast items were regualrly replenished.",
            "title": "We Found Refuge at the Hampton Inn Post-Hurricane Irene",
            "user": "DJ24Traveler"
        },
        {
            "date": "August 10, 2011",
            "detail_rating": {
                "business": null,
                "cleanliness": 2.0,
                "desk": null,
                "location": null,
                "pool": null,
                "restaurant": null,
                "rooms": null,
                "service": 3.0,
                "sleep": 2.0,
                "value": 2.0
            },
            "helpfulness": 2,
            "id": 116529088,
            "likes": {
                "disliked": null,
                "liked": null
            },
            "rating": 2.0,
            "stay_parameters": "Stayed August 2011, traveled with family",
            "text": "The facility itself though is starting to show its age. The lobby is small and not well suited for sitting and chatting with friends or family. The rooms and the furniture in the rooms are worn out, as is the carpeting. The bathrooms are functional but small and dated. The air conditioning units are efficient but loud.",
            "title": "Expected more from a Hampton Inn",
            "user": "KaMar4486"
        },
        {
            "date": "July 27, 2011",
            "detail_rating": {
                "business": null,
                "cleanliness": 2.0,
                "desk": null,
                "location": null,
                "pool": null,
                "restaurant": null,
                "rooms": null,
                "service": 4.0,
                "sleep": 1.0,
                "value": 1.0
            },
            "helpfulness": null,
            "id": 115866229,
            "likes": {
                "disliked": null,
                "liked": null
            },
            "rating": 2.0,
            "stay_parameters": "Stayed July 2011, traveled with family",
            "text": "In short, the wonderful staff at the Milford Hampton Inn deserve a better facilty. They do a terrific job though with what they've got!",
            "title": "Needs updating",
            "user": "chele98"
        },
        {
            "date": "April 12, 2012",
            "detail_rating": {
                "business": null,
                "cleanliness": 4.0,
                "desk": null,
                "location": 2.0,
                "pool": null,
                "restaurant": null,
                "rooms": 3.0,
                "service": 4.0,
                "sleep": 3.0,
                "value": 4.0
            },
            "helpfulness": 1,
            "id": 127769622,
            "likes": {
                "disliked": null,
                "liked": null
            },
            "rating": 4.0,
            "stay_parameters": "Stayed April 2012, traveled with family",
            "text": "I am currently here, taking my daughter on her last campus visit and open house, before she decides where she will attend grad school this fall.",
            "title": "Clean but dated",
            "user": "gccc116"
        },
        {
            "date": "April 10, 2012",
            "detail_rating": {
                "business": null,
                "cleanliness": 5.0,
                "desk": null,
                "location": 5.0,
                "pool": null,
                "restaurant": null,
                "rooms": 5.0,
                "service": 5.0,
                "sleep": 5.0,
                "value": 5.0
            },
            "helpfulness": null,
            "id": 127627554,
            "likes": {
                "disliked": null,
                "liked": null
            },
            "rating": 5.0,
            "stay_parameters": "Stayed April 2012, traveled with family",
            "text": "First, the goods:",
            "title": "Great Hotel",
            "user": "1travelingDad"
        },
        {
            "date": "February 20, 2012",
            "detail_rating": {
                "business": null,
                "cleanliness": 5.0,
                "desk": null,
                "location": 5.0,
                "pool": null,
                "restaurant": null,
                "rooms": 5.0,
                "service": 5.0,
                "sleep": 5.0,
                "value": 5.0
            },
            "helpfulness": 1,
            "id": 124887696,
            "likes": {
                "disliked": null,
                "liked": null
            },
            "rating": 5.0,
            "stay_parameters": "Stayed November 2011, traveled on business",
            "text": "Reasonable price",
            "title": "Great Stay",
            "user": "NYCAlarmGal"
        },
        {
            "date": "January 7, 2012",
            "detail_rating": {
                "business": null,
                "cleanliness": 5.0,
                "desk": null,
                "location": 5.0,
                "pool": null,
                "restaurant": null,
                "rooms": 5.0,
                "service": 5.0,
                "sleep": 5.0,
                "value": 5.0
            },
            "helpfulness": 1,
            "id": 122734260,
            "likes": {
                "disliked": null,
                "liked": null
            },
            "rating": 5.0,
            "stay_parameters": "Stayed December 2011, traveled as a couple",
            "text": "Friendly staff",
            "title": "Excellent Hotel",
            "user": "Joan B"
        },
        {
            "date": "December 23, 2011",
            "detail_rating": {
                "business": null,
                "cleanliness": 5.0,
                "desk": null,
                "location": 5.0,
                "pool": null,
                "restaurant": null,
                "rooms": 5.0,
                "service": 5.0,
                "sleep": 5.0,
                "value": 5.0
            },
            "helpfulness": 1,
            "id": 122051964,
            "likes": {
                "disliked": null,
                "liked": null
            },
            "rating": 5.0,
            "stay_parameters": "Stayed December 2011, traveled with family",
            "text": "Clean",
            "title": "Clean and nice",
            "user": "khadi04"
        },
        {
            "date": "December 5, 2011",
            "detail_rating": {
                "business": null,
                "cleanliness": 5.0,
                "desk": null,
                "location": 5.0,
                "pool": null,
                "restaurant": null,
                "rooms": 4.0,
                "service": 5.0,
                "sleep": 5.0,
                "value": 5.0
            },
            "helpfulness": 1,
            "id": 121439038,
            "likes": {
                "disliked": null,
                "liked": null
            },
            "rating": 3.0,
            "stay_parameters": "Stayed December 2011, traveled as a couple",
            "text": "We only stayed one night, and we had no problems. After we checked in, the front desk called to see if everything was okay. The room was clean, lovely bedding, big flat screen TV. No funky odors. We love the free hot buffet breakfast at Hampton Inn, but some have been better. The staff was friendly & helpful. The location is right off I-95. There was no microwave or refrigerator that some other Hampton Inns have, but we didn't need that this time. We have also had larger rooms at other Hampton Inns, but this room size was still fine. Some reviews said it was noisy, but we didn't experience that. We really wish they'd had a pool, though; we would have used it. The room was certainly worth the price we paid, and we would stay there again if we are ever back in Milford.",
            "title": "Clean room, good value",
            "user": "cphershon"
        },
        {
            "date": "November 28, 2011",
            "detail_rating": {
                "business": null,
                "cleanliness": 5.0,
                "desk": null,
                "location": 4.0,
                "pool": null,
                "restaurant": null,
                "rooms": 5.0,
                "service": 5.0,
                "sleep": 5.0,
                "value": 5.0
            },
            "helpfulness": 2,
            "id": 121141511,
            "likes": {
                "disliked": null,
                "liked": null
            },
            "rating": 5.0,
            "stay_parameters": "Stayed November 2011, traveled with family",
            "text": "This motel has easy on and off access to I-95 is close to a lot of shopping in the Milford area along US-1.",
            "title": "Neat & Clean",
            "user": "PATRAVELER032"
        },
        {
            "date": "November 21, 2011",
            "detail_rating": {
                "business": null,
                "cleanliness": 5.0,
                "desk": null,
                "location": 5.0,
                "pool": null,
                "restaurant": null,
                "rooms": 5.0,
                "service": 5.0,
                "sleep": null,
                "value": 5.0
            },
            "helpfulness": null,
            "id": 120879524,
            "likes": {
                "disliked": null,
                "liked": null
            },
            "rating": 5.0,
            "stay_parameters": "Stayed November 2011",
            "text": "All of the staff is very friendly and helpful, the motel is clean and well kept, nice hot breakfast every morning. It is an older property but well kept, and can be a little noisy at times because it is a very busy place seems like every time we stay here there is some sort of game going on near by either high school football of college football, (close to Yale campus). We still Like staying here, the beds are comfortable and clean, average size rooms, and good for a short stay.",
            "title": "Fantastic",
            "user": "Moneysgirl"
        },
        {
            "date": "November 5, 2011",
            "detail_rating": {
                "business": null,
                "cleanliness": 2.0,
                "desk": null,
                "location": 3.0,
                "pool": null,
                "restaurant": null,
                "rooms": 1.0,
                "service": 2.0,
                "sleep": 1.0,
                "value": 3.0
            },
            "helpfulness": 4,
            "id": 120213550,
            "likes": {
                "disliked": null,
                "liked": null
            },
            "rating": 1.0,
            "stay_parameters": "Stayed June 2011, traveled on business",
            "text": "Clean, immaculately! Comfortable, large beds. Great breakfast selection. Reasonable rates. Highly recommend.",
            "title": "Awful",
            "user": "ldygrdnr"
        },
        {
            "date": "October 26, 2011",
            "detail_rating": {
                "business": null,
                "cleanliness": 4.0,
                "desk": null,
                "location": 2.0,
                "pool": null,
                "restaurant": null,
                "rooms": 3.0,
                "service": 5.0,
                "sleep": 5.0,
                "value": 5.0
            },
            "helpfulness": 2,
            "id": 119757082,
            "likes": {
                "disliked": null,
                "liked": null
            },
            "rating": 3.0,
            "stay_parameters": "Stayed October 2011, traveled as a couple",
            "text": "I wish I'd believed the bad reviews of this hotel. I stayed one night, arrived late to find that the \"quiet room away from the highway\" I'd requested didn't exist. I did up with a room away from the highway, but it was just off the lobby and opposite the hotel laundry room. The room itself had seen better days, the wallpaper was falling off the wall, there seemed to be water damage to the walls and ceiling. The floors didn't seem to be clean and so on.",
            "title": "Dated Property with Friendly Staff",
            "user": "foodbuffs"
        },
        {
            "date": "July 25, 2011",
            "detail_rating": {
                "business": null,
                "cleanliness": 5.0,
                "desk": null,
                "location": null,
                "pool": null,
                "restaurant": null,
                "rooms": null,
                "service": 5.0,
                "sleep": 3.0,
                "value": 5.0
            },
            "helpfulness": null,
            "id": 115739467,
            "likes": {
                "disliked": null,
                "liked": null
            },
            "rating": 4.0,
            "stay_parameters": "Stayed June 2011, traveled with family",
            "text": "Would sugest trying to get room not facing the freeway. Breakfast was good as was the service.",
            "title": "Good hotel with a good breakfast",
            "user": "1travelingDad"
        },
        {
            "date": "May 23, 2011",
            "detail_rating": {
                "business": null,
                "cleanliness": 5.0,
                "desk": null,
                "location": 3.0,
                "pool": null,
                "restaurant": null,
                "rooms": 2.0,
                "service": 5.0,
                "sleep": 2.0,
                "value": 3.0
            },
            "helpfulness": 1,
            "id": 109563528,
            "likes": {
                "disliked": null,
                "liked": null
            },
            "rating": 2.0,
            "stay_parameters": "Stayed February 2011, traveled on business",
            "text": "Quite frankly, as a Diamond Club member, I feel you have to ask to see the room before you can actually check into a Hampton Inn. I feel sorry for the new franchisees who pour a lot of money into a new building when the brand suffers from old and out of date facilities such as this.",
            "title": "the lobby may be fresh, but the rooms are small, dingy and cramped",
            "user": "Donald J"
        },
        {
            "date": "May 20, 2011",
            "detail_rating": {
                "business": null,
                "cleanliness": 4.0,
                "desk": null,
                "location": 5.0,
                "pool": null,
                "restaurant": null,
                "rooms": 3.0,
                "service": 5.0,
                "sleep": null,
                "value": 4.0
            },
            "helpfulness": 3,
            "id": 109115414,
            "likes": {
                "disliked": null,
                "liked": null
            },
            "rating": 4.0,
            "stay_parameters": "Stayed May 2011, traveled on business",
            "text": "I have given up on their plastic cups and microwaved eggs. If you search the Hilton web site, you can usually stay at a Hilton Garden Inn or a Double Tree for no more money and even less.",
            "title": "Decent Hampton Inn",
            "user": "jasmich"
        },
        {
            "date": "May 16, 2011",
            "detail_rating": {
                "business": null,
                "cleanliness": null,
                "desk": null,
                "location": null,
                "pool": null,
                "restaurant": null,
                "rooms": null,
                "service": null,
                "sleep": null,
                "value": null
            },
            "helpfulness": 2,
            "id": 108481506,
            "likes": {
                "disliked": null,
                "liked": null
            },
            "rating": 5.0,
            "stay_parameters": null,
            "text": "I was a little concerned when I read the mixed reviews about this Hampton. I have stayed at numerous Hampton's throughout the country. This is an older Hampton that has had updates. While it does have smaller rooms, the rooms had been updated and were ok. I found the staff to be wonderful, and went our of their way to make this a good stay.",
            "title": "First Time Hampton Inn Experience",
            "user": "Takako F"
        },
        {
            "date": "May 5, 2011",
            "detail_rating": {
                "business": null,
                "cleanliness": 5.0,
                "desk": null,
                "location": 5.0,
                "pool": null,
                "restaurant": null,
                "rooms": 5.0,
                "service": 5.0,
                "sleep": 5.0,
                "value": 5.0
            },
            "helpfulness": 2,
            "id": 107062265,
            "likes": {
                "disliked": null,
                "liked": null
            },
            "rating": 5.0,
            "stay_parameters": "Stayed May 2011, traveled as a couple",
            "text": "This is definitely not as nice as the new Hampton's, but it is a good spot.",
            "title": "Great spot on the long road home",
            "user": "lapddect"
        }
    ],
    "slim_ranking": 0.307692307692,
    "stars": 2.5,
    "tripadvisor": {
        "VISITED": false,
        "country_name": null,
        "locality": null,
        "pic_link": null,
        "street_address": null
    },
    "user_rating": 4.0,
    "variance": {
        "average": 33,
        "excellent": 72,
        "poor": 16,
        "terrible": 10,
        "very good": 66
    }
}