{
    "aka": "Inn Of The Spanish Garden Hotel Santa Barbara",
    "description": "Experience the jewel of luxury boutique Santa Barbara hotels. Spanish Garden Inn offers a sophisticated Spanish-Mediterranean inspired design, quality amenities and close attention to personal service. The hotel epitomizes the vitality of the City and honors its tradition by recreating the history, romance and intrigue of Spanish Colonial Santa Barbara.",
    "detail_rating": {
        "cleanliness": 5.0,
        "location": 4.5,
        "rooms": 5.0,
        "service": 4.5,
        "sleep": 4.5,
        "value": 4.5
    },
    "location": {
        "city": "Santa Barbara",
        "continent": null,
        "country": "United States",
        "proposed_city": "Of",
        "province": null,
        "region": null
    },
    "name": "Spanish Garden Inn",
    "places": {
        "aka": [
            "Of"
        ],
        "hotel_description": [],
        "hotel_name": []
    },
    "review_count": 622,
    "review_count_current": 20,
    "reviews": [
        {
            "date": "October 31, 2007",
            "detail_rating": {
                "business": 5.0,
                "cleanliness": 5.0,
                "desk": null,
                "front_desk": 5.0,
                "location": 3.0,
                "pool": null,
                "restaurant": null,
                "rooms": 5.0,
                "service": 5.0,
                "sleep": null,
                "value": 5.0
            },
            "helpfulness": 3,
            "id": 10471143,
            "likes": {
                "disliked": "\u2014 nothign",
                "liked": "\u2014 Chill out factor"
            },
            "rating": 5.0,
            "stay_parameters": "Stayed October 2007",
            "text": "My sisters and I here in October 07, when we parked outside our first thoughts were it was perhaps not as nice as the website had lead us to belive, HOW WRONG WE WERE. This hotel and the staff were totally and absolutly brilliant. Everyone was very firendly and helpful, in particular Aarron, who carried our very large and heavy cases to/from our car with a smile. The hotel provide a complimentary breakfast and newspaper, which is very rare in hotels in the USA and every day in reception there are fresh chocolate chip cookies for guests. In the reception they have a huge book for guests to peruse listing several local restaurants & giving details of the menus & prices, so it is easy to decide where to go before leaving the hotel. Excellant value for money and we cannot wait to visit again & stay longer next time. An absolute must to stay in when visiting Santa Barbara an oasis of tranquility.",
            "title": "Fantastic",
            "user": "Sistersontourglasgow"
        },
        {
            "date": "October 27, 2007",
            "detail_rating": {
                "business": null,
                "cleanliness": 5.0,
                "desk": null,
                "front_desk": 4.0,
                "location": 4.0,
                "pool": null,
                "restaurant": null,
                "rooms": 5.0,
                "service": 2.0,
                "sleep": null,
                "value": 3.0
            },
            "helpfulness": 1,
            "id": 10363851,
            "likes": {
                "disliked": "\u2014 front desk staff friendly but unreliable",
                "liked": "\u2014 stunning room"
            },
            "rating": 4.0,
            "stay_parameters": "Stayed October 2007, traveled as a couple",
            "text": "I agree with the other positive reviews. I liked how it was close to, but not on, State St.",
            "title": "rustic charm, modern amenities",
            "user": "YC-YVR"
        },
        {
            "date": "October 23, 2007",
            "detail_rating": {
                "business": 3.0,
                "cleanliness": 5.0,
                "desk": null,
                "front_desk": 4.0,
                "location": 4.0,
                "pool": null,
                "restaurant": null,
                "rooms": 5.0,
                "service": 5.0,
                "sleep": null,
                "value": 2.0
            },
            "helpfulness": 2,
            "id": 10273017,
            "likes": {
                "disliked": null,
                "liked": null
            },
            "rating": 5.0,
            "stay_parameters": "Stayed January 2007, traveled on business",
            "text": "Our room was gorgeous and immaculate, having a little private garden which was connected to the main courtyard.",
            "title": "So clean and quiet!",
            "user": "RachelinSoCAL"
        },
        {
            "date": "October 23, 2007",
            "detail_rating": {
                "business": 5.0,
                "cleanliness": 5.0,
                "desk": null,
                "front_desk": 5.0,
                "location": 5.0,
                "pool": null,
                "restaurant": null,
                "rooms": 5.0,
                "service": 5.0,
                "sleep": null,
                "value": 5.0
            },
            "helpfulness": 1,
            "id": 10271871,
            "likes": {
                "disliked": null,
                "liked": null
            },
            "rating": 5.0,
            "stay_parameters": "Stayed October 2007, traveled as a couple",
            "text": "The staff are unanimously friendly. My only (minor) criticism was follow-up. We asked the front desk to make a dinner reservation at a new restaurant in Montecito we had read about. When we drove out there with our friends, we couldn't find the place, and it turned out that the restaurant (Sesto Senso) was so new it hadn't even opened. My mistake, perhaps, but it would have been helpful if the front desk had let me know that they weren't successful in making the booking.",
            "title": "Great Place, Great Staff",
            "user": "yotaman24"
        },
        {
            "date": "October 21, 2007",
            "detail_rating": {
                "business": 5.0,
                "cleanliness": 5.0,
                "desk": null,
                "front_desk": 5.0,
                "location": 5.0,
                "pool": null,
                "restaurant": null,
                "rooms": 5.0,
                "service": 5.0,
                "sleep": null,
                "value": 5.0
            },
            "helpfulness": 4,
            "id": 10173347,
            "likes": {
                "disliked": null,
                "liked": null
            },
            "rating": 4.0,
            "stay_parameters": "Stayed October 2007, traveled as a couple",
            "text": "We had also requested a particular bus schedule, but we never heard back.",
            "title": "Loved this place",
            "user": "theTraveLees"
        },
        {
            "date": "September 22, 2007",
            "detail_rating": {
                "business": null,
                "cleanliness": 5.0,
                "desk": null,
                "front_desk": 5.0,
                "location": 4.0,
                "pool": null,
                "restaurant": null,
                "rooms": 5.0,
                "service": 5.0,
                "sleep": null,
                "value": 4.0
            },
            "helpfulness": 1,
            "id": 8851650,
            "likes": {
                "disliked": "\u2014 Nothing",
                "liked": "\u2014 Everything"
            },
            "rating": 5.0,
            "stay_parameters": "Stayed September 2007, traveled as a couple",
            "text": "My wife and I stayed at the Inn in mid September and like the other recent reviewer were allocated room 13 but I'm delighted to say without any problems with plumbing noises!! I have to admit that we've stayed in Santa Barbara on 5 previous occassions and have always been completely seduced by the town,its setting, its climate,its facilities and its ambiance.",
            "title": "Room 13 not unlucky for us",
            "user": "Glyntraveller"
        },
        {
            "date": "September 21, 2007",
            "detail_rating": {
                "business": null,
                "cleanliness": 5.0,
                "desk": null,
                "front_desk": 5.0,
                "location": 5.0,
                "pool": null,
                "restaurant": null,
                "rooms": 5.0,
                "service": 5.0,
                "sleep": null,
                "value": 5.0
            },
            "helpfulness": 1,
            "id": 8838553,
            "likes": {
                "disliked": "\u2014 Room 13 possibly!",
                "liked": "\u2014 The location, the staff"
            },
            "rating": 5.0,
            "stay_parameters": "Stayed September 2007, traveled as a couple",
            "text": "Having admitted to a bias towards Santa Barbara, our previous positive feelings were even further enhanced by our stay at the Inn. This is a great place. The staff are excellent, the rooms are well equipped and maintained and the location is good (although some way from the beaches). Undoubtedly this is the best hotel of its type that we have ever stayed at and we offer everyone concerned many congratulations.",
            "title": "Quality Customer Service Maintains the Reputation",
            "user": "Big_Blue_Traveller"
        },
        {
            "date": "September 12, 2007",
            "detail_rating": {
                "business": null,
                "cleanliness": 5.0,
                "desk": null,
                "front_desk": 5.0,
                "location": 4.0,
                "pool": null,
                "restaurant": null,
                "rooms": 4.0,
                "service": 5.0,
                "sleep": null,
                "value": 5.0
            },
            "helpfulness": 1,
            "id": 8702326,
            "likes": {
                "disliked": null,
                "liked": null
            },
            "rating": 5.0,
            "stay_parameters": "Stayed September 2006, traveled as a couple",
            "text": "This could have been a disaster but the hotel really did pull out all the right stops to give us quality service.",
            "title": "Loved this place!",
            "user": "AKCHouston"
        },
        {
            "date": "September 4, 2007",
            "detail_rating": {
                "business": 5.0,
                "cleanliness": 5.0,
                "desk": null,
                "front_desk": 5.0,
                "location": 5.0,
                "pool": null,
                "restaurant": null,
                "rooms": 5.0,
                "service": 5.0,
                "sleep": null,
                "value": 5.0
            },
            "helpfulness": 3,
            "id": 8619090,
            "likes": {
                "disliked": "\u2014 Breakfast was adaquate; could offer a few more items.",
                "liked": "\u2014 Large rooms; clean; great beds and linens; large bathroms; plenty of storage"
            },
            "rating": 5.0,
            "stay_parameters": "Stayed August 2007, traveled with family",
            "text": "We arrived quite late after a really horrible Labour Day weekend drive from LAX and were immediately charmed by the hotel and staff. We were shown to out courtyard room and were again impressed by the quality of the room, the bathroom area and the general ambiance. We sank into out very comfortable bed to sleep off our jetlag from the UK and looked forward to a very pleasant night's sleep.",
            "title": "Fantastic Boutique Hotel",
            "user": "QualityTraveler"
        },
        {
            "date": "August 24, 2007",
            "detail_rating": {
                "business": null,
                "cleanliness": 5.0,
                "desk": null,
                "front_desk": 5.0,
                "location": 5.0,
                "pool": null,
                "restaurant": null,
                "rooms": 5.0,
                "service": 5.0,
                "sleep": null,
                "value": 5.0
            },
            "helpfulness": 3,
            "id": 8494100,
            "likes": {
                "disliked": "\u2014 Nothing",
                "liked": "\u2014 Everything"
            },
            "rating": 5.0,
            "stay_parameters": "Stayed July 2006, traveled as a couple",
            "text": "Unfortunately, at around 1.30am we were woken by incredibly loud and persistant plumbing noises of tanks filling and water running. Now, one expects occasional noise when another guest flushes the loo etc, but this was very loud and just didn't stop. So, off to reception where a very helpful night porter tried to ascertain what was wrong, called the hotel manager, offered us an alternative room for the night and handled two stressed out, jet lagged, tired people very well indeed. He told us that there would be another room available the next day and that they would move all our stuff etc. As the noise had finally stopped we decided to stay put for the night and move the next day. We never did get to the bottom of the reason for the noise - plumbing fault, odd & inconsiderate neighbours running baths repeatedly at 1am or a design fault in this part of the hotel (we were in room 13) but we did then get off to sleep.",
            "title": "Unbelievable",
            "user": "Mikez428"
        },
        {
            "date": "October 16, 2007",
            "detail_rating": {
                "business": null,
                "cleanliness": 5.0,
                "desk": null,
                "front_desk": 5.0,
                "location": 5.0,
                "pool": null,
                "restaurant": null,
                "rooms": 5.0,
                "service": 5.0,
                "sleep": null,
                "value": 4.0
            },
            "helpfulness": 3,
            "id": 10087561,
            "likes": {
                "disliked": "\u2014 can't say",
                "liked": "\u2014 personal service"
            },
            "rating": 5.0,
            "stay_parameters": "Stayed July 2007, traveled as a couple",
            "text": "We absolutely loved our 4 day stay here. We got the romance package which included a local bottle of wine waiting for us in our room and an in-room massage for the both of us. The staff was extremely helpful about recommending restaurants and helping us plan our wine country tour. They also helped us ship our wine home. Very personal, even down to the always fresh batch of cookies sitting at the front desk. It was walking distance from great restaurants and shopping. It's a little pricey, but worth it for the personalized service you just can't get a the large resorts.",
            "title": "The place to stay in Santa Barbara",
            "user": "geniejmc"
        },
        {
            "date": "October 7, 2007",
            "detail_rating": {
                "business": 5.0,
                "cleanliness": 5.0,
                "desk": null,
                "front_desk": 5.0,
                "location": 5.0,
                "pool": null,
                "restaurant": null,
                "rooms": 5.0,
                "service": 5.0,
                "sleep": null,
                "value": 5.0
            },
            "helpfulness": 4,
            "id": 10049565,
            "likes": {
                "disliked": null,
                "liked": null
            },
            "rating": 5.0,
            "stay_parameters": "Stayed October 2007, traveled as a couple",
            "text": "My husband and I stayed in Room 22 (executive king) for 3 nights for a belated anniversary celebration. We were married in Santa Barbara, so we were really excited to return.",
            "title": "Perfect stay in Santa Barbara!",
            "user": "Girlypanda"
        },
        {
            "date": "October 4, 2007",
            "detail_rating": {
                "business": 5.0,
                "cleanliness": 5.0,
                "desk": null,
                "front_desk": 5.0,
                "location": 5.0,
                "pool": null,
                "restaurant": null,
                "rooms": 5.0,
                "service": 5.0,
                "sleep": null,
                "value": 3.0
            },
            "helpfulness": 8,
            "id": 10037928,
            "likes": {
                "disliked": "\u2014 unauthorized charges",
                "liked": "\u2014 beautiful place, never go again because of situation nor recommed"
            },
            "rating": 2.0,
            "stay_parameters": "Stayed September 2007, traveled as a couple",
            "text": "Check in was fast with our room ready at 3 pm. Our room was on the second floor overlooking the pool. Everything was as described by other TA reviewers: a spacious room with flat screen TV with DVD player, separate sunken tub, robes, comfy bed, Molton Brown toiletries, fireplace, French press with electric tea kettle with a variety of teas and large jar of coffee.",
            "title": "hidden charges if you are sick",
            "user": "6078"
        },
        {
            "date": "September 27, 2007",
            "detail_rating": {
                "business": null,
                "cleanliness": 5.0,
                "desk": null,
                "front_desk": 4.0,
                "location": 5.0,
                "pool": null,
                "restaurant": null,
                "rooms": 5.0,
                "service": 5.0,
                "sleep": null,
                "value": 3.0
            },
            "helpfulness": 3,
            "id": 10010690,
            "likes": {
                "disliked": "\u2014 High price, but it's worth it for all that this hotel offers",
                "liked": "\u2014 Santa Barbara architecture and room ammenities"
            },
            "rating": 5.0,
            "stay_parameters": "Stayed September 2007, traveled as a couple",
            "text": "We really enjoyed the continental breakfast, especially the made to order coffee drinks. We went to the wine hour once and were impressed with the wide selection available.",
            "title": "Best Place in the Best Place",
            "user": "UrbanDan"
        },
        {
            "date": "September 23, 2007",
            "detail_rating": {
                "business": null,
                "cleanliness": null,
                "desk": null,
                "location": null,
                "pool": null,
                "restaurant": null,
                "rooms": null,
                "service": null,
                "sleep": null,
                "value": null
            },
            "helpfulness": 10,
            "id": 8864320,
            "likes": {
                "disliked": null,
                "liked": null
            },
            "rating": 1.0,
            "stay_parameters": null,
            "text": "Overall, what we enjoyed most about our stay were all the little touches: DVD library at front desk, tea/coffee available at all hours in lobby, turn down service (with a printed weather report), and water bottles at our departure.",
            "title": "Poorly run hotel",
            "user": "harvina"
        },
        {
            "date": "August 23, 2007",
            "detail_rating": {
                "business": null,
                "cleanliness": null,
                "desk": null,
                "location": null,
                "pool": null,
                "restaurant": null,
                "rooms": null,
                "service": null,
                "sleep": null,
                "value": null
            },
            "helpfulness": 1,
            "id": 8489857,
            "likes": {
                "disliked": null,
                "liked": null
            },
            "rating": 5.0,
            "stay_parameters": null,
            "text": "My family (2 teenagers and husband) stayed in 2 rooms at this wonderful inn. We traveled from LA up the coast to Napa, and this inn was our favorite. The staff was unbelievably accomodating. They knew us by name (thanks Frank!) and could not have been more accomdating. The rooms were spacious, very beautiful and clean. We had 2 suites on the main level right off the center court patio. The fire pit in the courtyard was very inviting at night, with candles lit on all the tables. The location was an easy 2 or so blocks from the heart of dowtown, so a great location. The breakfast buffet was very nice-fruit, quiche, granola, cereals, espresso if you want too! Would highly recommend this wonderful inn. We are very picky and we loved it!",
            "title": "Loved this inn!",
            "user": "JamesCA"
        },
        {
            "date": "August 13, 2007",
            "detail_rating": {
                "business": 5.0,
                "cleanliness": 5.0,
                "desk": null,
                "front_desk": 5.0,
                "location": null,
                "pool": null,
                "restaurant": null,
                "rooms": 5.0,
                "service": 5.0,
                "sleep": null,
                "value": 5.0
            },
            "helpfulness": 3,
            "id": 8408358,
            "likes": {
                "disliked": "\u2014 no elevator to upper floors",
                "liked": "\u2014 everything went perfect"
            },
            "rating": 5.0,
            "stay_parameters": "Stayed August 2007, traveled as a couple",
            "text": "Stayed in many nicer places in California and this is one of the best. Sometimes when everything goes smoothly you don't appreciate it as much as you should.",
            "title": "Don't Take Perfect for Granted",
            "user": "Anal Jim"
        },
        {
            "date": "August 13, 2007",
            "detail_rating": {
                "business": 4.0,
                "cleanliness": 5.0,
                "desk": null,
                "front_desk": 5.0,
                "location": 4.0,
                "pool": null,
                "restaurant": null,
                "rooms": 5.0,
                "service": 4.0,
                "sleep": null,
                "value": 5.0
            },
            "helpfulness": 3,
            "id": 8405340,
            "likes": {
                "disliked": "\u2014 nothing",
                "liked": "\u2014 such a change from big corporate hotels"
            },
            "rating": 5.0,
            "stay_parameters": "Stayed July 2007, traveled with family",
            "text": "The location was very convenient to a lot of walking distance locations. Parking was secure and covered in an underground garage with NO additional charge for parking. Check in was quick and polite. Super bell service. The room was lovely, very clean, great bedding, great toiletries, great view of clean pool with balcony and everything worked from every lamp to the fireplace and the heating and cooling.",
            "title": "Charming hotel full of character",
            "user": "liduk"
        },
        {
            "date": "August 12, 2007",
            "detail_rating": {
                "business": 5.0,
                "cleanliness": 5.0,
                "desk": null,
                "front_desk": 5.0,
                "location": 5.0,
                "pool": null,
                "restaurant": null,
                "rooms": 5.0,
                "service": 4.0,
                "sleep": null,
                "value": 4.0
            },
            "helpfulness": 4,
            "id": 8402421,
            "likes": {
                "disliked": "\u2014 No restaurant loacting on-site (but found plenty within walking distance)",
                "liked": "\u2014 Relaxing atmosphere"
            },
            "rating": 5.0,
            "stay_parameters": "Stayed August 2007, traveled as a couple",
            "text": "Breakfast INCLUDED and they will bring it to your room upon request.",
            "title": "Upscale and Comfortable",
            "user": "stillmars321"
        },
        {
            "date": "August 9, 2007",
            "detail_rating": {
                "business": null,
                "cleanliness": 5.0,
                "desk": null,
                "front_desk": 4.0,
                "location": 4.0,
                "pool": null,
                "restaurant": null,
                "rooms": 5.0,
                "service": 4.0,
                "sleep": null,
                "value": 5.0
            },
            "helpfulness": null,
            "id": 8378489,
            "likes": {
                "disliked": null,
                "liked": "\u2014 The room"
            },
            "rating": 5.0,
            "stay_parameters": "Stayed July 2007, traveled as a couple",
            "text": "Also the Inn of the Spanish Garden is very quiet for a downtown location with a very courteous and friendly staff.",
            "title": "Really lovely hotel - would highly recommend",
            "user": "snix"
        }
    ],
    "slim_ranking": 0.0166666666667,
    "stars": null,
    "tripadvisor": {
        "VISITED": false,
        "country_name": null,
        "locality": null,
        "pic_link": null,
        "street_address": null
    },
    "user_rating": 4.5,
    "variance": {
        "average": 16,
        "excellent": 489,
        "poor": 10,
        "terrible": 6,
        "very good": 101
    }
}