{
    "aka": "Adrema Hotel Berlin",
    "description": null,
    "detail_rating": {
        "cleanliness": null,
        "location": null,
        "rooms": null,
        "service": null,
        "sleep": null,
        "value": null
    },
    "location": {
        "city": null,
        "continent": "Europe",
        "country": "Germany",
        "proposed_city": "Berlin",
        "province": null,
        "region": null
    },
    "name": "Adrema Hotel",
    "places": {
        "aka": [
            "Berlin"
        ],
        "hotel_description": [],
        "hotel_name": []
    },
    "review_count": 304,
    "review_count_current": 8,
    "reviews": [
        {
            "date": "August 24, 2006",
            "detail_rating": {
                "business": 5.0,
                "cleanliness": 5.0,
                "desk": null,
                "front_desk": 5.0,
                "location": 2.0,
                "pool": null,
                "restaurant": null,
                "rooms": 5.0,
                "service": 5.0,
                "sleep": null,
                "value": 5.0
            },
            "helpfulness": 2,
            "id": 5703356,
            "likes": {
                "disliked": null,
                "liked": null
            },
            "rating": 5.0,
            "stay_parameters": "Stayed August 2006, traveled with family",
            "text": "This hotel is a fantastic value for the money. It is modern and clean. It had a very comfortable bed. The glass wall on the bathroom was a little funky (especially since I was traveling with my 15 year old son) but we got over it.",
            "title": "Loved it",
            "user": "2bTraveling"
        },
        {
            "date": "July 25, 2006",
            "detail_rating": {
                "business": 5.0,
                "cleanliness": 5.0,
                "desk": null,
                "front_desk": 5.0,
                "location": 5.0,
                "pool": null,
                "restaurant": null,
                "rooms": 5.0,
                "service": 5.0,
                "sleep": null,
                "value": 5.0
            },
            "helpfulness": 6,
            "id": 5508891,
            "likes": {
                "disliked": "\u2014 Not a single thing to say bad about it",
                "liked": "\u2014 EVERYTHING, CLEANLINESS, STAFF, DECORATION, LOCATION"
            },
            "rating": 5.0,
            "stay_parameters": "Stayed July 2006, traveled as a couple",
            "text": "The location isn't near anything but taxis are reasonable. We'd just take one to a location we'd want to see and then catch one back at the end of the day.",
            "title": "Fantastic Hotel",
            "user": "PinkMoon77"
        },
        {
            "date": "June 1, 2006",
            "detail_rating": {
                "business": null,
                "cleanliness": null,
                "desk": null,
                "location": null,
                "pool": null,
                "restaurant": null,
                "rooms": null,
                "service": null,
                "sleep": null,
                "value": null
            },
            "helpfulness": 13,
            "id": 5288631,
            "likes": {
                "disliked": null,
                "liked": null
            },
            "rating": 2.0,
            "stay_parameters": null,
            "text": "The breakfast was extra but worth it.",
            "title": "Beautiful rooms; OK location, Ok services",
            "user": "A TripAdvisor user"
        },
        {
            "date": "December 26, 2006",
            "detail_rating": {
                "business": 5.0,
                "cleanliness": 4.0,
                "desk": null,
                "front_desk": 5.0,
                "location": 2.0,
                "pool": null,
                "restaurant": null,
                "rooms": 5.0,
                "service": 5.0,
                "sleep": null,
                "value": 5.0
            },
            "helpfulness": 3,
            "id": 6500298,
            "likes": {
                "disliked": "\u2014 Location, location location and no kettle amenities",
                "liked": "\u2014 The beds are so comfy and the view over the river is great"
            },
            "rating": 4.0,
            "stay_parameters": "Stayed December 2006, traveled as a couple",
            "text": "Stayed here 14-18 Dec. Lovely Hotel but not a very good location as well as some others.",
            "title": "Lovely Hotel, Not very good location",
            "user": "gillycooke"
        },
        {
            "date": "December 18, 2006",
            "detail_rating": {
                "business": 5.0,
                "cleanliness": 4.0,
                "desk": null,
                "front_desk": 4.0,
                "location": 4.0,
                "pool": null,
                "restaurant": null,
                "rooms": 5.0,
                "service": 4.0,
                "sleep": null,
                "value": 5.0
            },
            "helpfulness": 1,
            "id": 6457221,
            "likes": {
                "disliked": "\u2014 Having to pay for leisure facilities",
                "liked": "\u2014 The design of the rooms"
            },
            "rating": 4.0,
            "stay_parameters": "Stayed November 2006, traveled as a couple",
            "text": "We stayed on the 6th floor over looking the river (request this when booking) and had a great view of the city.",
            "title": "Good river views",
            "user": "EEYORETIGGERR"
        },
        {
            "date": "December 5, 2006",
            "detail_rating": {
                "business": 3.0,
                "cleanliness": 5.0,
                "desk": null,
                "front_desk": 1.0,
                "location": 2.0,
                "pool": null,
                "restaurant": null,
                "rooms": 5.0,
                "service": 1.0,
                "sleep": null,
                "value": 3.0
            },
            "helpfulness": 2,
            "id": 6332958,
            "likes": {
                "disliked": null,
                "liked": null
            },
            "rating": 3.0,
            "stay_parameters": "Stayed November 2006, traveled with family",
            "text": "It is situated in the suburbs with a lot of turkish restaurants. the area dosen't feel safe when you get off the bus but actually is ok.",
            "title": "Details matter",
            "user": "genene"
        },
        {
            "date": "October 26, 2006",
            "detail_rating": {
                "business": 5.0,
                "cleanliness": 5.0,
                "desk": null,
                "front_desk": 5.0,
                "location": 4.0,
                "pool": null,
                "restaurant": null,
                "rooms": 5.0,
                "service": 5.0,
                "sleep": null,
                "value": 5.0
            },
            "helpfulness": null,
            "id": 6012713,
            "likes": {
                "disliked": "\u2014 Nothing really. It was all good.",
                "liked": "\u2014 Modern decor, cleanliness, price"
            },
            "rating": 4.0,
            "stay_parameters": "Stayed July 2006, traveled as a couple",
            "text": "The breakfast is 14 euro a day but if you come out of the hotel and turn left on the corner is wee cafe that does a a very cheap breakfast for no more than 5.50 euro.",
            "title": "Loved It",
            "user": "RobynR"
        },
        {
            "date": "September 13, 2006",
            "detail_rating": {
                "business": 5.0,
                "cleanliness": 5.0,
                "desk": null,
                "front_desk": 5.0,
                "location": 4.0,
                "pool": null,
                "restaurant": null,
                "rooms": 5.0,
                "service": 5.0,
                "sleep": null,
                "value": 5.0
            },
            "helpfulness": 5,
            "id": 5798739,
            "likes": {
                "disliked": "\u2014 Book a room with views to the river. Book directly through the hotel and get 3x2 night deal",
                "liked": "\u2014 The room was fantastic"
            },
            "rating": 5.0,
            "stay_parameters": "Stayed September 2006, traveled as a couple",
            "text": "If you need instructions on how to get to the hotel phone up and they will fax them to you. Once you get the hang of travelling to and from here its grand.",
            "title": "Fantastic Hotel - Very stylish, good location, great service!",
            "user": "JavierH75"
        }
    ],
    "slim_ranking": 0.373313343328,
    "stars": 4,
    "tripadvisor": {
        "VISITED": false,
        "country_name": null,
        "locality": null,
        "pic_link": null,
        "street_address": null
    },
    "user_rating": 4.0,
    "variance": {
        "average": 42,
        "excellent": 86,
        "poor": 30,
        "terrible": 13,
        "very good": 133
    }
}