{
    "aka": "Muang Samui Hotel Bophut",
    "description": null,
    "detail_rating": {
        "cleanliness": null,
        "location": null,
        "rooms": null,
        "service": null,
        "sleep": null,
        "value": null
    },
    "location": {
        "city": null,
        "continent": "Asia",
        "country": "Thailand",
        "proposed_city": null,
        "province": null,
        "region": null
    },
    "name": "Muang Samui Spa Resort",
    "places": {
        "aka": [],
        "hotel_description": [],
        "hotel_name": []
    },
    "review_count": 272,
    "review_count_current": 20,
    "reviews": [
        {
            "date": "April 20, 2008",
            "detail_rating": {
                "business": 3.0,
                "cleanliness": 4.0,
                "desk": null,
                "front_desk": 3.0,
                "location": 3.0,
                "pool": null,
                "restaurant": null,
                "rooms": 5.0,
                "service": 4.0,
                "sleep": null,
                "value": 5.0
            },
            "helpfulness": 1,
            "id": 15152622,
            "likes": {
                "disliked": "\u2014 no aircon at the lobby area, only one computer for internet access",
                "liked": "\u2014 The room with private outdoor spa"
            },
            "rating": 5.0,
            "stay_parameters": "Stayed April 2007, traveled as a couple",
            "text": "We stayed at Muang Samui easter 2007.",
            "title": "Would recommend Royal suite - even if not on honeymoon! :)",
            "user": "erwk05"
        },
        {
            "date": "March 30, 2008",
            "detail_rating": {
                "business": null,
                "cleanliness": null,
                "desk": null,
                "location": null,
                "pool": null,
                "restaurant": null,
                "rooms": null,
                "service": null,
                "sleep": null,
                "value": null
            },
            "helpfulness": 1,
            "id": 14657938,
            "likes": {
                "disliked": null,
                "liked": null
            },
            "rating": 5.0,
            "stay_parameters": null,
            "text": "unfortunately we came on the day of songkran - the people throwing water were camped outside the hotel all day and night. While we were waiting to be checked in we saw several couples all coming back to the hotel looking like drowned rats. So, thankfully we were booked into a Royal suite (as we found out - also termed honeymoon suite) as we pretty much spend 3 days straight within the hotel.",
            "title": "Fantastic staff making a fantastic holiday",
            "user": "DevonJet"
        },
        {
            "date": "March 12, 2008",
            "detail_rating": {
                "business": 3.0,
                "cleanliness": 4.0,
                "desk": null,
                "front_desk": 5.0,
                "location": 2.0,
                "pool": null,
                "restaurant": null,
                "rooms": 5.0,
                "service": 4.0,
                "sleep": null,
                "value": 3.0
            },
            "helpfulness": null,
            "id": 14249817,
            "likes": {
                "disliked": "\u2014 The disappointing beach",
                "liked": "\u2014 Our amazing Royal Suite"
            },
            "rating": 5.0,
            "stay_parameters": "Stayed March 2008, traveled as a couple",
            "text": "the room is absolutely beautiful. In the photos the royal suite looked wayyy nicer than the standard room for only $100au more a night.",
            "title": "One of the nicer Chaweng Beach options",
            "user": "amydownunder"
        },
        {
            "date": "February 17, 2008",
            "detail_rating": {
                "business": null,
                "cleanliness": 4.0,
                "desk": null,
                "front_desk": 4.0,
                "location": 4.0,
                "pool": null,
                "restaurant": null,
                "rooms": 5.0,
                "service": 4.0,
                "sleep": null,
                "value": 4.0
            },
            "helpfulness": 3,
            "id": 13613126,
            "likes": {
                "disliked": "\u2014 Bar tendeder service at the beach area",
                "liked": "\u2014 The rooms"
            },
            "rating": 4.0,
            "stay_parameters": "Stayed February 2008, traveled as a couple",
            "text": "The private deck with outdoor spa was awesome and very welcome at that time of year with the humidity. the room also had an indoor spa bath and wall-less shower. large dressing area and dresser. (see the photos/movie)",
            "title": "Lovely resort - needs to improve its attention to detai in its service",
            "user": "Dolce11"
        },
        {
            "date": "February 1, 2008",
            "detail_rating": {
                "business": 5.0,
                "cleanliness": 5.0,
                "desk": null,
                "front_desk": 5.0,
                "location": 5.0,
                "pool": null,
                "restaurant": null,
                "rooms": 5.0,
                "service": 4.0,
                "sleep": null,
                "value": 4.0
            },
            "helpfulness": 2,
            "id": 13162025,
            "likes": {
                "disliked": "\u2014 That i had to leave!",
                "liked": "\u2014 Authentic Thai Style, Wonderful Staff, Great Location"
            },
            "rating": 5.0,
            "stay_parameters": "Stayed October 2007, traveled as a couple",
            "text": "The restaurant across the street was very nice, the cocktails were even better (samui sunset I think the one I liked was called - served in a whole pineapple).",
            "title": "Honeymooners Dream!",
            "user": "daisygirl_79"
        },
        {
            "date": "January 31, 2008",
            "detail_rating": {
                "business": 5.0,
                "cleanliness": 5.0,
                "desk": null,
                "front_desk": 5.0,
                "location": 5.0,
                "pool": null,
                "restaurant": null,
                "rooms": 5.0,
                "service": 5.0,
                "sleep": null,
                "value": 5.0
            },
            "helpfulness": 2,
            "id": 13159486,
            "likes": {
                "disliked": "\u2014 That I need to go home again",
                "liked": "\u2014 The location, and the service by the beach staff"
            },
            "rating": 5.0,
            "stay_parameters": "Stayed June 2007, traveled as a couple",
            "text": "My fianc\u00e9 and I had our second stay at Muang Samui in June 2007 for 11 days. Our stay was perfect, and very relaxing after a week of sightseeing in Cambodia (Phon Pehn and Siem Reap). We were welcomed in the reception with cold towel and a coconut drink.",
            "title": "Wonderful hotel",
            "user": "Johnt35"
        },
        {
            "date": "January 20, 2008",
            "detail_rating": {
                "business": 2.0,
                "cleanliness": 5.0,
                "desk": null,
                "front_desk": 2.0,
                "location": 4.0,
                "pool": null,
                "restaurant": null,
                "rooms": 5.0,
                "service": 4.0,
                "sleep": null,
                "value": 4.0
            },
            "helpfulness": 2,
            "id": 12815569,
            "likes": {
                "disliked": "\u2014 Bar prices were a bit above average",
                "liked": "\u2014 Excellent rooms and privacy."
            },
            "rating": 5.0,
            "stay_parameters": "Stayed January 2008, traveled as a couple",
            "text": "We had a room with pool view at the ground floor. We could almost walk directly from our rooms into the pool. Which we could see, that our neighbor\u2019s three small girls really enjoyed, when we were sitting at our terrace. The room was decorated in Thai style and has a good size; also the bathroom was excellent with Jacuzzi for two and a really spacious shower. The room was very clean, not even dust under the bed. The room was quiet, and air-condition was working fine.",
            "title": "Excellent for honeymoon",
            "user": "public_identity"
        },
        {
            "date": "December 26, 2007",
            "detail_rating": {
                "business": null,
                "cleanliness": null,
                "desk": null,
                "location": null,
                "pool": null,
                "restaurant": null,
                "rooms": null,
                "service": null,
                "sleep": null,
                "value": null
            },
            "helpfulness": 5,
            "id": 11952853,
            "likes": {
                "disliked": null,
                "liked": null
            },
            "rating": 5.0,
            "stay_parameters": null,
            "text": "The pool is not big, but it never seems to be a problem, as only a few guests are using it at the same time. The breakfast is good, some hotels have a larger selection of food, but I find the selection and quality provided good, and it would cover everybody\u2019s taste and needs. The beach is wonderful for sunbathing, it\u00b4s very quiet, and it wonderful being there reading magazines or books.",
            "title": "The Most Amazing, Romantic Getaway....",
            "user": "Sofia70"
        },
        {
            "date": "December 11, 2007",
            "detail_rating": {
                "business": 5.0,
                "cleanliness": 5.0,
                "desk": null,
                "front_desk": 5.0,
                "location": 5.0,
                "pool": null,
                "restaurant": null,
                "rooms": 5.0,
                "service": 5.0,
                "sleep": null,
                "value": 5.0
            },
            "helpfulness": 4,
            "id": 11474079,
            "likes": {
                "disliked": "\u2014 The pool was a little shaded with trees but the beach makes up for it",
                "liked": "\u2014 The rooms and outdoor hottub"
            },
            "rating": 5.0,
            "stay_parameters": "Stayed November 2007, traveled as a couple",
            "text": "The service on the beach is perfect. The staffs help you with sun chairs and umbrellas, and come with water, shakes, drinks and food, as you order from your chair. Further do I like the possibility to buy a freshly printed Danish newspaper from the newspaper woman walking on the beach every morning. In the corner of the beach is there a small tent with the possibility to buy massage for up to 4 guests at the time, at a price of 300 bath. I\u00b4m unsure if this is part of the spa at the hotel, or they just have permission to be at the hotel beach. You need to walk a few minutes, if you want to go swimming at the beach. Personally I don\u00b4t see this a problem, as this is why the beach is so quiet and relaxing, and it\u00b4s almost the only exercise I get during my vacation.",
            "title": "Paradise",
            "user": "krusty6375"
        },
        {
            "date": "November 20, 2007",
            "detail_rating": {
                "business": 3.0,
                "cleanliness": 5.0,
                "desk": null,
                "front_desk": 3.0,
                "location": 4.0,
                "pool": null,
                "restaurant": null,
                "rooms": 5.0,
                "service": 4.0,
                "sleep": null,
                "value": 4.0
            },
            "helpfulness": null,
            "id": 10951141,
            "likes": {
                "disliked": "\u2014 Nothing really ... the daily workout in the gym ... too much exercise on a holiday!!",
                "liked": "\u2014 The relaxing atmosphere ... walks along the beach ... longing by the pool"
            },
            "rating": 5.0,
            "stay_parameters": "Stayed September 2007, traveled with friends",
            "text": "The spa at the hotel is good. I joined my fianc\u00e9 for two treatments, and it was wonderful and very relaxing. Of course it\u00b4s expensive, but I think the prices are about the same level as most other hotels I have stayed at.",
            "title": "Great place to stay ... very relaxing",
            "user": "ElthamBob"
        },
        {
            "date": "October 21, 2008",
            "detail_rating": {
                "business": 4.0,
                "cleanliness": 5.0,
                "desk": null,
                "front_desk": 5.0,
                "location": 4.0,
                "pool": null,
                "restaurant": null,
                "rooms": 5.0,
                "service": 4.0,
                "sleep": null,
                "value": 5.0
            },
            "helpfulness": null,
            "id": 21058452,
            "likes": {
                "disliked": "\u2014 Sea",
                "liked": "\u2014 Junior Suite, Spa"
            },
            "rating": 5.0,
            "stay_parameters": "Stayed August 2008, traveled as a couple",
            "text": "My boyfriend an I stayed at Muang Samui for 8 days in July/ August 2008. We really liked our room (Junior Suite), the staff was very kind and helpful (espessially at the Restaurant), we adored thw Rai Ra Spa, where we had 3 treatments and would definitelly go back!!!! The only disadvantage is that the property is small (but i think most Resorts in Samui are small) so if one stays longer than a week it could be boring. We liked the pool and we spent most of the time there since we didn' t like the sea.. The food at the Restaurant was absolutely perfect and the general atmosphere of the Hotel really romantic.....",
            "title": "Unforgettable Holidays",
            "user": "lovetripsAthens"
        },
        {
            "date": "September 13, 2008",
            "detail_rating": {
                "business": null,
                "cleanliness": 5.0,
                "desk": null,
                "front_desk": 5.0,
                "location": 5.0,
                "pool": null,
                "restaurant": null,
                "rooms": 5.0,
                "service": 5.0,
                "sleep": null,
                "value": 5.0
            },
            "helpfulness": 2,
            "id": 20039587,
            "likes": {
                "disliked": "\u2014 wifi didn't work inside the room...had to go to lobby for strong signal, but we were in a room furthest from lobby",
                "liked": "\u2014 staff and quality of everything on the premises"
            },
            "rating": 5.0,
            "stay_parameters": "Stayed May 2008, traveled as a couple",
            "text": "We stayed at Muang Samui for 7 nights in May. (We booked through agoda.com with no problems). Having done extensive research on the internet, we had high expectations of this place and we were not disappointed at all! The service was indeed first rate, from the check-in in the outdoor lobby, cleaning of the rooms, poolside food and drink service, breakfast staff, dinner on the beach, and help arranging activities- we were treated with Thai kindness and warmth at every step. The rooms are absolutely gorgeous and hugely spacious. The location was perfect IF you want to be on Chaweng Beach- it sits at the north end of the \"strip\" so you are close, and can walk everywhere on Chaweng, but never felt trapped in the middle of it all. In fact, when on the property itself, one forgets that the main street of Chaweng Beach is there at all. The breakfast buffet every morning was terrific, with so many choices I don't see how anyone could get tired of it or complain- everything was fresh and delicious. We had dinner on the beach at their restaurant twice, and yes it is a bit more expensive than alot of other restaurants on Samui, but not by alot, and the service and quality of food, and atmosphere at the edge of the water made it worth it.",
            "title": "Excellence in every way",
            "user": "boneplay"
        },
        {
            "date": "August 17, 2008",
            "detail_rating": {
                "business": null,
                "cleanliness": 3.0,
                "desk": null,
                "front_desk": 3.0,
                "location": 1.0,
                "pool": null,
                "restaurant": null,
                "rooms": 4.0,
                "service": 3.0,
                "sleep": null,
                "value": 2.0
            },
            "helpfulness": 2,
            "id": 19045189,
            "likes": {
                "disliked": "\u2014 Location",
                "liked": "\u2014 Room on second floor"
            },
            "rating": 2.0,
            "stay_parameters": "Stayed July 2008, traveled as a couple",
            "text": "The beach front itself is not the best place for swimming, but being at the north end there were very few hawkers, and noise at night from nearby bars was never a problem.",
            "title": "The rooms are beautiful, but the location and facilities are not 5*",
            "user": "Tipfromme"
        },
        {
            "date": "July 15, 2008",
            "detail_rating": {
                "business": 3.0,
                "cleanliness": 5.0,
                "desk": null,
                "front_desk": 4.0,
                "location": 5.0,
                "pool": null,
                "restaurant": null,
                "rooms": 5.0,
                "service": 5.0,
                "sleep": null,
                "value": 5.0
            },
            "helpfulness": 1,
            "id": 17899225,
            "likes": {
                "disliked": "\u2014 having to leave it and come home!!!",
                "liked": "\u2014 Everything - staff/food/location/accommodation....the list goes on!"
            },
            "rating": 5.0,
            "stay_parameters": "Stayed July 2008, traveled as a couple",
            "text": "There are less expensive places on Chaweng Beach but this place was quality through and through, and when compared to prices in the USA for this type of place, it is quite a bargain. We absolutely loved our stay at Muang Samui and would definitely consider it first when returning to Samui.",
            "title": "Muang - such a nice place...",
            "user": "Sharnii"
        },
        {
            "date": "May 26, 2008",
            "detail_rating": {
                "business": 3.0,
                "cleanliness": 5.0,
                "desk": null,
                "front_desk": 5.0,
                "location": 5.0,
                "pool": null,
                "restaurant": null,
                "rooms": 5.0,
                "service": 4.0,
                "sleep": null,
                "value": 5.0
            },
            "helpfulness": 3,
            "id": 16410720,
            "likes": {
                "disliked": "\u2014 service and internet access",
                "liked": "\u2014 swimming pool and the room"
            },
            "rating": 5.0,
            "stay_parameters": "Stayed May 2008, traveled as a couple",
            "text": "A lot of people have given this hotel top score. I have not, and I think that's because the hotel doesn't match with what I want from a perfect holiday on a tropical island.",
            "title": "Paradise Hotel!!!!",
            "user": "Glig"
        },
        {
            "date": "February 3, 2009",
            "detail_rating": {
                "business": 2.0,
                "cleanliness": 5.0,
                "desk": null,
                "front_desk": 4.0,
                "location": 5.0,
                "pool": null,
                "restaurant": null,
                "rooms": 5.0,
                "service": 5.0,
                "sleep": null,
                "value": 4.0
            },
            "helpfulness": null,
            "id": 24189822,
            "likes": {
                "disliked": "\u2014 Internet Charges",
                "liked": "\u2014 Standard of Room"
            },
            "rating": 5.0,
            "stay_parameters": "Stayed January 2009, traveled as a couple",
            "text": "Having read a number of reviews here we cjose this hotel on the basis of it's proximity to the town centre, beachside location, and it's potential to be a quiet relaxed retreat when we needed. Thankfully it filled all of these criteria perfectly with the added bonuses of an excellent spa, well appointed room and high quality seafood restaurant (over the road).",
            "title": "Just What We Wanted",
            "user": "HKPlum_Bum"
        },
        {
            "date": "January 30, 2009",
            "detail_rating": {
                "business": null,
                "cleanliness": null,
                "desk": null,
                "location": null,
                "pool": null,
                "restaurant": null,
                "rooms": null,
                "service": null,
                "sleep": null,
                "value": null
            },
            "helpfulness": 1,
            "id": 24024769,
            "likes": {
                "disliked": null,
                "liked": null
            },
            "rating": 4.0,
            "stay_parameters": null,
            "text": "Just to comment on some other points made in earlier reviews.....",
            "title": "Great looking resort but ...",
            "user": "Pochi99"
        },
        {
            "date": "January 14, 2009",
            "detail_rating": {
                "business": 5.0,
                "cleanliness": 5.0,
                "desk": null,
                "front_desk": 5.0,
                "location": 5.0,
                "pool": null,
                "restaurant": null,
                "rooms": 5.0,
                "service": 5.0,
                "sleep": null,
                "value": 5.0
            },
            "helpfulness": 1,
            "id": 23547131,
            "likes": {
                "disliked": null,
                "liked": "\u2014 The Room"
            },
            "rating": 5.0,
            "stay_parameters": "Stayed December 2008, traveled as a couple",
            "text": "Mosquitos - this is a tropical country - live with it.",
            "title": "AMAZING Hotel!",
            "user": "Jakino"
        },
        {
            "date": "December 23, 2008",
            "detail_rating": {
                "business": 4.0,
                "cleanliness": 2.0,
                "desk": null,
                "front_desk": 5.0,
                "location": 5.0,
                "pool": null,
                "restaurant": null,
                "rooms": 5.0,
                "service": 4.0,
                "sleep": null,
                "value": 5.0
            },
            "helpfulness": null,
            "id": 22936029,
            "likes": {
                "disliked": "\u2014 The small beach",
                "liked": "\u2014 The big room! and the Jacuzzi"
            },
            "rating": 5.0,
            "stay_parameters": "Stayed December 2008, traveled as a couple",
            "text": "Staff Language skills - If the people making this comment are all so multilinlingual themselves why don't they learn Thai?",
            "title": "Loved it!",
            "user": "Alan-Debbie2008"
        },
        {
            "date": "December 21, 2008",
            "detail_rating": {
                "business": 4.0,
                "cleanliness": 5.0,
                "desk": null,
                "front_desk": 5.0,
                "location": 5.0,
                "pool": null,
                "restaurant": null,
                "rooms": 5.0,
                "service": 5.0,
                "sleep": null,
                "value": 5.0
            },
            "helpfulness": null,
            "id": 22900208,
            "likes": {
                "disliked": "\u2014 Beach restuarant service at lunch.",
                "liked": "\u2014 Pool / Beach, Location, Quiet."
            },
            "rating": 5.0,
            "stay_parameters": "Stayed October 2008, traveled as a couple",
            "text": "Bathroom Door - Agree with an earlier comment that the see through part of the door may be a problem for a couple early on in their relationship (thankfully not a problem for us). Could suggest they fill the gap with wicker or raffia without losing the feel of the decor?",
            "title": "Great, relaxing stay.",
            "user": "Chuds"
        }
    ],
    "slim_ranking": 0.5,
    "stars": 5,
    "tripadvisor": {
        "VISITED": false,
        "country_name": null,
        "locality": null,
        "pic_link": null,
        "street_address": null
    },
    "user_rating": 4.0,
    "variance": {
        "average": 30,
        "excellent": 138,
        "poor": 12,
        "terrible": 13,
        "very good": 79
    }
}