{
    "aka": "Grange City London",
    "description": "The Grange City Hotel is a spectacular luxury 5 star hotel. Superbly located with unique panoramic views over the City and just a gemstone's throw away from the Tower of London, the Grange City represents a first for a hotel of this standard in the City.",
    "detail_rating": {
        "cleanliness": 4.5,
        "location": 4.5,
        "rooms": 4.0,
        "service": 4.0,
        "sleep": 4.0,
        "value": 4.0
    },
    "location": {
        "city": "London",
        "continent": "Europe",
        "country": "United Kingdom (UK)",
        "proposed_city": "London",
        "province": null,
        "region": null
    },
    "name": "Grange City Hotel",
    "places": {
        "aka": [
            "London"
        ],
        "hotel_description": [
            "London"
        ],
        "hotel_name": []
    },
    "review_count": 1199,
    "review_count_current": 40,
    "reviews": [
        {
            "date": "December 28, 2011",
            "detail_rating": {
                "business": null,
                "cleanliness": 5.0,
                "desk": null,
                "location": 5.0,
                "pool": null,
                "restaurant": null,
                "rooms": 5.0,
                "service": 5.0,
                "sleep": 5.0,
                "value": 5.0
            },
            "helpfulness": null,
            "id": 122189869,
            "likes": {
                "disliked": null,
                "liked": null
            },
            "rating": 5.0,
            "stay_parameters": "Stayed December 2011, traveled with family",
            "text": "1st Visit to hotel, stayed for two nights after boxing day, Hotel is very conveniently located, just two minutes from Towerhill tube station and 1 minute from Fenchurch Street Railway Station. On arrival reception staff was very helpful, and welcoming. Room was beautiful and very well furnished. We asked if we could extend our stay at the same rate, receptionist spoke to manager and immediately agreed even after the offer was no longer available. Breakfast was excellent. Overall hotel is very well staffed and not that expensive considering the location.",
            "title": "Great Location, Excellent service.",
            "user": "Jeff_Bath_uk"
        },
        {
            "date": "December 27, 2011",
            "detail_rating": {
                "business": null,
                "cleanliness": 5.0,
                "desk": null,
                "location": 4.0,
                "pool": null,
                "restaurant": null,
                "rooms": 3.0,
                "service": 3.0,
                "sleep": 4.0,
                "value": 3.0
            },
            "helpfulness": null,
            "id": 122146601,
            "likes": {
                "disliked": null,
                "liked": null
            },
            "rating": 4.0,
            "stay_parameters": "Stayed December 2011, traveled with friends",
            "text": "In this hotel you wouldn't think you were in England - every single member of staff is foreign! A shame I think.",
            "title": "Nice hotel but not a British member of staff in evidence anywhere!",
            "user": "PaulaViv"
        },
        {
            "date": "December 26, 2011",
            "detail_rating": {
                "business": null,
                "cleanliness": 5.0,
                "desk": null,
                "location": 5.0,
                "pool": null,
                "restaurant": null,
                "rooms": 5.0,
                "service": 5.0,
                "sleep": null,
                "value": 5.0
            },
            "helpfulness": null,
            "id": 122117089,
            "likes": {
                "disliked": null,
                "liked": null
            },
            "rating": 5.0,
            "stay_parameters": "Stayed December 2011",
            "text": "The information on the in-house TV screen was in incorrect English - they obviously couldn't even find a Brit to do that!!",
            "title": "A very nice Xmas stay",
            "user": "MrMmrsM"
        },
        {
            "date": "December 25, 2011",
            "detail_rating": {
                "business": null,
                "cleanliness": 5.0,
                "desk": null,
                "location": 5.0,
                "pool": null,
                "restaurant": null,
                "rooms": 5.0,
                "service": 5.0,
                "sleep": 4.0,
                "value": 5.0
            },
            "helpfulness": null,
            "id": 122079103,
            "likes": {
                "disliked": null,
                "liked": null
            },
            "rating": 5.0,
            "stay_parameters": "Stayed December 2011, traveled with family",
            "text": "2nd visit to hotel. stayed Xmas day and got a room upgrade. very nice room, lots of space. Big bed but the mattres was a little hard for our liking. Could see tower bridge (just) from our window. staff very helpfull. hotel bar good and not that expensive considering the location.",
            "title": "good night's stay",
            "user": "Barganax"
        },
        {
            "date": "December 24, 2011",
            "detail_rating": {
                "business": null,
                "cleanliness": 4.0,
                "desk": null,
                "location": 5.0,
                "pool": null,
                "restaurant": null,
                "rooms": 4.0,
                "service": 4.0,
                "sleep": 5.0,
                "value": 4.0
            },
            "helpfulness": null,
            "id": 122059730,
            "likes": {
                "disliked": null,
                "liked": null
            },
            "rating": 4.0,
            "stay_parameters": "Stayed December 2011, traveled solo",
            "text": "very close to DLR and tube station. also within a short walk of tower bridge and the tower of London. Would recommend",
            "title": "Enjoyable Stay",
            "user": "Frank S"
        },
        {
            "date": "January 6, 2012",
            "detail_rating": {
                "business": null,
                "cleanliness": 3.0,
                "desk": null,
                "location": 4.0,
                "pool": null,
                "restaurant": null,
                "rooms": 3.0,
                "service": 2.0,
                "sleep": 3.0,
                "value": 3.0
            },
            "helpfulness": 1,
            "id": 122656922,
            "likes": {
                "disliked": null,
                "liked": null
            },
            "rating": 3.0,
            "stay_parameters": "Stayed January 2012, traveled as a couple",
            "text": "I stayed here recently for my birthday, on a \"Romance Package\" booked by my boyfriend. I also recently stayed in the 5 star Corinthia hotel, so was expecting pretty much the same standard - how wrong was I!",
            "title": "Nowhere near a 5 star hotel",
            "user": "Beckiboo1983"
        },
        {
            "date": "January 6, 2012",
            "detail_rating": {
                "business": null,
                "cleanliness": 4.0,
                "desk": null,
                "location": 5.0,
                "pool": null,
                "restaurant": null,
                "rooms": 4.0,
                "service": 4.0,
                "sleep": null,
                "value": 5.0
            },
            "helpfulness": null,
            "id": 122644852,
            "likes": {
                "disliked": null,
                "liked": null
            },
            "rating": 4.0,
            "stay_parameters": "Stayed January 2012",
            "text": "The hotel is quite dated and has tired furniture. Our room was pleasant enough - we got upgraded to an executive room which had a view of the Tower of London, albeit an obscured one due to the office block next door. The room was large, as was the bed. However the furnishings were very old - the telephones looked like they were bought in 1985, and the overall decor of the room was not very modern. I didn't mind this too much as sometimes the most modern rooms arent necessarily the best.",
            "title": "Very nIce stay. Value for money.",
            "user": "JBlinderman"
        },
        {
            "date": "January 2, 2012",
            "detail_rating": {
                "business": null,
                "cleanliness": 4.0,
                "desk": null,
                "location": 3.0,
                "pool": null,
                "restaurant": null,
                "rooms": 1.0,
                "service": 3.0,
                "sleep": 1.0,
                "value": 2.0
            },
            "helpfulness": 4,
            "id": 122396301,
            "likes": {
                "disliked": null,
                "liked": null
            },
            "rating": 1.0,
            "stay_parameters": "Stayed December 2011, traveled as a couple",
            "text": "The spa was quite nice, a Roman theme with a large pool great for swimming and small-ish steam/sauna rooms etc. I had a massage which was passable, although the masseuse was very friendly.",
            "title": "Be VERY careful booking this hotel",
            "user": "auditt225"
        },
        {
            "date": "January 1, 2012",
            "detail_rating": {
                "business": null,
                "cleanliness": 5.0,
                "desk": null,
                "location": 5.0,
                "pool": null,
                "restaurant": null,
                "rooms": 5.0,
                "service": 5.0,
                "sleep": 5.0,
                "value": 5.0
            },
            "helpfulness": null,
            "id": 122369682,
            "likes": {
                "disliked": null,
                "liked": null
            },
            "rating": 5.0,
            "stay_parameters": "Stayed November 2011, traveled as a couple",
            "text": "Our package included dinner in the restaurant. I know we went in Jan 2012 but this huge restaurant was absolutely deserted. The food was nice, but the service was terrible. Upon arrival we were asked if we wanted a bottle of water, yes we said - and 30mins later we were still waiting for it, gasping of thirst. Our bottle of wine after 40mins, and the starters about 50mins. Nearly an hour to wait for your wine and starter - not good.",
            "title": "Excellent",
            "user": "21and"
        },
        {
            "date": "December 30, 2011",
            "detail_rating": {
                "business": null,
                "cleanliness": 4.0,
                "desk": null,
                "location": 3.0,
                "pool": null,
                "restaurant": null,
                "rooms": 4.0,
                "service": 2.0,
                "sleep": null,
                "value": 2.0
            },
            "helpfulness": 1,
            "id": 122298681,
            "likes": {
                "disliked": null,
                "liked": null
            },
            "rating": 3.0,
            "stay_parameters": "Stayed December 2011",
            "text": "The breakfast was passable, again, nothing 5* about this for me. It was bog standard English breakfast made from bog standard quality food. I was still eating and had put my knife and fork down on my plate (apart), when a waiter proceeded to swipe it from underneath me! I had to explain I was still eating - this is simple table etiquette - you would think a waiter in a 5* hotel would understand a guest has not finished if her cutlery is sitting apart on her plate. Again - I kept comparing this with previous hotels. It just seems that the staff here do not have a clue.",
            "title": "\u00a328 for two Gin & Tonics and a closed Sushi Restaurant.",
            "user": "Lawyer11"
        },
        {
            "date": "May 4, 2013",
            "detail_rating": {
                "business": null,
                "cleanliness": 4.0,
                "desk": null,
                "location": 5.0,
                "pool": null,
                "restaurant": null,
                "rooms": 3.0,
                "service": 3.0,
                "sleep": 3.0,
                "value": 3.0
            },
            "helpfulness": null,
            "id": 159626876,
            "likes": {
                "disliked": null,
                "liked": null
            },
            "rating": 3.0,
            "stay_parameters": "Stayed April 2013, traveled on business",
            "text": "I have multiple stays at the Grange as it is located close to our office in London. This time I stayed 4 nights, including the weekend with my wife. It always takes some time to check in, but the receptionists were friendly and polite. But unfortunately I automatically answered yes when they asked if I had stayed with them before - and then you always get a much worse room than those who stay for the first time, All my colleagues and friends that have stayed at the Grange have experienced the same - a lovely room with a nice view the first stay, and then it goes down in standard.... This time I got a terrible half part of a syndicate room with a 1 meter view into a wall; I even heard everything that was said in the other part of the syndicate room - not very private.",
            "title": "Good location by the Tower, but rooms and service varies a lot",
            "user": "Anders G"
        },
        {
            "date": "May 2, 2013",
            "detail_rating": {
                "business": null,
                "cleanliness": 3.0,
                "desk": null,
                "location": 5.0,
                "pool": null,
                "restaurant": null,
                "rooms": 5.0,
                "service": 1.0,
                "sleep": 4.0,
                "value": 1.0
            },
            "helpfulness": 1,
            "id": 159413815,
            "likes": {
                "disliked": null,
                "liked": null
            },
            "rating": 2.0,
            "stay_parameters": "Stayed May 2013, traveled as a couple",
            "text": "I asked for a better room for the last two nights when my wife arrived to stay for the first time - and then I got a very nice room on 6th floor with a beautiful view of Tower of London and Tower Bridge. These rooms have a nice lounge, but extremely small bathrooms.",
            "title": "The rudest staff I've even seen",
            "user": "Jack C"
        },
        {
            "date": "May 1, 2013",
            "detail_rating": {
                "business": null,
                "cleanliness": 4.0,
                "desk": null,
                "location": 5.0,
                "pool": null,
                "restaurant": null,
                "rooms": 5.0,
                "service": 5.0,
                "sleep": 4.0,
                "value": 4.0
            },
            "helpfulness": null,
            "id": 159380538,
            "likes": {
                "disliked": null,
                "liked": null
            },
            "rating": 5.0,
            "stay_parameters": "Stayed August 2012, traveled as a couple",
            "text": "The breakfast is average, with the option to get an omelet or fried egg at you own choice on weekdays. I was surprised to see that this option disappeared during weekends - why? It is at weekends you have time to enjoy a longer breakfast. The fresh fruit is very limited and not very exciting. The bacon must have been micro waved - unfortunately not very crispy or deliciously served.",
            "title": "Lovely Place, A Little Disappointed Though",
            "user": "Stacy L"
        },
        {
            "date": "April 30, 2013",
            "detail_rating": {
                "business": null,
                "cleanliness": 5.0,
                "desk": null,
                "location": 5.0,
                "pool": null,
                "restaurant": null,
                "rooms": 5.0,
                "service": 4.0,
                "sleep": 5.0,
                "value": 5.0
            },
            "helpfulness": null,
            "id": 159235270,
            "likes": {
                "disliked": null,
                "liked": null
            },
            "rating": 5.0,
            "stay_parameters": "Stayed April 2013, traveled with family",
            "text": "The concierge staff wes very friendly and took good care of us as always!",
            "title": "excellent location, quality hotel",
            "user": "Zanzibardreams"
        },
        {
            "date": "April 29, 2013",
            "detail_rating": {
                "business": null,
                "cleanliness": 5.0,
                "desk": null,
                "location": 4.0,
                "pool": null,
                "restaurant": null,
                "rooms": 5.0,
                "service": 4.0,
                "sleep": 5.0,
                "value": 5.0
            },
            "helpfulness": null,
            "id": 159167436,
            "likes": {
                "disliked": null,
                "liked": null
            },
            "rating": 5.0,
            "stay_parameters": "Stayed December 2012, traveled as a couple",
            "text": "To conclude - a nice location at the edge of City, good potential with some very nice room that might be available to you if you ask for it or claim that it is your first stay. A little too pricy with regards to \"value for money\". Will return, but will remember to inform that it is my first time at the Grange!",
            "title": "a beautiful hotel, good location",
            "user": "LauraScarborough92"
        },
        {
            "date": "May 8, 2013",
            "detail_rating": {
                "business": null,
                "cleanliness": 5.0,
                "desk": null,
                "location": 5.0,
                "pool": null,
                "restaurant": null,
                "rooms": 4.0,
                "service": 5.0,
                "sleep": 4.0,
                "value": 5.0
            },
            "helpfulness": 1,
            "id": 160041649,
            "likes": {
                "disliked": null,
                "liked": null
            },
            "rating": 5.0,
            "stay_parameters": "Stayed May 2013, traveled as a couple",
            "text": "Overall, very good hotel. Very good location, 2 min from the tube station, taxis are just outside.",
            "title": "One night stay",
            "user": "nikmpz"
        },
        {
            "date": "May 7, 2013",
            "detail_rating": {
                "business": null,
                "cleanliness": 5.0,
                "desk": null,
                "location": 5.0,
                "pool": null,
                "restaurant": null,
                "rooms": 5.0,
                "service": 4.0,
                "sleep": null,
                "value": 4.0
            },
            "helpfulness": null,
            "id": 159961576,
            "likes": {
                "disliked": null,
                "liked": null
            },
            "rating": 4.0,
            "stay_parameters": "Stayed May 2013",
            "text": "Swimming pool have lanes, and it was quite cold. Jacuzzi was cold, but good steam room and saunas. There is small good gym, restaurants in the hotel.",
            "title": "30th birthday stay",
            "user": "L0ndonChap"
        },
        {
            "date": "May 7, 2013",
            "detail_rating": {
                "business": null,
                "cleanliness": 5.0,
                "desk": null,
                "location": 5.0,
                "pool": null,
                "restaurant": null,
                "rooms": 5.0,
                "service": 5.0,
                "sleep": 5.0,
                "value": 5.0
            },
            "helpfulness": null,
            "id": 159919372,
            "likes": {
                "disliked": null,
                "liked": null
            },
            "rating": 4.0,
            "stay_parameters": "Stayed May 2013, traveled with friends",
            "text": "My wife and I stayed at the hotel for the first time for my 30th birthday. Although we only stayed for one night, it was conveniently located to Tower Hill tube and to some nearby attractions (albeit that we both work within 5 minutes of the Hotel and knew this beforehand!).",
            "title": "lovely hotel",
            "user": "southbankelgin"
        },
        {
            "date": "May 6, 2013",
            "detail_rating": {
                "business": null,
                "cleanliness": null,
                "desk": null,
                "location": null,
                "pool": null,
                "restaurant": null,
                "rooms": null,
                "service": null,
                "sleep": null,
                "value": null
            },
            "helpfulness": null,
            "id": 159839373,
            "likes": {
                "disliked": null,
                "liked": null
            },
            "rating": 4.0,
            "stay_parameters": null,
            "text": "The Hotel was elegant and didn't appear to be particularly busy. Although the Hotel did not make our stay special (eg complimentary drinks/sparkling wine etc), we did enjoy a sizeable room on the 8th floor with a view of some landmarks on the River.",
            "title": "K. Mitchell",
            "user": "Kathleen M"
        },
        {
            "date": "May 5, 2013",
            "detail_rating": {
                "business": null,
                "cleanliness": 4.0,
                "desk": null,
                "location": 5.0,
                "pool": null,
                "restaurant": null,
                "rooms": 5.0,
                "service": 4.0,
                "sleep": 4.0,
                "value": 4.0
            },
            "helpfulness": null,
            "id": 159697859,
            "likes": {
                "disliked": null,
                "liked": null
            },
            "rating": 4.0,
            "stay_parameters": "Stayed May 2013, traveled as a couple",
            "text": "Although the continental breakfast was pricey (\u00a322pp - though the room service menu looked reasonable), we did get a free Independent paper and made use of the efficient bellboy service to store our bag whilst we went sightseeing for the day.",
            "title": "Room upgraded on arrival, really nice stay throughout",
            "user": "David E"
        },
        {
            "date": "December 14, 2011",
            "detail_rating": {
                "business": null,
                "cleanliness": 2.0,
                "desk": null,
                "location": 4.0,
                "pool": null,
                "restaurant": null,
                "rooms": 3.0,
                "service": 3.0,
                "sleep": 1.0,
                "value": 3.0
            },
            "helpfulness": 1,
            "id": 121747240,
            "likes": {
                "disliked": null,
                "liked": null
            },
            "rating": 2.0,
            "stay_parameters": "Stayed December 2011, traveled on business",
            "text": "This hotel should have been really nice. Nicely decorated, great location and pleasant staff. Instead I had a horrible night.",
            "title": "Oh dear",
            "user": "Mervyn X"
        },
        {
            "date": "December 14, 2011",
            "detail_rating": {
                "business": null,
                "cleanliness": 4.0,
                "desk": null,
                "location": 4.0,
                "pool": null,
                "restaurant": null,
                "rooms": 4.0,
                "service": 4.0,
                "sleep": 4.0,
                "value": 4.0
            },
            "helpfulness": 1,
            "id": 121721848,
            "likes": {
                "disliked": null,
                "liked": null
            },
            "rating": 4.0,
            "stay_parameters": "Stayed December 2011, traveled as a couple",
            "text": "Upon arrival I was told I had received an upgrade to an executive room free of charge. Not a bad start I thought. So off I went to the annex and found room 110. Hardly executive. It was nicely furnished but the bed was very unusual to say the least. I seemed to have been pulled down from the wall. A kind of a \" put you up \" affair only a little more substantial, or so I thought.",
            "title": "Great location, service and view",
            "user": "RusticExplorers"
        },
        {
            "date": "December 13, 2011",
            "detail_rating": {
                "business": null,
                "cleanliness": 5.0,
                "desk": null,
                "location": 5.0,
                "pool": null,
                "restaurant": null,
                "rooms": 5.0,
                "service": 5.0,
                "sleep": 3.0,
                "value": 5.0
            },
            "helpfulness": null,
            "id": 121707857,
            "likes": {
                "disliked": null,
                "liked": null
            },
            "rating": 5.0,
            "stay_parameters": "Stayed December 2011, traveled as a couple",
            "text": "The internal walls were a weird kind of partition set up and the bathroom was tired.",
            "title": "Stunning!!",
            "user": "buttonsbabe86"
        },
        {
            "date": "December 12, 2011",
            "detail_rating": {
                "business": null,
                "cleanliness": 4.0,
                "desk": null,
                "location": 4.0,
                "pool": null,
                "restaurant": null,
                "rooms": 4.0,
                "service": 1.0,
                "sleep": 4.0,
                "value": 4.0
            },
            "helpfulness": null,
            "id": 121648445,
            "likes": {
                "disliked": null,
                "liked": null
            },
            "rating": 2.0,
            "stay_parameters": "Stayed December 2011, traveled as a couple",
            "text": "Anyway, I retired to bed and was comfortable enough, until around 4am the matress and",
            "title": "Walking into another couples bedroom was interesting",
            "user": "jean m"
        },
        {
            "date": "December 11, 2011",
            "detail_rating": {
                "business": null,
                "cleanliness": 4.0,
                "desk": null,
                "location": 5.0,
                "pool": null,
                "restaurant": null,
                "rooms": 4.0,
                "service": 5.0,
                "sleep": 4.0,
                "value": 4.0
            },
            "helpfulness": 1,
            "id": 121637518,
            "likes": {
                "disliked": null,
                "liked": null
            },
            "rating": 4.0,
            "stay_parameters": "Stayed December 2011, traveled as a couple",
            "text": "I began to fall through a gap in the wooden slats. I sank and sank and sank. It was one of those sleepy moments went I thought to myself, this is a weird dream I'm having.",
            "title": "Great location. Great hotel",
            "user": "TraceyC2504"
        },
        {
            "date": "May 17, 2013",
            "detail_rating": {
                "business": null,
                "cleanliness": 5.0,
                "desk": null,
                "location": 5.0,
                "pool": null,
                "restaurant": null,
                "rooms": 5.0,
                "service": 5.0,
                "sleep": 5.0,
                "value": 5.0
            },
            "helpfulness": 1,
            "id": 160978710,
            "likes": {
                "disliked": null,
                "liked": null
            },
            "rating": 5.0,
            "stay_parameters": "Stayed May 2013, traveled on business",
            "text": "I stayed at the Grage City London hotel for one night while down in London on business. Checking in at 8pm after a long day at work was easy and pleasant, and my room on the 2nd floor was large, clean and very comfortable. Although my room window was around 50 yards from an overground train line I heard no noise during the night. Room service was delivered within 20 minutes and was delicious and reasonably priced from a modest menu. Free wi-fi was a nice bonus, and the satellite tv channels included Sky Sports - a rare treat! Checkout was handled with minimum fuss and all staff I met throughout my short stay were very courteous and professional.",
            "title": "Large rooms, pleasant service",
            "user": "Tarff"
        },
        {
            "date": "May 15, 2013",
            "detail_rating": {
                "business": null,
                "cleanliness": 4.0,
                "desk": null,
                "location": 5.0,
                "pool": null,
                "restaurant": null,
                "rooms": 4.0,
                "service": 4.0,
                "sleep": 4.0,
                "value": 4.0
            },
            "helpfulness": null,
            "id": 160825925,
            "likes": {
                "disliked": null,
                "liked": null
            },
            "rating": 4.0,
            "stay_parameters": "Stayed May 2013, traveled with friends",
            "text": "The hotel was in a fantastic location - 3 minutes walk from Tower Gateway DLR station and minutes from both Tower Bridge and the Tower of London.",
            "title": "Everything you need for a city break",
            "user": "rhian106"
        },
        {
            "date": "May 15, 2013",
            "detail_rating": {
                "business": null,
                "cleanliness": null,
                "desk": null,
                "location": null,
                "pool": null,
                "restaurant": null,
                "rooms": null,
                "service": null,
                "sleep": null,
                "value": null
            },
            "helpfulness": null,
            "id": 160796730,
            "likes": {
                "disliked": null,
                "liked": null
            },
            "rating": 4.0,
            "stay_parameters": null,
            "text": "I have stayed at a number of hotels during business trips to London and the Grange City is - so far- the best. I'd put it just above the Crowne Plaza.",
            "title": "Great location",
            "user": "staceywoo"
        },
        {
            "date": "May 15, 2013",
            "detail_rating": {
                "business": null,
                "cleanliness": 4.0,
                "desk": null,
                "location": 5.0,
                "pool": null,
                "restaurant": null,
                "rooms": 3.0,
                "service": 4.0,
                "sleep": 4.0,
                "value": 3.0
            },
            "helpfulness": null,
            "id": 160762677,
            "likes": {
                "disliked": null,
                "liked": null
            },
            "rating": 3.0,
            "stay_parameters": "Stayed May 2013, traveled as a couple",
            "text": "Stayed for a long weekend it is idealy situated opposite Tower of London next to tube station a couple of reasonably priced eateries walking distance.",
            "title": "Between Average and Good.",
            "user": "RichClarkImages"
        },
        {
            "date": "May 8, 2013",
            "detail_rating": {
                "business": null,
                "cleanliness": 4.0,
                "desk": null,
                "location": 5.0,
                "pool": null,
                "restaurant": null,
                "rooms": 4.0,
                "service": 5.0,
                "sleep": null,
                "value": 4.0
            },
            "helpfulness": null,
            "id": 160055491,
            "likes": {
                "disliked": null,
                "liked": null
            },
            "rating": 4.0,
            "stay_parameters": "Stayed May 2013",
            "text": "Long queue at check inn on of the check in staff chose to ignore us we were passed over for wealthy looking clients. We were wearing trainers and carrying rucksacks we knew that we would be doing a lot of walking and preferred comfort. Eventually a nice male receptionist took pity on us and checked us in to an upgraded room with view of the Tower and Bridge.",
            "title": "Our second visit and still the same excellence",
            "user": "jamesmason885111"
        },
        {
            "date": "December 23, 2011",
            "detail_rating": {
                "business": null,
                "cleanliness": 5.0,
                "desk": null,
                "location": 5.0,
                "pool": null,
                "restaurant": null,
                "rooms": 5.0,
                "service": 5.0,
                "sleep": 5.0,
                "value": 4.0
            },
            "helpfulness": null,
            "id": 122020699,
            "likes": {
                "disliked": null,
                "liked": null
            },
            "rating": 5.0,
            "stay_parameters": "Stayed December 2011, traveled as a couple",
            "text": "Stayed here earlier in the year and was disappointed as a hen party on the same floor totally rui9ned the trip. Not the hotels fault and so after some negotiation revisited with an upgrade. The hotel excelled themselves. Service / check-in / reception were all first class. Food at the restaurant was superb and not overpriced. Well done Grange !",
            "title": "Redeemed themselves !",
            "user": "Phil A"
        },
        {
            "date": "December 22, 2011",
            "detail_rating": {
                "business": null,
                "cleanliness": 4.0,
                "desk": null,
                "location": 4.0,
                "pool": null,
                "restaurant": null,
                "rooms": 4.0,
                "service": 2.0,
                "sleep": 4.0,
                "value": 2.0
            },
            "helpfulness": 1,
            "id": 121976185,
            "likes": {
                "disliked": null,
                "liked": null
            },
            "rating": 2.0,
            "stay_parameters": "Stayed December 2011, traveled as a couple",
            "text": "The room was modern and spacious, the rate (through lastminute.com) was good - but the breakfast was dreadful! The buffet offered a desultory array with nothing cooked in front of you, so, for example, the fried eggs and scrambled eggs in the chafing dish looked tired, and the fruit juices didn't taste as though they'd seen fresh fruit in a long while. The price: a startling \u00a323 whether you wanted just tea, toast and marmalade or something passing for a full breakfast, For a five-star hotel, this was the worst breakfast I've come across. A convenient hotel for the City - but skip the breakfast.",
            "title": "Skip the breakfast",
            "user": "horseman29"
        },
        {
            "date": "December 20, 2011",
            "detail_rating": {
                "business": null,
                "cleanliness": 4.0,
                "desk": null,
                "location": 4.0,
                "pool": null,
                "restaurant": null,
                "rooms": 3.0,
                "service": 3.0,
                "sleep": 4.0,
                "value": 3.0
            },
            "helpfulness": 1,
            "id": 121919932,
            "likes": {
                "disliked": null,
                "liked": null
            },
            "rating": 3.0,
            "stay_parameters": "Stayed November 2011, traveled as a couple",
            "text": "Stayed at the Grange City Hotel as part of a weekend in London with my girlfriend. We originally booked a double room which was (i think called a superior). Trust me nothing about this room was superior - now you could blame me for booking one of the more basic rooms however when you consider this is a 5 star hotel in central London you would think that even the most basic room would be alright.",
            "title": "Bog Standard",
            "user": "Spartak A"
        },
        {
            "date": "December 19, 2011",
            "detail_rating": {
                "business": null,
                "cleanliness": 4.0,
                "desk": null,
                "location": 4.0,
                "pool": null,
                "restaurant": null,
                "rooms": 2.0,
                "service": 4.0,
                "sleep": 3.0,
                "value": 4.0
            },
            "helpfulness": null,
            "id": 121891089,
            "likes": {
                "disliked": null,
                "liked": null
            },
            "rating": 3.0,
            "stay_parameters": "Stayed December 2011, traveled as a couple",
            "text": "I'm going to be harsh to the hotel, but what i will say is that you don't want any of the basic double rooms. If you're going to go there, book one the larger better rooms (we got upgraded) which are far nicer.",
            "title": "nice but not sure what makes it a 5*",
            "user": "JoMark79"
        },
        {
            "date": "December 16, 2011",
            "detail_rating": {
                "business": null,
                "cleanliness": 5.0,
                "desk": null,
                "location": 4.0,
                "pool": null,
                "restaurant": null,
                "rooms": 3.0,
                "service": 5.0,
                "sleep": 2.0,
                "value": 1.0
            },
            "helpfulness": null,
            "id": 121787631,
            "likes": {
                "disliked": null,
                "liked": null
            },
            "rating": 3.0,
            "stay_parameters": "Stayed December 2011, traveled on business",
            "text": "The accommodation was fine, clean, tidy - but small. The facilities were good but not sure what differentiates a 5* from a 4*. View of office block even though documentation promised a great view - to be fair we could just see the gherkin over the office block. Breakfast seemed to have a very limited selection. No English! The location of the hotel was excellent.",
            "title": "underwhelmed",
            "user": "IRBaboonLondon"
        },
        {
            "date": "April 22, 2013",
            "detail_rating": {
                "business": null,
                "cleanliness": 5.0,
                "desk": null,
                "location": 5.0,
                "pool": null,
                "restaurant": null,
                "rooms": 5.0,
                "service": 4.0,
                "sleep": 5.0,
                "value": 4.0
            },
            "helpfulness": null,
            "id": 158507890,
            "likes": {
                "disliked": null,
                "liked": null
            },
            "rating": 4.0,
            "stay_parameters": "Stayed April 2013, traveled as a couple",
            "text": "A luxurious hotel very near Tower Bridge (which was handy as we were attending a wedding there). Very well appointed room, super comfy bed, two small sofas & coffee table, handy for eating our room service snacks. The pool and sauna were lovely, but disappointed the steam room was out of service. My partner used the gym, which was well equipped. We did have to ask house keeping for our robes, slippers & complementary water, which should have been in the room of a 5 star expensive hotel!",
            "title": "Lovely hotel, great location",
            "user": "Maggie_May09London"
        },
        {
            "date": "April 22, 2013",
            "detail_rating": {
                "business": null,
                "cleanliness": 4.0,
                "desk": null,
                "location": 4.0,
                "pool": null,
                "restaurant": null,
                "rooms": 2.0,
                "service": 3.0,
                "sleep": 4.0,
                "value": 2.0
            },
            "helpfulness": null,
            "id": 158498888,
            "likes": {
                "disliked": null,
                "liked": null
            },
            "rating": 4.0,
            "stay_parameters": "Stayed April 2013, traveled with family",
            "text": "We didn't bother with breakfast at \u00a326 per person.",
            "title": "not too bad but had better",
            "user": "lindseylou72"
        },
        {
            "date": "April 20, 2013",
            "detail_rating": {
                "business": null,
                "cleanliness": 5.0,
                "desk": null,
                "location": 4.0,
                "pool": null,
                "restaurant": null,
                "rooms": 2.0,
                "service": 2.0,
                "sleep": 5.0,
                "value": 2.0
            },
            "helpfulness": 1,
            "id": 158322679,
            "likes": {
                "disliked": null,
                "liked": null
            },
            "rating": 3.0,
            "stay_parameters": "Stayed April 2013, traveled with friends",
            "text": "God hotel, nicely situated but I expected more for the money. Has a pool and spa but didn't get chance to use them. Bar is nice but service was quite rubbish, empty glasses and not asked if we wanted more. My room was tiny, hardly any space compared to staying at the premier inn round the corner for half the price and that room was huge!!! Staff were polite but certainly didn't put themselves out and I found them quite stern and unhelpful with an issue I had. I would stay here again but only if it was on offer and there was no where else available.",
            "title": "Disappointed",
            "user": "598karenq"
        },
        {
            "date": "April 20, 2013",
            "detail_rating": {
                "business": null,
                "cleanliness": 5.0,
                "desk": null,
                "location": 5.0,
                "pool": null,
                "restaurant": null,
                "rooms": 5.0,
                "service": 5.0,
                "sleep": 5.0,
                "value": 5.0
            },
            "helpfulness": null,
            "id": 158312040,
            "likes": {
                "disliked": null,
                "liked": null
            },
            "rating": 5.0,
            "stay_parameters": "Stayed April 2013, traveled as a couple",
            "text": "Disappointed with this hotel. they said our room was an upgrade, the room was nice not but the view was terrible . We looked out over the hotel and fenchurch st station, which when there were announcement could be heard .",
            "title": "Would definitely book again",
            "user": "Zakkido"
        },
        {
            "date": "April 18, 2013",
            "detail_rating": {
                "business": null,
                "cleanliness": 5.0,
                "desk": null,
                "location": 5.0,
                "pool": null,
                "restaurant": null,
                "rooms": 4.0,
                "service": 5.0,
                "sleep": null,
                "value": 5.0
            },
            "helpfulness": null,
            "id": 158091865,
            "likes": {
                "disliked": null,
                "liked": null
            },
            "rating": 4.0,
            "stay_parameters": "Stayed January 2013",
            "text": "On check in I was not asked for a copy of my credit card. This led to a number of problems. One ended with us getting a call when in bed after midnight asking us to come backdown and pay our meal bill. Their mistake as we had paid our bar bill and were led to believe it was on the room bill. They then came to the room twice as they made a mistake the first, but they could not wait till the morning.",
            "title": "Perfect London exploring base.",
            "user": "KbPjc"
        }
    ],
    "slim_ranking": 0.28717472119,
    "stars": 5,
    "tripadvisor": {
        "VISITED": false,
        "country_name": null,
        "locality": null,
        "pic_link": null,
        "street_address": null
    },
    "user_rating": 4.0,
    "variance": {
        "average": 195,
        "excellent": 436,
        "poor": 87,
        "terrible": 54,
        "very good": 427
    }
}