{
    "aka": "Aloft London Excel Hotel London",
    "description": "The only hotel directly connected to ExCel London International Convention Centre (ICC), Aloft London ExCel features 252 Guest Rooms and Suites, a w xyz(SM) bar, re:fuel by Aloft(SM) where guests can grab a snack 24/7, and the re:mix(SM) lounge. Complimentary wired and wireless high speed internet access is also available throughout the hotel.",
    "detail_rating": {
        "cleanliness": 4.5,
        "location": 4.0,
        "rooms": 4.5,
        "service": 4.0,
        "sleep": 4.5,
        "value": 4.0
    },
    "location": {
        "city": "London",
        "continent": "Europe",
        "country": "United Kingdom (UK)",
        "proposed_city": "London",
        "province": null,
        "region": null
    },
    "name": "Aloft London Excel",
    "places": {
        "aka": [
            "London"
        ],
        "hotel_description": [
            "London"
        ],
        "hotel_name": [
            "London"
        ]
    },
    "review_count": 587,
    "review_count_current": 20,
    "reviews": [
        {
            "date": "May 6, 2013",
            "detail_rating": {
                "business": null,
                "cleanliness": 5.0,
                "desk": null,
                "location": 3.0,
                "pool": null,
                "restaurant": null,
                "rooms": 5.0,
                "service": 5.0,
                "sleep": 5.0,
                "value": 4.0
            },
            "helpfulness": null,
            "id": 159761093,
            "likes": {
                "disliked": null,
                "liked": null
            },
            "rating": 5.0,
            "stay_parameters": "Stayed May 2013, traveled as a couple",
            "text": "We stayed at the Aloft London Excel for one night, and although it was a little way out of the centre of London the hotel itself was beyond amazing!",
            "title": "Went above and beyond!",
            "user": "Sarah L"
        },
        {
            "date": "May 5, 2013",
            "detail_rating": {
                "business": null,
                "cleanliness": 5.0,
                "desk": null,
                "location": 5.0,
                "pool": null,
                "restaurant": null,
                "rooms": 5.0,
                "service": 5.0,
                "sleep": 5.0,
                "value": 5.0
            },
            "helpfulness": null,
            "id": 159719069,
            "likes": {
                "disliked": null,
                "liked": null
            },
            "rating": 5.0,
            "stay_parameters": "Stayed May 2013, traveled as a couple",
            "text": "Each room was a lavish as possible, with a huge television on the wall, lovely shower room that was huge! However, the bed was enormous and comfortable too! Beautiful",
            "title": "great stay",
            "user": "daveyjones111"
        },
        {
            "date": "May 5, 2013",
            "detail_rating": {
                "business": null,
                "cleanliness": 3.0,
                "desk": null,
                "location": 5.0,
                "pool": null,
                "restaurant": null,
                "rooms": 3.0,
                "service": 3.0,
                "sleep": 3.0,
                "value": 2.0
            },
            "helpfulness": null,
            "id": 159717616,
            "likes": {
                "disliked": null,
                "liked": null
            },
            "rating": 3.0,
            "stay_parameters": "Stayed May 2013, traveled on business",
            "text": "The 5 Stars go to the fact that I had organised a bottle of champagne for my boyfriend upon arrival, and they forgot! Well ... why the 5 stars then might you ask? Because when we got back from seeing our show there was a complimentary bottle of champagne in our room and a lovely handwritten note from the duty manager - this absolutely made our weekend!",
            "title": "Convenient",
            "user": "Kevin J"
        },
        {
            "date": "May 5, 2013",
            "detail_rating": {
                "business": null,
                "cleanliness": 5.0,
                "desk": null,
                "location": 4.0,
                "pool": null,
                "restaurant": null,
                "rooms": 5.0,
                "service": 4.0,
                "sleep": null,
                "value": 4.0
            },
            "helpfulness": null,
            "id": 159707460,
            "likes": {
                "disliked": null,
                "liked": null
            },
            "rating": 4.0,
            "stay_parameters": "Stayed April 2013",
            "text": "Got room on a deal from one of the hotel finder websites for a great price. Came with \"boxed\" breakfast.",
            "title": "Great location for the o2 & excel arenas",
            "user": "Chris H"
        },
        {
            "date": "April 30, 2013",
            "detail_rating": {
                "business": null,
                "cleanliness": 5.0,
                "desk": null,
                "location": 4.0,
                "pool": null,
                "restaurant": null,
                "rooms": 5.0,
                "service": 5.0,
                "sleep": 4.0,
                "value": 5.0
            },
            "helpfulness": 1,
            "id": 159228096,
            "likes": {
                "disliked": null,
                "liked": null
            },
            "rating": 5.0,
            "stay_parameters": "Stayed April 2013, traveled as a couple",
            "text": "Hotel is situated attached to the prince regent station on the docklands light railway. The hotel arrival was easy and they catered for an early check in at no extra charge.",
            "title": "Weekender away",
            "user": "DuFraz"
        },
        {
            "date": "May 21, 2013",
            "detail_rating": {
                "business": null,
                "cleanliness": 4.0,
                "desk": null,
                "location": 3.0,
                "pool": null,
                "restaurant": null,
                "rooms": 4.0,
                "service": 5.0,
                "sleep": 4.0,
                "value": 4.0
            },
            "helpfulness": 1,
            "id": 161405807,
            "likes": {
                "disliked": null,
                "liked": null
            },
            "rating": 4.0,
            "stay_parameters": "Stayed May 2013, traveled on business",
            "text": "Modern hotel, very well located right next to the Excel exhibitions center, with easy access to London City airport (473 bus, DLR or taxi). Young, efficient, enthusiastic staff. The room was good sized, very clean, with a nice view onto the Docklands. woluld certainly stay here again.",
            "title": "Good hotel for exhibitions at Excel",
            "user": "BraddyBarcelona"
        },
        {
            "date": "May 20, 2013",
            "detail_rating": {
                "business": null,
                "cleanliness": 5.0,
                "desk": null,
                "location": 5.0,
                "pool": null,
                "restaurant": null,
                "rooms": 4.0,
                "service": 4.0,
                "sleep": 4.0,
                "value": 4.0
            },
            "helpfulness": 1,
            "id": 161244845,
            "likes": {
                "disliked": null,
                "liked": null
            },
            "rating": 4.0,
            "stay_parameters": "Stayed May 2013, traveled on business",
            "text": "Hotel is located right next to London Excel exam halls. Therefore ideal when doing an exam over there.",
            "title": "Perfect pre-exam stay for London Excel",
            "user": "TheHagueNijntje"
        },
        {
            "date": "May 15, 2013",
            "detail_rating": {
                "business": null,
                "cleanliness": 4.0,
                "desk": null,
                "location": 4.0,
                "pool": null,
                "restaurant": null,
                "rooms": 4.0,
                "service": 3.0,
                "sleep": 4.0,
                "value": 4.0
            },
            "helpfulness": 1,
            "id": 160806342,
            "likes": {
                "disliked": null,
                "liked": null
            },
            "rating": 4.0,
            "stay_parameters": "Stayed April 2013, traveled as a couple",
            "text": "Close to London City airport. Easily accessible via DLR.",
            "title": "Modern and stylish",
            "user": "Sara K"
        },
        {
            "date": "May 14, 2013",
            "detail_rating": {
                "business": null,
                "cleanliness": 5.0,
                "desk": null,
                "location": 3.0,
                "pool": null,
                "restaurant": null,
                "rooms": 5.0,
                "service": 4.0,
                "sleep": 5.0,
                "value": 5.0
            },
            "helpfulness": 2,
            "id": 160642362,
            "likes": {
                "disliked": null,
                "liked": null
            },
            "rating": 4.0,
            "stay_parameters": "Stayed May 2013, traveled as a couple",
            "text": "Hotel has nice design.",
            "title": "Great Hotel",
            "user": "TravelSrut"
        },
        {
            "date": "May 13, 2013",
            "detail_rating": {
                "business": null,
                "cleanliness": 5.0,
                "desk": null,
                "location": 3.0,
                "pool": null,
                "restaurant": null,
                "rooms": 5.0,
                "service": 4.0,
                "sleep": 5.0,
                "value": 5.0
            },
            "helpfulness": null,
            "id": 160612573,
            "likes": {
                "disliked": null,
                "liked": null
            },
            "rating": 4.0,
            "stay_parameters": "Stayed May 2013, traveled as a couple",
            "text": "Handy self check in unless you forget your pin code or are using Maestro (not accepted).",
            "title": "Great place for a cheap stay",
            "user": "Alex L"
        },
        {
            "date": "May 9, 2013",
            "detail_rating": {
                "business": null,
                "cleanliness": 5.0,
                "desk": null,
                "location": 3.0,
                "pool": null,
                "restaurant": null,
                "rooms": 4.0,
                "service": 4.0,
                "sleep": 5.0,
                "value": 4.0
            },
            "helpfulness": null,
            "id": 160132312,
            "likes": {
                "disliked": null,
                "liked": null
            },
            "rating": 4.0,
            "stay_parameters": "Stayed May 2013, traveled on business",
            "text": "Excellent hotel.spacious airy rooms, friendly staff. Free wifi. Highly recommended if you have to be in the area. Some of our party were scheduled to be off loaded to another hotel due to over-booking (hey, it happens). The helpful accommodating manager changed this arrangement immediately with good humour when I explained the circumstances.",
            "title": "Great for Excel",
            "user": "Doogall"
        },
        {
            "date": "May 7, 2013",
            "detail_rating": {
                "business": null,
                "cleanliness": 5.0,
                "desk": null,
                "location": 5.0,
                "pool": null,
                "restaurant": null,
                "rooms": 5.0,
                "service": 5.0,
                "sleep": 5.0,
                "value": 5.0
            },
            "helpfulness": null,
            "id": 159993457,
            "likes": {
                "disliked": null,
                "liked": null
            },
            "rating": 4.0,
            "stay_parameters": "Stayed May 2013, traveled on business",
            "text": "For the location, it\u2019s a good Starwood property. I was on another assignment at the ExCel Convention Center and the hotel was in a prime location. The property is very clean and the staff are all amazing. The bar was off the hook!! The young bartender was the best I\u2019ve seen thus far. He engages in conversation and well schooled in football! The only drawback to this hidden gem is the restaurant. The restaurant needs some serious help in expanding their menu. I had dinner once and that was enough for me. For the rest of the week I would eat out or visit a little pub that\u2019s in walking distance. Not the best either, but by far better choice than the restaurant.",
            "title": "For the Location, It's a good Starwood Property",
            "user": "Angel A"
        },
        {
            "date": "May 7, 2013",
            "detail_rating": {
                "business": null,
                "cleanliness": 4.0,
                "desk": null,
                "location": 4.0,
                "pool": null,
                "restaurant": null,
                "rooms": 4.0,
                "service": 4.0,
                "sleep": 4.0,
                "value": 5.0
            },
            "helpfulness": null,
            "id": 159966653,
            "likes": {
                "disliked": null,
                "liked": null
            },
            "rating": 4.0,
            "stay_parameters": "Stayed May 2013, traveled as a couple",
            "text": "A Lastminute booking on Bank Holiday Monday surprisingly meant a VERY cheap deal. The \u00a3200 rack rate is above my usual budgte. That said the hotel adjoins the Excel so the location was perfect. We arrived early and were allowed to check in at about 10.00 am. On site parking cheaper than others around.",
            "title": "Very convenient for Excel",
            "user": "ilminstertraveller"
        },
        {
            "date": "May 7, 2013",
            "detail_rating": {
                "business": null,
                "cleanliness": 5.0,
                "desk": null,
                "location": 3.0,
                "pool": null,
                "restaurant": null,
                "rooms": 5.0,
                "service": 4.0,
                "sleep": 5.0,
                "value": 4.0
            },
            "helpfulness": null,
            "id": 159923894,
            "likes": {
                "disliked": null,
                "liked": null
            },
            "rating": 4.0,
            "stay_parameters": "Stayed May 2013, traveled on business",
            "text": "It must be quite new and is high tech. The keycard only has to be waved in the lidt for security and the same again at the door. A spacious nicely decorated modern room. Large shower (no bath) and bathroom with tea/coffee facilities, hair dryer, big TV, lots of channels, free wifi, comfortable bed and, importantly, good lighting.",
            "title": "Fantastic place at the end of the track",
            "user": "Travelling_Imp"
        },
        {
            "date": "May 6, 2013",
            "detail_rating": {
                "business": null,
                "cleanliness": 5.0,
                "desk": null,
                "location": 5.0,
                "pool": null,
                "restaurant": null,
                "rooms": 5.0,
                "service": 5.0,
                "sleep": 5.0,
                "value": 5.0
            },
            "helpfulness": null,
            "id": 159844265,
            "likes": {
                "disliked": null,
                "liked": null
            },
            "rating": 5.0,
            "stay_parameters": "Stayed February 2013, traveled as a couple",
            "text": "If I had one grouse it was that the tasty coffee bags, which unzipped and clipped to the rim of a cup, were too small for the large disposable paper cups of which there were only two, so dirty cups in the morning is you had coffee in the evening.",
            "title": "AMAZING!!!!!!!!",
            "user": "Valentina I"
        },
        {
            "date": "May 13, 2013",
            "detail_rating": {
                "business": null,
                "cleanliness": null,
                "desk": null,
                "location": null,
                "pool": null,
                "restaurant": null,
                "rooms": null,
                "service": null,
                "sleep": null,
                "value": null
            },
            "helpfulness": null,
            "id": 160581528,
            "likes": {
                "disliked": null,
                "liked": null
            },
            "rating": 5.0,
            "stay_parameters": null,
            "text": "Fantastic, modern, comfortable, relaxed and very welcoming. Brilliant friendly staff made our one night stay here very pleasurable. Room was very well appointed, lightning fast internet in the room and communal areas. Really felt like a home from home.",
            "title": "Brilliant hotle",
            "user": "BrummieStevie"
        },
        {
            "date": "May 12, 2013",
            "detail_rating": {
                "business": null,
                "cleanliness": 5.0,
                "desk": null,
                "location": 4.0,
                "pool": null,
                "restaurant": null,
                "rooms": 4.0,
                "service": 4.0,
                "sleep": 4.0,
                "value": 4.0
            },
            "helpfulness": 1,
            "id": 160429215,
            "likes": {
                "disliked": null,
                "liked": null
            },
            "rating": 4.0,
            "stay_parameters": "Stayed April 2013, traveled as a couple",
            "text": "Highly recommended.",
            "title": "Modern",
            "user": "Anne S"
        },
        {
            "date": "May 9, 2013",
            "detail_rating": {
                "business": null,
                "cleanliness": 5.0,
                "desk": null,
                "location": 3.0,
                "pool": null,
                "restaurant": null,
                "rooms": 5.0,
                "service": 5.0,
                "sleep": 5.0,
                "value": 4.0
            },
            "helpfulness": 1,
            "id": 160179365,
            "likes": {
                "disliked": null,
                "liked": null
            },
            "rating": 5.0,
            "stay_parameters": "Stayed February 2013, traveled on business",
            "text": "We spent one night at Aloft, choosing it because of it's close proximity to London City Airport.",
            "title": "The place where to stay",
            "user": "Antonio T"
        },
        {
            "date": "May 9, 2013",
            "detail_rating": {
                "business": null,
                "cleanliness": 4.0,
                "desk": null,
                "location": 5.0,
                "pool": null,
                "restaurant": null,
                "rooms": 5.0,
                "service": 4.0,
                "sleep": 4.0,
                "value": 3.0
            },
            "helpfulness": null,
            "id": 160145965,
            "likes": {
                "disliked": null,
                "liked": null
            },
            "rating": 4.0,
            "stay_parameters": "Stayed May 2013, traveled as a couple",
            "text": "The staff were pleasant and helpful.",
            "title": "Fantastic Location",
            "user": "Jess B"
        },
        {
            "date": "May 9, 2013",
            "detail_rating": {
                "business": null,
                "cleanliness": 5.0,
                "desk": null,
                "location": 5.0,
                "pool": null,
                "restaurant": null,
                "rooms": 5.0,
                "service": 5.0,
                "sleep": null,
                "value": 5.0
            },
            "helpfulness": null,
            "id": 160145787,
            "likes": {
                "disliked": null,
                "liked": null
            },
            "rating": 5.0,
            "stay_parameters": "Stayed May 2013",
            "text": "The room was fabulous, big and clean. The bathroom was spotless.",
            "title": "Excellent",
            "user": "Elizabeth G"
        }
    ],
    "slim_ranking": 0.203531598513,
    "stars": 4,
    "tripadvisor": {
        "VISITED": false,
        "country_name": null,
        "locality": null,
        "pic_link": null,
        "street_address": null
    },
    "user_rating": 4.0,
    "variance": {
        "average": 75,
        "excellent": 230,
        "poor": 22,
        "terrible": 12,
        "very good": 248
    }
}