{
    "aka": "Citadines Barcelona Ramblas Hotel",
    "description": "Situated in the heart of the city, this property is ideal to enjoy one of the best areas for shopping and leisure and to access easily any point in and around Barcelona. Citadines offers apartments (1-4pax) or studios (1-2 pax) in a comfortable and functional environment, equipped with sofa beds or traditional bedding, full kitchen and its appliances, bathroom, TV, HiFi and free connection to Internet.",
    "detail_rating": {
        "cleanliness": null,
        "location": null,
        "rooms": null,
        "service": null,
        "sleep": null,
        "value": null
    },
    "location": {
        "city": null,
        "continent": "Europe",
        "country": "Spain",
        "proposed_city": "Barcelona",
        "province": null,
        "region": "Catalonia"
    },
    "name": "Citadines Barcelona Ramblas",
    "places": {
        "aka": [
            "Barcelona"
        ],
        "hotel_description": [
            "Barcelona"
        ],
        "hotel_name": [
            "Barcelona"
        ]
    },
    "review_count": 331,
    "review_count_current": 18,
    "reviews": [
        {
            "date": "December 19, 2006",
            "detail_rating": {
                "business": null,
                "cleanliness": null,
                "desk": null,
                "location": null,
                "pool": null,
                "restaurant": null,
                "rooms": null,
                "service": null,
                "sleep": null,
                "value": null
            },
            "helpfulness": 6,
            "id": 6473402,
            "likes": {
                "disliked": null,
                "liked": null
            },
            "rating": 4.0,
            "stay_parameters": null,
            "text": "We stayed at the Citadines, Barcelona in late october this year. Perfect location, walking distance to many of the interesting",
            "title": "Good trip to Barcelona",
            "user": "norwtrav"
        },
        {
            "date": "December 13, 2006",
            "detail_rating": {
                "business": 5.0,
                "cleanliness": 4.0,
                "desk": null,
                "front_desk": 4.0,
                "location": 5.0,
                "pool": null,
                "restaurant": null,
                "rooms": 4.0,
                "service": 1.0,
                "sleep": null,
                "value": 2.0
            },
            "helpfulness": 11,
            "id": 6436482,
            "likes": {
                "disliked": "\u2014 Being robbed",
                "liked": "\u2014 Free Internet"
            },
            "rating": 2.0,
            "stay_parameters": "Stayed October 2006, traveled as a couple",
            "text": "places in Barcelona. We had no trouble with the room, a studio. The electric cooker was out of function, but instead there was",
            "title": "We were robbed here!!!",
            "user": "wisemonkeysabroad"
        },
        {
            "date": "November 1, 2006",
            "detail_rating": {
                "business": null,
                "cleanliness": 4.0,
                "desk": null,
                "front_desk": 4.0,
                "location": 5.0,
                "pool": null,
                "restaurant": null,
                "rooms": 4.0,
                "service": 4.0,
                "sleep": null,
                "value": 5.0
            },
            "helpfulness": 7,
            "id": 6042568,
            "likes": {
                "disliked": null,
                "liked": null
            },
            "rating": 4.0,
            "stay_parameters": "Stayed October 2006, traveled with friends",
            "text": "a micro wave oven that did function. No problem for us. And we were not bothered by the noise from Las Ramblas.",
            "title": "great location and ammenities",
            "user": "nana-on-the-go"
        },
        {
            "date": "September 15, 2007",
            "detail_rating": {
                "business": 3.0,
                "cleanliness": 4.0,
                "desk": null,
                "front_desk": 4.0,
                "location": 5.0,
                "pool": null,
                "restaurant": null,
                "rooms": 5.0,
                "service": 4.0,
                "sleep": null,
                "value": 5.0
            },
            "helpfulness": 3,
            "id": 8719882,
            "likes": {
                "disliked": "\u2014 nothing!",
                "liked": "\u2014 Very well equipped and excellent location"
            },
            "rating": 5.0,
            "stay_parameters": "Stayed September 2007, traveled with friends",
            "text": "Stayed here for a long weekend with a group of girls and couldn't have been more pleased with the accommodation. we had a one bedroom apartment which had a double bed and a sofa with a pull out bed beneath it so it was quite a sturdy bed (not the usual rickety camp bed you'd expect). Dining table and chairs, lots of cups and cutlery etc, a mini dishwasher (nice!) fridge, toaster, kettle so if you were mad enough to eat in you could. Bathroom had a good powerful shower (with shower curtain - agree with an earlier reviewer that it's a luxury!) hairdryer was fine although precariously placed above the loo so close the lid first just incase you drop it! ah yes, tv (with a few english language channels) and a cd player and a free safety deposit box. Towels were included.",
            "title": "Perfect location and great apartments!",
            "user": "Aliflower"
        },
        {
            "date": "July 30, 2007",
            "detail_rating": {
                "business": 5.0,
                "cleanliness": 1.0,
                "desk": null,
                "front_desk": 3.0,
                "location": 5.0,
                "pool": null,
                "restaurant": null,
                "rooms": 1.0,
                "service": 1.0,
                "sleep": null,
                "value": 2.0
            },
            "helpfulness": 5,
            "id": 8262671,
            "likes": {
                "disliked": "\u2014 the A/C is very hot!",
                "liked": "\u2014 Free internet"
            },
            "rating": 1.0,
            "stay_parameters": "Stayed July 2007, traveled with family",
            "text": "It's my understanding that the apartments aren't cleaned/sheets changed etc during your stay but I guess if you're staying longer they will do this for you. It's quite normal in Spain for hotel sheets to be changed just once a week, and let's face it environmentally it makes sense too.",
            "title": "Dont stay here!",
            "user": "MAMLOOHAH"
        },
        {
            "date": "June 3, 2007",
            "detail_rating": {
                "business": 5.0,
                "cleanliness": 5.0,
                "desk": null,
                "front_desk": 5.0,
                "location": 5.0,
                "pool": null,
                "restaurant": null,
                "rooms": 5.0,
                "service": 5.0,
                "sleep": null,
                "value": 5.0
            },
            "helpfulness": 1,
            "id": 7752115,
            "likes": {
                "disliked": "\u2014 I liked it all",
                "liked": "\u2014 The fact that it includes a complete kitchen and the studio is roomy."
            },
            "rating": 5.0,
            "stay_parameters": "Stayed May 2007, traveled on business",
            "text": "Location wise it's perfect, roughly halfway along the Ramblas, opposite the Boqueria market and the Liceu theatre. Close enough to explore the Barri Gotic, Cathedral, Placa Catalunya etc without taking the metro or a taxi, and about 30 minute walk to Barceloneta beach.",
            "title": "Why Stay Anywhere Else?",
            "user": "Travelsinger"
        },
        {
            "date": "January 8, 2007",
            "detail_rating": {
                "business": 4.0,
                "cleanliness": 4.0,
                "desk": null,
                "front_desk": 5.0,
                "location": 4.0,
                "pool": null,
                "restaurant": null,
                "rooms": 4.0,
                "service": 4.0,
                "sleep": null,
                "value": 4.0
            },
            "helpfulness": 8,
            "id": 6566413,
            "likes": {
                "disliked": "\u2014 walls arnt to thick, you can here EVERYTHING!!",
                "liked": "\u2014 Clean and well maintained"
            },
            "rating": 4.0,
            "stay_parameters": "Stayed February 2006, traveled with friends",
            "text": "I hope to return to Barcelona again very soon and will definitely be booking in here!",
            "title": "Excellent",
            "user": "gap12"
        },
        {
            "date": "January 5, 2007",
            "detail_rating": {
                "business": 4.0,
                "cleanliness": 4.0,
                "desk": null,
                "front_desk": 4.0,
                "location": 5.0,
                "pool": null,
                "restaurant": null,
                "rooms": 4.0,
                "service": 4.0,
                "sleep": null,
                "value": 4.0
            },
            "helpfulness": 7,
            "id": 6555026,
            "likes": {
                "disliked": "\u2014 beds",
                "liked": "\u2014 Location"
            },
            "rating": 4.0,
            "stay_parameters": "Stayed December 2006, traveled with family",
            "text": "we stayed here in july...2007",
            "title": "Solid 3* in a 5* location",
            "user": "AscotSteve_C"
        },
        {
            "date": "July 1, 2008",
            "detail_rating": {
                "business": 5.0,
                "cleanliness": 3.0,
                "desk": null,
                "front_desk": 4.0,
                "location": 5.0,
                "pool": null,
                "restaurant": null,
                "rooms": 2.0,
                "service": 4.0,
                "sleep": null,
                "value": 3.0
            },
            "helpfulness": 1,
            "id": 17397570,
            "likes": {
                "disliked": "\u2014 Sofabed instead of a real bed",
                "liked": "\u2014 Central location, free internet access"
            },
            "rating": 3.0,
            "stay_parameters": "Stayed June 2008, traveled as a couple",
            "text": "OK, it's my own fault for just assuming that an apart-hotel was like a suite. The last one that I stayed in was like this and so I assumed they all were.",
            "title": "Beware the Apart-Hotel",
            "user": "angli4anin"
        },
        {
            "date": "June 14, 2008",
            "detail_rating": {
                "business": null,
                "cleanliness": 5.0,
                "desk": null,
                "front_desk": 5.0,
                "location": 5.0,
                "pool": null,
                "restaurant": null,
                "rooms": 3.0,
                "service": 4.0,
                "sleep": null,
                "value": 5.0
            },
            "helpfulness": null,
            "id": 16919361,
            "likes": {
                "disliked": "\u2014 Beds were a bit uncomforatble",
                "liked": "\u2014 The Location"
            },
            "rating": 5.0,
            "stay_parameters": "Stayed May 2008, traveled as a couple",
            "text": "Mistake.",
            "title": "Great Location",
            "user": "BoCyn"
        },
        {
            "date": "May 26, 2008",
            "detail_rating": {
                "business": null,
                "cleanliness": 4.0,
                "desk": null,
                "front_desk": 3.0,
                "location": 5.0,
                "pool": null,
                "restaurant": null,
                "rooms": 4.0,
                "service": 4.0,
                "sleep": null,
                "value": 4.0
            },
            "helpfulness": 1,
            "id": 16403766,
            "likes": {
                "disliked": "\u2014 View",
                "liked": "\u2014 Location, cleanliness"
            },
            "rating": 4.0,
            "stay_parameters": "Stayed May 2008, traveled as a couple",
            "text": "Upon entering the room, I thought that I had lost a room as I couldn't find a bed. Eventually I realized that it just had a sofabed, which was a bit of a pain to open and close each night and not as comfortable as a normal bed.",
            "title": "Great stay at the Citadines",
            "user": "aquarianna"
        },
        {
            "date": "April 7, 2008",
            "detail_rating": {
                "business": 4.0,
                "cleanliness": 3.0,
                "desk": null,
                "front_desk": 3.0,
                "location": 5.0,
                "pool": null,
                "restaurant": null,
                "rooms": 2.0,
                "service": 3.0,
                "sleep": null,
                "value": 2.0
            },
            "helpfulness": 1,
            "id": 14869079,
            "likes": {
                "disliked": "\u2014 noise",
                "liked": "\u2014 location"
            },
            "rating": 2.0,
            "stay_parameters": "Stayed February 2008, traveled as a couple",
            "text": "Maybe I'm just lazy.",
            "title": "Great area, but you can do better",
            "user": "LoLoChicago"
        },
        {
            "date": "April 7, 2008",
            "detail_rating": {
                "business": null,
                "cleanliness": 5.0,
                "desk": null,
                "front_desk": 5.0,
                "location": 5.0,
                "pool": null,
                "restaurant": null,
                "rooms": 5.0,
                "service": 5.0,
                "sleep": null,
                "value": 5.0
            },
            "helpfulness": null,
            "id": 14865183,
            "likes": {
                "disliked": null,
                "liked": "\u2014 Location, spaciousness and cleanliness"
            },
            "rating": 5.0,
            "stay_parameters": "Stayed March 2008, traveled as a couple",
            "text": "I thought that the room was showing a bit too much wear and tear as well, although it was clean.",
            "title": "Superb - This is not hyberbole",
            "user": "Barry Lynch"
        },
        {
            "date": "March 15, 2008",
            "detail_rating": {
                "business": null,
                "cleanliness": 3.0,
                "desk": null,
                "front_desk": 3.0,
                "location": 5.0,
                "pool": null,
                "restaurant": null,
                "rooms": 3.0,
                "service": 3.0,
                "sleep": null,
                "value": 4.0
            },
            "helpfulness": null,
            "id": 14295348,
            "likes": {
                "disliked": "\u2014 In Spain smoking is allowed in the hotel bedrooms and our room smelt of smoke. We did ask for a non smoking room but not sure if they exist in Spain.",
                "liked": "\u2014 Location and price"
            },
            "rating": 4.0,
            "stay_parameters": "Stayed March 2008, traveled as a couple",
            "text": "The Citadines is on Las Ramblas only a few minutes walk from Placa Catalunya. Great position and areas such as the beach, Gothic Quarter and Las Gracias are all within walking distance.",
            "title": "Great Location",
            "user": "MAC444"
        },
        {
            "date": "February 1, 2008",
            "detail_rating": {
                "business": null,
                "cleanliness": 4.0,
                "desk": null,
                "front_desk": 4.0,
                "location": 4.0,
                "pool": null,
                "restaurant": null,
                "rooms": 4.0,
                "service": 4.0,
                "sleep": null,
                "value": 5.0
            },
            "helpfulness": 1,
            "id": 13163558,
            "likes": {
                "disliked": null,
                "liked": "\u2014 Location"
            },
            "rating": 4.0,
            "stay_parameters": "Stayed January 2008, traveled with friends",
            "text": "Our room was in the second building so did not look out on Las Ramblas. It was a good size and the kitchen has everything you need if you want to do some cooking. Really we spent very little time in our room as there was so much we wanted to see in Barcelona. The bed was a sofa bed with a pull out bed underneath. Not the most comfortable bed in the world but we were only there for 2 nights so this didn't bother us. Towels are provided and there is a hairdryer in the bathroom. There is a 24 hour reception and the staff were approachable and helpful. If you want breakfast it is 13 euros. Bit pricey but lots of choice and the dining room looks over Las Ramblas so you can spend ages eating and watching other people going to work. Bliss.",
            "title": "Great place to stay",
            "user": "BethanCardiff"
        },
        {
            "date": "November 21, 2007",
            "detail_rating": {
                "business": null,
                "cleanliness": null,
                "desk": null,
                "location": null,
                "pool": null,
                "restaurant": null,
                "rooms": null,
                "service": null,
                "sleep": null,
                "value": null
            },
            "helpfulness": 2,
            "id": 10961743,
            "likes": {
                "disliked": null,
                "liked": null
            },
            "rating": 4.0,
            "stay_parameters": null,
            "text": "We were very pleased with our stay. As other people have said Barcelona is an expensive city and The Citadines, for its position, offers a good deal. We wanted to visit all the Gaudi buildings and other attractions and the entrance costs for these places soon mounts up.",
            "title": "Loved the Citadines",
            "user": "E.Clements"
        },
        {
            "date": "November 12, 2007",
            "detail_rating": {
                "business": 4.0,
                "cleanliness": 4.0,
                "desk": null,
                "front_desk": 3.0,
                "location": 5.0,
                "pool": null,
                "restaurant": null,
                "rooms": 4.0,
                "service": 4.0,
                "sleep": null,
                "value": 4.0
            },
            "helpfulness": 3,
            "id": 10779689,
            "likes": {
                "disliked": "\u2014 Fold-out couch served as the bed.",
                "liked": "\u2014 Location"
            },
            "rating": 4.0,
            "stay_parameters": "Stayed November 2007, traveled as a couple",
            "text": "A friend and I stayed here during the last weekend in January, we had a great time and found these apartments to be in a great location with easy access to most of Barcelona, as two girls travelling we were pleased with the 24 hour reception, which was manned by friendly, helpful staff (except one, who seemed to take a dislike to my friend!). The rooms were great, they were clean and tidy with plenty of space. We found the rooms very warm and couldn't work the air conditioning, but this wasn't a problem as we could open the window without worry as we were so high up.",
            "title": "Overpriced, but what's an American in Europe to do these days?",
            "user": "gmurphyjc"
        },
        {
            "date": "October 21, 2007",
            "detail_rating": {
                "business": null,
                "cleanliness": 3.0,
                "desk": null,
                "front_desk": 3.0,
                "location": 4.0,
                "pool": null,
                "restaurant": null,
                "rooms": 3.0,
                "service": 3.0,
                "sleep": null,
                "value": 3.0
            },
            "helpfulness": 6,
            "id": 10198462,
            "likes": {
                "disliked": "\u2014 Taps",
                "liked": "\u2014 Location"
            },
            "rating": 3.0,
            "stay_parameters": "Stayed October 2007, traveled on business",
            "text": "We have just returned from a city break to Barcelona. Having been there many times we always wanted to try an apartment.",
            "title": "In the middle of La Rambla",
            "user": "JanneSiru"
        }
    ],
    "slim_ranking": 0.386233269598,
    "stars": 3,
    "tripadvisor": {
        "VISITED": false,
        "country_name": null,
        "locality": null,
        "pic_link": null,
        "street_address": null
    },
    "user_rating": 4.0,
    "variance": {
        "average": 67,
        "excellent": 95,
        "poor": 25,
        "terrible": 9,
        "very good": 135
    }
}