{
    "aka": "The Westin San Luis Potosi Hotel",
    "description": null,
    "detail_rating": {
        "cleanliness": null,
        "location": null,
        "rooms": null,
        "service": null,
        "sleep": null,
        "value": null
    },
    "location": {
        "city": null,
        "continent": null,
        "country": "Mexico",
        "proposed_city": "San",
        "province": null,
        "region": "Central Mexico and Gulf Coast"
    },
    "name": "The Westin San Luis Potosi",
    "places": {
        "aka": [
            "San"
        ],
        "hotel_description": [],
        "hotel_name": [
            "San"
        ]
    },
    "review_count": 110,
    "review_count_current": 19,
    "reviews": [
        {
            "date": "July 29, 2006",
            "detail_rating": {
                "business": 4.0,
                "cleanliness": 5.0,
                "desk": null,
                "front_desk": 3.0,
                "location": 3.0,
                "pool": null,
                "restaurant": null,
                "rooms": 2.0,
                "service": 2.0,
                "sleep": null,
                "value": 1.0
            },
            "helpfulness": 1,
            "id": 5525922,
            "likes": {
                "disliked": "\u2014 Noise, staff",
                "liked": "\u2014 Room, food"
            },
            "rating": 1.0,
            "stay_parameters": "Stayed June 2006, traveled with family",
            "text": "I stayed with my wife at the Westin San Luis last weekend, and it was hell. They had a wedding party at the main patio/garden and the music was on until 2:30am, right 2:30 in the morning. The music felt so loud as if it was coming from inside my room. Next morning I tried to get the General Manager, he was not there but one of his assistants help to hear my complains. Couldn't be worst, she said they had warned me about the noise when I made my reservation using their website. Of course I never received such a warning.",
            "title": "Avoid it!",
            "user": "jramon"
        },
        {
            "date": "May 14, 2006",
            "detail_rating": {
                "business": null,
                "cleanliness": null,
                "desk": null,
                "location": null,
                "pool": null,
                "restaurant": null,
                "rooms": null,
                "service": null,
                "sleep": null,
                "value": null
            },
            "helpfulness": 1,
            "id": 5066717,
            "likes": {
                "disliked": null,
                "liked": null
            },
            "rating": 4.0,
            "stay_parameters": null,
            "text": "The property is beautiful and Sunday brunch is great, but be careful if you want to spend a weekend there and they have a wedding celebration.",
            "title": "All the employees make you feel at home",
            "user": "A TripAdvisor user"
        },
        {
            "date": "April 3, 2006",
            "detail_rating": {
                "business": null,
                "cleanliness": 4.0,
                "desk": null,
                "location": null,
                "pool": null,
                "restaurant": null,
                "rooms": 5.0,
                "service": 1.0,
                "sleep": null,
                "value": 2.0
            },
            "helpfulness": 2,
            "id": 4831360,
            "likes": {
                "disliked": null,
                "liked": null
            },
            "rating": 1.0,
            "stay_parameters": "Stayed April 2006",
            "text": "I was at the Westin SLP for a week and the employees make you feel at home, starting from the door man, the reception Ladies the room service, every employee works above average to serve you it was a great experience.",
            "title": "Hated it",
            "user": "FedericoMty"
        },
        {
            "date": "February 16, 2006",
            "detail_rating": {
                "business": null,
                "cleanliness": 4.0,
                "desk": null,
                "location": null,
                "pool": null,
                "restaurant": null,
                "rooms": 5.0,
                "service": 4.0,
                "sleep": null,
                "value": 5.0
            },
            "helpfulness": 2,
            "id": 4464128,
            "likes": {
                "disliked": null,
                "liked": null
            },
            "rating": 4.0,
            "stay_parameters": "Stayed February 2006, traveled on business",
            "text": "I was born and raise in S.L.P. until the age of 19, now I live in Lyons IL and i travel a lot thru the USA. and the WESTIN SLP is the same as the WESTIN'S in USA or better.",
            "title": "Great value and beautiful",
            "user": "Ufpack"
        },
        {
            "date": "February 3, 2006",
            "detail_rating": {
                "business": null,
                "cleanliness": null,
                "desk": null,
                "location": null,
                "pool": null,
                "restaurant": null,
                "rooms": null,
                "service": null,
                "sleep": null,
                "value": null
            },
            "helpfulness": null,
            "id": 4411096,
            "likes": {
                "disliked": null,
                "liked": null
            },
            "rating": 2.0,
            "stay_parameters": null,
            "text": "The hotel is magnificent and I have never experienced such incredible service before. It was so lovely",
            "title": "Oh my",
            "user": "A TripAdvisor user"
        },
        {
            "date": "March 9, 2007",
            "detail_rating": {
                "business": 4.0,
                "cleanliness": 5.0,
                "desk": null,
                "front_desk": 4.0,
                "location": 3.0,
                "pool": null,
                "restaurant": null,
                "rooms": 4.0,
                "service": 4.0,
                "sleep": null,
                "value": 5.0
            },
            "helpfulness": null,
            "id": 6941232,
            "likes": {
                "disliked": "\u2014 One evening there was a party in the center of the hotel that was a bit loud",
                "liked": "\u2014 The architecture"
            },
            "rating": 4.0,
            "stay_parameters": "Stayed February 2007, traveled on business",
            "text": "A group of us traveled to San Luis Potosi in February. After reading the reviews, we were a bit nervous about our stay. However, we were all very pleased with the property. The hotel itself is beautiful. The architecture and the furnishings are lovely. Check in and check out was quick and efficient. The buffet breakfast offered an excellent selection at a reasonable price. The room was cleaned very well - carpets vacummed every day, towels and water replaced daily, etc. I would recommend the property!",
            "title": "Better than I expected!",
            "user": "BBAZTempe"
        },
        {
            "date": "November 25, 2006",
            "detail_rating": {
                "business": 4.0,
                "cleanliness": 3.0,
                "desk": null,
                "front_desk": 1.0,
                "location": 1.0,
                "pool": null,
                "restaurant": null,
                "rooms": 1.0,
                "service": 1.0,
                "sleep": null,
                "value": 1.0
            },
            "helpfulness": null,
            "id": 6174318,
            "likes": {
                "disliked": "\u2014 avoid it",
                "liked": "\u2014 to leave"
            },
            "rating": 1.0,
            "stay_parameters": "Stayed November 2006, traveled on business",
            "text": "I had a reservation there for two weeks. After checking in, 3 bellboys were watching me carrying my suitcase and searching for the room. No one was asking to help me.",
            "title": "Bad",
            "user": "jakim"
        },
        {
            "date": "October 25, 2006",
            "detail_rating": {
                "business": 2.0,
                "cleanliness": 5.0,
                "desk": null,
                "front_desk": 4.0,
                "location": 3.0,
                "pool": null,
                "restaurant": null,
                "rooms": 3.0,
                "service": 4.0,
                "sleep": null,
                "value": 4.0
            },
            "helpfulness": null,
            "id": 6010919,
            "likes": {
                "disliked": null,
                "liked": "\u2014 Rooms are dark and have no desk to work"
            },
            "rating": 4.0,
            "stay_parameters": "Stayed October 2006, traveled on business",
            "text": "The room was dark and noisy due to a generator or anything like this nearby and it was bloody cold there in November. The heat function of the aircon didn\u2019t work. No safe in this room.",
            "title": "Great Hotel, but Dark",
            "user": "axel57"
        },
        {
            "date": "October 8, 2006",
            "detail_rating": {
                "business": 3.0,
                "cleanliness": 4.0,
                "desk": null,
                "front_desk": 5.0,
                "location": 4.0,
                "pool": null,
                "restaurant": null,
                "rooms": 4.0,
                "service": 4.0,
                "sleep": null,
                "value": 4.0
            },
            "helpfulness": 1,
            "id": 5927315,
            "likes": {
                "disliked": "\u2014 clunky elevator",
                "liked": "\u2014 the hotel appearance"
            },
            "rating": 3.0,
            "stay_parameters": "Stayed September 2006, traveled on business",
            "text": "The staff is arrogant. The Hotel is located far from the center but there are a lot of car dealers around. Maybe a good place to stay if you plan to buy a new car.",
            "title": "Beautiful, but...",
            "user": "FrqTravlr"
        },
        {
            "date": "September 27, 2006",
            "detail_rating": {
                "business": null,
                "cleanliness": 5.0,
                "desk": null,
                "front_desk": 5.0,
                "location": 4.0,
                "pool": null,
                "restaurant": null,
                "rooms": 5.0,
                "service": 5.0,
                "sleep": null,
                "value": 5.0
            },
            "helpfulness": null,
            "id": 5883232,
            "likes": {
                "disliked": null,
                "liked": null
            },
            "rating": 4.0,
            "stay_parameters": "Stayed September 2006, traveled with family",
            "text": "I checked out after the first night and returned to the Holiday Inn which is not perfect but much better.",
            "title": "Incredible Hotel and Excellent Staff",
            "user": "quez70"
        },
        {
            "date": "August 14, 2007",
            "detail_rating": {
                "business": 2.0,
                "cleanliness": 5.0,
                "desk": null,
                "front_desk": 3.0,
                "location": 3.0,
                "pool": null,
                "restaurant": null,
                "rooms": 5.0,
                "service": 5.0,
                "sleep": null,
                "value": 5.0
            },
            "helpfulness": 3,
            "id": 8419403,
            "likes": {
                "disliked": null,
                "liked": null
            },
            "rating": 5.0,
            "stay_parameters": "Stayed June 2007, traveled on business",
            "text": "I stayed here for two weeks on business. This was my first trip to Mexico so I was not sure exactly what to expect. But the Westin was certainly pleasant. The hotel/resort itself is gorgeous. Beautiful artwork, excellent deatail with an authentic Mexican feel. My room was very nice and quite comfortable. The bed was AMAZING. The most comfortable hotel bed I have ever been in. I think they call it the heavenly bed-it certainly deserves that name. I had a cute little balconly that you could stand out on. There was a small table near the balcony window which served perfect for solo room service meals. I LOVED the bathroom. Gorgeous marble flooor with a oversized marble bath. I took baths everynight because it was so relaxing. Even the artwork and detail in the bathroom was beautiful. My room very clean. the maids did an amazing job. My floor was vacuumed everday. Be aware that if you are in your room and you want privacy, put the lock on-the maids will come in at various times to leave candy, clean, or leave a note for free drinks at the bar (which is nice). I learned quickly that if I didnt want to be bothered then I needed to lock the door. The gym was very roomy and easily accessible. I ate at the restuarant almost every night. The food was very good and the service was excellent. The dining room itslef was gorgeous and if you came at the right time, there was someone playing the piano and/or singing- very relaxing. Wireless internet was not free :(. Huge drawback for me and I'm sure for all the other business travellers, but I was able to access intnet in the business lounge when no one was in there. The pool was beautiful and centrally located. In the afternoon the sun beats right down on it. But the \"heated\" pool was freezing. Keep in mind that this on of the nicest areas for weddings, parties, get togethers in the state. So be prepared for all of that on the weekends. I think that they're a few girls' birthday celebrations happending in the courtyards on Saturday which was nice, but that night there was a wedding reception---boy do Mexicans know how to party. It was beautiful, but loud-until about 3am. The hotel forwarned us and offered ear plugs that day-I thought it was a joke at first, but they were serious. It was loud, but it was the weekend so I wasn't mad about it. Overall the service was great--the staff will do anything for you and do it with a smile whether they understand you or not :). If you will be in SLP, you HAVE to stay here. You'd be a fool not to.",
            "title": "Great Stay",
            "user": "misstaryn08"
        },
        {
            "date": "July 30, 2007",
            "detail_rating": {
                "business": null,
                "cleanliness": 5.0,
                "desk": null,
                "front_desk": 5.0,
                "location": 2.0,
                "pool": null,
                "restaurant": null,
                "rooms": 4.0,
                "service": 3.0,
                "sleep": null,
                "value": 4.0
            },
            "helpfulness": 1,
            "id": 8262701,
            "likes": {
                "disliked": "\u2014 It's location is not convenient.",
                "liked": "\u2014 The hotel is beautiful!!"
            },
            "rating": 4.0,
            "stay_parameters": "Stayed July 2007, traveled as a couple",
            "text": "Although the Westin was tricky to find (make sure to have good directions before heading out), we were delighted with our stay at this hotel. From the complimentary fruity beverages at check-in...to the extensive (if not a bit pricey) breakfast buffet...we were pleased. Our rooms were clean, spacious, and comfortable...providing down pillows and comforters and cable TV with several English language movie channels (subtitled of course).",
            "title": "We had a beautiful stay!",
            "user": "cyndec"
        },
        {
            "date": "July 26, 2007",
            "detail_rating": {
                "business": 5.0,
                "cleanliness": 4.0,
                "desk": null,
                "front_desk": 4.0,
                "location": 5.0,
                "pool": null,
                "restaurant": null,
                "rooms": 4.0,
                "service": 4.0,
                "sleep": null,
                "value": 4.0
            },
            "helpfulness": 1,
            "id": 8236056,
            "likes": {
                "disliked": "\u2014 the bathroom",
                "liked": "\u2014 it's a paeacefully and quit hotel"
            },
            "rating": 4.0,
            "stay_parameters": "Stayed July 2007, traveled as a couple",
            "text": "The public areas were also very nice. If you happen to be there before, during, or after a major group event (like a wedding), the courtyard, which IMO is the hotel's most impressive feature, may be cluttered with canopies or canopy framing. I was unable to take the picture I wanted to because of this framing but finally got a partial shot of the courtyard while the staff was bringing the framing down the next morning.",
            "title": "A Nice Place to stay",
            "user": "cocainomano"
        },
        {
            "date": "June 3, 2007",
            "detail_rating": {
                "business": 5.0,
                "cleanliness": 5.0,
                "desk": null,
                "front_desk": 5.0,
                "location": 4.0,
                "pool": null,
                "restaurant": null,
                "rooms": 5.0,
                "service": 5.0,
                "sleep": null,
                "value": 5.0
            },
            "helpfulness": 1,
            "id": 7752096,
            "likes": {
                "disliked": "\u2014 Directions to Hotel",
                "liked": "\u2014 Hotel and room decore/style"
            },
            "rating": 5.0,
            "stay_parameters": "Stayed May 2007, traveled as a couple",
            "text": "During our time there we visited their restaurant for dinner (food was good, but service was lax), and for their breakfast buffet (with options of a continental style breakfast with fruits, breads, homemade jams and cereals or a more thorough warm meal that included eggs served several ways, chilaquiles, meats, and omelets and tortas made to order).",
            "title": "Fantastic Stay",
            "user": "zoto96"
        },
        {
            "date": "March 25, 2007",
            "detail_rating": {
                "business": null,
                "cleanliness": 4.0,
                "desk": null,
                "front_desk": 4.0,
                "location": 4.0,
                "pool": null,
                "restaurant": null,
                "rooms": 5.0,
                "service": 5.0,
                "sleep": null,
                "value": 5.0
            },
            "helpfulness": 2,
            "id": 7219590,
            "likes": {
                "disliked": "\u2014 Nothing I can think of",
                "liked": "\u2014 The Beds"
            },
            "rating": 5.0,
            "stay_parameters": "Stayed March 2007, traveled on business",
            "text": "The hotel is a bit removed from the city's historic center (and even the closest major road), but if you've got good directions and are comfortable driving in Mexico, this shouldn't be too much of a concern.",
            "title": "Love the Beds!",
            "user": "aimblkjak21"
        },
        {
            "date": "December 28, 2005",
            "detail_rating": {
                "business": null,
                "cleanliness": null,
                "desk": null,
                "location": null,
                "pool": null,
                "restaurant": null,
                "rooms": null,
                "service": null,
                "sleep": null,
                "value": null
            },
            "helpfulness": 2,
            "id": 4308017,
            "likes": {
                "disliked": null,
                "liked": null
            },
            "rating": 5.0,
            "stay_parameters": null,
            "text": "I have stayed on numerous occasions at the Westin SLP since 1997. This is always with great pleasure that I stay there in this magnificent reconstruction of colonial Mexico.",
            "title": "Magical Place",
            "user": "A TripAdvisor user"
        },
        {
            "date": "August 8, 2005",
            "detail_rating": {
                "business": null,
                "cleanliness": 4.0,
                "desk": null,
                "location": null,
                "pool": null,
                "restaurant": null,
                "rooms": 4.0,
                "service": 2.0,
                "sleep": null,
                "value": 3.0
            },
            "helpfulness": 4,
            "id": 3746493,
            "likes": {
                "disliked": null,
                "liked": null
            },
            "rating": 3.0,
            "stay_parameters": "Stayed June 2005, traveled on business",
            "text": "Look at the details of the architecture, all these stones (local pink \"cantera\")which were all hand carved. This hotel used to be part of the Quinta Real family, a small Mexican chain that runs 7 or 8 beautiful buildings from Monterrey to Huatulco.",
            "title": "Not a business hotel",
            "user": "bbb1"
        },
        {
            "date": "December 6, 2003",
            "detail_rating": {
                "business": null,
                "cleanliness": 4.0,
                "desk": null,
                "location": null,
                "pool": null,
                "restaurant": null,
                "rooms": 4.0,
                "service": 4.0,
                "sleep": null,
                "value": 3.0
            },
            "helpfulness": 3,
            "id": 1508920,
            "likes": {
                "disliked": null,
                "liked": null
            },
            "rating": 4.0,
            "stay_parameters": "Stayed February 2005, traveled on business",
            "text": "I always feel like I am changing planet every time I walk into the Westin. It has a lot of magic transporting you back into the 18th and 19th century.",
            "title": "Interesting architecture",
            "user": "AA2199"
        },
        {
            "date": "July 29, 2003",
            "detail_rating": {
                "business": null,
                "cleanliness": null,
                "desk": null,
                "location": null,
                "pool": null,
                "restaurant": null,
                "rooms": null,
                "service": null,
                "sleep": null,
                "value": null
            },
            "helpfulness": 3,
            "id": 1153353,
            "likes": {
                "disliked": null,
                "liked": null
            },
            "rating": 4.0,
            "stay_parameters": null,
            "text": "There are 2 key dates that make the place even more special: the September 16th celebration and the New Year festivities. Special events take place there and they are worth being part of them.",
            "title": "Great place to spend the night",
            "user": "A TripAdvisor user"
        }
    ],
    "slim_ranking": 0.189189189189,
    "stars": 4,
    "tripadvisor": {
        "VISITED": false,
        "country_name": null,
        "locality": null,
        "pic_link": null,
        "street_address": null
    },
    "user_rating": 4.0,
    "variance": {
        "average": 13,
        "excellent": 35,
        "poor": 6,
        "terrible": 8,
        "very good": 48
    }
}