{
    "aka": null,
    "description": null,
    "detail_rating": {
        "cleanliness": null,
        "location": null,
        "rooms": null,
        "service": null,
        "sleep": null,
        "value": null
    },
    "location": {
        "city": null,
        "continent": "South Pacific",
        "country": "Australia",
        "proposed_city": "Fillmore",
        "province": null,
        "region": null
    },
    "name": "Fillmore's Lombardy",
    "places": {
        "aka": [],
        "hotel_description": [],
        "hotel_name": [
            "Fillmore"
        ]
    },
    "review_count": 7,
    "review_count_current": 5,
    "reviews": [
        {
            "date": "May 23, 2009",
            "detail_rating": {
                "business": null,
                "cleanliness": 5.0,
                "desk": null,
                "location": 5.0,
                "pool": null,
                "restaurant": null,
                "rooms": 5.0,
                "service": 5.0,
                "sleep": null,
                "value": 5.0
            },
            "helpfulness": 1,
            "id": 30599982,
            "likes": {
                "disliked": null,
                "liked": null
            },
            "rating": 5.0,
            "stay_parameters": "Stayed May 2009, traveled solo",
            "text": "Simply put, this was a wonderful place to stay.",
            "title": "Wonderful--Just like staying at home!",
            "user": "struck"
        },
        {
            "date": "April 1, 2009",
            "detail_rating": {
                "business": null,
                "cleanliness": 5.0,
                "desk": null,
                "location": 5.0,
                "pool": null,
                "restaurant": null,
                "rooms": 5.0,
                "service": 5.0,
                "sleep": null,
                "value": 5.0
            },
            "helpfulness": 1,
            "id": 27246689,
            "likes": {
                "disliked": null,
                "liked": null
            },
            "rating": 5.0,
            "stay_parameters": "Stayed February 2009",
            "text": "I had never stayed at a B & B before, so I was a little nervous. There was nothing to be afraid of, however, as the hosts, Peter and Penny, made me feel right at home.",
            "title": "Like a Stay with friend",
            "user": "Rosie_and_Laurenz"
        },
        {
            "date": "July 30, 2008",
            "detail_rating": {
                "business": 3.0,
                "cleanliness": 4.0,
                "desk": null,
                "front_desk": 4.0,
                "location": 5.0,
                "pool": null,
                "restaurant": null,
                "rooms": 5.0,
                "service": 5.0,
                "sleep": null,
                "value": 4.0
            },
            "helpfulness": null,
            "id": 18418672,
            "likes": {
                "disliked": "\u2014 need to drive to town",
                "liked": "\u2014 the location - ocean views and the quality of the meals"
            },
            "rating": 5.0,
            "stay_parameters": "Stayed July 2008, traveled as a couple",
            "text": "There are two rooms for rent--I stayed in the upstairs room with a commanding view of Smith Bay in the distance. There is a separate sitting area below the upstairs room and next to the downstairs room, although I never sat there. I ended up sitting at the smaller table in this wonderfully large kitchen as Peter and/or Penny were preparing meals.",
            "title": "Relaxing stay with great cooks!",
            "user": "JCB_8"
        },
        {
            "date": "March 2, 2008",
            "detail_rating": {
                "business": null,
                "cleanliness": null,
                "desk": null,
                "location": null,
                "pool": null,
                "restaurant": null,
                "rooms": null,
                "service": null,
                "sleep": null,
                "value": null
            },
            "helpfulness": 1,
            "id": 14001613,
            "likes": {
                "disliked": null,
                "liked": null
            },
            "rating": 5.0,
            "stay_parameters": null,
            "text": "The main room next to the guest area is a very large room with a fireplace and large dining table. Eating breakfast while looking out at Smith Bay is certainly a treat. You will not go hungry.",
            "title": "Quiet New Year",
            "user": "Coylum"
        },
        {
            "date": "December 26, 2007",
            "detail_rating": {
                "business": null,
                "cleanliness": 4.0,
                "desk": null,
                "front_desk": 5.0,
                "location": 5.0,
                "pool": null,
                "restaurant": null,
                "rooms": 4.0,
                "service": 5.0,
                "sleep": null,
                "value": 5.0
            },
            "helpfulness": 2,
            "id": 11961346,
            "likes": {
                "disliked": "\u2014 Nothing",
                "liked": "\u2014 Peter & Penny (& the Pudding)"
            },
            "rating": 5.0,
            "stay_parameters": "Stayed November 2007, traveled as a couple",
            "text": "For an extra fee, you can have Peter and Penny serve up a fantastic evening meal. Do you have any special requests? Let them know and they will try and get it for you, particularly if you love fresh seafood (but only if it is fresh). I asked for a dozen oysters on the halfshell and Peter served them up on the last night of my three-night stay. You can actually forget you are staying at a B & B, particularly since most places serve you a regular breakfast and out the door you go for the day. Fillmore's Lombardy is a great place to come to after a full day of touring Kangaroo Island.",
            "title": "The Impossible Pudding",
            "user": "Chris_Jens"
        }
    ],
    "slim_ranking": 0.833333333333,
    "stars": null,
    "tripadvisor": {
        "VISITED": false,
        "country_name": null,
        "locality": null,
        "pic_link": null,
        "street_address": null
    },
    "user_rating": 5.0,
    "variance": {
        "average": 0,
        "excellent": 7,
        "poor": 0,
        "terrible": 0,
        "very good": 0
    }
}