{
    "aka": "Plaza Tour Eiffel Paris",
    "description": "Close to the Eiffel Tower and the Trocadero, this Boutique Hotel is situated in a very upscale residential area in the heart of the 16th arrondissement of Paris. It enjoys a highly attractive setting with a walking distance of the capitals monuments, restaurant and stores.Entirely renovated, the hotel combines contemporary decor with an elegant atmosphere devoted to your well-being.This 4 stars Boutique Hotel has 41 rooms and Suites, a Fitness room, a Free Wifi Internet access, American Buffet Breakfast, a room service and a nice Lounge Bar.",
    "detail_rating": {
        "cleanliness": 4.5,
        "location": 4.5,
        "rooms": 4.0,
        "service": 4.5,
        "sleep": 4.5,
        "value": 4.5
    },
    "location": {
        "city": "Paris",
        "continent": "Europe",
        "country": "France",
        "proposed_city": "Paris",
        "province": null,
        "region": "Ile-de-France"
    },
    "name": "Plaza Tour Eiffel",
    "places": {
        "aka": [
            "Paris"
        ],
        "hotel_description": [
            "Paris",
            "Bar"
        ],
        "hotel_name": []
    },
    "review_count": 442,
    "review_count_current": 27,
    "reviews": [
        {
            "date": "September 3, 2008",
            "detail_rating": {
                "business": null,
                "cleanliness": 5.0,
                "desk": null,
                "front_desk": 5.0,
                "location": 5.0,
                "pool": null,
                "restaurant": null,
                "rooms": 4.0,
                "service": 4.0,
                "sleep": null,
                "value": 4.0
            },
            "helpfulness": 1,
            "id": 19707406,
            "likes": {
                "disliked": "\u2014 nothing",
                "liked": "\u2014 cleanliness and location"
            },
            "rating": 5.0,
            "stay_parameters": "Stayed September 2008, traveled as a couple",
            "text": "Just back from a 4 day Paris break at this great hotel. We read lots reviews and were so pleased that we decided to choose this hotel. Stayed in a superior room which was just as described extremely clean and comfortable (clean towels every day and lovely L'Octane toiletries).",
            "title": "Couldn't fault this hotel - loved it",
            "user": "wheeler210"
        },
        {
            "date": "August 29, 2008",
            "detail_rating": {
                "business": 5.0,
                "cleanliness": 5.0,
                "desk": null,
                "front_desk": 5.0,
                "location": 5.0,
                "pool": null,
                "restaurant": null,
                "rooms": 4.0,
                "service": 5.0,
                "sleep": null,
                "value": 4.0
            },
            "helpfulness": 1,
            "id": 19527675,
            "likes": {
                "disliked": null,
                "liked": "\u2014 Comfortable"
            },
            "rating": 4.0,
            "stay_parameters": "Stayed August 2008, traveled as a couple",
            "text": "The staff are v. friendly and helpful no matter what time of day. Had a deal where breakfast was included and it was v.good but not sure that we would have paid the going rate as there are places that are cheaper to eat.",
            "title": "Great Hotel, excellent location",
            "user": "Blue_Zee"
        },
        {
            "date": "August 26, 2008",
            "detail_rating": {
                "business": null,
                "cleanliness": 5.0,
                "desk": null,
                "front_desk": 5.0,
                "location": 5.0,
                "pool": null,
                "restaurant": null,
                "rooms": 5.0,
                "service": 5.0,
                "sleep": null,
                "value": 5.0
            },
            "helpfulness": null,
            "id": 19392885,
            "likes": {
                "disliked": null,
                "liked": null
            },
            "rating": 5.0,
            "stay_parameters": "Stayed August 2008",
            "text": "Great location just 5mins from metro and the busy Trocadero area that as lively cafes. Metro easy to negotiate and a quick and cheap way to travel, however for a more leisurely trip take the Batbus that travels down the river stopping at the main tourist spots (11Euros for a day ticket).",
            "title": "Lovely little hotel",
            "user": "tcyaya"
        },
        {
            "date": "August 20, 2008",
            "detail_rating": {
                "business": null,
                "cleanliness": 5.0,
                "desk": null,
                "front_desk": 5.0,
                "location": 5.0,
                "pool": null,
                "restaurant": null,
                "rooms": 4.0,
                "service": 5.0,
                "sleep": null,
                "value": 4.0
            },
            "helpfulness": 2,
            "id": 19144439,
            "likes": {
                "disliked": "\u2014 a bit on the small side but what's new in city hotels?",
                "liked": "\u2014 friendly and modern and clean and comfortable"
            },
            "rating": 5.0,
            "stay_parameters": "Stayed August 2008, traveled as a couple",
            "text": "I would recommend this hotel and would definately stay again.",
            "title": "anniversary weekend in August 2008",
            "user": "palinscamera"
        },
        {
            "date": "August 16, 2008",
            "detail_rating": {
                "business": 5.0,
                "cleanliness": 5.0,
                "desk": null,
                "front_desk": 4.0,
                "location": 5.0,
                "pool": null,
                "restaurant": null,
                "rooms": 5.0,
                "service": 4.0,
                "sleep": null,
                "value": 5.0
            },
            "helpfulness": 1,
            "id": 19017857,
            "likes": {
                "disliked": "\u2014 Nothing",
                "liked": "\u2014 Room quality and location"
            },
            "rating": 5.0,
            "stay_parameters": "Stayed July 2008, traveled as a couple",
            "text": "Stayed in Paris for a week in this small but very pleasant Hotel, with very friendly and helpful staff.",
            "title": "Excellent hotel in good location",
            "user": "ivan06"
        },
        {
            "date": "August 9, 2008",
            "detail_rating": {
                "business": 5.0,
                "cleanliness": 5.0,
                "desk": null,
                "front_desk": 5.0,
                "location": 4.0,
                "pool": null,
                "restaurant": null,
                "rooms": 5.0,
                "service": 5.0,
                "sleep": null,
                "value": 4.0
            },
            "helpfulness": 1,
            "id": 18773186,
            "likes": {
                "disliked": null,
                "liked": "\u2014 modern feel"
            },
            "rating": 4.0,
            "stay_parameters": "Stayed July 2008, traveled as a couple",
            "text": "Breakfast was included in our deal (an August promotion) and was like the hotel small but perfectly formed. More than enough to keep you going and obviously pastries and bread were all fresh.",
            "title": "great find",
            "user": "frona"
        },
        {
            "date": "August 3, 2008",
            "detail_rating": {
                "business": 3.0,
                "cleanliness": 4.0,
                "desk": null,
                "front_desk": 5.0,
                "location": 4.0,
                "pool": null,
                "restaurant": null,
                "rooms": 4.0,
                "service": 4.0,
                "sleep": null,
                "value": 4.0
            },
            "helpfulness": 1,
            "id": 18560984,
            "likes": {
                "disliked": "\u2014 Price of a cup of tea",
                "liked": "\u2014 Decor"
            },
            "rating": 4.0,
            "stay_parameters": "Stayed July 2008, traveled as a couple",
            "text": "Overall if you want a base that is well located, with a modern feel, and staff who trip over themselves to help then the Plaza is ideal.",
            "title": "Nice Hotel",
            "user": "MichaelandLouise"
        },
        {
            "date": "October 1, 2008",
            "detail_rating": {
                "business": 3.0,
                "cleanliness": 5.0,
                "desk": null,
                "front_desk": 5.0,
                "location": 5.0,
                "pool": null,
                "restaurant": null,
                "rooms": 5.0,
                "service": 5.0,
                "sleep": null,
                "value": 4.0
            },
            "helpfulness": 1,
            "id": 20531043,
            "likes": {
                "disliked": "\u2014 Shower was odd, half a door, you got water on the floor everytime you showered.",
                "liked": "\u2014 The quiet location but still close to everything."
            },
            "rating": 5.0,
            "stay_parameters": "Stayed September 2008, traveled with friends",
            "text": "We recently spent four days in Paris and stayed at Plaza Tour Eiffel. The staff was so nice and helpful. The room was bigger than expected and so clean!! The bathroom was spotless everyday. The shower was a little strange but other than that I reccommend this hotel!",
            "title": "Great Quiet Hotel",
            "user": "Bocagirl12"
        },
        {
            "date": "September 24, 2008",
            "detail_rating": {
                "business": 5.0,
                "cleanliness": 5.0,
                "desk": null,
                "front_desk": 5.0,
                "location": 5.0,
                "pool": null,
                "restaurant": null,
                "rooms": 3.0,
                "service": 5.0,
                "sleep": null,
                "value": 5.0
            },
            "helpfulness": 5,
            "id": 20350348,
            "likes": {
                "disliked": "\u2014 occaisional cold shower",
                "liked": "\u2014 Hotel Staff"
            },
            "rating": 5.0,
            "stay_parameters": "Stayed September 2008, traveled with friends",
            "text": "I guess the title is a little presumptuous but after reading the reviews on TA before we went I think I can help a little more with our review.",
            "title": "Definitive Review",
            "user": "sacoffee"
        },
        {
            "date": "September 17, 2008",
            "detail_rating": {
                "business": 5.0,
                "cleanliness": 5.0,
                "desk": null,
                "front_desk": 5.0,
                "location": 5.0,
                "pool": null,
                "restaurant": null,
                "rooms": 5.0,
                "service": 5.0,
                "sleep": null,
                "value": 5.0
            },
            "helpfulness": 3,
            "id": 20154284,
            "likes": {
                "disliked": "\u2014 nothing.",
                "liked": "\u2014 The service was outstanding"
            },
            "rating": 5.0,
            "stay_parameters": "Stayed September 2008, traveled on business",
            "text": "We went with two other couples to Paris, this is our second trip and the first trip for the other two couples. I travel abroad extensively as part of my job and am accustomed to staying in 4 - 5 star hotels. So when we were looking into this trip I had to consider the other two couples and their spending limits ... so to the web we went. We looked at at least twenty different hotels, going back and forth on cost vs. features, reading every review we could, consulting a travel agent, etc. until we finally settled on the Tour Eiffel.",
            "title": "Great service, wonderful location!",
            "user": "DRMNSTR"
        },
        {
            "date": "September 16, 2008",
            "detail_rating": {
                "business": 4.0,
                "cleanliness": 4.0,
                "desk": null,
                "front_desk": 5.0,
                "location": 5.0,
                "pool": null,
                "restaurant": null,
                "rooms": 4.0,
                "service": 5.0,
                "sleep": null,
                "value": 3.0
            },
            "helpfulness": null,
            "id": 20112869,
            "likes": {
                "disliked": "\u2014 Expensive",
                "liked": "\u2014 Location and size"
            },
            "rating": 5.0,
            "stay_parameters": "Stayed August 2008, traveled as a couple",
            "text": "Once the booking was complete I was never really sold as I know what European hotels are like and you typically get what you pay for. The 4-5 star hotels are very expensive but you get the amenities of large bathrooms, comfortable beds, in house resteraunt, room services, etc.",
            "title": "Lovely small, modern and well placed Paris hotel",
            "user": "Tom4681"
        },
        {
            "date": "September 7, 2008",
            "detail_rating": {
                "business": 4.0,
                "cleanliness": 4.0,
                "desk": null,
                "front_desk": 4.0,
                "location": 5.0,
                "pool": null,
                "restaurant": null,
                "rooms": 3.0,
                "service": 3.0,
                "sleep": null,
                "value": 4.0
            },
            "helpfulness": 1,
            "id": 19846069,
            "likes": {
                "disliked": null,
                "liked": null
            },
            "rating": 5.0,
            "stay_parameters": "Stayed August 2008, traveled as a couple",
            "text": "Well knowing all this I was expecting the least from the Tour Eiffel, even though the reviews have been good on TA.",
            "title": "Great location",
            "user": "ansh48"
        },
        {
            "date": "November 18, 2008",
            "detail_rating": {
                "business": 5.0,
                "cleanliness": 5.0,
                "desk": null,
                "front_desk": 5.0,
                "location": 5.0,
                "pool": null,
                "restaurant": null,
                "rooms": 4.0,
                "service": 5.0,
                "sleep": null,
                "value": 4.0
            },
            "helpfulness": 1,
            "id": 21976210,
            "likes": {
                "disliked": null,
                "liked": "\u2014 Staff"
            },
            "rating": 4.0,
            "stay_parameters": "Stayed November 2008, traveled with friends",
            "text": "Just returned from a week stay in Paris at the Plaza Tour Eiffel. I usually do not write reviews but the staff were so nice and helpful I thought it was necessary to let others know about this great hotel. The hotel is located about a ten minute walk from the Eiffel Tower and is in a very quiet part of Paris. It is a good break from the crowded streets at many of the city sights.",
            "title": "Lovely hotel in a quiet section in Paris",
            "user": "jewelSLC"
        },
        {
            "date": "November 18, 2008",
            "detail_rating": {
                "business": 4.0,
                "cleanliness": 5.0,
                "desk": null,
                "front_desk": 5.0,
                "location": 5.0,
                "pool": null,
                "restaurant": null,
                "rooms": 5.0,
                "service": 5.0,
                "sleep": null,
                "value": 5.0
            },
            "helpfulness": 1,
            "id": 21975608,
            "likes": {
                "disliked": "\u2014 not much",
                "liked": "\u2014 location, personnel, facilities"
            },
            "rating": 5.0,
            "stay_parameters": "Stayed November 2008, traveled as a couple",
            "text": "The rooms are very clean and modern. The room we stayed in was a typical Paris hotel room size but it was comfortable and we had a view of the tower from our window.",
            "title": "Staying with the Residents in Paris",
            "user": "MTNester1957"
        },
        {
            "date": "November 14, 2008",
            "detail_rating": {
                "business": 4.0,
                "cleanliness": 5.0,
                "desk": null,
                "front_desk": 5.0,
                "location": 5.0,
                "pool": null,
                "restaurant": null,
                "rooms": 4.0,
                "service": 5.0,
                "sleep": null,
                "value": 5.0
            },
            "helpfulness": 1,
            "id": 21849941,
            "likes": {
                "disliked": "\u2014 I would have to be very picky to find anything wrong",
                "liked": "\u2014 Very clean Hotel and helpfull staff."
            },
            "rating": 5.0,
            "stay_parameters": "Stayed September 2008, traveled with family",
            "text": "The staff are very helpful and polite. All speak English and do not seem to mind multiple questions and requests. We particularly appraciated Daniel, Mohammad and Sophie. I would definately reccomend this hotel.",
            "title": "Loved this Hotel - Great Location",
            "user": "marypicc"
        },
        {
            "date": "November 10, 2008",
            "detail_rating": {
                "business": 5.0,
                "cleanliness": 5.0,
                "desk": null,
                "front_desk": 5.0,
                "location": 5.0,
                "pool": null,
                "restaurant": null,
                "rooms": 5.0,
                "service": 5.0,
                "sleep": null,
                "value": 5.0
            },
            "helpfulness": null,
            "id": 21692906,
            "likes": {
                "disliked": null,
                "liked": null
            },
            "rating": 5.0,
            "stay_parameters": "Stayed November 2008, traveled as a couple",
            "text": "This was our first trip to Paris, and we only had 3 days. I wanted to find someplace special that wouldn't cost us our house! After reading the reviews here, I was fairly confident that we had found the right place....and we did. When we visti other countries, we prefer to stay in places that will allow us to experience a piece of native life....the Plaza Tour Eiffel does that. The hotel is located in an upscale residential area. At 8 AM, watch the mothers and fathers walking their children to school; by 10 AM the older women are walking to the markets. If you head towards the Trocadera, you will pass the Thailand and Spanish Embassies. If you head toward Place de Mexico, you'll pass a local bakery, boutiques and fresh fruit market. We spent every evening sipping wine and eating cheeses at the various bistros at the Trocadera which is a few minute walk from the hotel. There are very few tourists there (relatively speaking), and you'll find yourself immersed in French spoken with the speed of the TGV. (Although all the waitstaff spoke fluent english.) The hotel is lovely. The personnel are helpful in every way, taking our bags from the cabbie and to our room. Our plane came in early, and we were at the hotel at 10:30 AM. we fully expected to leave our bags there and check in later. However, they had a room ready for us which was a treat as we had just come in from the States and were fairly \"fried\". Our room was a bit small because we had a corner room over the front door, but it suited us fine. The bathroom was spotless, of a good size and has a good hairdryer in it! The storage is primarily in a wardrobe - and it did fit the clothing of two people with no problem. The bed was extremely comfortable, as were the pillows. We ended up leaving at 6 AM to catch a flight, and they offered to check us out the night before so we wouldn't be delayed, as well as arranged for a taxi which arrived right on time. Overall, it was a great place to stay...I would recommend it to everyone and anyone. Should we ever be able to return to Paris, I shall stay there again. FYI, the Metro is less than a 5 minute walk away, the Eiffel Tower takes 10-15 minutes to stroll, as does the Batabus, The Arc de Triomphe is about 40 minutes to walk to via the Avenue of New York next to the Seine. The cab fare from the airport was about 45 Euros.",
            "title": "Look at no other, just order your room!",
            "user": "ballodent"
        },
        {
            "date": "October 2, 2008",
            "detail_rating": {
                "business": 5.0,
                "cleanliness": 5.0,
                "desk": null,
                "front_desk": 5.0,
                "location": 5.0,
                "pool": null,
                "restaurant": null,
                "rooms": 5.0,
                "service": 5.0,
                "sleep": null,
                "value": 5.0
            },
            "helpfulness": 1,
            "id": 20548268,
            "likes": {
                "disliked": "\u2014 No complaints - an excellent experience.",
                "liked": "\u2014 Very friendly staff, safe & convenient location, clean & modern rooms."
            },
            "rating": 5.0,
            "stay_parameters": "Stayed August 2008, traveled as a couple",
            "text": "Stayed here for three night in September with my daughter and niece. The Hotel Staff made us feel so welcome upon arrival and",
            "title": "Well located, clean, modern & great staff. Highly recommended.",
            "user": "FPTC"
        },
        {
            "date": "July 10, 2008",
            "detail_rating": {
                "business": 4.0,
                "cleanliness": 4.0,
                "desk": null,
                "front_desk": 4.0,
                "location": 4.0,
                "pool": null,
                "restaurant": null,
                "rooms": 4.0,
                "service": 4.0,
                "sleep": null,
                "value": 4.0
            },
            "helpfulness": 1,
            "id": 17743805,
            "likes": {
                "disliked": "\u2014 reception",
                "liked": "\u2014 clean"
            },
            "rating": 4.0,
            "stay_parameters": "Stayed May 2008, traveled as a couple",
            "text": "I book this hotel through www.tramazing.com",
            "title": "Nice location",
            "user": "daniel_chung11"
        },
        {
            "date": "July 4, 2008",
            "detail_rating": {
                "business": 4.0,
                "cleanliness": 5.0,
                "desk": null,
                "front_desk": 5.0,
                "location": 5.0,
                "pool": null,
                "restaurant": null,
                "rooms": 5.0,
                "service": 5.0,
                "sleep": null,
                "value": 4.0
            },
            "helpfulness": 2,
            "id": 17527863,
            "likes": {
                "disliked": "\u2014 The price of drinks",
                "liked": "\u2014 Everything!"
            },
            "rating": 5.0,
            "stay_parameters": "Stayed July 2008, traveled as a couple",
            "text": "able to find the best and cheapest rate compare to others. Hotel is in good location, clean rooms, overall is good",
            "title": "Fantastic Hotel",
            "user": "holidayfever"
        },
        {
            "date": "June 29, 2008",
            "detail_rating": {
                "business": 5.0,
                "cleanliness": 5.0,
                "desk": null,
                "front_desk": 5.0,
                "location": 5.0,
                "pool": null,
                "restaurant": null,
                "rooms": 5.0,
                "service": 5.0,
                "sleep": null,
                "value": 4.0
            },
            "helpfulness": 2,
            "id": 17345776,
            "likes": {
                "disliked": "\u2014 Could not find a fault with this hotel",
                "liked": "\u2014 Modern Look and Feel"
            },
            "rating": 5.0,
            "stay_parameters": "Stayed June 2008, traveled as a couple",
            "text": "We booked this hotel because of it's location and the excellent reviews on tripadvisor. We certainly weren't disappointed. Yes the location is ideal as it's near the Eiffel Tower and Trocadero. There are a good selection of cafes and restaurants nearby so it isn't too far to wander back to the hotel after a pleasant evening eating and drinking.",
            "title": "Perfect hotel in a great location",
            "user": "cnixon1984"
        },
        {
            "date": "June 27, 2008",
            "detail_rating": {
                "business": 3.0,
                "cleanliness": 5.0,
                "desk": null,
                "front_desk": 5.0,
                "location": 4.0,
                "pool": null,
                "restaurant": null,
                "rooms": 4.0,
                "service": 5.0,
                "sleep": null,
                "value": 4.0
            },
            "helpfulness": 3,
            "id": 17282303,
            "likes": {
                "disliked": "\u2014 Nothing!",
                "liked": "\u2014 It was comfortable, staff were friendly and location was ideal!"
            },
            "rating": 5.0,
            "stay_parameters": "Stayed March 2008, traveled as a couple",
            "text": "The hotel is more than worthy of it's 4* rating. Although the rooms are small (who spends a lot of time in their room in Paris anyway?) they are extremely comfortable. Breakfast is plentiful with the usual foods you get with continental breakfast as well as scrambled eggs and ham.",
            "title": "Loved it!",
            "user": "Pinky80"
        },
        {
            "date": "May 24, 2008",
            "detail_rating": {
                "business": 4.0,
                "cleanliness": 5.0,
                "desk": null,
                "front_desk": 5.0,
                "location": 5.0,
                "pool": null,
                "restaurant": null,
                "rooms": 4.0,
                "service": 5.0,
                "sleep": null,
                "value": 5.0
            },
            "helpfulness": 4,
            "id": 16369032,
            "likes": {
                "disliked": "\u2014 Nothing, I enjoyed the hotel thoroughly",
                "liked": "\u2014 Location, service, room accommodations, proximity to attractions, proximity to Metro"
            },
            "rating": 5.0,
            "stay_parameters": "Stayed May 2008, traveled as a couple",
            "text": "The staff are really fantastic. Nothing is too much trouble. They are extremely polite and helpful.",
            "title": "Amazing romantic vacation - this hotel made all the difference",
            "user": "BVThomps"
        },
        {
            "date": "July 29, 2008",
            "detail_rating": {
                "business": 2.0,
                "cleanliness": 2.0,
                "desk": null,
                "front_desk": 3.0,
                "location": 3.0,
                "pool": null,
                "restaurant": null,
                "rooms": 1.0,
                "service": 2.0,
                "sleep": null,
                "value": 1.0
            },
            "helpfulness": null,
            "id": 18383336,
            "likes": {
                "disliked": null,
                "liked": null
            },
            "rating": 2.0,
            "stay_parameters": "Stayed July 2008, traveled on business",
            "text": "Well presented rooms though basic rooms are a little on the small side. Polite and helpful staff.",
            "title": "Dissapointing All Round",
            "user": "MariL"
        },
        {
            "date": "July 28, 2008",
            "detail_rating": {
                "business": 3.0,
                "cleanliness": 5.0,
                "desk": null,
                "front_desk": 5.0,
                "location": 4.0,
                "pool": null,
                "restaurant": null,
                "rooms": 4.0,
                "service": 5.0,
                "sleep": null,
                "value": 4.0
            },
            "helpfulness": 2,
            "id": 18348256,
            "likes": {
                "disliked": "\u2014 No complaint.",
                "liked": "\u2014 Service"
            },
            "rating": 4.0,
            "stay_parameters": "Stayed July 2008, traveled as a couple",
            "text": "Would return.",
            "title": "Not Just Three Stars",
            "user": "JustRuss"
        },
        {
            "date": "July 14, 2008",
            "detail_rating": {
                "business": 2.0,
                "cleanliness": 2.0,
                "desk": null,
                "front_desk": 2.0,
                "location": 2.0,
                "pool": null,
                "restaurant": null,
                "rooms": 1.0,
                "service": null,
                "sleep": null,
                "value": 1.0
            },
            "helpfulness": 3,
            "id": 17875437,
            "likes": {
                "disliked": null,
                "liked": "\u2014 nothing"
            },
            "rating": 1.0,
            "stay_parameters": "Stayed July 2008, traveled on business",
            "text": "I was expecting a contemporarty Frech experience, however this could not have been further from the truth.",
            "title": "Nothing Special With Significant Downsides",
            "user": "duke_clar"
        },
        {
            "date": "July 14, 2008",
            "detail_rating": {
                "business": 4.0,
                "cleanliness": 5.0,
                "desk": null,
                "front_desk": 5.0,
                "location": 5.0,
                "pool": null,
                "restaurant": null,
                "rooms": 5.0,
                "service": 5.0,
                "sleep": null,
                "value": 5.0
            },
            "helpfulness": 2,
            "id": 17857394,
            "likes": {
                "disliked": null,
                "liked": "\u2014 Friendly staff, clean and a great place to stay !"
            },
            "rating": 5.0,
            "stay_parameters": "Stayed June 2008, traveled as a couple",
            "text": "I was expected to go downstairs to get everything I wanted - even the WiFi key?",
            "title": "Ecellente, the place to stay in Paris",
            "user": "starySwitzerland"
        },
        {
            "date": "July 11, 2008",
            "detail_rating": {
                "business": null,
                "cleanliness": 4.0,
                "desk": null,
                "front_desk": 4.0,
                "location": 5.0,
                "pool": null,
                "restaurant": null,
                "rooms": 3.0,
                "service": 4.0,
                "sleep": null,
                "value": 4.0
            },
            "helpfulness": 3,
            "id": 17773895,
            "likes": {
                "disliked": "\u2014 Fairly small rooms and prices",
                "liked": "\u2014 It was extremely well situated for the attractions and shopping"
            },
            "rating": 4.0,
            "stay_parameters": "Stayed February 2008, traveled as a couple",
            "text": "I was travelling alone and can honestly say I did not feel safe and could hear others through the wall.",
            "title": "Great but....",
            "user": "fubarinkent"
        }
    ],
    "slim_ranking": 0.0518683770218,
    "stars": 4,
    "tripadvisor": {
        "VISITED": false,
        "country_name": null,
        "locality": null,
        "pic_link": null,
        "street_address": null
    },
    "user_rating": 4.5,
    "variance": {
        "average": 24,
        "excellent": 259,
        "poor": 5,
        "terrible": 1,
        "very good": 153
    }
}