{
    "aka": "Il Sogno Di Alghero Sardinia",
    "description": "For those who love being in touch with nature along the seaside, while relaxing or being entertained with one or several activities, our BED & BREAKFAST \" IL SOGNO DI ALGHERO \"(Alghero's Dream) is your ideal place. Our B&B is located within an olive tree plantatio, on top of a hill, just outside the town of Alghero. A small creek separates our property from the marvellous and typical Mediterranean vegetation of which you will have an impressive view.",
    "detail_rating": {
        "cleanliness": null,
        "location": null,
        "rooms": null,
        "service": null,
        "sleep": null,
        "value": null
    },
    "location": {
        "city": null,
        "continent": "Europe",
        "country": "Italy",
        "proposed_city": "Alghero",
        "province": null,
        "region": null
    },
    "name": "Il Sogno di Alghero",
    "places": {
        "aka": [
            "Alghero"
        ],
        "hotel_description": [
            "ALGHERO",
            "Alghero"
        ],
        "hotel_name": [
            "Alghero"
        ]
    },
    "review_count": 173,
    "review_count_current": 2,
    "reviews": [
        {
            "date": "November 18, 2010",
            "detail_rating": {
                "business": null,
                "cleanliness": 5.0,
                "desk": null,
                "location": 5.0,
                "pool": null,
                "restaurant": null,
                "rooms": 4.0,
                "service": 5.0,
                "sleep": 5.0,
                "value": 5.0
            },
            "helpfulness": 1,
            "id": 87464586,
            "likes": {
                "disliked": null,
                "liked": null
            },
            "rating": 5.0,
            "stay_parameters": "Stayed October 2010, traveled with family",
            "text": "Il Sogno di Alghero feels a bit like a oasis of serenity and friendliness surrounded by olive trees. The setting is beautiful (the olive grove, swimming pool, reading corner and hamac \"island\" are a dream) and the owners Alessandro and Monica are wonderful hosts. We have rarely felt so welcome and received as much useful information and help on our travels. We were even treated to a freshly baked cake and some wonderful vegetables.",
            "title": "Outstanding hospitality",
            "user": "asmile"
        },
        {
            "date": "October 12, 2010",
            "detail_rating": {
                "business": null,
                "cleanliness": 5.0,
                "desk": null,
                "location": 3.0,
                "pool": null,
                "restaurant": null,
                "rooms": 4.0,
                "service": 4.0,
                "sleep": 3.0,
                "value": 4.0
            },
            "helpfulness": null,
            "id": 83220458,
            "likes": {
                "disliked": null,
                "liked": null
            },
            "rating": 4.0,
            "stay_parameters": "Stayed October 2010, traveled as a couple",
            "text": "While Alghero is very beautiful, we were happy to stay in green surroundings rather than in town, especially as car parking can be difficult to find in town. It was also good to have a kitchen at our disposal.",
            "title": "Nice and calm",
            "user": "krihol"
        }
    ],
    "slim_ranking": 0.0277777777778,
    "stars": null,
    "tripadvisor": {
        "VISITED": false,
        "country_name": null,
        "locality": null,
        "pic_link": null,
        "street_address": null
    },
    "user_rating": 5.0,
    "variance": {
        "average": 1,
        "excellent": 158,
        "poor": 1,
        "terrible": 0,
        "very good": 13
    }
}