{
    "aka": "Aloft Bengaluru Whitefield Hotel",
    "description": "Starwood Hotels & Resorts Worldwide, Inc.\u00ae added a new tWist in travel by announcing the opening of its second Aloft in India located at Bengaluru . Located in Whitefield, Aloft Bengaluru Whitefield introduces style at a steal to its guests with 166 spacious, loft-like rooms, accessible technology and a vibrant, social atmosphere. The hotel also offers 5700 Sq Feet of meeting space in Tactic and The Hub, 100 sqm of fitness space called re:charge. Guests can grab a drink with friends at the re:mix and w xyz bar or de-stress at splash, the pool. Featuring loft-like guest rooms, a buzzing bar scene in the open lobby, an urban-inspired grab-and go caf\u00e9 and industrial design elements throughout, Aloft delivers urban-influenced, modern and vibrant designs and an energetic guest experience at an affordable price point.Aloft, the sizzling tech-savvy brand that has rocked the U.S. hospitality industry, made its debut in India in 2010 with Aloft Chennai OMR IT Expressway and Aloft Bengaluru Whitefield. Aimed at Generation Y, Aloft is Starwood\u2019s design-led, social-experience brand that has enjoyed the fastest ramp-up of any brand in the hotel history. The centerpiece of the Aloft room is the ultra-comfortable signature bed. Large stylish bathrooms complement the guest experience with oversized walk-in showers and amenities created by bliss\u00ae spa. Each guest loft is also a combination of high-tech office and entertainment center, featuring wireless internet access and plug & play, a one-stop connectivity solution for multiple electronic gadgetry such as PDAs, cell phones, mp3 players and laptops - all linked to a large flat panel HDTV ready television for optimal sound and viewing.The hotel has multiple dinning experience coffe shop & speciality restaurant.",
    "detail_rating": {
        "cleanliness": null,
        "location": null,
        "rooms": null,
        "service": null,
        "sleep": null,
        "value": null
    },
    "location": {
        "city": "Bangalore",
        "continent": "Asia",
        "country": "India",
        "proposed_city": "Whitefield",
        "province": null,
        "region": "Karnataka"
    },
    "name": "Aloft Bengaluru Whitefield",
    "places": {
        "aka": [
            "Whitefield"
        ],
        "hotel_description": [
            "Whitefield",
            "Chennai"
        ],
        "hotel_name": [
            "Whitefield"
        ]
    },
    "review_count": 190,
    "review_count_current": 6,
    "reviews": [
        {
            "date": "April 16, 2011",
            "detail_rating": {
                "business": null,
                "cleanliness": 5.0,
                "desk": null,
                "location": 3.0,
                "pool": null,
                "restaurant": null,
                "rooms": 3.0,
                "service": 4.0,
                "sleep": 3.0,
                "value": 5.0
            },
            "helpfulness": null,
            "id": 104244064,
            "likes": {
                "disliked": null,
                "liked": null
            },
            "rating": 3.0,
            "stay_parameters": "Stayed April 2011, traveled on business",
            "text": "This hotel was quite affordably priced compared to some of the other hotels nearby, but does not match them in quality.",
            "title": "Affordable hotel, but a few drawbacks",
            "user": "europa00"
        },
        {
            "date": "March 5, 2011",
            "detail_rating": {
                "business": null,
                "cleanliness": 5.0,
                "desk": null,
                "location": 3.0,
                "pool": null,
                "restaurant": null,
                "rooms": 5.0,
                "service": 5.0,
                "sleep": 5.0,
                "value": 5.0
            },
            "helpfulness": 1,
            "id": 99019822,
            "likes": {
                "disliked": null,
                "liked": null
            },
            "rating": 5.0,
            "stay_parameters": "Stayed February 2011, traveled on business",
            "text": "I could hear activity in the (connecting) room next door - shade being raised, as well as television. II was so exhausted most evenings, it didn't really matter.",
            "title": "Nice and affordable place",
            "user": "Citrus143"
        },
        {
            "date": "February 26, 2011",
            "detail_rating": {
                "business": null,
                "cleanliness": null,
                "desk": null,
                "location": 3.0,
                "pool": null,
                "restaurant": null,
                "rooms": 3.0,
                "service": 4.0,
                "sleep": 3.0,
                "value": 4.0
            },
            "helpfulness": 1,
            "id": 98040616,
            "likes": {
                "disliked": null,
                "liked": null
            },
            "rating": 3.0,
            "stay_parameters": "Stayed February 2011, traveled on business",
            "text": "Food at hotel was very average. Breakfast was OK but in a warm room and so I skipped the coffee. There were two restaurants and because of the location of the hotel, didn't want to try go anywhere else. The food was just OK at dinner time - asked for one dish to be made less spicy, and it was still firey hot, and the meditteranean restaurant had a lot of choices, but didn't have anything spectatcular there after three dinners.",
            "title": "no frills in whitefield",
            "user": "PJGMumbai"
        },
        {
            "date": "January 3, 2011",
            "detail_rating": {
                "business": null,
                "cleanliness": 4.0,
                "desk": null,
                "location": 2.0,
                "pool": null,
                "restaurant": null,
                "rooms": 5.0,
                "service": 4.0,
                "sleep": 5.0,
                "value": 4.0
            },
            "helpfulness": 1,
            "id": 91479579,
            "likes": {
                "disliked": null,
                "liked": null
            },
            "rating": 3.0,
            "stay_parameters": "Stayed December 2010, traveled on business",
            "text": "Hotel had free internet access - that works for just two devices.",
            "title": "Only A BusinesS Hotel",
            "user": "ApoorvaB"
        },
        {
            "date": "November 25, 2010",
            "detail_rating": {
                "business": null,
                "cleanliness": 5.0,
                "desk": null,
                "location": 1.0,
                "pool": null,
                "restaurant": null,
                "rooms": 3.0,
                "service": 5.0,
                "sleep": 1.0,
                "value": 2.0
            },
            "helpfulness": null,
            "id": 88152744,
            "likes": {
                "disliked": null,
                "liked": null
            },
            "rating": 3.0,
            "stay_parameters": "Stayed November 2010, traveled as a couple",
            "text": "Power went out several times during the stay. I remember at least six times. There are no emergency lights, so the restaurant, bar, room all go pitch dark for about a minute, until either the generator kicks in or the power is restored. Seems like this is such a frequent event, there should be some emergency lights, but I suppose that is not in the building code in India.",
            "title": "Check out after five mins",
            "user": "josephberlin"
        },
        {
            "date": "November 4, 2010",
            "detail_rating": {
                "business": null,
                "cleanliness": 3.0,
                "desk": null,
                "location": 4.0,
                "pool": null,
                "restaurant": null,
                "rooms": 5.0,
                "service": 5.0,
                "sleep": 4.0,
                "value": 4.0
            },
            "helpfulness": null,
            "id": 85918251,
            "likes": {
                "disliked": null,
                "liked": null
            },
            "rating": 4.0,
            "stay_parameters": "Stayed October 2010, traveled on business",
            "text": "My family and I stayed for over 1 month at this hotel so had a great insight into this hotel.",
            "title": "Great business hotel with family friendly attentive service",
            "user": "RKtraveller"
        }
    ],
    "slim_ranking": 0.110497237569,
    "stars": 4,
    "tripadvisor": {
        "VISITED": false,
        "country_name": null,
        "locality": null,
        "pic_link": null,
        "street_address": null
    },
    "user_rating": 4.0,
    "variance": {
        "average": 21,
        "excellent": 87,
        "poor": 6,
        "terrible": 5,
        "very good": 71
    }
}