{
    "aka": "Hilton Columbus/Polaris Hotel",
    "description": "Set in the thriving Polaris Centers of Commerce, the AAA Four Diamond Hilton Columbus/Polaris hotel offers an elegant stay in an excellent location. Just off Interstate 71 and featuring a complimentary shuttle to and from Port Columbus International Airport (CMH), this Columbus, OH hotel is ideally located near transportation links. The shuttle is available 6:00am to 10:30pm Monday through Friday and 7:00am to 10:00pm on weekends.",
    "detail_rating": {
        "cleanliness": null,
        "location": null,
        "rooms": null,
        "service": null,
        "sleep": null,
        "value": null
    },
    "location": {
        "city": "Columbus",
        "continent": null,
        "country": "United States",
        "proposed_city": "Columbus",
        "province": null,
        "region": null
    },
    "name": "Hilton Columbus/Polaris",
    "places": {
        "aka": [
            "Columbus"
        ],
        "hotel_description": [
            "Columbus"
        ],
        "hotel_name": [
            "Columbus"
        ]
    },
    "review_count": 261,
    "review_count_current": 20,
    "reviews": [
        {
            "date": "November 19, 2011",
            "detail_rating": {
                "business": null,
                "cleanliness": 5.0,
                "desk": null,
                "location": 5.0,
                "pool": null,
                "restaurant": null,
                "rooms": 5.0,
                "service": 5.0,
                "sleep": 5.0,
                "value": 5.0
            },
            "helpfulness": null,
            "id": 120790995,
            "likes": {
                "disliked": null,
                "liked": null
            },
            "rating": 5.0,
            "stay_parameters": "Stayed November 2011, traveled on business",
            "text": "Newer Hotel, great beds, perfect place to work with plenty of desk place, shower only in some rooms (prefer that). Staff great, clean room, excellent value, perfect location, free parking, next to upscale Mall with food, shops and fun to chill after long day. Like the workout room and pool too.",
            "title": "A business travelers' dream",
            "user": "businesstraveler486"
        },
        {
            "date": "November 4, 2011",
            "detail_rating": {
                "business": null,
                "cleanliness": 5.0,
                "desk": null,
                "location": 5.0,
                "pool": null,
                "restaurant": null,
                "rooms": 5.0,
                "service": 5.0,
                "sleep": null,
                "value": 5.0
            },
            "helpfulness": null,
            "id": 120164896,
            "likes": {
                "disliked": null,
                "liked": null
            },
            "rating": 5.0,
            "stay_parameters": "Stayed November 2011",
            "text": "Stayed at this hotel over night for a conference. I found it to be very clean, the workers were friendly, and the location was perfect. Word to the wise bring a sweater or dress warmly if you will be attending a conference as the ballroom is freezing!",
            "title": "Great stay",
            "user": "helffrde"
        },
        {
            "date": "November 2, 2011",
            "detail_rating": {
                "business": null,
                "cleanliness": 5.0,
                "desk": null,
                "location": 5.0,
                "pool": null,
                "restaurant": null,
                "rooms": 5.0,
                "service": 5.0,
                "sleep": 5.0,
                "value": 5.0
            },
            "helpfulness": null,
            "id": 120082557,
            "likes": {
                "disliked": null,
                "liked": null
            },
            "rating": 5.0,
            "stay_parameters": "Stayed October 2011, traveled solo",
            "text": "service at the front desk is great. Rooms are very clean and well appointed. Hotel still feels, looks and smells new.",
            "title": "Great service and rooms",
            "user": "bill d"
        },
        {
            "date": "October 31, 2011",
            "detail_rating": {
                "business": null,
                "cleanliness": 5.0,
                "desk": null,
                "location": 5.0,
                "pool": null,
                "restaurant": null,
                "rooms": 5.0,
                "service": 5.0,
                "sleep": 5.0,
                "value": 4.0
            },
            "helpfulness": null,
            "id": 119945232,
            "likes": {
                "disliked": null,
                "liked": null
            },
            "rating": 5.0,
            "stay_parameters": "Stayed October 2011, traveled on business",
            "text": "Convenient location to Polaris Mall.",
            "title": "Good Hotel for a Conference",
            "user": "HugeCat"
        },
        {
            "date": "October 25, 2011",
            "detail_rating": {
                "business": null,
                "cleanliness": 5.0,
                "desk": null,
                "location": 5.0,
                "pool": null,
                "restaurant": null,
                "rooms": 5.0,
                "service": 5.0,
                "sleep": 5.0,
                "value": 5.0
            },
            "helpfulness": null,
            "id": 119720846,
            "likes": {
                "disliked": null,
                "liked": null
            },
            "rating": 5.0,
            "stay_parameters": "Stayed October 2011, traveled on business",
            "text": "I shared a room with a friend for two nights to attend a conference at this hotel. The location is close to the interstate and easy to find. Check-in by a friendly staff member was a breeze. Our double queen room on the 8th floor was immaculate and spacious. My bed was very comfortable with fresh linens. There were nice Peter Thomas Roth products in the bathroom. The room was quiet and room temperature was easily controlled.",
            "title": "Great Value",
            "user": "mmmtcn"
        },
        {
            "date": "February 14, 2012",
            "detail_rating": {
                "business": null,
                "cleanliness": 5.0,
                "desk": null,
                "location": 5.0,
                "pool": null,
                "restaurant": null,
                "rooms": 5.0,
                "service": 5.0,
                "sleep": 5.0,
                "value": 5.0
            },
            "helpfulness": null,
            "id": 124564591,
            "likes": {
                "disliked": null,
                "liked": null
            },
            "rating": 5.0,
            "stay_parameters": "Stayed January 2012, traveled solo",
            "text": "Assumed this would be your standard Hilton Hotel and pretty much knew what to expect. However, the Hilton Polaris exceeded my expectations. From the Shuttle Drivers who took me to and from hotel to airport to the front desk staff to the restaurnt personnel, every staff member was especially friendly, professional, accomodating, pleasant, attentive, and made a big difference, during my 2 night stay. The location is great too, only 15 min. ride from airport (complimentary shuttle service) and close to many restaurants and the Polaris Mall.",
            "title": "Pleasantly Surprised!",
            "user": "ssilcg"
        },
        {
            "date": "February 11, 2012",
            "detail_rating": {
                "business": null,
                "cleanliness": 5.0,
                "desk": null,
                "location": 5.0,
                "pool": null,
                "restaurant": null,
                "rooms": 5.0,
                "service": 5.0,
                "sleep": 4.0,
                "value": 5.0
            },
            "helpfulness": null,
            "id": 124446104,
            "likes": {
                "disliked": null,
                "liked": null
            },
            "rating": 5.0,
            "stay_parameters": "Stayed February 2012, traveled solo",
            "text": "Requested a quiet room (was in Columbus due to sudden death of close friend) and was upgraded to room 911. Obviously, I was a bit hesitant about that room #, but decided to take that room anyhow. Great room, quiet, clean and spacious, w very comfy bed, luxurious bedding and towels. Appreciated the complimentary bottles of water!",
            "title": "Well-trained staff with comfortable surroundings",
            "user": "auditor152"
        },
        {
            "date": "December 29, 2011",
            "detail_rating": {
                "business": null,
                "cleanliness": 5.0,
                "desk": null,
                "location": 5.0,
                "pool": null,
                "restaurant": null,
                "rooms": 5.0,
                "service": 5.0,
                "sleep": 5.0,
                "value": 5.0
            },
            "helpfulness": 1,
            "id": 122252360,
            "likes": {
                "disliked": null,
                "liked": null
            },
            "rating": 5.0,
            "stay_parameters": "Stayed December 2011, traveled with family",
            "text": "Restaurant and Lounge both excellent with great food, ambience, and wait staff! Hosted Sunday brunch for 6 people and it was lovely and plentiful with lots of quality choices plus eggs, waffles, etc. made to order.",
            "title": "Tasteful, spacious, comfortable",
            "user": "Daniel S"
        },
        {
            "date": "December 26, 2011",
            "detail_rating": {
                "business": null,
                "cleanliness": 5.0,
                "desk": null,
                "location": 5.0,
                "pool": null,
                "restaurant": null,
                "rooms": 2.0,
                "service": 1.0,
                "sleep": 4.0,
                "value": 4.0
            },
            "helpfulness": 2,
            "id": 122121719,
            "likes": {
                "disliked": null,
                "liked": null
            },
            "rating": 2.0,
            "stay_parameters": "Stayed December 2011, traveled on business",
            "text": "As a smoker in a non-smoking hotel, I appreciated the hotel's efforts to provide outdoor areas w comfortable seating for smoking. Given it was Jan, the outside fire pit was especially welcoming.",
            "title": "Beautiful and new but operated by amateurs",
            "user": "BotRoad"
        },
        {
            "date": "November 28, 2011",
            "detail_rating": {
                "business": null,
                "cleanliness": 5.0,
                "desk": null,
                "location": 4.0,
                "pool": null,
                "restaurant": null,
                "rooms": 5.0,
                "service": 5.0,
                "sleep": 5.0,
                "value": 4.0
            },
            "helpfulness": null,
            "id": 121174770,
            "likes": {
                "disliked": null,
                "liked": null
            },
            "rating": 4.0,
            "stay_parameters": "Stayed November 2011, traveled on business",
            "text": "Highly recommend this hotel and would be delighted to stay there again.",
            "title": "Clean and perfect for a conference",
            "user": "jrice009"
        },
        {
            "date": "April 30, 2012",
            "detail_rating": {
                "business": null,
                "cleanliness": 5.0,
                "desk": null,
                "location": 5.0,
                "pool": null,
                "restaurant": null,
                "rooms": 5.0,
                "service": 3.0,
                "sleep": 5.0,
                "value": 4.0
            },
            "helpfulness": null,
            "id": 129112846,
            "likes": {
                "disliked": null,
                "liked": null
            },
            "rating": 4.0,
            "stay_parameters": "Stayed April 2012, traveled on business",
            "text": "We stayed at the Hilton Polaris for 2 nights for a conference this weekend. The rooms and conference areas were great and had no complaints on the look of the exterior or interior (maybe it's newer?). There were a lot of kids using the pool area and I think this would be a great stop for any family traveling on I71. There is plenty to do around the hotel with numerous restaurants and stores. When we checked out and returned home we discovered we left clothes hanging in the closet. When we called the hotel they transfered us to Housekeeping where we got their voicemail. We called back again and they told us they would transfer us again. After some prying, the hotel took our name (customer service was lacking here), but the next day we called back and housekeeping had our items. Would we stay here again - absolutely!",
            "title": "Pretty Good Hotel",
            "user": "ohiocouple"
        },
        {
            "date": "April 23, 2012",
            "detail_rating": {
                "business": null,
                "cleanliness": 5.0,
                "desk": null,
                "location": 4.0,
                "pool": null,
                "restaurant": null,
                "rooms": 5.0,
                "service": 5.0,
                "sleep": 5.0,
                "value": 4.0
            },
            "helpfulness": 1,
            "id": 128431848,
            "likes": {
                "disliked": null,
                "liked": null
            },
            "rating": 5.0,
            "stay_parameters": "Stayed April 2012, traveled on business",
            "text": "This hotel is what I would consider a benchmark for all hotels to try to mimic. The lobby has a beautiful fire feature and the staff was welcoming and efficient!",
            "title": "Wonderful Hotel",
            "user": "fenfusion"
        },
        {
            "date": "April 23, 2012",
            "detail_rating": {
                "business": null,
                "cleanliness": 4.0,
                "desk": null,
                "location": 3.0,
                "pool": null,
                "restaurant": null,
                "rooms": 4.0,
                "service": 5.0,
                "sleep": 4.0,
                "value": 5.0
            },
            "helpfulness": 1,
            "id": 128419866,
            "likes": {
                "disliked": null,
                "liked": null
            },
            "rating": 4.0,
            "stay_parameters": "Stayed April 2012, traveled on business",
            "text": "The room itself was spacious and had a functional layout and included interesting art.",
            "title": "Big rooms, seems very new",
            "user": "citysuburb"
        },
        {
            "date": "April 23, 2012",
            "detail_rating": {
                "business": null,
                "cleanliness": 5.0,
                "desk": null,
                "location": 4.0,
                "pool": null,
                "restaurant": null,
                "rooms": 4.0,
                "service": 5.0,
                "sleep": 3.0,
                "value": null
            },
            "helpfulness": 1,
            "id": 128412047,
            "likes": {
                "disliked": null,
                "liked": null
            },
            "rating": 4.0,
            "stay_parameters": "Stayed April 2012, traveled on business",
            "text": "The bathroom was amazing. The granite counter tops and tiled shower made me feel as though I was visiting a millionaire friend for the evening. The water pressure was almost too high, but after a long day of working in the military, it helped me relax.",
            "title": "Very Good hotel",
            "user": "pingos04"
        },
        {
            "date": "April 9, 2012",
            "detail_rating": {
                "business": null,
                "cleanliness": 5.0,
                "desk": null,
                "location": 5.0,
                "pool": null,
                "restaurant": null,
                "rooms": 5.0,
                "service": 5.0,
                "sleep": 5.0,
                "value": 5.0
            },
            "helpfulness": 2,
            "id": 127521350,
            "likes": {
                "disliked": null,
                "liked": null
            },
            "rating": 5.0,
            "stay_parameters": "Stayed April 2012, traveled with family",
            "text": "There isn't much nearby in the way of breakfast, so enjoy what the hotel has to offer.",
            "title": "Great Experience Reasonable Rate",
            "user": "IEBob"
        },
        {
            "date": "April 5, 2012",
            "detail_rating": {
                "business": null,
                "cleanliness": 5.0,
                "desk": null,
                "location": 5.0,
                "pool": null,
                "restaurant": null,
                "rooms": 4.0,
                "service": 4.0,
                "sleep": 4.0,
                "value": 5.0
            },
            "helpfulness": 2,
            "id": 127327638,
            "likes": {
                "disliked": null,
                "liked": null
            },
            "rating": 4.0,
            "stay_parameters": "Stayed March 2012, traveled on business",
            "text": "Hilton - Polaris is a solid, consitent \"business\" hotel located in a major retail hub in north Columbus. Rooms are large, clean and well turned out. The staff is friendly and helpful. The hotel has all of the 'usual\" amenities - pool, lounge, gym, business center, meeting facilites and I think that there is a spa there as well. There is great access to any number of retail and restaurant options - to include a very good steak house right in-front of the hotel. The only real distinguishing feature are the \"fire features\" out back - kinda neat burning torch type things. So take it for what it is - a nice, comfortable, consistent albiet generic business hotel with access to a ton of retail and restaurant options.",
            "title": "Solid, consistent business hotel with access to great retail/restaurants",
            "user": "daddyo-2"
        },
        {
            "date": "March 28, 2012",
            "detail_rating": {
                "business": null,
                "cleanliness": 5.0,
                "desk": null,
                "location": 5.0,
                "pool": null,
                "restaurant": null,
                "rooms": 5.0,
                "service": 5.0,
                "sleep": 5.0,
                "value": 4.0
            },
            "helpfulness": 1,
            "id": 126876586,
            "likes": {
                "disliked": null,
                "liked": null
            },
            "rating": 4.0,
            "stay_parameters": "Stayed February 2012, traveled on business",
            "text": "I have stayed at this hotel about 10 times in the past few years. I just love this hotel. The rooms are always clean and comfortable. I book the suite with the parlor which have been located at the end of the hall. There is no noise at all which is very important to me. The beds are comfortable with wonderful linens. It is located near many great restaurants and a mall. I have never had a problem at this hotel. Great place to stay.",
            "title": "Always stay here when in Columbus",
            "user": "xuna48"
        },
        {
            "date": "March 25, 2012",
            "detail_rating": {
                "business": null,
                "cleanliness": 5.0,
                "desk": null,
                "location": 5.0,
                "pool": null,
                "restaurant": null,
                "rooms": 5.0,
                "service": 5.0,
                "sleep": null,
                "value": 5.0
            },
            "helpfulness": 1,
            "id": 126635985,
            "likes": {
                "disliked": null,
                "liked": null
            },
            "rating": 5.0,
            "stay_parameters": "Stayed March 2012",
            "text": "Stayed one night while visting Columbus. Beautiful property with spacious rooms and a very friendly, accomodating staff. Great location to shopping and restaurants, free parking and easy access to the highways. Quick trip to downtown and getting on our way home quickly. Thoroughly enjoyed our stay.",
            "title": "Excellant hotel with a staff to match",
            "user": "BrandonPittsburgh"
        },
        {
            "date": "March 5, 2012",
            "detail_rating": {
                "business": null,
                "cleanliness": 5.0,
                "desk": null,
                "location": 5.0,
                "pool": null,
                "restaurant": null,
                "rooms": 5.0,
                "service": 5.0,
                "sleep": 5.0,
                "value": 5.0
            },
            "helpfulness": 1,
            "id": 125661378,
            "likes": {
                "disliked": null,
                "liked": null
            },
            "rating": 5.0,
            "stay_parameters": "Stayed December 2011, traveled with family",
            "text": "I have stayed here 2 times once with my family and once with just the hubby and enjoyed it both times, very nice location to all the resturaunts and shopping is fantastic",
            "title": "Love the hotel and location",
            "user": "smile_u_nut"
        },
        {
            "date": "February 29, 2012",
            "detail_rating": {
                "business": null,
                "cleanliness": 5.0,
                "desk": null,
                "location": 5.0,
                "pool": null,
                "restaurant": null,
                "rooms": 5.0,
                "service": 5.0,
                "sleep": 5.0,
                "value": 5.0
            },
            "helpfulness": null,
            "id": 125422104,
            "likes": {
                "disliked": null,
                "liked": null
            },
            "rating": 5.0,
            "stay_parameters": "Stayed February 2012, traveled on business",
            "text": "This newer Hilton property is a must-stay in the Columbus area! It's immaculate, modern, comfortable and in an excellent location with tons of restaurant and shopping choices! I stay there regularly for business and even brought my family to the hotel over the holidays and enjoyed the mall and the nice indoor pool.",
            "title": "Beautiful Hotel with 5 Star, Honest Staff!",
            "user": "hollishall"
        }
    ],
    "slim_ranking": 0.0287769784173,
    "stars": 3.5,
    "tripadvisor": {
        "VISITED": false,
        "country_name": null,
        "locality": null,
        "pic_link": null,
        "street_address": null
    },
    "user_rating": 4.5,
    "variance": {
        "average": 13,
        "excellent": 177,
        "poor": 3,
        "terrible": 4,
        "very good": 64
    }
}