{
    "aka": "Ramada Ballina",
    "description": "Ramada Hotel & Suites has 115 rooms consisting of hotel spa rooms, 1 and 2 bedroom suites and 2 and 3 bedroom penthouses, all with modern, stylish decor and all the facilities you would expect from an international class hotel.",
    "detail_rating": {
        "cleanliness": null,
        "location": null,
        "rooms": null,
        "service": null,
        "sleep": null,
        "value": null
    },
    "location": {
        "city": "Ballina",
        "continent": "South Pacific",
        "country": "Australia",
        "proposed_city": "Ramada",
        "province": null,
        "region": null
    },
    "name": "Ramada Hotel & Suites",
    "places": {
        "aka": [
            "Ramada"
        ],
        "hotel_description": [
            "Ramada"
        ],
        "hotel_name": [
            "Ramada"
        ]
    },
    "review_count": 238,
    "review_count_current": 20,
    "reviews": [
        {
            "date": "July 10, 2012",
            "detail_rating": {
                "business": null,
                "cleanliness": null,
                "desk": null,
                "location": null,
                "pool": null,
                "restaurant": null,
                "rooms": null,
                "service": null,
                "sleep": null,
                "value": null
            },
            "helpfulness": 1,
            "id": 133986083,
            "likes": {
                "disliked": null,
                "liked": null
            },
            "rating": 4.0,
            "stay_parameters": null,
            "text": "This is a modern hotel, situated right on the river. Well appointed room with lovely views.",
            "title": "Nice winter break by the river",
            "user": "Jetboy787"
        },
        {
            "date": "July 8, 2012",
            "detail_rating": {
                "business": null,
                "cleanliness": 5.0,
                "desk": null,
                "location": 5.0,
                "pool": null,
                "restaurant": null,
                "rooms": 5.0,
                "service": 5.0,
                "sleep": 5.0,
                "value": 4.0
            },
            "helpfulness": null,
            "id": 133740403,
            "likes": {
                "disliked": null,
                "liked": null
            },
            "rating": 4.0,
            "stay_parameters": "Stayed June 2012, traveled on business",
            "text": "I would not hesitate in recommending the spa room.",
            "title": "Beautiful rooms",
            "user": "KrisGrafton"
        },
        {
            "date": "July 1, 2012",
            "detail_rating": {
                "business": null,
                "cleanliness": 5.0,
                "desk": null,
                "location": 5.0,
                "pool": null,
                "restaurant": null,
                "rooms": 5.0,
                "service": 4.0,
                "sleep": 5.0,
                "value": 4.0
            },
            "helpfulness": null,
            "id": 133145480,
            "likes": {
                "disliked": null,
                "liked": null
            },
            "rating": 5.0,
            "stay_parameters": "Stayed June 2012, traveled on business",
            "text": "Very quiet and right inte centre of town.",
            "title": "Surprisingly Great!",
            "user": "Michael A"
        },
        {
            "date": "June 28, 2012",
            "detail_rating": {
                "business": null,
                "cleanliness": 5.0,
                "desk": null,
                "location": 5.0,
                "pool": null,
                "restaurant": null,
                "rooms": 5.0,
                "service": 5.0,
                "sleep": 5.0,
                "value": 5.0
            },
            "helpfulness": null,
            "id": 132935592,
            "likes": {
                "disliked": null,
                "liked": null
            },
            "rating": 5.0,
            "stay_parameters": "Stayed February 2012, traveled as a couple",
            "text": "Rooms are lovely with spa bath which open up into the room. Restaurant is great with very good coffee. Conference room was good and roomy but noise from the kitchen was distracting. Staff were all very helpful and 24 hour reception was excellent, good undercover secure parking.",
            "title": "Lovely place for a romantic getaway",
            "user": "BarbWeston"
        },
        {
            "date": "June 13, 2012",
            "detail_rating": {
                "business": null,
                "cleanliness": 5.0,
                "desk": null,
                "location": 5.0,
                "pool": null,
                "restaurant": null,
                "rooms": 5.0,
                "service": 5.0,
                "sleep": 4.0,
                "value": 4.0
            },
            "helpfulness": null,
            "id": 131869831,
            "likes": {
                "disliked": null,
                "liked": null
            },
            "rating": 5.0,
            "stay_parameters": "Stayed June 2012, traveled with family",
            "text": "Views are fantastic and it is close to the shopping centre.",
            "title": "Vinesh 612",
            "user": "vinesh d"
        },
        {
            "date": "May 2, 2012",
            "detail_rating": {
                "business": null,
                "cleanliness": 4.0,
                "desk": null,
                "location": 5.0,
                "pool": null,
                "restaurant": null,
                "rooms": 5.0,
                "service": 5.0,
                "sleep": 4.0,
                "value": 4.0
            },
            "helpfulness": null,
            "id": 129263913,
            "likes": {
                "disliked": null,
                "liked": null
            },
            "rating": 5.0,
            "stay_parameters": "Stayed April 2012, traveled as a couple",
            "text": "Such a great location in the main street of Ballina. The views to the river where the vista is unspoilt by development, affording glimpses of fishing vessels and other water craft, with mangroves in the distance behind. The one bedroom apartment is spacious and generous. An impressive well- appointed bathroom includes a large spa bath (which does need a certain amount of water to be operational). The over sized bedroom features a very comfortable king sized bed and ample room for your things, river views as well! The lounge/kitchen is spacious and includes all you need for a trouble free stay. Once again the river views are a welcome feature from every room and leave you with a relaxed and calm attitude as you sit and enjoy the scenery. The staff were extremely efficient and helpful, attending to requests promptly and courteously.",
            "title": "comfortable, peaceful and pristine river views",
            "user": "ninaoriana"
        },
        {
            "date": "April 22, 2012",
            "detail_rating": {
                "business": null,
                "cleanliness": 4.0,
                "desk": null,
                "location": 5.0,
                "pool": null,
                "restaurant": null,
                "rooms": 5.0,
                "service": 4.0,
                "sleep": 5.0,
                "value": 5.0
            },
            "helpfulness": null,
            "id": 128360416,
            "likes": {
                "disliked": null,
                "liked": null
            },
            "rating": 4.0,
            "stay_parameters": "Stayed April 2012, traveled with family",
            "text": "Stayed here for 1 night as we attended a Wedding in Ballina. Good room with spa overlooking the river. Modern decor and tea/coffee and toiletries included. King Size Bed was very comfortable. Restaurant & Bar onsite also pool. Indian restaurant and hair salon also in complex. My sister and I took advantage of the hair salon as we were going to the wedding. Checkout was 11am. Even though check-in was 2pm we let them know we were attending a wedding and they prepared our rooms quickly and we checked-in at 12.30.",
            "title": "Excellent Location overlooking the River",
            "user": "Robyn A"
        },
        {
            "date": "April 14, 2012",
            "detail_rating": {
                "business": null,
                "cleanliness": 5.0,
                "desk": null,
                "location": 5.0,
                "pool": null,
                "restaurant": null,
                "rooms": 5.0,
                "service": 5.0,
                "sleep": 5.0,
                "value": 4.0
            },
            "helpfulness": 1,
            "id": 127893192,
            "likes": {
                "disliked": null,
                "liked": null
            },
            "rating": 5.0,
            "stay_parameters": "Stayed April 2012, traveled as a couple",
            "text": "Walking distance to shops and restaurants and the Ballina RSL Club.",
            "title": "Great hotel",
            "user": "Swishytail"
        },
        {
            "date": "April 13, 2012",
            "detail_rating": {
                "business": null,
                "cleanliness": 5.0,
                "desk": null,
                "location": 4.0,
                "pool": null,
                "restaurant": null,
                "rooms": 5.0,
                "service": 4.0,
                "sleep": 4.0,
                "value": 3.0
            },
            "helpfulness": 1,
            "id": 127788402,
            "likes": {
                "disliked": null,
                "liked": null
            },
            "rating": 5.0,
            "stay_parameters": "Stayed April 2012, traveled as a couple",
            "text": "Great hotel, lovely room with an excellent river view and well looked after by the staff. I'll come back.",
            "title": "Perfect hotel for a quiet beach retreat.",
            "user": "julesher"
        },
        {
            "date": "April 10, 2012",
            "detail_rating": {
                "business": null,
                "cleanliness": 5.0,
                "desk": null,
                "location": 5.0,
                "pool": null,
                "restaurant": null,
                "rooms": 5.0,
                "service": 5.0,
                "sleep": 5.0,
                "value": 5.0
            },
            "helpfulness": null,
            "id": 127638986,
            "likes": {
                "disliked": null,
                "liked": null
            },
            "rating": 5.0,
            "stay_parameters": "Stayed April 2012, traveled on business",
            "text": "We didn't have a reservation and just showed up in the middle of the night. The staff was very helpful and kind. They found accommodation for us and made our check in process simple and diligent: something we really appreciated, since we were driving for hours.",
            "title": "A slice of Paradise",
            "user": "Pheephox"
        },
        {
            "date": "June 12, 2012",
            "detail_rating": {
                "business": null,
                "cleanliness": 5.0,
                "desk": null,
                "location": 5.0,
                "pool": null,
                "restaurant": null,
                "rooms": 5.0,
                "service": 5.0,
                "sleep": 5.0,
                "value": 5.0
            },
            "helpfulness": null,
            "id": 131864084,
            "likes": {
                "disliked": null,
                "liked": null
            },
            "rating": 5.0,
            "stay_parameters": "Stayed June 2012, traveled with family",
            "text": "I booked 4 rooms for my family and friends, rooms were spotless and so fresh, very impressive decor aswell, we were 13 of us , from owner Peter Nair to staff they made every effort to move things around so we can all enjoy evening together over looking richmond river, the view is second to none, service is great and all staff were very professional and price is so reasonable, not overrated and over price like byron, ballina is so lucky to have ramada,General manager karen and Mr Peter Nair you guys rock, thank you for making over weekend very memorable and enjoyoble",
            "title": "Family long weekend stay",
            "user": "danny s"
        },
        {
            "date": "June 6, 2012",
            "detail_rating": {
                "business": null,
                "cleanliness": 5.0,
                "desk": null,
                "location": 5.0,
                "pool": null,
                "restaurant": null,
                "rooms": 5.0,
                "service": 5.0,
                "sleep": 4.0,
                "value": 5.0
            },
            "helpfulness": null,
            "id": 131440493,
            "likes": {
                "disliked": null,
                "liked": null
            },
            "rating": 4.0,
            "stay_parameters": "Stayed June 2012, traveled as a couple",
            "text": "My husband and I recently stayed here for a night in a Hotel Spa Room to celebrate our Wedding Anniversary. We were given a great room on the 5th floor overlooking the beautiful Richmond River. We have stayed here before and noticed the positive changes in the hotel. On this occasion we were very impressed with the staff who professional, friendly and helpful in both the the front Desk and the Restaurant, which all helps to make your stay enjoyable and fun.",
            "title": "Wedding Anniversary Getaway",
            "user": "auaora"
        },
        {
            "date": "May 30, 2012",
            "detail_rating": {
                "business": null,
                "cleanliness": null,
                "desk": null,
                "location": null,
                "pool": null,
                "restaurant": null,
                "rooms": null,
                "service": null,
                "sleep": null,
                "value": null
            },
            "helpfulness": null,
            "id": 130983224,
            "likes": {
                "disliked": null,
                "liked": null
            },
            "rating": 5.0,
            "stay_parameters": null,
            "text": "For a town like Ballina which has just been bypassed and some businesses are suffering it was good to see this Hotel busy and operating smoothly.",
            "title": "A great stay!",
            "user": "Glynis031"
        },
        {
            "date": "May 29, 2012",
            "detail_rating": {
                "business": null,
                "cleanliness": 3.0,
                "desk": null,
                "location": 4.0,
                "pool": null,
                "restaurant": null,
                "rooms": 4.0,
                "service": 3.0,
                "sleep": null,
                "value": 3.0
            },
            "helpfulness": null,
            "id": 130848279,
            "likes": {
                "disliked": null,
                "liked": null
            },
            "rating": 3.0,
            "stay_parameters": "Stayed May 2012",
            "text": "Would recommend this to both couples and families for a relaxing break in a picturesque location.",
            "title": "Business Trip. Good rooms, good location. Average customer service.",
            "user": "Sd1973"
        },
        {
            "date": "May 26, 2012",
            "detail_rating": {
                "business": null,
                "cleanliness": 5.0,
                "desk": null,
                "location": 5.0,
                "pool": null,
                "restaurant": null,
                "rooms": 5.0,
                "service": 5.0,
                "sleep": null,
                "value": 5.0
            },
            "helpfulness": null,
            "id": 130654315,
            "likes": {
                "disliked": null,
                "liked": null
            },
            "rating": 5.0,
            "stay_parameters": "Stayed April 2012",
            "text": "I booked a \u201cMother\u2019s Day in May\u201d special for $150: a river view queen room, chocolates, a bottle of bubbly, and a designer (Peter Morrissey) loofah and bath bomb.",
            "title": "Beautiful location, fabulous service",
            "user": "Michelle T"
        },
        {
            "date": "May 14, 2012",
            "detail_rating": {
                "business": null,
                "cleanliness": 5.0,
                "desk": null,
                "location": 4.0,
                "pool": null,
                "restaurant": null,
                "rooms": 5.0,
                "service": 5.0,
                "sleep": 5.0,
                "value": 5.0
            },
            "helpfulness": 1,
            "id": 129915605,
            "likes": {
                "disliked": null,
                "liked": null
            },
            "rating": 5.0,
            "stay_parameters": "Stayed January 2012, traveled as a couple",
            "text": "We stayed here for 6 nights during a month long honeymoon in Australia during January 2012, we were originally looking at Byron Bay, but 6 nights here was more than half the price of 5 nights in Byron Bay, we had a hire car so getting around wasn't a problem.",
            "title": "Loved this hotel so much!",
            "user": "belindacoles"
        },
        {
            "date": "May 13, 2012",
            "detail_rating": {
                "business": null,
                "cleanliness": null,
                "desk": null,
                "location": null,
                "pool": null,
                "restaurant": null,
                "rooms": null,
                "service": null,
                "sleep": null,
                "value": null
            },
            "helpfulness": null,
            "id": 129854139,
            "likes": {
                "disliked": null,
                "liked": null
            },
            "rating": 5.0,
            "stay_parameters": null,
            "text": "On the first night we stayed in a Spa Hotel Room which overlooked the river, within moments of arriving we were sat on the balcony watching a dolphin and a turtle, a lovely welcome. The Hotel room was spacious and the bathroom was lovely and big with a walk in shower and a jacuzzi bath. There was also a laundry room outside our apartment (shared with the neighbouring room) and this came in handy.",
            "title": "Wonderful location great service",
            "user": "Julie E"
        },
        {
            "date": "May 13, 2012",
            "detail_rating": {
                "business": null,
                "cleanliness": 5.0,
                "desk": null,
                "location": 5.0,
                "pool": null,
                "restaurant": null,
                "rooms": 5.0,
                "service": 4.0,
                "sleep": 4.0,
                "value": 4.0
            },
            "helpfulness": null,
            "id": 129848005,
            "likes": {
                "disliked": null,
                "liked": null
            },
            "rating": 4.0,
            "stay_parameters": "Stayed May 2012, traveled as a couple",
            "text": "That evening we quickly realised that although beautiful, the town of Ballina was a little sleepy with not a massive variety of places to eat out, so we asked if we could upgrade to a 1 bedroom apartment, they allowed us to do this for something like an extra $20 per night. The apartment was AMAZING, we had a separate bedroom with a bathroom and small balcony and then had a large living area with full kitchen, dining table, sofa and large balcony overlooking the river - I would 100% recommend the apartments if you are staying more than a few nights and enjoy the flexibility of being able to cook your own meals, for us its a novelty as there are many wonderful fresh foods Australia has to offer than the UK doesn't.",
            "title": "Easy weekend away. Flawless.",
            "user": "lhalve10"
        },
        {
            "date": "May 11, 2012",
            "detail_rating": {
                "business": null,
                "cleanliness": 5.0,
                "desk": null,
                "location": 5.0,
                "pool": null,
                "restaurant": null,
                "rooms": 5.0,
                "service": 5.0,
                "sleep": 5.0,
                "value": 5.0
            },
            "helpfulness": 1,
            "id": 129778707,
            "likes": {
                "disliked": null,
                "liked": null
            },
            "rating": 5.0,
            "stay_parameters": "Stayed April 2012, traveled as a couple",
            "text": "The hotels bar service, food and drink was all very pleasant and each evening at sunset we would sit outside with a drink or a coffee, and also used this time to make use of the free bar wifi to keep in touch with family back home. Highly recommend their milkshakes :)",
            "title": "Great location",
            "user": "oj4u"
        },
        {
            "date": "May 9, 2012",
            "detail_rating": {
                "business": null,
                "cleanliness": 5.0,
                "desk": null,
                "location": 5.0,
                "pool": null,
                "restaurant": null,
                "rooms": 5.0,
                "service": 5.0,
                "sleep": 5.0,
                "value": 5.0
            },
            "helpfulness": null,
            "id": 129644162,
            "likes": {
                "disliked": null,
                "liked": null
            },
            "rating": 5.0,
            "stay_parameters": "Stayed April 2012, traveled as a couple",
            "text": "The immediate local area has a variety of small shops, take away food places and a few restaurants and bars, you can also walk to the big surf club where they serve meals as well. We had a car so we were able to explore some of the local areas, shopping centres, beaches and also took a day trip to Byron Bay.",
            "title": "Fantastic Hotel, sparkling and comfortable",
            "user": "GillingamJill"
        }
    ],
    "slim_ranking": 0.235294117647,
    "stars": 4.5,
    "tripadvisor": {
        "VISITED": false,
        "country_name": null,
        "locality": null,
        "pic_link": null,
        "street_address": null
    },
    "user_rating": 4.0,
    "variance": {
        "average": 23,
        "excellent": 103,
        "poor": 12,
        "terrible": 2,
        "very good": 98
    }
}