{
    "aka": "Four Seasons Resort Bali At Sayan Hotel Ubud",
    "description": null,
    "detail_rating": {
        "cleanliness": null,
        "location": null,
        "rooms": null,
        "service": null,
        "sleep": null,
        "value": null
    },
    "location": {
        "city": "Sayan",
        "continent": "Asia",
        "country": "Indonesia",
        "proposed_city": "Bali",
        "province": null,
        "region": null
    },
    "name": "Four Seasons Resort Bali at Sayan",
    "places": {
        "aka": [
            "Bali",
            "Ubud"
        ],
        "hotel_description": [],
        "hotel_name": [
            "Bali"
        ]
    },
    "review_count": 541,
    "review_count_current": 16,
    "reviews": [
        {
            "date": "August 6, 2007",
            "detail_rating": {
                "business": 5.0,
                "cleanliness": 5.0,
                "desk": null,
                "front_desk": 5.0,
                "location": 5.0,
                "pool": null,
                "restaurant": null,
                "rooms": 5.0,
                "service": 5.0,
                "sleep": null,
                "value": 5.0
            },
            "helpfulness": 2,
            "id": 8358900,
            "likes": {
                "disliked": null,
                "liked": null
            },
            "rating": 5.0,
            "stay_parameters": "Stayed July 2007",
            "text": "Four Seasons Resort - Sayan, Bali",
            "title": "Simply Bombastic!",
            "user": "asatkowiak"
        },
        {
            "date": "August 2, 2007",
            "detail_rating": {
                "business": null,
                "cleanliness": 5.0,
                "desk": null,
                "front_desk": 5.0,
                "location": 5.0,
                "pool": null,
                "restaurant": null,
                "rooms": 5.0,
                "service": 5.0,
                "sleep": null,
                "value": 5.0
            },
            "helpfulness": 2,
            "id": 8279158,
            "likes": {
                "disliked": "\u2014 Nothing (maybe a bit on food prices!)",
                "liked": "\u2014 Location, room & service"
            },
            "rating": 5.0,
            "stay_parameters": "Stayed July 2007, traveled with family",
            "text": "First Impression/Lobby - The Four Seasons Hotel and Resort Sayan in Bali is the epitome of warmth, beauty and style, all at it's best. Walking the long bridge from the drop-off center to reception, looking at the jungle all around you transports you to a",
            "title": "Beautiful location & wonderful service",
            "user": "babygenius"
        },
        {
            "date": "July 12, 2007",
            "detail_rating": {
                "business": null,
                "cleanliness": 5.0,
                "desk": null,
                "front_desk": 5.0,
                "location": 5.0,
                "pool": null,
                "restaurant": null,
                "rooms": 5.0,
                "service": 5.0,
                "sleep": null,
                "value": 5.0
            },
            "helpfulness": 2,
            "id": 8108946,
            "likes": {
                "disliked": null,
                "liked": "\u2014 The overall perfect experience"
            },
            "rating": 5.0,
            "stay_parameters": "Stayed January 2006, traveled as a couple",
            "text": "different place, physically, mentally and spiritually. Gone are the crowds and the hassles of normal day life, here is the peace and serenity that makes a place so special.",
            "title": "Once in a lifetime experience.....",
            "user": "G8RED"
        },
        {
            "date": "June 26, 2007",
            "detail_rating": {
                "business": null,
                "cleanliness": 5.0,
                "desk": null,
                "front_desk": 5.0,
                "location": 5.0,
                "pool": null,
                "restaurant": null,
                "rooms": 4.0,
                "service": 5.0,
                "sleep": null,
                "value": 4.0
            },
            "helpfulness": 2,
            "id": 8001783,
            "likes": {
                "disliked": "\u2014 Bed was noisy and uncomfortable",
                "liked": "\u2014 Very relaxing"
            },
            "rating": 5.0,
            "stay_parameters": "Stayed June 2007, traveled as a couple",
            "text": "I've described many places as having a warm welcome but Four Season Sayan takes it to a whole new level. From every person we saw it was a beautiful, truly",
            "title": "hard to beat",
            "user": "lindsay56"
        },
        {
            "date": "June 21, 2007",
            "detail_rating": {
                "business": 3.0,
                "cleanliness": 5.0,
                "desk": null,
                "front_desk": 4.0,
                "location": 4.0,
                "pool": null,
                "restaurant": null,
                "rooms": 5.0,
                "service": 4.0,
                "sleep": null,
                "value": 3.0
            },
            "helpfulness": 6,
            "id": 7956297,
            "likes": {
                "disliked": "\u2014 Service and overall value of the stay",
                "liked": "\u2014 Beautiful rooms and great breakfast at the Terrace Restaraunt"
            },
            "rating": 5.0,
            "stay_parameters": "Stayed June 2007, traveled as a couple",
            "text": "heartfelt welcome. Of all the places I visited in the world, Four Seasons Sayan knows the art of making a person feel welcome. It simply and easily just comes from their heart.",
            "title": "$ecluded Relaxation But...",
            "user": "akboxak"
        },
        {
            "date": "June 4, 2007",
            "detail_rating": {
                "business": 2.0,
                "cleanliness": 2.0,
                "desk": null,
                "front_desk": 3.0,
                "location": 4.0,
                "pool": null,
                "restaurant": null,
                "rooms": 2.0,
                "service": 2.0,
                "sleep": null,
                "value": 3.0
            },
            "helpfulness": 6,
            "id": 7753839,
            "likes": {
                "disliked": "\u2014 pretensious service",
                "liked": "\u2014 location"
            },
            "rating": 3.0,
            "stay_parameters": "Stayed April 2007, traveled with family",
            "text": "My husband and I have stayed in various resorts in Bali. When we came to FS Sayan, we found the location and the architecture very impressive. But, our villa looked tired inside. And, there were spider webs hanging down from the ceiling in our bathroom and sitting area. Our outdoor lounge chairs were so dirty that we did not want to use them. The in-room internet service did not work. We asked for assistance but still could not fix it.",
            "title": "Good but not Great Experience",
            "user": "Jwpositano"
        },
        {
            "date": "September 21, 2007",
            "detail_rating": {
                "business": 4.0,
                "cleanliness": 4.0,
                "desk": null,
                "front_desk": 2.0,
                "location": 4.0,
                "pool": null,
                "restaurant": null,
                "rooms": 4.0,
                "service": 3.0,
                "sleep": null,
                "value": 3.0
            },
            "helpfulness": 1,
            "id": 8841098,
            "likes": {
                "disliked": "\u2014 Too tricked-out; too big; poor room selection",
                "liked": "\u2014 River views and sounds"
            },
            "rating": 4.0,
            "stay_parameters": "Stayed September 2007, traveled as a couple",
            "text": "If we had come from the airport right to this hotel at the start of our Bali trip, I would be writing a much different review. However, after six days at Amankila on the coast, we had a more conservative view of Bali luxury, and this property was sort of too tricked out for us.",
            "title": "Not as wonderful as Amandari",
            "user": "strickles"
        },
        {
            "date": "September 18, 2007",
            "detail_rating": {
                "business": null,
                "cleanliness": 5.0,
                "desk": null,
                "front_desk": 5.0,
                "location": 5.0,
                "pool": null,
                "restaurant": null,
                "rooms": 5.0,
                "service": 5.0,
                "sleep": null,
                "value": 4.0
            },
            "helpfulness": 4,
            "id": 8753666,
            "likes": {
                "disliked": null,
                "liked": null
            },
            "rating": 5.0,
            "stay_parameters": "Stayed August 2007, traveled solo",
            "text": "In addition, we failed to see why the Four Seasons (which we have frequented at many locations in Europe over the years) would ask us if we had any special events that formed a basis for our visit when we made the reservation, and would then ignore it. We told the hotel it was a significant birthday for my wife, and our 20th anniversary that led to our trip. On arrival, we were shown to a pretty basic suite, that wasn't in a great location, and our apparent acknowledgement of our special circumstances were some rose petals sprinkled in a bathtub. We asked to see a nicer suite, and we were shown to a wonderful riverview room, but they insisted on a higher payment for it, despite our long history with the company and our reservation information. The same thing happened at the Four Seasons Singapore, at the end of our trip-they didn't even acknowledge our circumstances, let alone that we were dedicated prior customers of the chain.",
            "title": "Beauty and tranquility",
            "user": "John M"
        },
        {
            "date": "September 12, 2007",
            "detail_rating": {
                "business": 3.0,
                "cleanliness": 4.0,
                "desk": null,
                "front_desk": 4.0,
                "location": 4.0,
                "pool": null,
                "restaurant": null,
                "rooms": 3.0,
                "service": 3.0,
                "sleep": null,
                "value": 2.0
            },
            "helpfulness": 2,
            "id": 8703862,
            "likes": {
                "disliked": "\u2014 no privacy",
                "liked": "\u2014 the views"
            },
            "rating": 3.0,
            "stay_parameters": "Stayed September 2007, traveled as a couple",
            "text": "In any event, after dinner at Amandari, that property offered us an upgrade to a pool suite at less cost than the Four Seasons room, and at a much nicer property. Rather than a tricked-out somewhat artificial \"farm\" experience at Four Seasons, we had a real village farm right outside our suite, with trails and walks down to the river, and the highest level of personal attention one could ever ask for. We went from a hundred or more rooms on the property to one of just 20 to 30. So we left after one night at Sayan, and spent our next six days, and all of our dough, at Amandari.",
            "title": "Needs some polish, just not the best",
            "user": "coops822"
        },
        {
            "date": "September 1, 2007",
            "detail_rating": {
                "business": 5.0,
                "cleanliness": 5.0,
                "desk": null,
                "location": 5.0,
                "pool": null,
                "restaurant": null,
                "rooms": null,
                "service": 5.0,
                "sleep": null,
                "value": 5.0
            },
            "helpfulness": 3,
            "id": 8602424,
            "likes": {
                "disliked": "\u2014 -",
                "liked": "\u2014 Cinema, cinema ..."
            },
            "rating": 5.0,
            "stay_parameters": "Stayed July 2006, traveled as a couple",
            "text": "You can check out our reviews of Amandari and Amankila elsewhere on Trip Advisor. We didn't regret our move for one second. We have a full photo blog link of our time on Bali on the Amankila posting.",
            "title": "Great architecture, spectacular location.",
            "user": "Tadzio76"
        },
        {
            "date": "August 12, 2007",
            "detail_rating": {
                "business": 5.0,
                "cleanliness": 5.0,
                "desk": null,
                "front_desk": 5.0,
                "location": 5.0,
                "pool": null,
                "restaurant": null,
                "rooms": 5.0,
                "service": 5.0,
                "sleep": null,
                "value": 5.0
            },
            "helpfulness": 3,
            "id": 8399811,
            "likes": {
                "disliked": "\u2014 my short staying",
                "liked": "\u2014 location, secluded villa, excellent service"
            },
            "rating": 5.0,
            "stay_parameters": "Stayed July 2007, traveled as a couple",
            "text": "I spent three nights here in August at the end of a business trip through Asia and only have gushing compliments for this place. I was a bit apprehensive given some of the negative comments I read here but can't imagine they stayed at the same resort. From the moment you arrive, you're transported to this other world of peace and tranquility.",
            "title": "2 nights in paradise",
            "user": "viajecitosmil"
        },
        {
            "date": "December 13, 2007",
            "detail_rating": {
                "business": 4.0,
                "cleanliness": 5.0,
                "desk": null,
                "front_desk": 5.0,
                "location": 5.0,
                "pool": null,
                "restaurant": null,
                "rooms": 5.0,
                "service": 5.0,
                "sleep": null,
                "value": 5.0
            },
            "helpfulness": 2,
            "id": 11537212,
            "likes": {
                "disliked": "\u2014 Stairs...there are a lot of them!!!",
                "liked": "\u2014 Service, Architecture, Remoteness"
            },
            "rating": 5.0,
            "stay_parameters": "Stayed December 2007, traveled as a couple",
            "text": "Having stayed in many other luxury (5+ star) resorts around the world including Vanuatu, Tahiti, Hawaii, Australia (Noosa, Hayman Island, etc), I have to rate this on par with some of the world's best in terms of service.",
            "title": "Service Excellence",
            "user": "lafffer"
        },
        {
            "date": "December 12, 2007",
            "detail_rating": {
                "business": 3.0,
                "cleanliness": 5.0,
                "desk": null,
                "front_desk": 5.0,
                "location": 5.0,
                "pool": null,
                "restaurant": null,
                "rooms": 5.0,
                "service": 5.0,
                "sleep": null,
                "value": 5.0
            },
            "helpfulness": null,
            "id": 11504648,
            "likes": {
                "disliked": null,
                "liked": null
            },
            "rating": 5.0,
            "stay_parameters": "Stayed September 2007, traveled as a couple",
            "text": "The negatives exhibited by some others here are all easily addressed if you speak to someone. For example, if you don't like your villa, ask to be moved and your issues will be resolved if there is availability. We made sure that our special requirements were communicated ahead of time and checked that the communication got through despite our travel agents confirming them. Moral of the story is - if its special, you make sure the job is done right.",
            "title": "beautiful , just lovely!!!",
            "user": "aman23"
        },
        {
            "date": "December 11, 2007",
            "detail_rating": {
                "business": null,
                "cleanliness": null,
                "desk": null,
                "location": null,
                "pool": null,
                "restaurant": null,
                "rooms": null,
                "service": null,
                "sleep": null,
                "value": null
            },
            "helpfulness": 2,
            "id": 11485761,
            "likes": {
                "disliked": null,
                "liked": null
            },
            "rating": 5.0,
            "stay_parameters": null,
            "text": "The Good: Service (exemplary) - they remember your name even if you call them several days after you have checked out!!!, architecture/scenery (lush green like you are in a forest), remoteness (doesn't get quieter/more remote than this in a luxury resort in Bali), in-room cleanliness (no dust even on the mosquito nets!!! and no geckos got into our room - that is an achievement in itself if you know Bali), room facilities (love the large bathroom), hotel facilities including bar and restaurant - the food is some of the best in Bali which you can experience in a hotel/resort.",
            "title": "Nice",
            "user": "Grubber22"
        },
        {
            "date": "October 22, 2007",
            "detail_rating": {
                "business": 3.0,
                "cleanliness": 5.0,
                "desk": null,
                "front_desk": 5.0,
                "location": 5.0,
                "pool": null,
                "restaurant": null,
                "rooms": 5.0,
                "service": 5.0,
                "sleep": null,
                "value": 4.0
            },
            "helpfulness": 2,
            "id": 10225288,
            "likes": {
                "disliked": "\u2014 Nothing!",
                "liked": "\u2014 Location, Staff and Rooms!"
            },
            "rating": 5.0,
            "stay_parameters": "Stayed September 2007, traveled as a couple",
            "text": "The Bad: Buggy wait times can vary depending on how busy they are, Spa experience isn't the best but still acceptable, restaurant service can fluctuate (they took away our forks when there was still a plate of danish pastry sitting there expecting us to eat with our fingers I guess).",
            "title": "A really Amazing Hotel...",
            "user": "mandymoo32"
        },
        {
            "date": "September 25, 2007",
            "detail_rating": {
                "business": null,
                "cleanliness": 5.0,
                "desk": null,
                "front_desk": 5.0,
                "location": 5.0,
                "pool": null,
                "restaurant": null,
                "rooms": 5.0,
                "service": 5.0,
                "sleep": null,
                "value": 5.0
            },
            "helpfulness": 1,
            "id": 10002418,
            "likes": {
                "disliked": null,
                "liked": null
            },
            "rating": 5.0,
            "stay_parameters": "Stayed August 2006, traveled as a couple",
            "text": "Overall, the bad wasn't enough for us to say we won't be returning to this place. In fact, we plan to come back here whenever Ubud is on our travel agenda.",
            "title": "Perfect!",
            "user": "Asliko"
        }
    ],
    "slim_ranking": 0.5,
    "stars": 5,
    "tripadvisor": {
        "VISITED": false,
        "country_name": null,
        "locality": null,
        "pic_link": null,
        "street_address": null
    },
    "user_rating": 4.5,
    "variance": {
        "average": 12,
        "excellent": 449,
        "poor": 9,
        "terrible": 8,
        "very good": 63
    }
}