{
    "aka": "Sofitel Queenstown Hotel And Spa",
    "description": "Experience a new level of sophistication at Sofitel Queenstown Hotel and Spa recently awarded only Qualmark Exclusive Hotel. Inspired by the charms of Paris and the charisma of Queenstown hospitality, be mesmerized by its tasteful combination of French antique chic and local avant-garde design. Centrally located and providing exceptional personal service the hotel truly embodies the Sofitel concept \u2018art de vivre\u2019 \u2013 the art of living. The lobby and lounge flow into a resplendent reception enclave, invoking the panache of Paris and warm hospitality inherent to any Queenstown stay. Elegantly appointed rooms and suites feature comforts such as Sofitel\u2019s sumptuous 'MyBed', double spa bath and separate walk-in rain shower. Modern surround sound LCD TV/DVD players entertain in bedroom and bathroom, a pillow menu and plush New Zealand possum throws add yet another fine touch. Hotel facilities include signature restaurant, Vie, an intimate Nue Lounge and the luxurious Left Bank Caf\u00e9 \u2013 part French kitchen, part tea room \u2013 open for breakfast and lunch in charming Paris fashion. The \u2018piece de resistance\u2019 is LeSpa, a relaxing haven where mind, body and spirit unite. Using French and New Zealand products, LeSpa\u2019s lavish treatments, which include a traditional Maori rituals and Hammam steam room, place strong emphasis on balance, well being and regeneration.",
    "detail_rating": {
        "cleanliness": 5.0,
        "location": 5.0,
        "rooms": 4.5,
        "service": 4.5,
        "sleep": 4.5,
        "value": 4.5
    },
    "location": {
        "city": null,
        "continent": "South Pacific",
        "country": "New Zealand",
        "proposed_city": "Queenstown",
        "province": null,
        "region": "South Island"
    },
    "name": "Sofitel Queenstown Hotel & Spa",
    "places": {
        "aka": [
            "Queenstown"
        ],
        "hotel_description": [
            "Queenstown",
            "Paris"
        ],
        "hotel_name": [
            "Queenstown"
        ]
    },
    "review_count": 633,
    "review_count_current": 18,
    "reviews": [
        {
            "date": "September 3, 2008",
            "detail_rating": {
                "business": 5.0,
                "cleanliness": 5.0,
                "desk": null,
                "front_desk": 2.0,
                "location": 3.0,
                "pool": null,
                "restaurant": null,
                "rooms": 5.0,
                "service": 5.0,
                "sleep": null,
                "value": 4.0
            },
            "helpfulness": null,
            "id": 19721260,
            "likes": {
                "disliked": "\u2014 The wait at reception when we arrived",
                "liked": "\u2014 The free upgrade"
            },
            "rating": 4.0,
            "stay_parameters": "Stayed January 2008, traveled as a couple",
            "text": "Ok well the first thing I have to tell you is that we booked this hotel a superior lake view room about 8 months in advance, when we arrived ( on our wedding anniversary) we had a long wait in reception. being told our room wasnt ready, this was mid way through the afternoon, we was not pleased as we only planned to stay 2 nights before moving on. We were offered free coffee or drinks while we were waiting. This would have been good, however time was passing and there was no sign of the drinks we ordered. We had to continually ask at rerception how long before our room was ready after a age about 1 hour or so we were called to reception and given a key after checking in .",
            "title": "Confusion at the Sofitel",
            "user": "UkSand"
        },
        {
            "date": "August 20, 2008",
            "detail_rating": {
                "business": 5.0,
                "cleanliness": 4.0,
                "desk": null,
                "front_desk": 1.0,
                "location": 5.0,
                "pool": null,
                "restaurant": null,
                "rooms": 5.0,
                "service": 1.0,
                "sleep": null,
                "value": 4.0
            },
            "helpfulness": null,
            "id": 19150487,
            "likes": {
                "disliked": "\u2014 Slow Staff & cant speek English",
                "liked": "\u2014 The Room"
            },
            "rating": 4.0,
            "stay_parameters": "Stayed July 2007, traveled with family",
            "text": "When we reached the room we were first of all delighted as we had been upgraded to a suite at no extra cost. The only thing was we didnt have a view as we had booked a lake view. but hey the suite made up for it we did have a small ballcony and the suite its self was of a very high standard infact it was excellent. very tastfully decorated with fantastic furnishings. Bathroom was amazing .",
            "title": "Excellent Hotel.... Bad Service....",
            "user": "ntegra"
        },
        {
            "date": "August 4, 2008",
            "detail_rating": {
                "business": null,
                "cleanliness": 5.0,
                "desk": null,
                "front_desk": 4.0,
                "location": 5.0,
                "pool": null,
                "restaurant": null,
                "rooms": 5.0,
                "service": 5.0,
                "sleep": null,
                "value": 5.0
            },
            "helpfulness": null,
            "id": 18589103,
            "likes": {
                "disliked": null,
                "liked": null
            },
            "rating": 5.0,
            "stay_parameters": "Stayed June 2008, traveled as a couple",
            "text": "One night we decided to have room service for our evening meal as the suite was so wonderful we decided to eat out one night and eat in the other. Room service was great, food was excellent",
            "title": "Loved this hotel",
            "user": "corky_c"
        },
        {
            "date": "July 17, 2008",
            "detail_rating": {
                "business": 5.0,
                "cleanliness": 5.0,
                "desk": null,
                "front_desk": 5.0,
                "location": 5.0,
                "pool": null,
                "restaurant": null,
                "rooms": 5.0,
                "service": 5.0,
                "sleep": null,
                "value": 4.0
            },
            "helpfulness": 1,
            "id": 17996334,
            "likes": {
                "disliked": "\u2014 I had to go home eventually!",
                "liked": "\u2014 Staff, rooms, location"
            },
            "rating": 5.0,
            "stay_parameters": "Stayed June 2008, traveled as a couple",
            "text": "all in all this hotel is a fantastic experience.",
            "title": "Great rooms, great staff, great location.",
            "user": "atob"
        },
        {
            "date": "June 27, 2008",
            "detail_rating": {
                "business": 5.0,
                "cleanliness": 5.0,
                "desk": null,
                "front_desk": 5.0,
                "location": 5.0,
                "pool": null,
                "restaurant": null,
                "rooms": 5.0,
                "service": 5.0,
                "sleep": null,
                "value": 5.0
            },
            "helpfulness": null,
            "id": 17292883,
            "likes": {
                "disliked": "\u2014 n/a",
                "liked": "\u2014 The suite we stayed in was amazing!"
            },
            "rating": 5.0,
            "stay_parameters": "Stayed June 2008, traveled as a couple",
            "text": "However, the hotel is not directlty on the lake it has a few buildings in front of it and the hotel its self isnt so tall, so Im not sure how much of a view we would have had.",
            "title": "Honeymoon in Heaven!!!",
            "user": "cxbsju"
        },
        {
            "date": "May 19, 2008",
            "detail_rating": {
                "business": 3.0,
                "cleanliness": 5.0,
                "desk": null,
                "front_desk": 4.0,
                "location": 5.0,
                "pool": null,
                "restaurant": null,
                "rooms": 5.0,
                "service": 4.0,
                "sleep": null,
                "value": 5.0
            },
            "helpfulness": null,
            "id": 16195035,
            "likes": {
                "disliked": "\u2014 Stuffy Staff",
                "liked": "\u2014 Design"
            },
            "rating": 5.0,
            "stay_parameters": "Stayed August 2007, traveled solo",
            "text": "Nice Hotel by mainstream NZ hotel standards. Nice features in all the rooms, with some nice touches like the underfloor heating, tv in the bathroom, coffee machine etc...",
            "title": "Very Enjoyable Stay",
            "user": "hotelier021"
        },
        {
            "date": "May 19, 2008",
            "detail_rating": {
                "business": 3.0,
                "cleanliness": 4.0,
                "desk": null,
                "front_desk": 5.0,
                "location": 5.0,
                "pool": null,
                "restaurant": null,
                "rooms": 5.0,
                "service": 4.0,
                "sleep": null,
                "value": 5.0
            },
            "helpfulness": null,
            "id": 16184971,
            "likes": {
                "disliked": "\u2014 Breakfast buffet",
                "liked": "\u2014 Size and comfort of room, spa services"
            },
            "rating": 4.0,
            "stay_parameters": "Stayed May 2008, traveled as a couple",
            "text": "Stayed at the hotel on several occasions. Its a great example of NZ design. Great location.",
            "title": "Lovely rooms, but some teething issues?",
            "user": "bluegoldhighlander"
        },
        {
            "date": "April 21, 2008",
            "detail_rating": {
                "business": 4.0,
                "cleanliness": 5.0,
                "desk": null,
                "front_desk": 4.0,
                "location": 5.0,
                "pool": null,
                "restaurant": null,
                "rooms": 5.0,
                "service": 5.0,
                "sleep": null,
                "value": 5.0
            },
            "helpfulness": null,
            "id": 15198280,
            "likes": {
                "disliked": "\u2014 I guess the hotel restaraunts, some issues with the TV, water on bathroom floor",
                "liked": "\u2014 bed, bathroom, balcony view, location"
            },
            "rating": 5.0,
            "stay_parameters": "Stayed April 2008, traveled as a couple",
            "text": "If your the type to stare out your window for hours then the St Moritz or new Rooms at the Novotel might be for you. But if your keen to explore Queenstown then the Sofitel is a great place to be.",
            "title": "Fabulous Honeymoon Stay",
            "user": "Diefy"
        },
        {
            "date": "February 2, 2008",
            "detail_rating": {
                "business": 5.0,
                "cleanliness": 5.0,
                "desk": null,
                "front_desk": 4.0,
                "location": 5.0,
                "pool": null,
                "restaurant": null,
                "rooms": 5.0,
                "service": 4.0,
                "sleep": null,
                "value": 4.0
            },
            "helpfulness": null,
            "id": 13217961,
            "likes": {
                "disliked": "\u2014 restaurant could do with improvement",
                "liked": "\u2014 Location and quality of rooms"
            },
            "rating": 5.0,
            "stay_parameters": "Stayed January 2008, traveled with family",
            "text": "All of the hotels dinner restaurants are great. Try the code bar while your there.",
            "title": "Great Hotel",
            "user": "munjarra"
        },
        {
            "date": "January 19, 2008",
            "detail_rating": {
                "business": null,
                "cleanliness": 3.0,
                "desk": null,
                "front_desk": 2.0,
                "location": 2.0,
                "pool": null,
                "restaurant": null,
                "rooms": 4.0,
                "service": 1.0,
                "sleep": null,
                "value": 1.0
            },
            "helpfulness": 3,
            "id": 12802152,
            "likes": {
                "disliked": "\u2014 The service",
                "liked": "\u2014 Large rooms"
            },
            "rating": 2.0,
            "stay_parameters": "Stayed January 2008, traveled with family",
            "text": "All in all a good choice at a reasonable price in Queenstown.",
            "title": "Doesn't deserve its five star rating",
            "user": "cwoodhead"
        },
        {
            "date": "December 16, 2007",
            "detail_rating": {
                "business": null,
                "cleanliness": 5.0,
                "desk": null,
                "front_desk": 5.0,
                "location": 5.0,
                "pool": null,
                "restaurant": null,
                "rooms": 5.0,
                "service": 5.0,
                "sleep": null,
                "value": 5.0
            },
            "helpfulness": 2,
            "id": 11586222,
            "likes": {
                "disliked": "\u2014 Nothing",
                "liked": "\u2014 Gorgeous Room"
            },
            "rating": 5.0,
            "stay_parameters": "Stayed December 2007, traveled as a couple",
            "text": "This is an amazing hotel and definitely far surpasses any other Sofitel I've stayed in.",
            "title": "Possibly the worlds best Sofitel",
            "user": "splatnz"
        },
        {
            "date": "December 4, 2007",
            "detail_rating": {
                "business": null,
                "cleanliness": 5.0,
                "desk": null,
                "front_desk": 4.0,
                "location": 5.0,
                "pool": null,
                "restaurant": null,
                "rooms": 5.0,
                "service": 5.0,
                "sleep": null,
                "value": 4.0
            },
            "helpfulness": 5,
            "id": 11246713,
            "likes": {
                "disliked": null,
                "liked": null
            },
            "rating": 5.0,
            "stay_parameters": "Stayed November 2007",
            "text": "Likes:",
            "title": "Excellent stay",
            "user": "grover_tx"
        },
        {
            "date": "November 2, 2007",
            "detail_rating": {
                "business": null,
                "cleanliness": null,
                "desk": null,
                "location": null,
                "pool": null,
                "restaurant": null,
                "rooms": null,
                "service": null,
                "sleep": null,
                "value": null
            },
            "helpfulness": 2,
            "id": 10527562,
            "likes": {
                "disliked": null,
                "liked": null
            },
            "rating": 2.0,
            "stay_parameters": null,
            "text": "- Amazing room",
            "title": "upside down",
            "user": "gidgetsurf"
        },
        {
            "date": "September 19, 2007",
            "detail_rating": {
                "business": null,
                "cleanliness": 5.0,
                "desk": null,
                "front_desk": 5.0,
                "location": 5.0,
                "pool": null,
                "restaurant": null,
                "rooms": 5.0,
                "service": null,
                "sleep": null,
                "value": 5.0
            },
            "helpfulness": 6,
            "id": 8822731,
            "likes": {
                "disliked": "\u2014 nothing",
                "liked": "\u2014 Everything"
            },
            "rating": 5.0,
            "stay_parameters": "Stayed September 2007, traveled as a couple",
            "text": "- Real coffee-machine in-room",
            "title": "Stay at the Sofitel in Queenstown",
            "user": "acctgdweeb001"
        },
        {
            "date": "August 4, 2007",
            "detail_rating": {
                "business": 3.0,
                "cleanliness": 5.0,
                "desk": null,
                "front_desk": 4.0,
                "location": 5.0,
                "pool": null,
                "restaurant": null,
                "rooms": 5.0,
                "service": 5.0,
                "sleep": null,
                "value": 4.0
            },
            "helpfulness": 6,
            "id": 8351591,
            "likes": {
                "disliked": "\u2014 no wifi",
                "liked": "\u2014 location, amenities in the room"
            },
            "rating": 5.0,
            "stay_parameters": "Stayed May 2007, traveled solo",
            "text": "- Very nice bathroom with L'Occitane amenities",
            "title": "One of my best hotel stays ever!",
            "user": "BeforeSunrise"
        },
        {
            "date": "June 19, 2007",
            "detail_rating": {
                "business": null,
                "cleanliness": 4.0,
                "desk": null,
                "front_desk": 4.0,
                "location": 5.0,
                "pool": null,
                "restaurant": null,
                "rooms": 5.0,
                "service": 4.0,
                "sleep": null,
                "value": 4.0
            },
            "helpfulness": 4,
            "id": 7936000,
            "likes": {
                "disliked": "\u2014 Lacks character",
                "liked": "\u2014 Location, comfort"
            },
            "rating": 4.0,
            "stay_parameters": "Stayed June 2007, traveled as a couple",
            "text": "We stayed in an upper floor lakeview room at the end of May 2007.",
            "title": "Can't beat the location",
            "user": "SussexCpl"
        },
        {
            "date": "May 27, 2007",
            "detail_rating": {
                "business": 5.0,
                "cleanliness": 5.0,
                "desk": null,
                "front_desk": 5.0,
                "location": 5.0,
                "pool": null,
                "restaurant": null,
                "rooms": 5.0,
                "service": 5.0,
                "sleep": null,
                "value": 5.0
            },
            "helpfulness": 2,
            "id": 7702991,
            "likes": {
                "disliked": "\u2014 The Spa wasn't opend !!",
                "liked": "\u2014 The Bed"
            },
            "rating": 5.0,
            "stay_parameters": "Stayed May 2007, traveled as a couple",
            "text": "Sofitel Queenstown deserves the good reviews it has received on TA. Location is great \u2013 right in town, but one block back from the busy streets, so suffers from little noise. Paying extra for a lake view isn\u2019t worth it though. The view is only of a small section of water, and balconies are tiny. Mountain views are arguably better \u2013 fewer ugly rooftops.",
            "title": "Best Hotel in Asia/Pacific",
            "user": "sarahdr"
        },
        {
            "date": "January 1, 2007",
            "detail_rating": {
                "business": 3.0,
                "cleanliness": 2.0,
                "desk": null,
                "front_desk": 3.0,
                "location": 5.0,
                "pool": null,
                "restaurant": null,
                "rooms": 5.0,
                "service": 3.0,
                "sleep": null,
                "value": 4.0
            },
            "helpfulness": 9,
            "id": 6534223,
            "likes": {
                "disliked": null,
                "liked": "\u2014 Location, modern amenities"
            },
            "rating": 4.0,
            "stay_parameters": "Stayed December 2006, traveled as a couple",
            "text": "Check-in was very easy, and staff professional. Only criticisms are that the reception and lounge/bar areas are a bit bland and soulless, and porter difficult to find. We were given a voucher for a welcome drink in front of the fire on the first night.",
            "title": "Comfortable stay in a great location",
            "user": "5*fan"
        }
    ],
    "slim_ranking": 0.16393442623,
    "stars": 5,
    "tripadvisor": {
        "VISITED": false,
        "country_name": null,
        "locality": null,
        "pic_link": null,
        "street_address": null
    },
    "user_rating": 4.5,
    "variance": {
        "average": 41,
        "excellent": 446,
        "poor": 19,
        "terrible": 7,
        "very good": 120
    }
}