{
    "aka": null,
    "description": "Cesis is one of the most beautiful towns in Latvia with an ancient history and traditions. It has a unique combination of gardens and parks, historical buildings, narrow roadways, wooden houses and lovely squares. Kolonna Hotel Cesis is situated in the very centre of the town, near the city park. The historical scenery of the town is adorned by the Castle of the Livonian Order (1206), Cesis New Castle and St. John\u2019s Church (1284). This hotel was built 1938 and its first name was Tervete. Later it was renamed Hotel Cesis. In December 2005, the hotel became a member of the Kolonna Hotels Group. Kolonna Hotels Cesis offers 40 rooms and can accommodate up to 77 guests. For the guests comfort, hotel offers cozy and comfortable sauna and solarium. The hotel accepts payment in Latvian lats, major local and international Credit Cards: Euro Card/ Master Card, American Express, Visa Card, Visa Electron.",
    "detail_rating": {
        "cleanliness": null,
        "location": null,
        "rooms": null,
        "service": null,
        "sleep": null,
        "value": null
    },
    "location": {
        "city": "Cesis",
        "continent": "Europe",
        "country": "Latvia",
        "proposed_city": null,
        "province": null,
        "region": "Vidzeme Region"
    },
    "name": "Kolonna Hotel Cesis",
    "places": {
        "aka": [],
        "hotel_description": [],
        "hotel_name": []
    },
    "review_count": 20,
    "review_count_current": 2,
    "reviews": [
        {
            "date": "August 13, 2007",
            "detail_rating": {
                "business": 4.0,
                "cleanliness": 5.0,
                "desk": null,
                "front_desk": 5.0,
                "location": 5.0,
                "pool": null,
                "restaurant": null,
                "rooms": 4.0,
                "service": 4.0,
                "sleep": null,
                "value": 5.0
            },
            "helpfulness": 2,
            "id": 8405770,
            "likes": {
                "disliked": "\u2014 A bit predictable, lack of originality",
                "liked": "\u2014 Location, cleanliness"
            },
            "rating": 4.0,
            "stay_parameters": "Stayed August 2007, traveled as a couple",
            "text": "Kolonna is a very well-known brand in Latvia. They have the biggest chain of perfume shops, a leading real estate agency and they recently started building a chain of hotels.",
            "title": "Nice (But a little generic)",
            "user": "angli4anin"
        },
        {
            "date": "May 19, 2007",
            "detail_rating": {
                "business": 3.0,
                "cleanliness": 5.0,
                "desk": null,
                "location": 5.0,
                "pool": null,
                "restaurant": null,
                "rooms": 5.0,
                "service": 4.0,
                "sleep": null,
                "value": 5.0
            },
            "helpfulness": 2,
            "id": 7645295,
            "likes": {
                "disliked": null,
                "liked": "\u2014 Quality accomodation at a reasonable price in an interesting area"
            },
            "rating": 5.0,
            "stay_parameters": "Stayed May 2007, traveled on business",
            "text": "I had read good things about the one in Riga and also the first review of their one in Cesis was also very positive. My research showed no other hotels in Cesis were of international quality, so there really was no question as to where we would stay.",
            "title": "Mountain Biking in Latvia",
            "user": "Russelluk"
        }
    ],
    "slim_ranking": 0.5,
    "stars": null,
    "tripadvisor": {
        "VISITED": false,
        "country_name": null,
        "locality": null,
        "pic_link": null,
        "street_address": null
    },
    "user_rating": 3.5,
    "variance": {
        "average": 6,
        "excellent": 3,
        "poor": 3,
        "terrible": 0,
        "very good": 8
    }
}