{
    "aka": "Roodenburg House Cape Town, South Africa",
    "description": "This beautifully restored 1882 Arts and Crafts residence is set in the heart of leafy Rondebosch, close to sports stadia and UCT. Luxury and comfort with air-conditioned bedrooms, original art work, fireplaces, stylish bar and lounges, gym and saltwater pool set in tranquil gardens. DSTV and WiFi. Gourmet breakfasts alfresco or indoors, with home cooked dinners offered. Spa treatments arranged. Conferences for up to 20. Easy access to City and airport. TGCSA 4-Star Guest House | Secure gated parking | Children welcome",
    "detail_rating": {
        "cleanliness": null,
        "location": null,
        "rooms": null,
        "service": null,
        "sleep": null,
        "value": null
    },
    "location": {
        "city": null,
        "continent": "Africa",
        "country": "South Africa",
        "proposed_city": "Rondebosch",
        "province": null,
        "region": null
    },
    "name": "Roodenburg House",
    "places": {
        "aka": [],
        "hotel_description": [
            "Rondebosch"
        ],
        "hotel_name": []
    },
    "review_count": 61,
    "review_count_current": 20,
    "reviews": [
        {
            "date": "January 12, 2012",
            "detail_rating": {
                "business": null,
                "cleanliness": 5.0,
                "desk": null,
                "location": 5.0,
                "pool": null,
                "restaurant": null,
                "rooms": 5.0,
                "service": 5.0,
                "sleep": 5.0,
                "value": 5.0
            },
            "helpfulness": null,
            "id": 122998134,
            "likes": {
                "disliked": null,
                "liked": null
            },
            "rating": 5.0,
            "stay_parameters": "Stayed December 2011, traveled solo",
            "text": "I had an excellent stay at this guesthouse. Luxurious comfortable rooms, great staff, delicious breakfast and very conveniently located. One of the best places I have stayed at. I would definitely recommend it.",
            "title": "Wonderful guesthouse and great location",
            "user": "Estelle H"
        },
        {
            "date": "December 5, 2011",
            "detail_rating": {
                "business": null,
                "cleanliness": 5.0,
                "desk": null,
                "location": 5.0,
                "pool": null,
                "restaurant": null,
                "rooms": 5.0,
                "service": 5.0,
                "sleep": 5.0,
                "value": 5.0
            },
            "helpfulness": 1,
            "id": 121412171,
            "likes": {
                "disliked": null,
                "liked": null
            },
            "rating": 5.0,
            "stay_parameters": "Stayed November 2011, traveled on business",
            "text": "This guesthouse is wonderful! I stayed here for one week and loved every minute of it. The staff is extremely helpful. Although I was here for work, staying here made it almost seem like a holiday. The rooms are wonderful, big and luxurious! Conveniently located close to shops and not far from the main highway (the N2), the location couldn't have been better. The property is well maintained and extremely clean. Working out by the pool was a delight. I will definitely stay here again! Thank you David (the manager) and Bev and Phillip are great!",
            "title": "A wonderful guesthouse and great staff!",
            "user": "Halla H"
        },
        {
            "date": "November 17, 2011",
            "detail_rating": {
                "business": null,
                "cleanliness": 5.0,
                "desk": null,
                "location": 5.0,
                "pool": null,
                "restaurant": null,
                "rooms": 5.0,
                "service": 5.0,
                "sleep": null,
                "value": 5.0
            },
            "helpfulness": null,
            "id": 120708926,
            "likes": {
                "disliked": null,
                "liked": null
            },
            "rating": 5.0,
            "stay_parameters": "Stayed November 2011",
            "text": "I was very well looked after at a reasonable price. Service is excellent and will keep coming back!",
            "title": "Total value for money and a hearty stay!",
            "user": "MrMarkSham"
        },
        {
            "date": "November 5, 2011",
            "detail_rating": {
                "business": null,
                "cleanliness": 5.0,
                "desk": null,
                "location": 4.0,
                "pool": null,
                "restaurant": null,
                "rooms": 5.0,
                "service": 5.0,
                "sleep": 5.0,
                "value": 5.0
            },
            "helpfulness": null,
            "id": 120213064,
            "likes": {
                "disliked": null,
                "liked": null
            },
            "rating": 5.0,
            "stay_parameters": "Stayed November 2011, traveled solo",
            "text": "I had a great stay at the Roodenburg House and was sad to leave. I chose this place as it was near the Sport Sciences Institute where I had knee surgery. David, the establishment's manager, and his extremely friendly and accommodating team, did everything possible to make my post-op stay there easy, stress-free and super comfortable.",
            "title": "A Really Special Place",
            "user": "gpm2010a"
        },
        {
            "date": "October 28, 2011",
            "detail_rating": {
                "business": null,
                "cleanliness": 5.0,
                "desk": null,
                "location": 5.0,
                "pool": null,
                "restaurant": null,
                "rooms": 5.0,
                "service": 5.0,
                "sleep": 5.0,
                "value": 5.0
            },
            "helpfulness": null,
            "id": 119837989,
            "likes": {
                "disliked": null,
                "liked": null
            },
            "rating": 5.0,
            "stay_parameters": "Stayed March 2011, traveled on business",
            "text": "The guesthouse is a very nicely appointed and well maintained large house. I stayed in the downstairs suite, which is quite roomy, fully furnished with elegant but inviting chairs, a nice desk, armoire, a large very comfortable bed, and colorful, tasteful drapery. There is also a good quality flat screen television with a DVD player, free hi-speed internet, a fireplace, and the room opens to a small private garden patio. The bathroom is large and matches the room in being luxuriously outfitted.",
            "title": "Roodenburg House: A special place that calls you back for a return visit",
            "user": "Marylyn C"
        },
        {
            "date": "December 16, 2012",
            "detail_rating": {
                "business": null,
                "cleanliness": 5.0,
                "desk": null,
                "location": 5.0,
                "pool": null,
                "restaurant": null,
                "rooms": 5.0,
                "service": 5.0,
                "sleep": 5.0,
                "value": 5.0
            },
            "helpfulness": null,
            "id": 147538371,
            "likes": {
                "disliked": null,
                "liked": null
            },
            "rating": 5.0,
            "stay_parameters": "Stayed December 2012, traveled on business",
            "text": "The decoration is very nice and the place is quiet in a very nice environment (in particular you will enjoy a nice view of the table mountain)",
            "title": "Lovely place to stay",
            "user": "Virg17"
        },
        {
            "date": "September 24, 2012",
            "detail_rating": {
                "business": null,
                "cleanliness": 5.0,
                "desk": null,
                "location": 5.0,
                "pool": null,
                "restaurant": null,
                "rooms": 5.0,
                "service": 5.0,
                "sleep": 5.0,
                "value": 5.0
            },
            "helpfulness": null,
            "id": 141086596,
            "likes": {
                "disliked": null,
                "liked": null
            },
            "rating": 5.0,
            "stay_parameters": "Stayed May 2012, traveled as a couple",
            "text": "Service is excellent and the staff is very kind.",
            "title": "Great location. Outstanding Hospitality!",
            "user": "bwcarlin"
        },
        {
            "date": "August 27, 2012",
            "detail_rating": {
                "business": null,
                "cleanliness": 5.0,
                "desk": null,
                "location": 5.0,
                "pool": null,
                "restaurant": null,
                "rooms": 5.0,
                "service": 5.0,
                "sleep": 5.0,
                "value": 5.0
            },
            "helpfulness": null,
            "id": 138543280,
            "likes": {
                "disliked": null,
                "liked": null
            },
            "rating": 5.0,
            "stay_parameters": "Stayed October 2011, traveled on business",
            "text": "Last but not least, breakfast is very good.",
            "title": "Roodenburg House- Excellent!",
            "user": "Mrugank I"
        },
        {
            "date": "August 17, 2012",
            "detail_rating": {
                "business": null,
                "cleanliness": 5.0,
                "desk": null,
                "location": 3.0,
                "pool": null,
                "restaurant": null,
                "rooms": 5.0,
                "service": 5.0,
                "sleep": 5.0,
                "value": 5.0
            },
            "helpfulness": null,
            "id": 137423400,
            "likes": {
                "disliked": null,
                "liked": null
            },
            "rating": 5.0,
            "stay_parameters": "Stayed August 2012, traveled on business",
            "text": "You can go !",
            "title": "Great Guesthouse!",
            "user": "Joachim K"
        },
        {
            "date": "June 21, 2012",
            "detail_rating": {
                "business": null,
                "cleanliness": 5.0,
                "desk": null,
                "location": 4.0,
                "pool": null,
                "restaurant": null,
                "rooms": 5.0,
                "service": 5.0,
                "sleep": 5.0,
                "value": 5.0
            },
            "helpfulness": null,
            "id": 132431075,
            "likes": {
                "disliked": null,
                "liked": null
            },
            "rating": 5.0,
            "stay_parameters": "Stayed May 2012, traveled as a couple",
            "text": "We have traveled to Cape Town several times over the last few years and have stayed in a couple different B&B's. The Roodenburg House was by far the best experience! It's so conveniently located and has great amenities, but the personal attention given by David and his staff was extraordinary! One night we grabbed some carry-out from a nearby Thai restaurant and brought it back to the Roodenburg House. The staff brought out plates and silverware for us at a time when they were off-duty. Just one of the many ways they made us feel welcome during our stay. I would highly recommend the Roodenburg House to anyone who is traveling to Cape Town for business or pleasure.",
            "title": "What a lovely place",
            "user": "orowan"
        },
        {
            "date": "April 20, 2012",
            "detail_rating": {
                "business": null,
                "cleanliness": 5.0,
                "desk": null,
                "location": 5.0,
                "pool": null,
                "restaurant": null,
                "rooms": 5.0,
                "service": 5.0,
                "sleep": 5.0,
                "value": 5.0
            },
            "helpfulness": null,
            "id": 128222261,
            "likes": {
                "disliked": null,
                "liked": null
            },
            "rating": 5.0,
            "stay_parameters": "Stayed March 2012, traveled with friends",
            "text": "I recently had the good fortune to stay in the most delightful guest house in Cape Town. The rooms were luxurious, very clean and extremely comfortable. They cater to your every need and add their personal touch to make you feel at home. The staff are so friendly and are always available to help,no matter what your request.The manager, David goes out of his way to arrange tours, massages,shopping for special items and anything else you may require.",
            "title": "Roodenburg House",
            "user": "Susan G"
        },
        {
            "date": "April 9, 2012",
            "detail_rating": {
                "business": null,
                "cleanliness": 5.0,
                "desk": null,
                "location": 5.0,
                "pool": null,
                "restaurant": null,
                "rooms": 5.0,
                "service": 5.0,
                "sleep": 5.0,
                "value": 5.0
            },
            "helpfulness": null,
            "id": 127561051,
            "likes": {
                "disliked": null,
                "liked": null
            },
            "rating": 5.0,
            "stay_parameters": "Stayed March 2012, traveled solo",
            "text": "I would not hesitate to recommend Roodenburg House and cannot wait to return.",
            "title": "Truly a perfect choice!",
            "user": "Patsy B B"
        },
        {
            "date": "April 5, 2012",
            "detail_rating": {
                "business": null,
                "cleanliness": 5.0,
                "desk": null,
                "location": 5.0,
                "pool": null,
                "restaurant": null,
                "rooms": 5.0,
                "service": 5.0,
                "sleep": 5.0,
                "value": 5.0
            },
            "helpfulness": null,
            "id": 127295015,
            "likes": {
                "disliked": null,
                "liked": null
            },
            "rating": 5.0,
            "stay_parameters": "Stayed February 2012, traveled with family",
            "text": "Firstly the location is very central, easy access to downtown, Muizenburg and airport. Felt very safe during my daily walks in the neighbourhood. I was there for 3 weeks and cannot say enough about the excellence of every aspect of Roodenburg. Room was fabulous, staff are more obliging than I have come across in any 5 star hotel, breakfast was amazing & actually they will arrange to have whatever one wants. The living room area is so warm and inviting, it is quiet and so comfortable but the TV is available at all times if you want to watch & there is also TV in the rooms. The pool area is charming with a gorgeous view of the mountain and a feeling of serenity.",
            "title": "perfect stay just outside capetown",
            "user": "Timothy069"
        },
        {
            "date": "March 14, 2012",
            "detail_rating": {
                "business": null,
                "cleanliness": 5.0,
                "desk": null,
                "location": 5.0,
                "pool": null,
                "restaurant": null,
                "rooms": 5.0,
                "service": 5.0,
                "sleep": 5.0,
                "value": 5.0
            },
            "helpfulness": 1,
            "id": 126083228,
            "likes": {
                "disliked": null,
                "liked": null
            },
            "rating": 5.0,
            "stay_parameters": "Stayed January 2012, traveled as a couple",
            "text": "The house itself is very tastefully decorated but at the same time it has a sense of warmth and welcome that I truly felt & loved. I will be back there next year because of the welcome and excellent service as well as the privacy & comfort. I will definitely recommend Roodenburg to any and evryone who is visiting Cape Town. Thanks to David and his amazing staff for being such a huge part of the success of my holiday!",
            "title": "Great place to stay",
            "user": "Bolsybob"
        },
        {
            "date": "March 7, 2012",
            "detail_rating": {
                "business": null,
                "cleanliness": 5.0,
                "desk": null,
                "location": 5.0,
                "pool": null,
                "restaurant": null,
                "rooms": 5.0,
                "service": 5.0,
                "sleep": 5.0,
                "value": 5.0
            },
            "helpfulness": null,
            "id": 125753515,
            "likes": {
                "disliked": null,
                "liked": null
            },
            "rating": 5.0,
            "stay_parameters": "Stayed February 2012, traveled as a couple",
            "text": "relaxed and still close to the city, we really enjoyed our stay here. rooms were comfy, hosts were very friendly. They even prepared breakfast(in our frigde) when we needed to leave the b&b at 5am for our flight back.",
            "title": "A gorgeous home to unwind & relax,",
            "user": "kasnow"
        },
        {
            "date": "February 28, 2012",
            "detail_rating": {
                "business": null,
                "cleanliness": 5.0,
                "desk": null,
                "location": 5.0,
                "pool": null,
                "restaurant": null,
                "rooms": 5.0,
                "service": 5.0,
                "sleep": 5.0,
                "value": 5.0
            },
            "helpfulness": null,
            "id": 125374614,
            "likes": {
                "disliked": null,
                "liked": null
            },
            "rating": 5.0,
            "stay_parameters": "Stayed February 2012, traveled solo",
            "text": "After staying at the Roodenburg House I will have a very hard time going back to chain hotels with their generic service. Unfortunately my stay was quite short. Should I ever get to visit Cape Town again Roodenburg House will be my first choice. The service is simply outstanding!! Thanks for a great experience.",
            "title": "Wonderful guest house!",
            "user": "girbit"
        },
        {
            "date": "February 25, 2012",
            "detail_rating": {
                "business": null,
                "cleanliness": 5.0,
                "desk": null,
                "location": 4.0,
                "pool": null,
                "restaurant": null,
                "rooms": 5.0,
                "service": 5.0,
                "sleep": 5.0,
                "value": 4.0
            },
            "helpfulness": null,
            "id": 125181152,
            "likes": {
                "disliked": null,
                "liked": null
            },
            "rating": 5.0,
            "stay_parameters": "Stayed October 2011, traveled on business",
            "text": "I was in Cape Town on business for about two weeks and stayed here the whole time. The rooms here carry nice characteristics and they are huge (compared to hotels in my city, Hong Kong). Staff here are extremely friendly and helpful. The breakfast here is pretty much the same everyday but I still enjoyed a lot. Great thanks to David! And I am sorry for this belated review.",
            "title": "Warm and sweet",
            "user": "TheodoreShou"
        },
        {
            "date": "February 20, 2012",
            "detail_rating": {
                "business": null,
                "cleanliness": 5.0,
                "desk": null,
                "location": 5.0,
                "pool": null,
                "restaurant": null,
                "rooms": 5.0,
                "service": 5.0,
                "sleep": 5.0,
                "value": 5.0
            },
            "helpfulness": null,
            "id": 124917677,
            "likes": {
                "disliked": null,
                "liked": null
            },
            "rating": 5.0,
            "stay_parameters": "Stayed February 2012, traveled with friends",
            "text": "We spent 14nights at this beautiful guest house the location was excellent and very convenient to all he wonderful sights that Cape Town has to offer. David and his staff especially Philip really looked after us and nothing was ever too much trouble. We would highly recommend this guest house as a place t stay and would like t thank them for making ou holiday complete and to return one day",
            "title": "What a trip Pam and Terry",
            "user": "pjrtar"
        },
        {
            "date": "January 24, 2012",
            "detail_rating": {
                "business": null,
                "cleanliness": 4.0,
                "desk": null,
                "location": 4.0,
                "pool": null,
                "restaurant": null,
                "rooms": 5.0,
                "service": 5.0,
                "sleep": 4.0,
                "value": 5.0
            },
            "helpfulness": null,
            "id": 123535645,
            "likes": {
                "disliked": null,
                "liked": null
            },
            "rating": 5.0,
            "stay_parameters": "Stayed December 2011, traveled as a couple",
            "text": "n",
            "title": "Feeling like at home",
            "user": "BernieWien"
        },
        {
            "date": "January 14, 2012",
            "detail_rating": {
                "business": null,
                "cleanliness": 5.0,
                "desk": null,
                "location": 5.0,
                "pool": null,
                "restaurant": null,
                "rooms": 5.0,
                "service": 5.0,
                "sleep": 4.0,
                "value": 5.0
            },
            "helpfulness": 1,
            "id": 123056548,
            "likes": {
                "disliked": null,
                "liked": null
            },
            "rating": 5.0,
            "stay_parameters": "Stayed January 2012, traveled with family",
            "text": "We want to thank the whole staff - especially David for the hospitality they offered to us during our stay in Capetown. The hotel\u00b4s location is close to Capetown (surroundings of the city, 20 min to city centre) in a very safe area; rooms and service are excellent and the atmosphere is cosy and warm. We received many information for visiting Capetown and even at the end of our stay David helped us with recommodations for our next destinations. For us it was one of the best guesthouses during our vacation in Western Cape.",
            "title": "An amazing place",
            "user": "Claire M"
        }
    ],
    "slim_ranking": 0.151785714286,
    "stars": 4,
    "tripadvisor": {
        "VISITED": false,
        "country_name": null,
        "locality": null,
        "pic_link": null,
        "street_address": null
    },
    "user_rating": 5.0,
    "variance": {
        "average": 0,
        "excellent": 55,
        "poor": 0,
        "terrible": 0,
        "very good": 6
    }
}