{
    "aka": "Towneplace Suites Sacramento Cal Expo Hotel Sacramento",
    "description": "Welcome to Real Living! I would like to take this opportunity to introduce you to the TownePlace Suites Cal Expo, Sacramento CA. The TownePlace Suites is conveniently located to all major destinations of Sacramento, including Sacramento International Airport, Downtown Sacramento, California State Capital, and Old Town Sacramento. We offer 117 spacious suites that come in four different floor plans, ranging from Studio Suites with one queen bed or two queen beds, One Bedroom Suites and Two Bedroom Suites. Each of our hotel suites is uniquely designed for the extended stay travel in mind with fully quipped kitchens and the welcome home feel. We provide a complimentary local shuttle service Monday-Friday,within a 5-mile radius, which would be a great transportation resource for your personnel. There is also 775 sq. ft. of meeting space that can comfortably accommodate 25-30 people as well as catering services available.",
    "detail_rating": {
        "cleanliness": null,
        "location": null,
        "rooms": null,
        "service": null,
        "sleep": null,
        "value": null
    },
    "location": {
        "city": "Sacramento",
        "continent": null,
        "country": "United States",
        "proposed_city": "Sacramento",
        "province": null,
        "region": null
    },
    "name": "TownePlace Suites Sacramento Cal Expo",
    "places": {
        "aka": [
            "Sacramento"
        ],
        "hotel_description": [
            "Sacramento"
        ],
        "hotel_name": [
            "Sacramento"
        ]
    },
    "review_count": 60,
    "review_count_current": 4,
    "reviews": [
        {
            "date": "December 26, 2007",
            "detail_rating": {
                "business": null,
                "cleanliness": null,
                "desk": null,
                "location": null,
                "pool": null,
                "restaurant": null,
                "rooms": null,
                "service": null,
                "sleep": null,
                "value": null
            },
            "helpfulness": null,
            "id": 11969302,
            "likes": {
                "disliked": null,
                "liked": null
            },
            "rating": 4.0,
            "stay_parameters": null,
            "text": "We were very pleased with this hotel. The staff was very friendly and helpful. The location was convenient - close to a freeway but very quiet. The room was great - nicely decorated with two club chairs, two queen beds, a dining table for four that doubled as a desk and a full kitchen, including good size refrigerator, cook-top, dishwasher and microwave. The bathroom had a very nice tub/shower, very nice fixtures and a few amenities.",
            "title": "Great Hotel for the Price",
            "user": "GinOaklandCA"
        },
        {
            "date": "October 15, 2007",
            "detail_rating": {
                "business": null,
                "cleanliness": null,
                "desk": null,
                "location": null,
                "pool": null,
                "restaurant": null,
                "rooms": null,
                "service": null,
                "sleep": null,
                "value": null
            },
            "helpfulness": 1,
            "id": 10083820,
            "likes": {
                "disliked": null,
                "liked": null
            },
            "rating": 5.0,
            "stay_parameters": null,
            "text": "We didn't use the pool or exercise facilities. We were somewhat disappointed with the continental breakfast, but it wasn't all that bad. Bagels, lots of cereals, apples, yogurt, juice and coffee.",
            "title": "Comfortable three nights",
            "user": "tramrider"
        },
        {
            "date": "September 27, 2007",
            "detail_rating": {
                "business": 4.0,
                "cleanliness": 4.0,
                "desk": null,
                "front_desk": 4.0,
                "location": 3.0,
                "pool": null,
                "restaurant": null,
                "rooms": 5.0,
                "service": 4.0,
                "sleep": null,
                "value": 5.0
            },
            "helpfulness": null,
            "id": 10011766,
            "likes": {
                "disliked": null,
                "liked": "\u2014 I loved the spacious suite with the kitchenette facilities"
            },
            "rating": 4.0,
            "stay_parameters": "Stayed August 2007, traveled on business",
            "text": "All in all, we were very satisfied and would go there again.",
            "title": "An incredible Home away from Home",
            "user": "aaa413"
        },
        {
            "date": "August 27, 2007",
            "detail_rating": {
                "business": 3.0,
                "cleanliness": 2.0,
                "desk": null,
                "front_desk": 1.0,
                "location": 3.0,
                "pool": null,
                "restaurant": null,
                "rooms": 3.0,
                "service": 1.0,
                "sleep": null,
                "value": 3.0
            },
            "helpfulness": null,
            "id": 8516765,
            "likes": {
                "disliked": null,
                "liked": null
            },
            "rating": 1.0,
            "stay_parameters": "Stayed August 2007, traveled with family",
            "text": "Three new Marriott hotels are together in same collection of new office buildings along Tribute Road. They share parking lots. Although adjacent to Business I-80 east of downtown, you needed a car to get to the Arden Way mall and restaurants two miles away. That said, the suite appointments were outstanding. We enjoyed the heated pool, husband was glad to use the lobby internet. Breakfast was excellent, and one could walk to the Courtyard for lunch or dinner. (The third Marriott here is a Fairfield.)",
            "title": "Problems, horrible staff",
            "user": "jobay"
        }
    ],
    "slim_ranking": 0.294117647059,
    "stars": 2.5,
    "tripadvisor": {
        "VISITED": false,
        "country_name": null,
        "locality": null,
        "pic_link": null,
        "street_address": null
    },
    "user_rating": 4.0,
    "variance": {
        "average": 7,
        "excellent": 17,
        "poor": 7,
        "terrible": 1,
        "very good": 28
    }
}