{
  "id" : "010",
  "title" : "ritz carton luxury suite butler excellent service",
  "description" : "Is there an excellent butler service in luxury suits at any The Ritz-Carlton?",
  "narrative" : "Typo in carton (correct: carlton). The spelling mistake should be detected. The engine should use the corrected one. A relevant review has to describe that there is an excellent butler service of a The Ritz-Carlton luxury suite."
}