{
    "aka": "Milan Windsor Hotel",
    "description": null,
    "detail_rating": {
        "cleanliness": null,
        "location": null,
        "rooms": null,
        "service": null,
        "sleep": null,
        "value": null
    },
    "location": {
        "city": "Milan",
        "continent": "Europe",
        "country": "Italy",
        "proposed_city": "Windsor",
        "province": null,
        "region": "Lombardy"
    },
    "name": "Windsor Hotel Milano",
    "places": {
        "aka": [
            "Windsor"
        ],
        "hotel_description": [],
        "hotel_name": [
            "Windsor",
            "Milano"
        ]
    },
    "review_count": 327,
    "review_count_current": 29,
    "reviews": [
        {
            "date": "August 2, 2011",
            "detail_rating": {
                "business": null,
                "cleanliness": null,
                "desk": null,
                "location": null,
                "pool": null,
                "restaurant": null,
                "rooms": null,
                "service": null,
                "sleep": null,
                "value": null
            },
            "helpfulness": null,
            "id": 116189372,
            "likes": {
                "disliked": null,
                "liked": null
            },
            "rating": 3.0,
            "stay_parameters": null,
            "text": "We stayed here for one night in July on our way to Tuscany.",
            "title": "Not a 4 Star Hotel, OK but nothing speacial,good location to train station",
            "user": "zedmeister"
        },
        {
            "date": "July 28, 2011",
            "detail_rating": {
                "business": null,
                "cleanliness": 4.0,
                "desk": null,
                "location": null,
                "pool": null,
                "restaurant": null,
                "rooms": null,
                "service": 4.0,
                "sleep": 4.0,
                "value": 4.0
            },
            "helpfulness": null,
            "id": 115890473,
            "likes": {
                "disliked": null,
                "liked": null
            },
            "rating": 4.0,
            "stay_parameters": "Stayed September 2010, traveled with friends",
            "text": "The rooms are hit and miss. Our room was small, with a concrete bed and our friends room a couple of doors away was HUGE and had the same concrete bed, so they tell us.",
            "title": "No doubt - a 4 star hotel! :)",
            "user": "TichaPT"
        },
        {
            "date": "July 9, 2011",
            "detail_rating": {
                "business": null,
                "cleanliness": 5.0,
                "desk": null,
                "location": null,
                "pool": null,
                "restaurant": null,
                "rooms": null,
                "service": 5.0,
                "sleep": 4.0,
                "value": 3.0
            },
            "helpfulness": null,
            "id": 115194757,
            "likes": {
                "disliked": null,
                "liked": null
            },
            "rating": 5.0,
            "stay_parameters": "Stayed June 2011, traveled on business",
            "text": "The Hotel Manager who greeted us on arrival, a late arrival by the way, was barely friendly, just barely. No real welcome or feeling of appreciating our business but he checked us in quickly and sent us on our way to our small and huge rooms.",
            "title": "They were very helpful.",
            "user": "Vincent115"
        },
        {
            "date": "July 8, 2011",
            "detail_rating": {
                "business": null,
                "cleanliness": 4.0,
                "desk": null,
                "location": null,
                "pool": null,
                "restaurant": null,
                "rooms": null,
                "service": 3.0,
                "sleep": 3.0,
                "value": 2.0
            },
            "helpfulness": null,
            "id": 115154679,
            "likes": {
                "disliked": null,
                "liked": null
            },
            "rating": 3.0,
            "stay_parameters": "Stayed July 2011, traveled on business",
            "text": "The rooms are very old and dated, they look like rooms that have been fitted out with furniture collected from verge collections, nothing really matching, nothing really nice but heck it did the job and it was concrete bed after all.",
            "title": "Not quite a 4 stars hotel",
            "user": "Beecootz"
        },
        {
            "date": "June 26, 2011",
            "detail_rating": {
                "business": null,
                "cleanliness": 4.0,
                "desk": null,
                "location": null,
                "pool": null,
                "restaurant": null,
                "rooms": null,
                "service": 4.0,
                "sleep": 4.0,
                "value": 4.0
            },
            "helpfulness": 1,
            "id": 114749797,
            "likes": {
                "disliked": null,
                "liked": null
            },
            "rating": 4.0,
            "stay_parameters": "Stayed May 2011, traveled on business",
            "text": "The bathroom was OK nothing great but it did the job.",
            "title": "It was perfect for me...",
            "user": "Evaflava"
        },
        {
            "date": "August 1, 2005",
            "detail_rating": {
                "business": null,
                "cleanliness": 4.0,
                "desk": null,
                "location": null,
                "pool": null,
                "restaurant": null,
                "rooms": 4.0,
                "service": 4.0,
                "sleep": null,
                "value": 5.0
            },
            "helpfulness": 7,
            "id": 3728044,
            "likes": {
                "disliked": null,
                "liked": null
            },
            "rating": 5.0,
            "stay_parameters": "Stayed March 2005",
            "text": "We stayed at the Windsor Thursday through till Monday while following Scotland in Milan.",
            "title": "Wonderful Windsor!",
            "user": "MrSporran"
        },
        {
            "date": "May 3, 2005",
            "detail_rating": {
                "business": null,
                "cleanliness": 5.0,
                "desk": null,
                "location": null,
                "pool": null,
                "restaurant": null,
                "rooms": 4.0,
                "service": 4.0,
                "sleep": null,
                "value": 5.0
            },
            "helpfulness": 5,
            "id": 3435971,
            "likes": {
                "disliked": null,
                "liked": null
            },
            "rating": 5.0,
            "stay_parameters": "Stayed April 2005, traveled on business",
            "text": "We were slightly disappointed at the hotel exterior - from the side we approached it looked quite run down. However once inside the foyer we took a lift up to our room which was both spacious and comfortable.",
            "title": "Wonderful Windsor in Mian",
            "user": "ilovedeniro"
        },
        {
            "date": "April 26, 2005",
            "detail_rating": {
                "business": null,
                "cleanliness": 3.0,
                "desk": null,
                "location": null,
                "pool": null,
                "restaurant": null,
                "rooms": 3.0,
                "service": 3.0,
                "sleep": null,
                "value": 4.0
            },
            "helpfulness": 3,
            "id": 3416656,
            "likes": {
                "disliked": null,
                "liked": null
            },
            "rating": 4.0,
            "stay_parameters": "Stayed April 2005",
            "text": "A large double bed, wardrobe, and desk still left plenty of space to move around. The bathroom was adequate with a powerful shower. A nice touch was the complimentary mini-bar equiped with soft drinks and water.Our room looked out onto the street and a tram line directly below, however by winding the shutter down the noise was minimum.",
            "title": "Very good, but check your rate",
            "user": "GradguyAtlanta"
        },
        {
            "date": "March 17, 2005",
            "detail_rating": {
                "business": null,
                "cleanliness": null,
                "desk": null,
                "location": null,
                "pool": null,
                "restaurant": null,
                "rooms": null,
                "service": null,
                "sleep": null,
                "value": null
            },
            "helpfulness": 1,
            "id": 3283005,
            "likes": {
                "disliked": null,
                "liked": null
            },
            "rating": 2.0,
            "stay_parameters": null,
            "text": "The attitude of the staff was excellent, they couldn't do enough from ordering and ushering you to your taxi, helping with the free internet service, and providing free bar snacks the hotel was excellent.",
            "title": "Functional, but could be better",
            "user": "BMathieson"
        },
        {
            "date": "October 3, 2004",
            "detail_rating": {
                "business": null,
                "cleanliness": null,
                "desk": null,
                "location": null,
                "pool": null,
                "restaurant": null,
                "rooms": null,
                "service": null,
                "sleep": null,
                "value": null
            },
            "helpfulness": null,
            "id": 2615993,
            "likes": {
                "disliked": null,
                "liked": null
            },
            "rating": 3.0,
            "stay_parameters": null,
            "text": "At a rate of 100 Euros a night the hotel was excellent value in a great location. If you are planning to visit, the \"Friends\" bar is a great local pub just a minute or so walk from the Windsor :-)",
            "title": "Nice for the weekend",
            "user": "ReedyBarnsley"
        },
        {
            "date": "October 26, 2010",
            "detail_rating": {
                "business": null,
                "cleanliness": 4.0,
                "desk": null,
                "location": 3.0,
                "pool": null,
                "restaurant": null,
                "rooms": 2.0,
                "service": 1.0,
                "sleep": 2.0,
                "value": 2.0
            },
            "helpfulness": null,
            "id": 84871676,
            "likes": {
                "disliked": null,
                "liked": null
            },
            "rating": 2.0,
            "stay_parameters": "Stayed October 2010, traveled with family",
            "text": "The hotel advertise: \"free wi-fi, free minbar, air conditioning, satellite tv\"",
            "title": "Stay clear of this hotel",
            "user": "Ullert"
        },
        {
            "date": "September 28, 2010",
            "detail_rating": {
                "business": null,
                "cleanliness": 5.0,
                "desk": null,
                "location": 4.0,
                "pool": null,
                "restaurant": null,
                "rooms": 4.0,
                "service": 5.0,
                "sleep": 4.0,
                "value": 5.0
            },
            "helpfulness": null,
            "id": 81293378,
            "likes": {
                "disliked": null,
                "liked": null
            },
            "rating": 4.0,
            "stay_parameters": "Stayed October 2009, traveled with friends",
            "text": "-Well, the free wi-fi was only in the lobby area and not always working. The minibar contained 4 bottles of water and 2 cans of soft drinks and was not re-stocked during the 3 nights stay. Air conditon system could not be operated and the room as very hot. Satellite TV???? Not even the italian channels were viewable (bad reception/snow on the screen). The rooms are not very sound proofed either - be prepared to hear the conversation in the room next door.",
            "title": "Nice Hotel! Good value for money and well situed to visit Milan",
            "user": "GiaTrip349"
        },
        {
            "date": "September 25, 2010",
            "detail_rating": {
                "business": null,
                "cleanliness": 5.0,
                "desk": null,
                "location": 4.0,
                "pool": null,
                "restaurant": null,
                "rooms": 5.0,
                "service": 4.0,
                "sleep": 5.0,
                "value": 4.0
            },
            "helpfulness": null,
            "id": 80961273,
            "likes": {
                "disliked": null,
                "liked": null
            },
            "rating": 4.0,
            "stay_parameters": "Stayed July 2010, traveled with friends",
            "text": "Location: The hotel is situated directly next to a very busy road with heavy traffic and tram-lines on two sides of the hotel. Since the hotel is on a street corner the trams makes a tremendous noise when turning the corner. Impossible to keep windows open.",
            "title": "Elegant lodging",
            "user": "pan0s2010"
        },
        {
            "date": "September 20, 2010",
            "detail_rating": {
                "business": null,
                "cleanliness": 5.0,
                "desk": null,
                "location": 5.0,
                "pool": null,
                "restaurant": null,
                "rooms": 5.0,
                "service": 5.0,
                "sleep": 5.0,
                "value": 5.0
            },
            "helpfulness": 1,
            "id": 80236985,
            "likes": {
                "disliked": null,
                "liked": null
            },
            "rating": 5.0,
            "stay_parameters": "Stayed June 2010, traveled as a couple",
            "text": "Reception staff generally unfriendly - not serviceminded.",
            "title": "very good location, excellent breakfast, nice price",
            "user": "fugurlucan"
        },
        {
            "date": "September 5, 2010",
            "detail_rating": {
                "business": null,
                "cleanliness": 5.0,
                "desk": null,
                "location": 4.0,
                "pool": null,
                "restaurant": null,
                "rooms": 4.0,
                "service": 3.0,
                "sleep": 3.0,
                "value": 5.0
            },
            "helpfulness": null,
            "id": 78316010,
            "likes": {
                "disliked": null,
                "liked": null
            },
            "rating": 4.0,
            "stay_parameters": "Stayed August 2010, traveled as a couple",
            "text": "No Iron/ironing board available....in a 4* hotel???",
            "title": "Value for money is good!",
            "user": "TravelSprinkle"
        },
        {
            "date": "April 6, 2011",
            "detail_rating": {
                "business": null,
                "cleanliness": 3.0,
                "desk": null,
                "location": 4.0,
                "pool": null,
                "restaurant": null,
                "rooms": 2.0,
                "service": 2.0,
                "sleep": null,
                "value": 3.0
            },
            "helpfulness": 4,
            "id": 103081449,
            "likes": {
                "disliked": null,
                "liked": null
            },
            "rating": 3.0,
            "stay_parameters": "Stayed April 2011",
            "text": "Stayed here for 2nights on leisure and found my room too small, warm and the air con wasn't working on my 2nd night. I asked the reception to look at it and he said as I only had one night left it was not possible to fix so he suggested I open the window!!! The tv also failed to work due to a faulty wire, but decided not to pursue this. Breakfast was quite nice, reception was rather discourteous.",
            "title": "Crap rooms but not bad location",
            "user": "Leon118"
        },
        {
            "date": "February 17, 2011",
            "detail_rating": {
                "business": null,
                "cleanliness": 5.0,
                "desk": null,
                "location": 4.0,
                "pool": null,
                "restaurant": null,
                "rooms": 3.0,
                "service": 5.0,
                "sleep": 3.0,
                "value": 4.0
            },
            "helpfulness": 1,
            "id": 96959222,
            "likes": {
                "disliked": null,
                "liked": null
            },
            "rating": 4.0,
            "stay_parameters": "Stayed November 2010, traveled solo",
            "text": "I went to Milan and surrounding areas mostly for shopping, so I had chosen this hotel because it was not far away from shopping street Corso Buenos Aires, next to Central Station - 5-10 minutes walk,and 2 stops by metro to Dome.Actually it takes you 30-40 minutes afoot to get the centre if you prefer to stroll around but it's not so interesting 'coz you don't have any sights on your way.",
            "title": "Very good hotel with excellent breakfast",
            "user": "Amorfika"
        },
        {
            "date": "February 6, 2011",
            "detail_rating": {
                "business": null,
                "cleanliness": 4.0,
                "desk": null,
                "location": 3.0,
                "pool": null,
                "restaurant": null,
                "rooms": 3.0,
                "service": 3.0,
                "sleep": 4.0,
                "value": 3.0
            },
            "helpfulness": 1,
            "id": 95656750,
            "likes": {
                "disliked": null,
                "liked": null
            },
            "rating": 3.0,
            "stay_parameters": "Stayed January 2011, traveled with friends",
            "text": "The room was ordinary.Small and clean.I just didn't like much the color - all in some agressive colors of dark red and blue.Old TVset was changed into the new plasma one during my staying.Free cable internet.Minibar included some soft drinks and mineral water.The view from the window was a big construction with 2 hoisting cranes ;).",
            "title": "Four stars ma non troppo",
            "user": "currapintos"
        },
        {
            "date": "December 7, 2010",
            "detail_rating": {
                "business": null,
                "cleanliness": 4.0,
                "desk": null,
                "location": 4.0,
                "pool": null,
                "restaurant": null,
                "rooms": 3.0,
                "service": 2.0,
                "sleep": 4.0,
                "value": 3.0
            },
            "helpfulness": 1,
            "id": 89275503,
            "likes": {
                "disliked": null,
                "liked": null
            },
            "rating": 3.0,
            "stay_parameters": "Stayed September 2010, traveled as a couple",
            "text": "The bathroom had bidet.Toiletries included soap, shoe polish, ear pads.But no toothpaste and toothbrush.",
            "title": "Not trust in Internet service",
            "user": "lumlom"
        },
        {
            "date": "October 29, 2010",
            "detail_rating": {
                "business": null,
                "cleanliness": 4.0,
                "desk": null,
                "location": 5.0,
                "pool": null,
                "restaurant": null,
                "rooms": 4.0,
                "service": 4.0,
                "sleep": 5.0,
                "value": 4.0
            },
            "helpfulness": null,
            "id": 85317698,
            "likes": {
                "disliked": null,
                "liked": null
            },
            "rating": 4.0,
            "stay_parameters": "Stayed October 2010, traveled with family",
            "text": "If you are sensitive towards noise outside - be aware of tram noise that begins very early and may hurt your sleeping.",
            "title": "Clean hotel in the centre of Milan",
            "user": "mewmew3008"
        },
        {
            "date": "June 25, 2011",
            "detail_rating": {
                "business": null,
                "cleanliness": 3.0,
                "desk": null,
                "location": null,
                "pool": null,
                "restaurant": null,
                "rooms": null,
                "service": 4.0,
                "sleep": 4.0,
                "value": 4.0
            },
            "helpfulness": 1,
            "id": 114742223,
            "likes": {
                "disliked": null,
                "liked": null
            },
            "rating": 4.0,
            "stay_parameters": "Stayed April 2011, traveled as a couple",
            "text": "the hotel's central location meant that we were conveniently placed for all we wished to see and do. the metro is so close and the only improvement to the website would be to post which is the nearest of the many exits from the metro. Despite being on the corner where the trams squeak round, our fourth -floor room was quiet. It was comfortable and large enough for a three night stay.. We only took breakfast once as we had booked on a room only basis but the buffet fare was plentiful and well up to standard> It was a bonus on Easter Monday to have a massive street market across the road and down many of the side street. We would definitely use again",
            "title": "ticked all the boxes",
            "user": "DavidWelle"
        },
        {
            "date": "June 9, 2011",
            "detail_rating": {
                "business": null,
                "cleanliness": 3.0,
                "desk": null,
                "location": null,
                "pool": null,
                "restaurant": null,
                "rooms": null,
                "service": 4.0,
                "sleep": 4.0,
                "value": 4.0
            },
            "helpfulness": 2,
            "id": 112371806,
            "likes": {
                "disliked": null,
                "liked": null
            },
            "rating": 4.0,
            "stay_parameters": "Stayed April 2011, traveled with friends",
            "text": "Nice location, close to metro",
            "title": "Nice location",
            "user": "CStefanou"
        },
        {
            "date": "May 23, 2011",
            "detail_rating": {
                "business": null,
                "cleanliness": 4.0,
                "desk": null,
                "location": 5.0,
                "pool": null,
                "restaurant": null,
                "rooms": 4.0,
                "service": 5.0,
                "sleep": 4.0,
                "value": 5.0
            },
            "helpfulness": 2,
            "id": 109528138,
            "likes": {
                "disliked": null,
                "liked": null
            },
            "rating": 4.0,
            "stay_parameters": "Stayed May 2011, traveled with family",
            "text": "Nice breakfast not so great variety",
            "title": "great wee hotel",
            "user": "jgorspider"
        },
        {
            "date": "May 9, 2011",
            "detail_rating": {
                "business": null,
                "cleanliness": 4.0,
                "desk": null,
                "location": 3.0,
                "pool": null,
                "restaurant": null,
                "rooms": 4.0,
                "service": 2.0,
                "sleep": 3.0,
                "value": 1.0
            },
            "helpfulness": 1,
            "id": 107562106,
            "likes": {
                "disliked": null,
                "liked": null
            },
            "rating": 2.0,
            "stay_parameters": "Stayed May 2011, traveled on business",
            "text": "Nice rooms, not modern type.",
            "title": "Stuck in the '70 ...",
            "user": "CeesF"
        },
        {
            "date": "April 13, 2011",
            "detail_rating": {
                "business": null,
                "cleanliness": 2.0,
                "desk": null,
                "location": 4.0,
                "pool": null,
                "restaurant": null,
                "rooms": 1.0,
                "service": 3.0,
                "sleep": 1.0,
                "value": 2.0
            },
            "helpfulness": 2,
            "id": 103893264,
            "likes": {
                "disliked": null,
                "liked": null
            },
            "rating": 2.0,
            "stay_parameters": "Stayed April 2011, traveled as a couple",
            "text": "Do not listen to the moaners in other reviews - this is a great hotel -",
            "title": "Never again!",
            "user": "Paolo_Corinne"
        },
        {
            "date": "September 24, 2004",
            "detail_rating": {
                "business": null,
                "cleanliness": 5.0,
                "desk": null,
                "location": null,
                "pool": null,
                "restaurant": null,
                "rooms": 4.0,
                "service": 5.0,
                "sleep": null,
                "value": 4.0
            },
            "helpfulness": 2,
            "id": 2598719,
            "likes": {
                "disliked": null,
                "liked": null
            },
            "rating": 4.0,
            "stay_parameters": "Stayed August 2004",
            "text": "Hotel Windsor",
            "title": "Windsor Hotel good base",
            "user": "Stewart166"
        },
        {
            "date": "May 6, 2003",
            "detail_rating": {
                "business": null,
                "cleanliness": null,
                "desk": null,
                "location": null,
                "pool": null,
                "restaurant": null,
                "rooms": null,
                "service": null,
                "sleep": null,
                "value": null
            },
            "helpfulness": 3,
            "id": 987982,
            "likes": {
                "disliked": null,
                "liked": null
            },
            "rating": 1.0,
            "stay_parameters": null,
            "text": "A good location between the station and Duomo, ideal for those girls doing their shopping in the \"Golden Rectangle\"",
            "title": "Won't Stay Again",
            "user": "Memsahib"
        },
        {
            "date": "November 6, 2002",
            "detail_rating": {
                "business": null,
                "cleanliness": 5.0,
                "desk": null,
                "location": null,
                "pool": null,
                "restaurant": null,
                "rooms": 5.0,
                "service": 5.0,
                "sleep": null,
                "value": 5.0
            },
            "helpfulness": null,
            "id": 739708,
            "likes": {
                "disliked": null,
                "liked": null
            },
            "rating": 4.0,
            "stay_parameters": "Stayed November 2002",
            "text": "Reception was great when we arrived and said we would not use the lifts and take the stairs to our room, on the 6th floor. They moved us immediately to the 1st Floor, very considerate.",
            "title": "Ideal Location Immaculate Hotel",
            "user": "lingolovesulongtime"
        },
        {
            "date": "October 22, 2002",
            "detail_rating": {
                "business": null,
                "cleanliness": null,
                "desk": null,
                "location": null,
                "pool": null,
                "restaurant": null,
                "rooms": null,
                "service": null,
                "sleep": null,
                "value": null
            },
            "helpfulness": 1,
            "id": 720988,
            "likes": {
                "disliked": null,
                "liked": null
            },
            "rating": 3.0,
            "stay_parameters": null,
            "text": "Rooms were large with nice clean bathrooms.",
            "title": "Expensive in Milian",
            "user": "A TripAdvisor user"
        }
    ],
    "slim_ranking": 0.297235023041,
    "stars": 4,
    "tripadvisor": {
        "VISITED": false,
        "country_name": null,
        "locality": null,
        "pic_link": null,
        "street_address": null
    },
    "user_rating": 3.5,
    "variance": {
        "average": 62,
        "excellent": 78,
        "poor": 37,
        "terrible": 23,
        "very good": 127
    }
}