{
    "aka": "Hotel Quirinale Rome",
    "description": "The Hotel Quirinale, a beautiful 4-star hotel located in the heart of Rome, is near the major highlights of the city. Period furniture, valuable fabrics and original oil paintings decorate the spacious public rooms and lounges. The 209elegant rooms and suites are fully equipped with every modern comfort.Free WI-FI connection in all public areas and in each room.It is the ideal place to spend an unforgettable stay, both for families and business people. Conventions, meetings and receptions in a welcoming atmosphere \u2013 adjoining meeting rooms adaptable to any request with advanced technology and professional staff.Guests can experience the best of Italian cuisine at our Rossini Restaurant or a light snack at the Green Bar, during Spring and Summer months in the peace of our private garden.The history of the Hotel Quirinale is indissolubly linked to the adjoining Opera House, connected to the hotel by a direct passage.",
    "detail_rating": {
        "cleanliness": 4.0,
        "location": 4.5,
        "rooms": 4.0,
        "service": 4.0,
        "sleep": 4.0,
        "value": 4.0
    },
    "location": {
        "city": "Rome",
        "continent": "Europe",
        "country": "Italy",
        "proposed_city": "Rome",
        "province": null,
        "region": "Lazio"
    },
    "name": "Quirinale Hotel",
    "places": {
        "aka": [
            "Rome"
        ],
        "hotel_description": [
            "Rome",
            "Green",
            "Bar",
            "Spring"
        ],
        "hotel_name": []
    },
    "review_count": 1089,
    "review_count_current": 20,
    "reviews": [
        {
            "date": "January 29, 2012",
            "detail_rating": {
                "business": null,
                "cleanliness": 5.0,
                "desk": null,
                "location": 5.0,
                "pool": null,
                "restaurant": null,
                "rooms": 5.0,
                "service": 5.0,
                "sleep": 5.0,
                "value": 5.0
            },
            "helpfulness": 6,
            "id": 123803953,
            "likes": {
                "disliked": null,
                "liked": null
            },
            "rating": 5.0,
            "stay_parameters": "Stayed December 2011, traveled with family",
            "text": "The personnel are very helpful and accommodating. The location is great, centrally located, but not clogged with traffic. I loved having breakfast in the garden and drinks in the grand lobby. The place feels like an 19th century palace, complete with paintings in the public spaces.",
            "title": "Ten years Returning to the Same Hotel",
            "user": "John R"
        },
        {
            "date": "January 27, 2012",
            "detail_rating": {
                "business": null,
                "cleanliness": 2.0,
                "desk": null,
                "location": 4.0,
                "pool": null,
                "restaurant": null,
                "rooms": 3.0,
                "service": 4.0,
                "sleep": 4.0,
                "value": 3.0
            },
            "helpfulness": 3,
            "id": 123682735,
            "likes": {
                "disliked": null,
                "liked": null
            },
            "rating": 3.0,
            "stay_parameters": "Stayed May 2011, traveled as a couple",
            "text": "Well, the location is good, the price could be better, but the tones of died, dried flies between windows are unacceptable! How can you enjoy staing in a relatively good hotel knowing that nobody bothers to wipe out dust etc.",
            "title": "With a nice atmosphere... and dirt",
            "user": "grzegorz_krol"
        },
        {
            "date": "January 24, 2012",
            "detail_rating": {
                "business": null,
                "cleanliness": 3.0,
                "desk": null,
                "location": 4.0,
                "pool": null,
                "restaurant": null,
                "rooms": 3.0,
                "service": 3.0,
                "sleep": 4.0,
                "value": 5.0
            },
            "helpfulness": 4,
            "id": 123560879,
            "likes": {
                "disliked": null,
                "liked": null
            },
            "rating": 4.0,
            "stay_parameters": "Stayed February 2011, traveled on business",
            "text": "Not a US 5-star chain hotel...accept the fact that things are different in Europe than Cleveland...everything you need, spacious rooms and walking distance to anything you need. A good place to begin your Italian sojourn...",
            "title": "Old World Charm and central location...all good!",
            "user": "William C"
        },
        {
            "date": "January 23, 2012",
            "detail_rating": {
                "business": null,
                "cleanliness": 4.0,
                "desk": null,
                "location": 3.0,
                "pool": null,
                "restaurant": null,
                "rooms": 4.0,
                "service": 3.0,
                "sleep": 4.0,
                "value": 4.0
            },
            "helpfulness": 1,
            "id": 123518026,
            "likes": {
                "disliked": null,
                "liked": null
            },
            "rating": 4.0,
            "stay_parameters": "Stayed January 2012, traveled with family",
            "text": "The hotel is very elegant and classic. It was very quiet when we stayed and not much atmosphere. The restaurant is quite restrained. But we got excellent value.",
            "title": "Very elegant hotel",
            "user": "fightingirish101"
        },
        {
            "date": "January 19, 2012",
            "detail_rating": {
                "business": null,
                "cleanliness": 4.0,
                "desk": null,
                "location": 5.0,
                "pool": null,
                "restaurant": null,
                "rooms": 4.0,
                "service": 4.0,
                "sleep": 3.0,
                "value": 4.0
            },
            "helpfulness": 6,
            "id": 123290722,
            "likes": {
                "disliked": null,
                "liked": null
            },
            "rating": 4.0,
            "stay_parameters": "Stayed January 2012, traveled on business",
            "text": "This hotel is on the Via Nazionale, quite near to Rome's main train station and about 40 mins drive from the Fumicino airport. It's in a good location in a safe part of Rome, about 15 mins walk from the Trevi fountain and other popular tourist sites - the Collosseum is just down the road (turn left out the hotel, then turn left on via Serpenti and you'll see it in front of you). The Parthenon and Spanish Steps are walkable as well, and I took a stroll up to the Villa Medici on a nice sunny morning during my stay.",
            "title": "Good choice for business or leisure in Rome",
            "user": "CotswoldFish"
        },
        {
            "date": "January 15, 2012",
            "detail_rating": {
                "business": null,
                "cleanliness": 4.0,
                "desk": null,
                "location": 5.0,
                "pool": null,
                "restaurant": null,
                "rooms": 4.0,
                "service": 5.0,
                "sleep": 4.0,
                "value": 4.0
            },
            "helpfulness": 4,
            "id": 123131129,
            "likes": {
                "disliked": null,
                "liked": null
            },
            "rating": 5.0,
            "stay_parameters": "Stayed August 2011, traveled with friends",
            "text": "Stayed here for 3 nights this summer. Beautiful hotel. Room and bathroom were very large. Breakfast buffet was great with a lot of choices. Very nice courtyard to eat breakfast at. Very good location - tons of restaurants and gelato shops and a short walk to the Trevi and Spanish steps.",
            "title": "Great stay",
            "user": "plum93"
        },
        {
            "date": "January 7, 2012",
            "detail_rating": {
                "business": null,
                "cleanliness": 5.0,
                "desk": null,
                "location": 5.0,
                "pool": null,
                "restaurant": null,
                "rooms": 5.0,
                "service": 5.0,
                "sleep": 5.0,
                "value": 5.0
            },
            "helpfulness": 7,
            "id": 122739084,
            "likes": {
                "disliked": null,
                "liked": null
            },
            "rating": 5.0,
            "stay_parameters": "Stayed July 2011, traveled with friends",
            "text": "We went to this hotel because my grandfather used to go there very often many years ago, even my mother knew it and recommended it to us, even though she hadn't gone there for a very long time.",
            "title": "Old hotel, many memories",
            "user": "dise\ufffd\ufffdadora"
        },
        {
            "date": "January 2, 2012",
            "detail_rating": {
                "business": null,
                "cleanliness": 5.0,
                "desk": null,
                "location": 5.0,
                "pool": null,
                "restaurant": null,
                "rooms": 4.0,
                "service": 3.0,
                "sleep": 3.0,
                "value": 4.0
            },
            "helpfulness": 4,
            "id": 122391577,
            "likes": {
                "disliked": null,
                "liked": null
            },
            "rating": 4.0,
            "stay_parameters": "Stayed November 2011, traveled with friends",
            "text": "Yes, it is a very old hotel, yet very classy and clean",
            "title": "good hotel but the lobby need an upgrade",
            "user": "Pierre Andre D"
        },
        {
            "date": "December 31, 2011",
            "detail_rating": {
                "business": null,
                "cleanliness": 5.0,
                "desk": null,
                "location": 5.0,
                "pool": null,
                "restaurant": null,
                "rooms": 5.0,
                "service": 5.0,
                "sleep": 5.0,
                "value": 5.0
            },
            "helpfulness": 3,
            "id": 122318570,
            "likes": {
                "disliked": null,
                "liked": null
            },
            "rating": 5.0,
            "stay_parameters": "Stayed December 2011, traveled with friends",
            "text": "The location is great, you can go from there walking all around Rome. Transportation available.",
            "title": "Fantastic stay and great location!",
            "user": "figgylowe"
        },
        {
            "date": "December 28, 2011",
            "detail_rating": {
                "business": null,
                "cleanliness": 5.0,
                "desk": null,
                "location": 5.0,
                "pool": null,
                "restaurant": null,
                "rooms": 5.0,
                "service": 5.0,
                "sleep": 5.0,
                "value": 5.0
            },
            "helpfulness": 2,
            "id": 122166891,
            "likes": {
                "disliked": null,
                "liked": null
            },
            "rating": 5.0,
            "stay_parameters": "Stayed December 2011, traveled as a couple",
            "text": "Great breakfast, great service.",
            "title": "Excellent Hotel",
            "user": "koomaros"
        },
        {
            "date": "March 16, 2012",
            "detail_rating": {
                "business": null,
                "cleanliness": null,
                "desk": null,
                "location": null,
                "pool": null,
                "restaurant": null,
                "rooms": null,
                "service": null,
                "sleep": null,
                "value": null
            },
            "helpfulness": 1,
            "id": 126190086,
            "likes": {
                "disliked": null,
                "liked": null
            },
            "rating": 4.0,
            "stay_parameters": null,
            "text": "This hotel is older, but that only means rooms that are larger and much more comfortable than newer European and Italian hotels. The location is fabulous for touring the ruins and museums. The staff was helpful and efficient, even if they did not try to be our close personal friends, HIV other reviewers seem o expect. Now for the idiots. Those who omplain of \" pay tv only\" do not know how to operate a remote. There is a TV button to push because the tv starts by default at the pay movie menu (just like U.S. hotels!). Likewise, the wifi internet requires a device-specific code. Then itworks fine. The room service was actually good, when our son wanted a late night snack. This place was a great value and we would gladly come back.",
            "title": "Ignore idiot reviews",
            "user": "sccarlin"
        },
        {
            "date": "March 12, 2012",
            "detail_rating": {
                "business": null,
                "cleanliness": 4.0,
                "desk": null,
                "location": 5.0,
                "pool": null,
                "restaurant": null,
                "rooms": 4.0,
                "service": 5.0,
                "sleep": 4.0,
                "value": 4.0
            },
            "helpfulness": 3,
            "id": 125986815,
            "likes": {
                "disliked": null,
                "liked": null
            },
            "rating": 5.0,
            "stay_parameters": "Stayed March 2012, traveled as a couple",
            "text": "Before yourip a place, please use your brain.",
            "title": "Looking for a good central hotel?",
            "user": "chichileila"
        },
        {
            "date": "March 10, 2012",
            "detail_rating": {
                "business": null,
                "cleanliness": 5.0,
                "desk": null,
                "location": 5.0,
                "pool": null,
                "restaurant": null,
                "rooms": 5.0,
                "service": 5.0,
                "sleep": 3.0,
                "value": 3.0
            },
            "helpfulness": 2,
            "id": 125894070,
            "likes": {
                "disliked": null,
                "liked": null
            },
            "rating": 5.0,
            "stay_parameters": "Stayed March 2012, traveled with family",
            "text": "Just back from a 4-days trip to Rome: We stayed in the Quirinal: A great hotel. It took only approx. 10 minutes walk from Termini to the hotel where we were welcome by a friendly and helpful staff. The decor of the hotel and room was like one of an old Roman palace to a high standard. We had a room facing the garden which was pretty quite and we could leave the windows open (one downfall: it was pretty warm in the room). Qurinale is perfectly located for sightseeing: bus stop right in front and underground 5 minutes away only. Restaurants across the street offer pizza and pasta at reasonable prices. My husband and I will definately return and will recommend the hotel to other friends.",
            "title": "Good central hotel",
            "user": "Clanks76"
        },
        {
            "date": "February 28, 2012",
            "detail_rating": {
                "business": null,
                "cleanliness": 5.0,
                "desk": null,
                "location": 5.0,
                "pool": null,
                "restaurant": null,
                "rooms": 5.0,
                "service": 5.0,
                "sleep": 5.0,
                "value": 4.0
            },
            "helpfulness": 5,
            "id": 125346035,
            "likes": {
                "disliked": null,
                "liked": null
            },
            "rating": 5.0,
            "stay_parameters": "Stayed February 2012, traveled with friends",
            "text": "Just back from Rome and this hotel was lovely. Old so very in fitting with the surroundings and decor to a high standard. Right next to train and metro so very good location. Good restaurants near buy and easy to get to all the sites. Only downfall was that the rooms were very warm (and I'm usually cold!) they have the cold air from the aircon turned off in winter but really needs to be kept on. You can open the windows but too much traffic noise to keep open at night. This would not stop me returning to this hotel though!!",
            "title": "Roman holiday",
            "user": "Maureen_Dub"
        },
        {
            "date": "February 19, 2012",
            "detail_rating": {
                "business": null,
                "cleanliness": 4.0,
                "desk": null,
                "location": 4.0,
                "pool": null,
                "restaurant": null,
                "rooms": 3.0,
                "service": 4.0,
                "sleep": 3.0,
                "value": 4.0
            },
            "helpfulness": 4,
            "id": 124799791,
            "likes": {
                "disliked": null,
                "liked": null
            },
            "rating": 3.0,
            "stay_parameters": "Stayed February 2012, traveled with friends",
            "text": "Six of us stayed in the excellent Quirinale in Feb 2012. Location is perfect for a holiday in Rome. The bus termini is about 5 or 10 minutes away - and there is a bus stop right outside the hotel. The restaurants in the immediate area are very good and there are two Irish pubs on the street.",
            "title": "A fading hotel in great location",
            "user": "Janiefeelgood59"
        },
        {
            "date": "February 19, 2012",
            "detail_rating": {
                "business": null,
                "cleanliness": 5.0,
                "desk": null,
                "location": 5.0,
                "pool": null,
                "restaurant": null,
                "rooms": 5.0,
                "service": 5.0,
                "sleep": 5.0,
                "value": 5.0
            },
            "helpfulness": 3,
            "id": 124799284,
            "likes": {
                "disliked": null,
                "liked": null
            },
            "rating": 5.0,
            "stay_parameters": "Stayed February 2012, traveled as a couple",
            "text": "We stayed at Hotel Quirinale February 10 - 12, 2012. I absolutely loved it! The hotel has the old world charm that a hotel in Rome should have. My room was large with a high ceiling, with a huge bed and proper antique furnishings. The flat screen tv looked out of place. The bathroom had a massive sink and massive cast iron roll top bath. The bath was so big that I floated away when I leaned back!! If you want white walls and minimalist furnishings, this isn't the place for you. If you want old world elegance, then book it now. I, for one, cannot wait to stay here again. Nearly forgot to mention the staff!, who were all absolutely wonderful and couldn't do enough for us.",
            "title": "Elegant, old world charm.",
            "user": "Carlsberg P"
        },
        {
            "date": "February 16, 2012",
            "detail_rating": {
                "business": null,
                "cleanliness": 5.0,
                "desk": null,
                "location": 5.0,
                "pool": null,
                "restaurant": null,
                "rooms": 5.0,
                "service": 5.0,
                "sleep": 5.0,
                "value": 5.0
            },
            "helpfulness": 2,
            "id": 124650690,
            "likes": {
                "disliked": null,
                "liked": null
            },
            "rating": 5.0,
            "stay_parameters": "Stayed February 2012, traveled with friends",
            "text": "Lovely Hotel, staff very friendly and helpful, rooms large and comfortable, bath and shower in our bathroom, plenty of towels. Breakfast excellent, buffet style with lots of choices, set us up for the day. We stayed as a party of 4 friends to go too the Rugby and also to celebrate a 60th Birthday, we all had a great break.",
            "title": "Rugby and a Birthday in Rome",
            "user": "holidaytimeaylesbury"
        },
        {
            "date": "February 9, 2012",
            "detail_rating": {
                "business": null,
                "cleanliness": 4.0,
                "desk": null,
                "location": 5.0,
                "pool": null,
                "restaurant": null,
                "rooms": 4.0,
                "service": 3.0,
                "sleep": 4.0,
                "value": 3.0
            },
            "helpfulness": 2,
            "id": 124362979,
            "likes": {
                "disliked": null,
                "liked": null
            },
            "rating": 3.0,
            "stay_parameters": "Stayed November 2011, traveled on business",
            "text": "Massive pile of a place in a fantasitc location - about 10 minutes from Termini, and an easy walk to the sights, good service from the staff, decent breakfast, and free wifi",
            "title": "A little faded from past glories, but a fantastic location",
            "user": "Teiresias"
        },
        {
            "date": "January 30, 2012",
            "detail_rating": {
                "business": null,
                "cleanliness": 5.0,
                "desk": null,
                "location": 5.0,
                "pool": null,
                "restaurant": null,
                "rooms": 4.0,
                "service": 4.0,
                "sleep": 4.0,
                "value": 5.0
            },
            "helpfulness": 4,
            "id": 123868864,
            "likes": {
                "disliked": null,
                "liked": null
            },
            "rating": 4.0,
            "stay_parameters": "Stayed January 2012, traveled on business",
            "text": "Only downer was the lack of availability of ironing services - I had work shirts that I needed to iron after unpacking, and couldn't borrow an iron. I had to put the shirts through their laundry service which was irritating.",
            "title": "A good hotel, in a great location at the right $$$",
            "user": "Jim and Barbara J"
        },
        {
            "date": "January 29, 2012",
            "detail_rating": {
                "business": null,
                "cleanliness": 5.0,
                "desk": null,
                "location": 5.0,
                "pool": null,
                "restaurant": null,
                "rooms": 5.0,
                "service": 5.0,
                "sleep": 5.0,
                "value": 5.0
            },
            "helpfulness": 2,
            "id": 123810599,
            "likes": {
                "disliked": null,
                "liked": null
            },
            "rating": 5.0,
            "stay_parameters": "Stayed December 2011, traveled with family",
            "text": "I was in Rome on business for 6 days and stayed at the 4 star Hotel Quirinale. The location, for me was excellent. It was near the center of Rome, 1 block from a main metro station and 2 blocks from the train station. Easy to walk to all of the monuments in Rome, Trevi Fountain, Piazza Navona, Spanish Steps even the Vatican. The good part was it was on Via Nazionale which is loaded with everyday shopping (not the stuff you can't afford like on the via Condotti).",
            "title": "Returning to the Hotel Quirinale for the last ten years",
            "user": "rita a"
        }
    ],
    "slim_ranking": 0.252755905512,
    "stars": 4,
    "tripadvisor": {
        "VISITED": false,
        "country_name": null,
        "locality": null,
        "pic_link": null,
        "street_address": null
    },
    "user_rating": 4.0,
    "variance": {
        "average": 215,
        "excellent": 296,
        "poor": 63,
        "terrible": 44,
        "very good": 471
    }
}