{
    "aka": null,
    "description": null,
    "detail_rating": {
        "cleanliness": null,
        "location": null,
        "rooms": null,
        "service": null,
        "sleep": null,
        "value": null
    },
    "location": {
        "city": null,
        "continent": "Europe",
        "country": "Poland",
        "proposed_city": "Szczecin",
        "province": null,
        "region": "Western Poland"
    },
    "name": "Campanile Szczecin Hotel",
    "places": {
        "aka": [],
        "hotel_description": [],
        "hotel_name": [
            "Szczecin"
        ]
    },
    "review_count": 70,
    "review_count_current": 20,
    "reviews": [
        {
            "date": "October 27, 2010",
            "detail_rating": {
                "business": null,
                "cleanliness": 4.0,
                "desk": null,
                "location": 4.0,
                "pool": null,
                "restaurant": null,
                "rooms": 3.0,
                "service": 3.0,
                "sleep": 4.0,
                "value": 4.0
            },
            "helpfulness": null,
            "id": 85080039,
            "likes": {
                "disliked": null,
                "liked": null
            },
            "rating": 4.0,
            "stay_parameters": "Stayed October 2010, traveled on business",
            "text": "Not luxury but good value with attentive staff. It has nice location and fairly central - in the midway between the main railway station of Szczecin and city centre shopping. The room was standard, but clean, comfortable and had everything I needed for short term stay (maybe except the hairdryer). Linens provided and towels are changed daily. Free mineral water in the room. Wi-Fi is free and work fast. Most everything at breakfast was quite good, including the service as well as the food, however, it's a little overpriced. There is a possibility to use garage parking space for extra fee (25 zl per day). All in all a good standard in this category.",
            "title": "Good standard, central location",
            "user": "jakub-krakau"
        },
        {
            "date": "May 3, 2010",
            "detail_rating": {
                "business": null,
                "cleanliness": 5.0,
                "desk": null,
                "location": 5.0,
                "pool": null,
                "restaurant": null,
                "rooms": 5.0,
                "service": 5.0,
                "sleep": 5.0,
                "value": 5.0
            },
            "helpfulness": null,
            "id": 63121105,
            "likes": {
                "disliked": null,
                "liked": null
            },
            "rating": 5.0,
            "stay_parameters": "Stayed April 2010, traveled solo",
            "text": "Great place for the price. Very professionally run with modern and very clean rooms & facilities.",
            "title": "Modern, clean and great value for city centre.",
            "user": "Edikop"
        },
        {
            "date": "February 28, 2009",
            "detail_rating": {
                "business": null,
                "cleanliness": 3.0,
                "desk": null,
                "location": 5.0,
                "pool": null,
                "restaurant": null,
                "rooms": 2.0,
                "service": 3.0,
                "sleep": null,
                "value": 4.0
            },
            "helpfulness": 1,
            "id": 25324361,
            "likes": {
                "disliked": null,
                "liked": null
            },
            "rating": 3.0,
            "stay_parameters": "Stayed February 2009, traveled on business",
            "text": "Location is also very close to the main train station and opposite the main cathedral in the city who's steeple is always visible on the city skyline so easy to find your way back when walking or driving.",
            "title": "Basic and cheap, not of the best quality..",
            "user": "Karolina_Boch"
        },
        {
            "date": "June 19, 2008",
            "detail_rating": {
                "business": 3.0,
                "cleanliness": 3.0,
                "desk": null,
                "front_desk": 3.0,
                "location": 4.0,
                "pool": null,
                "restaurant": null,
                "rooms": 2.0,
                "service": 3.0,
                "sleep": null,
                "value": 5.0
            },
            "helpfulness": null,
            "id": 17041694,
            "likes": {
                "disliked": "\u2014 Tatty rooms",
                "liked": "\u2014 Dirt cheap"
            },
            "rating": 3.0,
            "stay_parameters": "Stayed June 2008, traveled as a couple",
            "text": "Restaurant and bar is nothing to write home about and breakfast is a little expensive so eat elsewhere.",
            "title": "Cheap as chips but very basic",
            "user": "Jamezon"
        },
        {
            "date": "December 31, 2007",
            "detail_rating": {
                "business": null,
                "cleanliness": 5.0,
                "desk": null,
                "front_desk": 5.0,
                "location": 5.0,
                "pool": null,
                "restaurant": null,
                "rooms": 5.0,
                "service": 4.0,
                "sleep": null,
                "value": 5.0
            },
            "helpfulness": null,
            "id": 12176086,
            "likes": {
                "disliked": "\u2014 Nothing really to dislike",
                "liked": "\u2014 Hotel was very comfortable, well run, and affordable"
            },
            "rating": 4.0,
            "stay_parameters": "Stayed August 2007, traveled on business",
            "text": "Parking available under the hotel but I was lucky to just park on the pavement outside the hotel where taxis usually stand. This was allowed so I saved a bit on parking charges.",
            "title": "Perfectly Adequate",
            "user": "guillaume51"
        },
        {
            "date": "November 17, 2011",
            "detail_rating": {
                "business": null,
                "cleanliness": 4.0,
                "desk": null,
                "location": 5.0,
                "pool": null,
                "restaurant": null,
                "rooms": 4.0,
                "service": 4.0,
                "sleep": 5.0,
                "value": 5.0
            },
            "helpfulness": 5,
            "id": 120714206,
            "likes": {
                "disliked": null,
                "liked": null
            },
            "rating": 4.0,
            "stay_parameters": "Stayed July 2011, traveled on business",
            "text": "Stayed at the Campanile Szczecin Hotel for one night while heading south in Europe.",
            "title": "Good standard hotel centrally located in Szczecin",
            "user": "Ausgarius"
        },
        {
            "date": "November 1, 2011",
            "detail_rating": {
                "business": null,
                "cleanliness": 4.0,
                "desk": null,
                "location": 4.0,
                "pool": null,
                "restaurant": null,
                "rooms": 4.0,
                "service": 4.0,
                "sleep": 4.0,
                "value": 5.0
            },
            "helpfulness": 1,
            "id": 120016497,
            "likes": {
                "disliked": null,
                "liked": null
            },
            "rating": 5.0,
            "stay_parameters": "Stayed September 2011, traveled as a couple",
            "text": "The hotel is located quite centrally in Szczecin. Easy to park the car right outside the hotel, free of charge. The neighbourhood is a bit noisy (traffic) but I was in no way disturbed and slept comfortably during the night.",
            "title": "Excellent value for money, clean and big enough room",
            "user": "ringingup"
        },
        {
            "date": "August 29, 2011",
            "detail_rating": {
                "business": null,
                "cleanliness": 4.0,
                "desk": null,
                "location": 4.0,
                "pool": null,
                "restaurant": null,
                "rooms": 4.0,
                "service": 4.0,
                "sleep": 4.0,
                "value": 5.0
            },
            "helpfulness": 2,
            "id": 117420289,
            "likes": {
                "disliked": null,
                "liked": null
            },
            "rating": 5.0,
            "stay_parameters": "Stayed September 2011, traveled as a couple",
            "text": "The room is standard and what you would expect from a two star hotel. Still clean and in good shape.",
            "title": "\"Good value for money\"",
            "user": "ringingup"
        },
        {
            "date": "July 29, 2011",
            "detail_rating": {
                "business": null,
                "cleanliness": 5.0,
                "desk": null,
                "location": null,
                "pool": null,
                "restaurant": null,
                "rooms": null,
                "service": 4.0,
                "sleep": 3.0,
                "value": 3.0
            },
            "helpfulness": 1,
            "id": 115999111,
            "likes": {
                "disliked": null,
                "liked": null
            },
            "rating": 3.0,
            "stay_parameters": "Stayed June 2011, traveled solo",
            "text": "When arriving I was handed two coupons that said \u201cA glass to welcome you, Free at our bar\u201d. Very nice I thought and went to the bar.",
            "title": "A good option.",
            "user": "ChelseyO"
        },
        {
            "date": "January 23, 2011",
            "detail_rating": {
                "business": null,
                "cleanliness": 5.0,
                "desk": null,
                "location": 5.0,
                "pool": null,
                "restaurant": null,
                "rooms": 5.0,
                "service": 5.0,
                "sleep": 5.0,
                "value": 5.0
            },
            "helpfulness": null,
            "id": 94134451,
            "likes": {
                "disliked": null,
                "liked": null
            },
            "rating": 5.0,
            "stay_parameters": "Stayed January 2011, traveled as a couple",
            "text": "The bartender replied: No no, no free drinks in the bar. Go to the restaurant, buy some food and you\u2019ll get your free drink.",
            "title": "Great value for money",
            "user": "AphraDieppe"
        },
        {
            "date": "April 22, 2012",
            "detail_rating": {
                "business": null,
                "cleanliness": 5.0,
                "desk": null,
                "location": 5.0,
                "pool": null,
                "restaurant": null,
                "rooms": 4.0,
                "service": 4.0,
                "sleep": 3.0,
                "value": 5.0
            },
            "helpfulness": 1,
            "id": 128316972,
            "likes": {
                "disliked": null,
                "liked": null
            },
            "rating": 4.0,
            "stay_parameters": "Stayed April 2012, traveled with family",
            "text": "My wife & I stayed here for two nights in April, this being our third stay at this hotel. The price, quality etc is all good, however it lost marks for me on this occasion because we had a cold night! They have put summer duvets on (understandable for April), however it was unseasonably cold outside, so we asked reception if we could have extra bed covers. We were told they didn't have any and so had quite a chilly night as the room heating isn't great. Also there was an annoying noise from the fan/air duct in the bathroom which we couldn't switich off which reception said would go off itself during the night. The next day we were given an additional duvet which sorted the problem, but this should really have been available the first night.",
            "title": "Good hotel, but slight drop in standards!",
            "user": "chief270974"
        },
        {
            "date": "February 23, 2012",
            "detail_rating": {
                "business": null,
                "cleanliness": 4.0,
                "desk": null,
                "location": 4.0,
                "pool": null,
                "restaurant": null,
                "rooms": 3.0,
                "service": 3.0,
                "sleep": 4.0,
                "value": 4.0
            },
            "helpfulness": 1,
            "id": 125073322,
            "likes": {
                "disliked": null,
                "liked": null
            },
            "rating": 3.0,
            "stay_parameters": "Stayed February 2012, traveled as a couple",
            "text": "Overall a very good budget hotel in a good location which comfortable and does the job. Slightly let down on this occasion, but it wouldn't put me off staying here again!",
            "title": "Pleasantly average",
            "user": "Sinead M"
        },
        {
            "date": "January 11, 2012",
            "detail_rating": {
                "business": null,
                "cleanliness": 5.0,
                "desk": null,
                "location": 5.0,
                "pool": null,
                "restaurant": null,
                "rooms": 4.0,
                "service": 4.0,
                "sleep": 3.0,
                "value": 5.0
            },
            "helpfulness": 2,
            "id": 122928531,
            "likes": {
                "disliked": null,
                "liked": null
            },
            "rating": 5.0,
            "stay_parameters": "Stayed April 2012, traveled with family",
            "text": "This hotel made for a cheap break as in total I paid \u00a3116 for a double room for 5 nights. However, considering how incredibly cheap food and drink is in the city, I would not for a second recommend ordering from the bar or getting breakfast. For 39PLN (or 7 ish quid) the breakfast buffet was small and simple and not at all enticing. We were also charged 59PLn for a vodka red bull and jack daniels and coke when in bars across the city it would cost no more than 30PLN at the most expensive.",
            "title": "Clean, tidy, comfortable budget hotel that puts other to shame",
            "user": "chief270974"
        },
        {
            "date": "January 11, 2012",
            "detail_rating": {
                "business": null,
                "cleanliness": 4.0,
                "desk": null,
                "location": 5.0,
                "pool": null,
                "restaurant": null,
                "rooms": 4.0,
                "service": 4.0,
                "sleep": 4.0,
                "value": 5.0
            },
            "helpfulness": 1,
            "id": 122913542,
            "likes": {
                "disliked": null,
                "liked": null
            },
            "rating": 4.0,
            "stay_parameters": "Stayed January 2012, traveled as a couple",
            "text": "The hotel room was average, but lacked a safety deposit box. Free wifi is included but for two days we struggled with connection (not so good for picking up business emails etc). The staff were very helpful and wouldnt hesitate to arrange any of our cabs.",
            "title": "Excellent value for money",
            "user": "slawekg07"
        },
        {
            "date": "November 28, 2011",
            "detail_rating": {
                "business": null,
                "cleanliness": 3.0,
                "desk": null,
                "location": 3.0,
                "pool": null,
                "restaurant": null,
                "rooms": 3.0,
                "service": 3.0,
                "sleep": 3.0,
                "value": 3.0
            },
            "helpfulness": 1,
            "id": 121158850,
            "likes": {
                "disliked": null,
                "liked": null
            },
            "rating": 3.0,
            "stay_parameters": "Stayed November 2011, traveled on business",
            "text": "All in all, for what it was- a cheap break- I cannot complain.",
            "title": "Standard hotel from Campanile chain",
            "user": "FrancescTort"
        },
        {
            "date": "August 19, 2012",
            "detail_rating": {
                "business": null,
                "cleanliness": 5.0,
                "desk": null,
                "location": 5.0,
                "pool": null,
                "restaurant": null,
                "rooms": 5.0,
                "service": 5.0,
                "sleep": 5.0,
                "value": 5.0
            },
            "helpfulness": 1,
            "id": 137623977,
            "likes": {
                "disliked": null,
                "liked": null
            },
            "rating": 4.0,
            "stay_parameters": "Stayed August 2012, traveled as a couple",
            "text": "This is a great hotel for a city break in Szczecin! The rooms are large, spotlessly clean and comfortable and had everything we needed for a short stay. The location is second to none being just a short walk to the train station and to all local restaurants, cafes, bars and shopping centres. The bed was comfortable, the shower was powerful and it was an added bonus to have tea and coffee making facilities. Reception staff speak very good English and were very helpful with arranging our transport back to the airport.The only downsides to the hotel was the lack of plug sockets in the room-only one in the bedroom and the cost of drinks in the hotel bar which were the highest we paid anywhere in Szczecin! That said there is no shortage of bars nearby so this should not put you off! When we return to Szczecin we will certainly stay here again!",
            "title": "Perfect base to explore Szczecin!",
            "user": "saoirsechick"
        },
        {
            "date": "July 18, 2012",
            "detail_rating": {
                "business": null,
                "cleanliness": 5.0,
                "desk": null,
                "location": 5.0,
                "pool": null,
                "restaurant": null,
                "rooms": 4.0,
                "service": 4.0,
                "sleep": 5.0,
                "value": 4.0
            },
            "helpfulness": 1,
            "id": 134767939,
            "likes": {
                "disliked": null,
                "liked": null
            },
            "rating": 4.0,
            "stay_parameters": "Stayed August 2011, traveled as a couple",
            "text": "Nothing very outstanding, as long as comfort and amenities were concerned, but the location just across the cathedral and 15 minutes away from the train station make it a sensible choice if you're on a budget. Free internet, but breakfast was too expensive, I passed. Recommended place for a short stay",
            "title": "Great location",
            "user": "Eric W"
        },
        {
            "date": "June 21, 2012",
            "detail_rating": {
                "business": null,
                "cleanliness": 5.0,
                "desk": null,
                "location": 5.0,
                "pool": null,
                "restaurant": null,
                "rooms": 5.0,
                "service": 5.0,
                "sleep": 5.0,
                "value": 5.0
            },
            "helpfulness": null,
            "id": 132471308,
            "likes": {
                "disliked": null,
                "liked": null
            },
            "rating": 5.0,
            "stay_parameters": "Stayed June 2012, traveled with friends",
            "text": "excellent staff , great value for money , clean and perfectly situated",
            "title": "euro 2012 base",
            "user": "dannyk5500"
        },
        {
            "date": "May 24, 2012",
            "detail_rating": {
                "business": null,
                "cleanliness": 4.0,
                "desk": null,
                "location": 5.0,
                "pool": null,
                "restaurant": null,
                "rooms": 4.0,
                "service": 5.0,
                "sleep": 5.0,
                "value": 5.0
            },
            "helpfulness": null,
            "id": 130512626,
            "likes": {
                "disliked": null,
                "liked": null
            },
            "rating": 5.0,
            "stay_parameters": "Stayed May 2012, traveled as a couple",
            "text": "Great location for the hotel, within easy walking distance of everywhere and only about 10 mins from the station. All we wanted was a cheap break, we got a cheap clean room that were a decent size with a large bed and good shower - nothing much else to say, if you just want a few nights away from everything without paying the earth, you could a lot worse than booking this hotel. Friendly helpful staff as well!",
            "title": "Clean, Simple & Good Location",
            "user": "monkeyman99"
        },
        {
            "date": "May 23, 2012",
            "detail_rating": {
                "business": null,
                "cleanliness": 4.0,
                "desk": null,
                "location": 4.0,
                "pool": null,
                "restaurant": null,
                "rooms": 4.0,
                "service": 5.0,
                "sleep": 4.0,
                "value": 5.0
            },
            "helpfulness": null,
            "id": 130471884,
            "likes": {
                "disliked": null,
                "liked": null
            },
            "rating": 5.0,
            "stay_parameters": "Stayed May 2012, traveled as a couple",
            "text": "We stayed here for 3 nights and I found the hotel to be clean and tidy. Our double room had ample space for a few nights stay but there was lots of hangers and space if you were staying longer. 10 mins walk from the station and lots of shops and nightlife within a short walk. I borrowed a hairdryer from Reception and they have a locked room for leaving your luggage - anything we asked the staff they were more than helpful. I would definitely stay here again.",
            "title": "Great stay",
            "user": "annie2301"
        }
    ],
    "slim_ranking": 0.391304347826,
    "stars": 2,
    "tripadvisor": {
        "VISITED": false,
        "country_name": null,
        "locality": null,
        "pic_link": null,
        "street_address": null
    },
    "user_rating": 4.0,
    "variance": {
        "average": 15,
        "excellent": 14,
        "poor": 3,
        "terrible": 2,
        "very good": 36
    }
}