{
    "aka": "Tivoli Lisboa Lisbon",
    "description": "Located in the heart of Lisbon, this is an elegant 5 star hotel. Renowned for its business meeting facilities for top executives, Tivoli Lisboa continues the tradition of being a well known meeting point in the city. A weekend in this hotel means you can enjoy our swimming pool, a drink in the privacy of our bars and relax meal in one of our 2 restaurantes, Terra\u00e7o with a unique view and Brasserie Flo Lisbon.",
    "detail_rating": {
        "cleanliness": 4.5,
        "location": 4.5,
        "rooms": 4.0,
        "service": 4.0,
        "sleep": 4.5,
        "value": 4.0
    },
    "location": {
        "city": "Lisbon",
        "continent": "Europe",
        "country": "Portugal",
        "proposed_city": "Tivoli",
        "province": null,
        "region": "Estremadura"
    },
    "name": "Tivoli Lisboa",
    "places": {
        "aka": [
            "Tivoli",
            "Lisbon"
        ],
        "hotel_description": [
            "Lisbon",
            "Tivoli"
        ],
        "hotel_name": [
            "Tivoli"
        ]
    },
    "review_count": 706,
    "review_count_current": 5,
    "reviews": [
        {
            "date": "March 28, 2006",
            "detail_rating": {
                "business": null,
                "cleanliness": 5.0,
                "desk": null,
                "location": null,
                "pool": null,
                "restaurant": null,
                "rooms": 4.0,
                "service": 4.0,
                "sleep": null,
                "value": 4.0
            },
            "helpfulness": 7,
            "id": 4739368,
            "likes": {
                "disliked": null,
                "liked": null
            },
            "rating": 4.0,
            "stay_parameters": "Stayed September 2005",
            "text": "As a young couple travelling through Europe, budget was always on our mind - and we got a very decent room at the Tivoli for a reasonable price.",
            "title": "Good value for where it is",
            "user": "Chad_and_Ang"
        },
        {
            "date": "March 26, 2006",
            "detail_rating": {
                "business": null,
                "cleanliness": 5.0,
                "desk": null,
                "location": null,
                "pool": null,
                "restaurant": null,
                "rooms": 4.0,
                "service": 5.0,
                "sleep": null,
                "value": 4.0
            },
            "helpfulness": 6,
            "id": 4735666,
            "likes": {
                "disliked": null,
                "liked": null
            },
            "rating": 4.0,
            "stay_parameters": "Stayed March 2006",
            "text": "The service was formal and helpful, the room clean and comfortable, and Lisbon was beautiful.",
            "title": "Loved the service",
            "user": "labbifri"
        },
        {
            "date": "February 7, 2006",
            "detail_rating": {
                "business": null,
                "cleanliness": null,
                "desk": null,
                "location": null,
                "pool": null,
                "restaurant": null,
                "rooms": null,
                "service": null,
                "sleep": null,
                "value": null
            },
            "helpfulness": 17,
            "id": 4440764,
            "likes": {
                "disliked": null,
                "liked": null
            },
            "rating": 4.0,
            "stay_parameters": null,
            "text": "Our only suggestion to anyone looking to stay here would be to be aware of the distance you'll be walking to the main hub of Lisbon. The hotel is at the top of the (mainly steep) main street that runs right through the heart of the city, so you'll be walking for a good 15 minutes to get where you want to be. Alternatively there's a Metro stop right outside the hotel (on the other side of the block), which we'd definitely recommend.",
            "title": "Really Good",
            "user": "Englanderin"
        },
        {
            "date": "November 17, 2005",
            "detail_rating": {
                "business": null,
                "cleanliness": 5.0,
                "desk": null,
                "location": null,
                "pool": null,
                "restaurant": null,
                "rooms": 5.0,
                "service": 5.0,
                "sleep": null,
                "value": 3.0
            },
            "helpfulness": 18,
            "id": 4123960,
            "likes": {
                "disliked": null,
                "liked": null
            },
            "rating": 4.0,
            "stay_parameters": "Stayed November 2005",
            "text": "My wife and I stayed at this hotel during the off-season of November 10-15. We stayed in the Tivoli Suite located on the 8th floor. The suite was pretty impressive and very roomy. The service was excellent all around. The food was 5 star all the way but very, very expensive. There are 2 restaurants within this hotel 1 on the lobby and 1 on the top floor. The restaurant on the top floor is spectacular with an amazing view but make sure you have a few hundred euros if you want to eat there.",
            "title": "Great Info you need to know",
            "user": "Coldmaac"
        },
        {
            "date": "April 16, 2006",
            "detail_rating": {
                "business": null,
                "cleanliness": null,
                "desk": null,
                "location": null,
                "pool": null,
                "restaurant": null,
                "rooms": null,
                "service": null,
                "sleep": null,
                "value": null
            },
            "helpfulness": 8,
            "id": 4977484,
            "likes": {
                "disliked": null,
                "liked": null
            },
            "rating": 4.0,
            "stay_parameters": null,
            "text": "Stayed at the hotel during April 2006 for three nights. It was the first hotel I have stayed in that did not take a credit card imprint - although the booking had been paid for in advance. We were just asked on check out about our use of the mini bar - which was as expensive as mini bars are! Staff were very helpful and polite.",
            "title": "Good but not international 5 star.",
            "user": "A TripAdvisor user"
        }
    ],
    "slim_ranking": 0.209090909091,
    "stars": 5,
    "tripadvisor": {
        "VISITED": false,
        "country_name": null,
        "locality": null,
        "pic_link": null,
        "street_address": null
    },
    "user_rating": 4.0,
    "variance": {
        "average": 99,
        "excellent": 306,
        "poor": 27,
        "terrible": 12,
        "very good": 262
    }
}