{
    "aka": "3 Palms Resort Oasis Hotel Scottsdale",
    "description": null,
    "detail_rating": {
        "cleanliness": 4.5,
        "location": 4.0,
        "rooms": 4.0,
        "service": 4.0,
        "sleep": 4.5,
        "value": 4.0
    },
    "location": {
        "city": null,
        "continent": null,
        "country": "United States",
        "proposed_city": "Scottsdale",
        "province": null,
        "region": null
    },
    "name": "3 Palms",
    "places": {
        "aka": [
            "Scottsdale"
        ],
        "hotel_description": [],
        "hotel_name": []
    },
    "review_count": 674,
    "review_count_current": 40,
    "reviews": [
        {
            "date": "April 16, 2007",
            "detail_rating": {
                "business": 2.0,
                "cleanliness": 3.0,
                "desk": null,
                "front_desk": 2.0,
                "location": 3.0,
                "pool": null,
                "restaurant": null,
                "rooms": 1.0,
                "service": 3.0,
                "sleep": null,
                "value": 1.0
            },
            "helpfulness": 2,
            "id": 7374594,
            "likes": {
                "disliked": "\u2014 The whole experience. Not worth the money at all.",
                "liked": "\u2014 The bed was pretty comfortable"
            },
            "rating": 1.0,
            "stay_parameters": "Stayed April 2007, traveled as a couple",
            "text": "This place was definitely not worth 150$ a night. It was basically a glamorized Motel 6. The d\u00e9cor looked new but was super cheap (ie.The bathtub faucet handle broke off into the tub.) There was some random abandoned building in the front of the hotel... The door to our room wouldn\u2019t shut completely without a lot of force and we ended up sleeping with it open all night and didn\u2019t know it until the next morning. Also, you can hear absolutely everything that is going on outside. There was nothing quiet about this place. The walls were extremely thin. We could hear every person pass by and both sides of our neighbors. I was extremely disappointed with this place and will never stay there again. I urge anyone that is thinking about booking here to go see it first.",
            "title": "More like 1 out of 3 palms",
            "user": "Linzee10"
        },
        {
            "date": "April 8, 2007",
            "detail_rating": {
                "business": null,
                "cleanliness": 5.0,
                "desk": null,
                "front_desk": 5.0,
                "location": 5.0,
                "pool": null,
                "restaurant": null,
                "rooms": 5.0,
                "service": 5.0,
                "sleep": null,
                "value": 5.0
            },
            "helpfulness": null,
            "id": 7291973,
            "likes": {
                "disliked": null,
                "liked": null
            },
            "rating": 5.0,
            "stay_parameters": "Stayed April 2007, traveled with family",
            "text": "Couldn't have said it better myself than the last reviewer. I stayed here with my mom and at $150 a night in Scottsdale, it couldn't be beat. The beds were VERY comfortable, the rooms fashionably decorated, the service excellent. The room was TINY. My mum and I were pretty much bumping into each other but esthetically, it was very pleasing and comfortable. I will definitely stay here again...until I get rich and can afford the higher end hotels.",
            "title": "Ditto the review from March 28th",
            "user": "TwoInTahoe"
        },
        {
            "date": "April 7, 2007",
            "detail_rating": {
                "business": null,
                "cleanliness": 4.0,
                "desk": null,
                "front_desk": 1.0,
                "location": 3.0,
                "pool": null,
                "restaurant": null,
                "rooms": 3.0,
                "service": 1.0,
                "sleep": null,
                "value": 2.0
            },
            "helpfulness": null,
            "id": 7289945,
            "likes": {
                "disliked": "\u2014 The external building appearance",
                "liked": "\u2014 The room design"
            },
            "rating": 2.0,
            "stay_parameters": "Stayed March 2007, traveled as a couple",
            "text": "Sometimes a renovation makes all the difference but not at the 3 Palms. The interior design is worthy of any resort in Scottsdale, a very modern geometric theme with bright colors. The attitude of the women working at the front desk is also more appropriate for the massive resorts in central Scottsdale than a hotel located on the back end of the mile of cars. I really dislike attitude and disdain in my hotel staff.",
            "title": "All dressed up but still a motel",
            "user": "Marymarcia"
        },
        {
            "date": "March 28, 2007",
            "detail_rating": {
                "business": null,
                "cleanliness": 5.0,
                "desk": null,
                "front_desk": 5.0,
                "location": 4.0,
                "pool": null,
                "restaurant": null,
                "rooms": 5.0,
                "service": 3.0,
                "sleep": null,
                "value": 5.0
            },
            "helpfulness": null,
            "id": 7239097,
            "likes": {
                "disliked": null,
                "liked": null
            },
            "rating": 5.0,
            "stay_parameters": "Stayed March 2007, traveled with friends",
            "text": "The renovation could not mask the original motel's structure with rooms opening up into the parking lot and the pool hanging off the side like an afterthought. The rooms are still the tight 1950s dimensions, though they appeared to vary in dimensions. One room appeared to have a hot tub two feet from the bed!",
            "title": "Shockingly good for the price",
            "user": "Master_Shake"
        },
        {
            "date": "March 14, 2007",
            "detail_rating": {
                "business": null,
                "cleanliness": 3.0,
                "desk": null,
                "front_desk": 2.0,
                "location": 3.0,
                "pool": null,
                "restaurant": null,
                "rooms": 1.0,
                "service": 1.0,
                "sleep": null,
                "value": 1.0
            },
            "helpfulness": 2,
            "id": 7160428,
            "likes": {
                "disliked": "\u2014 Staff",
                "liked": "\u2014 nothing"
            },
            "rating": 1.0,
            "stay_parameters": "Stayed March 2007",
            "text": "The location is convenient to the airport, Mesa, Tempe, Scottsdale, and the 101 interstrate but does not offer much of interest in its immediate vicinity. There is a 6 screen drive-in, waterpark and casino a few miles down the road.",
            "title": "Horrible Experience",
            "user": "CV1807"
        },
        {
            "date": "March 12, 2007",
            "detail_rating": {
                "business": null,
                "cleanliness": 5.0,
                "desk": null,
                "front_desk": 1.0,
                "location": 4.0,
                "pool": null,
                "restaurant": null,
                "rooms": 3.0,
                "service": 1.0,
                "sleep": null,
                "value": 1.0
            },
            "helpfulness": 1,
            "id": 7148920,
            "likes": {
                "disliked": "\u2014 Overall experience with hotel staff",
                "liked": "\u2014 Bedding"
            },
            "rating": 1.0,
            "stay_parameters": "Stayed March 2007, traveled as a couple",
            "text": "I had a very disapointing experience with the 3 Palms hotel. I am alergic to many foods, and therefore I must prepare my own. I was told that the room that I booked over the phone had a kitchenette in it, but upon arrival I found out that my expectations would not even come close to being met. The room did not have a kitchenette in it, and the staff at the front desk were anything but helpful. I ended up leaving the hotel, very unsatisfied. I would not reccomend this hotel to anyone, based upon how rude the staff was and for the fact that it is very over priced.",
            "title": "Terrible experience at the 3 Palms",
            "user": "Meghan31285"
        },
        {
            "date": "February 19, 2007",
            "detail_rating": {
                "business": 1.0,
                "cleanliness": 3.0,
                "desk": null,
                "front_desk": 3.0,
                "location": 1.0,
                "pool": null,
                "restaurant": null,
                "rooms": 4.0,
                "service": 2.0,
                "sleep": null,
                "value": 2.0
            },
            "helpfulness": 4,
            "id": 6813220,
            "likes": {
                "disliked": "\u2014 very noisey hotel",
                "liked": "\u2014 decorations"
            },
            "rating": 2.0,
            "stay_parameters": "Stayed February 2007, traveled as a couple",
            "text": "I think hotels are using the term \"boutique\" and \"resort\" a little too loosely these days. The room was clean and nicely decorated, but it is a motel! The rooms are incredibly small and you can hear everything through the walls. Between the kids screaming in the room next door, and the loud music coming from the room above us at 7am, I wouldn't recommend staying at the 3 Palms Resort Oasis. What I paid for that room was highly overpriced!",
            "title": "Boutique hotel....I don't think so!",
            "user": "flagstaff32"
        },
        {
            "date": "January 30, 2007",
            "detail_rating": {
                "business": 1.0,
                "cleanliness": 4.0,
                "desk": null,
                "front_desk": 3.0,
                "location": 3.0,
                "pool": null,
                "restaurant": null,
                "rooms": 4.0,
                "service": 2.0,
                "sleep": null,
                "value": 2.0
            },
            "helpfulness": 5,
            "id": 6717008,
            "likes": {
                "disliked": "\u2014 internet connectivity & service",
                "liked": "\u2014 The bed and bedding."
            },
            "rating": 2.0,
            "stay_parameters": "Stayed January 2007, traveled on business",
            "text": "I stayed for a week here as a business traveler. I stayed in a regular queen room the first few nights and then a deluxe queen suite on the last night. Overall it was a less than average stay because of the unreliable internet service, which is important for me. The business center is not the most comfortable place to work in the evenings.",
            "title": "below average stay ...",
            "user": "TXSunnyTraveller"
        },
        {
            "date": "January 12, 2007",
            "detail_rating": {
                "business": 3.0,
                "cleanliness": 5.0,
                "desk": null,
                "front_desk": 3.0,
                "location": 3.0,
                "pool": null,
                "restaurant": null,
                "rooms": 2.0,
                "service": 3.0,
                "sleep": null,
                "value": 1.0
            },
            "helpfulness": 5,
            "id": 6583298,
            "likes": {
                "disliked": "\u2014 The motor lodge configuration",
                "liked": "\u2014 Clean"
            },
            "rating": 2.0,
            "stay_parameters": "Stayed January 2007, traveled as a couple",
            "text": "My reviews are as follows:",
            "title": "The Marble Motor Lodge",
            "user": "Buckeye2007"
        },
        {
            "date": "December 30, 2006",
            "detail_rating": {
                "business": 5.0,
                "cleanliness": 5.0,
                "desk": null,
                "front_desk": 4.0,
                "location": 3.0,
                "pool": null,
                "restaurant": null,
                "rooms": 5.0,
                "service": 5.0,
                "sleep": null,
                "value": 5.0
            },
            "helpfulness": 1,
            "id": 6518127,
            "likes": {
                "disliked": "\u2014 a little \"out of the way\"",
                "liked": "\u2014 upscale luxury of the rooms and customer service"
            },
            "rating": 4.0,
            "stay_parameters": "Stayed December 2006, traveled with family",
            "text": "Pros-",
            "title": "WOW! We love the 3 Palms Resort Oasis!",
            "user": "Andersfamily"
        },
        {
            "date": "August 28, 2013",
            "detail_rating": {
                "business": null,
                "cleanliness": 5.0,
                "desk": null,
                "location": 5.0,
                "pool": null,
                "restaurant": null,
                "rooms": 5.0,
                "service": 5.0,
                "sleep": 5.0,
                "value": 5.0
            },
            "helpfulness": null,
            "id": 174593500,
            "likes": {
                "disliked": null,
                "liked": null
            },
            "rating": 5.0,
            "stay_parameters": "Stayed August 2013, traveled on business",
            "text": "This hotel was super nice and easily worth twice the price. Everything was clean and very well designed. It even has a great pool and outdoor area. The hotel is also very conveniently located and easy to access from all directions.",
            "title": "3 Palms Gets 5 Stars!",
            "user": "Matt F"
        },
        {
            "date": "August 26, 2013",
            "detail_rating": {
                "business": null,
                "cleanliness": 3.0,
                "desk": null,
                "location": 3.0,
                "pool": null,
                "restaurant": null,
                "rooms": 3.0,
                "service": 4.0,
                "sleep": 4.0,
                "value": 4.0
            },
            "helpfulness": null,
            "id": 174175863,
            "likes": {
                "disliked": null,
                "liked": null
            },
            "rating": 4.0,
            "stay_parameters": "Stayed August 2013, traveled as a couple",
            "text": "When I arrived I was very pleasantly greeted by Amanda, who continued to provide great service throughout the duration of my stay. It's obvious that she knows her job well and enjoys the hospitality business.",
            "title": "Quick Stay",
            "user": "tlcc"
        },
        {
            "date": "August 24, 2013",
            "detail_rating": {
                "business": null,
                "cleanliness": 4.0,
                "desk": null,
                "location": 5.0,
                "pool": null,
                "restaurant": null,
                "rooms": 4.0,
                "service": 5.0,
                "sleep": 4.0,
                "value": 5.0
            },
            "helpfulness": null,
            "id": 173747070,
            "likes": {
                "disliked": null,
                "liked": null
            },
            "rating": 5.0,
            "stay_parameters": "Stayed July 2013, traveled with family",
            "text": "We found a great deal on a king room with a spa tub for one night (we were celebrating my brothers bday at midnight bingo at casino arizona, it was about 2 miles away.) The front staff was great very nice made sure we had everything we needed when we checked in. The room was very cute, not really spacious, but good enought for a nights stay. The bed was comfy but the pillows were a bit soft (for my taste.) The next morning we tried to use the spa tub, bad news, it didn't work. no spa jets. That sucked! The shower was big, but the shower head had a lot of dried residue and it was a really weak stream. Overall, it was a nice experience for 1 night and we were REALLY pleased with the price.",
            "title": "Good place for family",
            "user": "Shaunt K"
        },
        {
            "date": "August 23, 2013",
            "detail_rating": {
                "business": null,
                "cleanliness": 5.0,
                "desk": null,
                "location": 5.0,
                "pool": null,
                "restaurant": null,
                "rooms": 5.0,
                "service": 5.0,
                "sleep": null,
                "value": 5.0
            },
            "helpfulness": null,
            "id": 173732154,
            "likes": {
                "disliked": null,
                "liked": null
            },
            "rating": 5.0,
            "stay_parameters": "Stayed August 2013",
            "text": "My wife and I decided t take the twins on a long summer vacation. We started in Arizona, and worked our way back up until we got back to the bay. Being on a budget, we decided to stay at local properties and stay away from bigger name hotels. The 3 palms started our trip off well. My kids loved the pool and the staff was very nice. The hotel was very affordable and the rooms were nice.",
            "title": "Amazing stay!!!",
            "user": "SarahCiampa"
        },
        {
            "date": "August 20, 2013",
            "detail_rating": {
                "business": null,
                "cleanliness": 5.0,
                "desk": null,
                "location": 5.0,
                "pool": null,
                "restaurant": null,
                "rooms": 5.0,
                "service": 5.0,
                "sleep": 5.0,
                "value": 5.0
            },
            "helpfulness": null,
            "id": 173268747,
            "likes": {
                "disliked": null,
                "liked": null
            },
            "rating": 5.0,
            "stay_parameters": "Stayed August 2013, traveled on business",
            "text": "We cannot wait to come back. We had a great stay. Quiet(couldn't hear the neighbors or their televisions), clean \"grounds\", close by to many restaurants and things to do, clean pool, staff was super helpful whenever we had any questions, and the bed was super comfy. Five stars.",
            "title": "Amazing Service and Accommodations!",
            "user": "Emma M"
        },
        {
            "date": "September 9, 2013",
            "detail_rating": {
                "business": null,
                "cleanliness": 4.0,
                "desk": null,
                "location": 3.0,
                "pool": null,
                "restaurant": null,
                "rooms": 3.0,
                "service": 4.0,
                "sleep": 4.0,
                "value": 5.0
            },
            "helpfulness": 2,
            "id": 176469123,
            "likes": {
                "disliked": null,
                "liked": null
            },
            "rating": 4.0,
            "stay_parameters": "Stayed September 2013, traveled solo",
            "text": "I stayed the night at this hotel last minute when I needed a cheap place to sleep. It was pretty clean and the bed was comfy. There was a coffee maker, mini-fridge, iron in the room. This is by no means a resort (even though there is a pool). But served as a great place to stay the night quickly.",
            "title": "A nice place to sleep for a cheap price",
            "user": "impresiv1"
        },
        {
            "date": "September 7, 2013",
            "detail_rating": {
                "business": null,
                "cleanliness": 5.0,
                "desk": null,
                "location": 5.0,
                "pool": null,
                "restaurant": null,
                "rooms": 5.0,
                "service": 5.0,
                "sleep": 5.0,
                "value": 5.0
            },
            "helpfulness": 1,
            "id": 176235505,
            "likes": {
                "disliked": null,
                "liked": null
            },
            "rating": 5.0,
            "stay_parameters": "Stayed September 2013, traveled as a couple",
            "text": "This hotel is in south Scottsdale... not in the best part of Scottsdale, but not the slums either. This place is a great bargain for the price!",
            "title": "Great hotel!",
            "user": "morevacations39"
        },
        {
            "date": "September 7, 2013",
            "detail_rating": {
                "business": null,
                "cleanliness": 4.0,
                "desk": null,
                "location": 5.0,
                "pool": null,
                "restaurant": null,
                "rooms": 5.0,
                "service": 3.0,
                "sleep": 5.0,
                "value": 5.0
            },
            "helpfulness": 1,
            "id": 176200700,
            "likes": {
                "disliked": null,
                "liked": null
            },
            "rating": 4.0,
            "stay_parameters": "Stayed August 2013, traveled solo",
            "text": "It is walking distance from a restaurant, and there is a grocery store within walking distance.",
            "title": "Great Summer rates",
            "user": "Brad H"
        },
        {
            "date": "September 4, 2013",
            "detail_rating": {
                "business": null,
                "cleanliness": 4.0,
                "desk": null,
                "location": 4.0,
                "pool": null,
                "restaurant": null,
                "rooms": 4.0,
                "service": 4.0,
                "sleep": null,
                "value": 5.0
            },
            "helpfulness": 1,
            "id": 175828291,
            "likes": {
                "disliked": null,
                "liked": null
            },
            "rating": 4.0,
            "stay_parameters": "Stayed September 2013",
            "text": "The 3 Palms is a very clean and friendly hotel. All staff that we encountered (front desk, maid service, maintenance) were friendly and helpful. We stayed in a standard 2 queen room, there was more than enough room and the beds were great! Air conditioning was awesome and loved the pool and hot tub area. The guest lounge is great for when you want to use the computer to print out directions to somewhere. This is our second time staying at 3 Palms and we will definitely stay here again.",
            "title": "Great hotel for the price",
            "user": "Beebopabby"
        },
        {
            "date": "September 3, 2013",
            "detail_rating": {
                "business": null,
                "cleanliness": 5.0,
                "desk": null,
                "location": 5.0,
                "pool": null,
                "restaurant": null,
                "rooms": 5.0,
                "service": 4.0,
                "sleep": 5.0,
                "value": 5.0
            },
            "helpfulness": 1,
            "id": 175578886,
            "likes": {
                "disliked": null,
                "liked": null
            },
            "rating": 5.0,
            "stay_parameters": "Stayed August 2013, traveled with friends",
            "text": "Finished up a month-long stay and overall a satisfying stay. This is like your poor man's Scottsdale resort, so you will find alot of families and others who aren't in the top economic class and can't afford the top Scottsdale resorts. The prices here in summer average about $45 a night. Most rooms contain a small frig and 90's era microwave. The TV's are all top notch and a good DVD player is also included. Beds are very cozy and this place is probably most like a good Hampton Inn in terms of quality. There is a park across the street, but it also doubles as a frisbee course and dog owners rarely pick up after their pets. Free coffee in in AM in the lounge, but most times the machine would be out when I got inside. Friendly, front desk staff, but check your credit cards because I had major snafu that took 2 hours to fix.",
            "title": "Best deal hands down!",
            "user": "Eric S"
        },
        {
            "date": "June 11, 2007",
            "detail_rating": {
                "business": 5.0,
                "cleanliness": 4.0,
                "desk": null,
                "front_desk": 2.0,
                "location": 3.0,
                "pool": null,
                "restaurant": null,
                "rooms": 3.0,
                "service": 4.0,
                "sleep": null,
                "value": 4.0
            },
            "helpfulness": 1,
            "id": 7836162,
            "likes": {
                "disliked": "\u2014 The orange everywhere and the access to the room from the outside",
                "liked": "\u2014 I liked the price and the room amenities"
            },
            "rating": 3.0,
            "stay_parameters": "Stayed June 2007, traveled as a couple",
            "text": "My husband and I took a last minute trip to Scottsdale this past weekend and loved the trip, but were not all that impressed with the 3 Palms. It is more of a \"motel\" than a \"Hotel\". You access your room from the outside, such as in a Holiday Inn. The rooms have been updated and they do offer good amenities such as a refrigerator, microwave, coffee pot, etc. The price was good too. It is just not as advertised.",
            "title": "Okay - Not Great",
            "user": "BWasham"
        },
        {
            "date": "May 22, 2007",
            "detail_rating": {
                "business": null,
                "cleanliness": null,
                "desk": null,
                "location": null,
                "pool": null,
                "restaurant": null,
                "rooms": null,
                "service": null,
                "sleep": null,
                "value": null
            },
            "helpfulness": 1,
            "id": 7673510,
            "likes": {
                "disliked": null,
                "liked": null
            },
            "rating": 5.0,
            "stay_parameters": null,
            "text": "Basically - clean, reasonably priced room, but nothing to write home about.",
            "title": "A great little Gem, a small resort with a personal touch",
            "user": "michelleinseattle"
        },
        {
            "date": "May 21, 2007",
            "detail_rating": {
                "business": null,
                "cleanliness": null,
                "desk": null,
                "location": null,
                "pool": null,
                "restaurant": null,
                "rooms": null,
                "service": null,
                "sleep": null,
                "value": null
            },
            "helpfulness": 1,
            "id": 7667580,
            "likes": {
                "disliked": null,
                "liked": null
            },
            "rating": 4.0,
            "stay_parameters": null,
            "text": "Being a frequent traveler to Arizona I found this wonderful little hotel in the heart of Scottsdale. The hotel is very hip and retro, clean rooms and centrally located and close to shopping, restaurants and the interstate. I found the staff to be wonderful, very friendly; they make you feel like you are at a 5 star hotel\u2026 I enjoyed the pool area and you can receive a great massage on site\u2026 A great value~",
            "title": "Don't pay more than $75...",
            "user": "Extended_Weekender"
        },
        {
            "date": "April 28, 2007",
            "detail_rating": {
                "business": 3.0,
                "cleanliness": 4.0,
                "desk": null,
                "front_desk": 5.0,
                "location": 1.0,
                "pool": null,
                "restaurant": null,
                "rooms": 4.0,
                "service": 4.0,
                "sleep": null,
                "value": 3.0
            },
            "helpfulness": 1,
            "id": 7479394,
            "likes": {
                "disliked": "\u2014 location",
                "liked": "\u2014 decoration"
            },
            "rating": 4.0,
            "stay_parameters": "Stayed April 2007, traveled on business",
            "text": "Very nice pool and brand new fitness area. Room was remodeled, but awkward. Example, unable to view TV from anywhere besides the bed, and had to close cabinet doors covering TV to walk from bathroom to couch or front door. Found the refrigerator and DVD player in the same cabinet under the TV, same issue with the cabinet doors. Bed was comfy. Staff were friendly and upbeat. Surrounding area was very pleasant. Not a resort, but definitely not a dump either.",
            "title": "No complains",
            "user": "cataltar"
        },
        {
            "date": "April 24, 2007",
            "detail_rating": {
                "business": 2.0,
                "cleanliness": 3.0,
                "desk": null,
                "front_desk": 2.0,
                "location": 3.0,
                "pool": null,
                "restaurant": null,
                "rooms": 2.0,
                "service": 2.0,
                "sleep": null,
                "value": 2.0
            },
            "helpfulness": 1,
            "id": 7430282,
            "likes": {
                "disliked": null,
                "liked": null
            },
            "rating": 2.0,
            "stay_parameters": "Stayed April 2007, traveled as a couple",
            "text": "Pretty impressive lobby, all white, minimalist (as rest of the premises), mostly clean. Young and dynamic frontdesk personnel. Inn converted to a motel, not a hotel definitely. Yet, pretty impressive and stylish. Rooms are very nicely decorated, beds are very very comfy with down pillows and comforters. Bath and restroom are together in one very tiny room, walls of which was completly covered with black marble, looks luxurious yet makes you feel a little trapped. Nice hot water supply. Pretty pool area. There is a bar at the pool, however, was closed due to incomplete renovation. B/c of the same reason, there was no room service, no breakfast. Locationwise, a little awkward. Yes, it is close to Scottsdale (compared to Pheonix!) but it is on a street lined with auto dealers. But it is right next to a recreational area where you see people strolling and biking around an artificical pool. After seeing downtown Scottsdale and the hotels on the Scottsdale Drive, I regretted staying in this hotel. Even the Double Tree there is very attractive. So explore your options in that area first. We paid an average of $150 per night.",
            "title": "A Nice Coat of Paint",
            "user": "jrm2"
        },
        {
            "date": "September 16, 2013",
            "detail_rating": {
                "business": null,
                "cleanliness": 4.0,
                "desk": null,
                "location": 5.0,
                "pool": null,
                "restaurant": null,
                "rooms": 4.0,
                "service": 4.0,
                "sleep": 4.0,
                "value": 5.0
            },
            "helpfulness": 1,
            "id": 177419869,
            "likes": {
                "disliked": null,
                "liked": null
            },
            "rating": 4.0,
            "stay_parameters": "Stayed September 2013, traveled on business",
            "text": "16 SEPT 2013",
            "title": "Affordable, great location, no resort fee, mini frig and micro!",
            "user": "creativeconsulting"
        },
        {
            "date": "September 16, 2013",
            "detail_rating": {
                "business": null,
                "cleanliness": 5.0,
                "desk": null,
                "location": 3.0,
                "pool": null,
                "restaurant": null,
                "rooms": 4.0,
                "service": 4.0,
                "sleep": 5.0,
                "value": 4.0
            },
            "helpfulness": 1,
            "id": 177405131,
            "likes": {
                "disliked": null,
                "liked": null
            },
            "rating": 4.0,
            "stay_parameters": "Stayed September 2013, traveled solo",
            "text": "This resort property (a hotel remodeled) is designated as a resort because of the spa.",
            "title": "short stay",
            "user": "Valerie S"
        },
        {
            "date": "September 14, 2013",
            "detail_rating": {
                "business": null,
                "cleanliness": 4.0,
                "desk": null,
                "location": 3.0,
                "pool": null,
                "restaurant": null,
                "rooms": null,
                "service": 3.0,
                "sleep": 3.0,
                "value": 5.0
            },
            "helpfulness": 1,
            "id": 177172729,
            "likes": {
                "disliked": null,
                "liked": null
            },
            "rating": 3.0,
            "stay_parameters": "Stayed September 2013, traveled as a couple",
            "text": "(Resort defined: A hotel may consist of guest rooms, restaurants, a pool, meeting space and business services. A resort, by most standards, may include all the above, but must also include an associated recreational aspect, be it golf, spa, amusement park, skiing, etc.)",
            "title": "Needs a little TLC",
            "user": "Patronking"
        },
        {
            "date": "September 14, 2013",
            "detail_rating": {
                "business": null,
                "cleanliness": 5.0,
                "desk": null,
                "location": 5.0,
                "pool": null,
                "restaurant": null,
                "rooms": 5.0,
                "service": 5.0,
                "sleep": 5.0,
                "value": 5.0
            },
            "helpfulness": 1,
            "id": 177094420,
            "likes": {
                "disliked": null,
                "liked": null
            },
            "rating": 5.0,
            "stay_parameters": "Stayed September 2013, traveled solo",
            "text": "The property is affordable, is in a great location between Snottsdale (correct spelling to denote the pretentious and and less than genuine attitude) Tempe. This property was remodeled and painted which adds to the aesthetics.",
            "title": "Great Staff and Very helpful. Great Rooms/Low Price",
            "user": "Dana J"
        },
        {
            "date": "September 12, 2013",
            "detail_rating": {
                "business": null,
                "cleanliness": 5.0,
                "desk": null,
                "location": 3.0,
                "pool": null,
                "restaurant": null,
                "rooms": 5.0,
                "service": 5.0,
                "sleep": 5.0,
                "value": 5.0
            },
            "helpfulness": 2,
            "id": 176946830,
            "likes": {
                "disliked": null,
                "liked": null
            },
            "rating": 5.0,
            "stay_parameters": "Stayed September 2013, traveled as a couple",
            "text": "The property is very quiet at night. The pool closes and is locked at 12am.",
            "title": "Perfect for good price",
            "user": "JessLightning"
        },
        {
            "date": "August 8, 2007",
            "detail_rating": {
                "business": null,
                "cleanliness": 4.0,
                "desk": null,
                "front_desk": 5.0,
                "location": 2.0,
                "pool": null,
                "restaurant": null,
                "rooms": 2.0,
                "service": 3.0,
                "sleep": null,
                "value": 2.0
            },
            "helpfulness": 3,
            "id": 8373155,
            "likes": {
                "disliked": "\u2014 Everything else",
                "liked": "\u2014 Decor OK, front desk cordial"
            },
            "rating": 2.0,
            "stay_parameters": "Stayed June 2007, traveled as a couple",
            "text": "The pictures on the website are pretty misleading. Upon arriving, the tiny lobby was the only part that looked like the pictures. Keep in mind that this place is essentially a motel, on par with a Motel 8 if it weren't for the decor in some places. It really wasn't that terrible of a stay, but I must draw attention to details that were lacking because boutique hotels are supposed to specialize in said details and special touches.",
            "title": "Motel, not Hotel",
            "user": "dizzyaz"
        },
        {
            "date": "July 31, 2007",
            "detail_rating": {
                "business": null,
                "cleanliness": 5.0,
                "desk": null,
                "front_desk": 5.0,
                "location": 5.0,
                "pool": null,
                "restaurant": null,
                "rooms": 5.0,
                "service": 4.0,
                "sleep": null,
                "value": 5.0
            },
            "helpfulness": 2,
            "id": 8263735,
            "likes": {
                "disliked": "\u2014 there's nothing we didn't like!",
                "liked": "\u2014 the bed was the best i have EVER slept in!"
            },
            "rating": 5.0,
            "stay_parameters": "Stayed June 2007, traveled as a couple",
            "text": "It's barely located in Scottsdale, and not the part that most envision, though it isn't in a necessarily terrible area. Half of the rooms are right on a street, separated only by a sidewalk, a strip of grass and the curb. Coming here with my significant other I had envisioned a hotel at least comparable to the Clarendon in Phoenix, but it looked more like a Best Western from the outside. The room itself was possibly as small as you can get. We had paid for a room with a king bed and a jacuzzi, but never used the jacuzzi. This is because the carpet surrounding the jacuzzi was soaking wet when we arrived and stayed that way the entire time. It wasn't that pleasant having to sleep inches away from this leaky jacuzzi, but the bed was very comfortable.",
            "title": "a desert OASIS, indeed!",
            "user": "Cynister1"
        },
        {
            "date": "July 27, 2007",
            "detail_rating": {
                "business": 5.0,
                "cleanliness": 5.0,
                "desk": null,
                "front_desk": 5.0,
                "location": 5.0,
                "pool": null,
                "restaurant": null,
                "rooms": 5.0,
                "service": 5.0,
                "sleep": null,
                "value": 5.0
            },
            "helpfulness": 1,
            "id": 8244923,
            "likes": {
                "disliked": null,
                "liked": null
            },
            "rating": 5.0,
            "stay_parameters": "Stayed July 2007, traveled as a couple",
            "text": "The TV would flicker on and off, seemingly to a pattern, and we figured out the culprit: the people staying above us were playing music on their stereo and the TV went in and out to the beat. Classy, so we left and came back later that night. We fell asleep and at about 2 A.M., we heard very loud arguing, drunken laughing and crying, and finally a screaming match between two high school or college age girls and a guy. I'm a really heavy sleeper, but the walls are so thin that you can hear a lot. It got to the point where I heard their whole dilemma and wanted to scream \"GIVE HER HER MONEY BACK!\" so it would be over with. Keep in mind these people were not directly above us, but above us and to the right one room. We still heard them. I called the front desk and they said they'd come, but we still heard them fighting an hour later. Not wanting to ruin a supposed weekend vacation, we finally fell asleep with the help of earplugs. Said guests were still there the next morning, and still fighting. Also, the guests next to us approached us in the morning to ask if we wanted to drink beer with them. They looked like convicts on the run, not young hip vacationers.",
            "title": "Will be going back!!",
            "user": "MikesGirl88"
        },
        {
            "date": "July 27, 2007",
            "detail_rating": {
                "business": 1.0,
                "cleanliness": 4.0,
                "desk": null,
                "front_desk": 4.0,
                "location": 2.0,
                "pool": null,
                "restaurant": null,
                "rooms": 3.0,
                "service": null,
                "sleep": null,
                "value": 2.0
            },
            "helpfulness": 2,
            "id": 8244463,
            "likes": {
                "disliked": "\u2014 Motel not hotel; Zero services and/or amenities; Weird location",
                "liked": "\u2014 The staff was friendly and really tried to be helpful with the broken a/c"
            },
            "rating": 3.0,
            "stay_parameters": "Stayed March 2007, traveled on business",
            "text": "Clientele: 18-26 year olds who reserved a room here on the fly with their clubbing buddies or new \"friends\". Kevin Federline sans money from Britney. A few disheartened people who desired a nice place to stay but got this instead and are stuck here until they can go home.",
            "title": "Motel not Hotel",
            "user": "HoustonTravelsnob"
        },
        {
            "date": "July 25, 2007",
            "detail_rating": {
                "business": 3.0,
                "cleanliness": 4.0,
                "desk": null,
                "front_desk": 3.0,
                "location": 2.0,
                "pool": null,
                "restaurant": null,
                "rooms": 3.0,
                "service": 4.0,
                "sleep": null,
                "value": 2.0
            },
            "helpfulness": 4,
            "id": 8234855,
            "likes": {
                "disliked": null,
                "liked": null
            },
            "rating": 2.0,
            "stay_parameters": "Stayed April 2007, traveled with family",
            "text": "My point is, this is not a trendy boutique hotel like it's marketed. It's Days Inn with better decor. I wouldn't pay upwards of $65 for this place.",
            "title": "Be forewarned but remain optomistic",
            "user": "Mr_49er"
        },
        {
            "date": "August 31, 2013",
            "detail_rating": {
                "business": null,
                "cleanliness": 5.0,
                "desk": null,
                "location": 5.0,
                "pool": null,
                "restaurant": null,
                "rooms": 5.0,
                "service": 5.0,
                "sleep": null,
                "value": 5.0
            },
            "helpfulness": 1,
            "id": 175040178,
            "likes": {
                "disliked": null,
                "liked": null
            },
            "rating": 5.0,
            "stay_parameters": "Stayed August 2013",
            "text": "3 palms is such a nice laid back hotel. Very clean , nice rooms, and nice added touch with the blu sol spa on location. But made me enjoy my stay the most was the GREAT customer service from Amanda :-) she was helpful such a sweetheart. I will tell everyone I know to book a room at 3 palms because of how welcome Amanda made me feel. Not to mention she helped me plan my boyfriend's bday. He loved it !!! Glad it all worked out :) Thanks",
            "title": "Best Customer Service",
            "user": "L0veBug24"
        },
        {
            "date": "August 31, 2013",
            "detail_rating": {
                "business": null,
                "cleanliness": 5.0,
                "desk": null,
                "location": 5.0,
                "pool": null,
                "restaurant": null,
                "rooms": 5.0,
                "service": 5.0,
                "sleep": 5.0,
                "value": 5.0
            },
            "helpfulness": 1,
            "id": 174910003,
            "likes": {
                "disliked": null,
                "liked": null
            },
            "rating": 5.0,
            "stay_parameters": "Stayed August 2013, traveled on business",
            "text": "Nice hotel and comfortable beds...Fabulous front desk lady Amanda was so awesome.. Great help with her directing us to sites like the beautiful aquarium and wonderful shopping centers. She is super and a true gem of an employee for this or any hotel..",
            "title": "Cozy and very clean",
            "user": "gmilliken"
        },
        {
            "date": "August 30, 2013",
            "detail_rating": {
                "business": null,
                "cleanliness": 5.0,
                "desk": null,
                "location": 5.0,
                "pool": null,
                "restaurant": null,
                "rooms": 4.0,
                "service": 5.0,
                "sleep": 5.0,
                "value": 5.0
            },
            "helpfulness": 1,
            "id": 174901841,
            "likes": {
                "disliked": null,
                "liked": null
            },
            "rating": 5.0,
            "stay_parameters": "Stayed August 2013, traveled with family",
            "text": "If you're on a budget and need to be in or around Scottsdale, this is a great hotel. My family and I were surprised by the down pillows, higher thread count, and granite counter tops. The second best thing was the cleanliness of the room. Couch in the other room may have been a little overbearing for its size, but overall we were very satisfied with our stay.",
            "title": "Great hotel for the price + helpful customer service",
            "user": "kb_18"
        },
        {
            "date": "August 30, 2013",
            "detail_rating": {
                "business": null,
                "cleanliness": 5.0,
                "desk": null,
                "location": 3.0,
                "pool": null,
                "restaurant": null,
                "rooms": 4.0,
                "service": 5.0,
                "sleep": 5.0,
                "value": 5.0
            },
            "helpfulness": null,
            "id": 174879857,
            "likes": {
                "disliked": null,
                "liked": null
            },
            "rating": 4.0,
            "stay_parameters": "Stayed August 2013, traveled solo",
            "text": "The best thing was the customer service - everyone at the front desk was very accommodating. They even help you book your tours, so if you're coming from out of state, this is a great help. Emmanuel deserves major kudos for assisting me with the booking of both the hotel and our Grand Canyon tour, city tour, and hot air balloon ride. Brian was also helpful in hooking us up with a good discount.",
            "title": "Very good stay",
            "user": "311Chiefs"
        },
        {
            "date": "August 29, 2013",
            "detail_rating": {
                "business": null,
                "cleanliness": 3.0,
                "desk": null,
                "location": 4.0,
                "pool": null,
                "restaurant": null,
                "rooms": 4.0,
                "service": 5.0,
                "sleep": 5.0,
                "value": 4.0
            },
            "helpfulness": null,
            "id": 174741828,
            "likes": {
                "disliked": null,
                "liked": null
            },
            "rating": 5.0,
            "stay_parameters": "Stayed August 2013, traveled on business",
            "text": "The room was very clean and beds were soft and nice. I met a employe named Luna that was very friendly and helpful. AC worked great in August and kept the room super chilled. I would recommend to others to book this hotel. Especially because of the service I got from Luna. Service goes a long way and always gets my return business if its good.",
            "title": "So pleased with my experience!",
            "user": "Meg Z"
        }
    ],
    "slim_ranking": 0.53164556962,
    "stars": 3.5,
    "tripadvisor": {
        "VISITED": false,
        "country_name": null,
        "locality": null,
        "pic_link": null,
        "street_address": null
    },
    "user_rating": 4.0,
    "variance": {
        "average": 71,
        "excellent": 317,
        "poor": 40,
        "terrible": 67,
        "very good": 179
    }
}