{
    "aka": "Lindner Hotel Cologne",
    "description": null,
    "detail_rating": {
        "cleanliness": null,
        "location": null,
        "rooms": null,
        "service": null,
        "sleep": null,
        "value": null
    },
    "location": {
        "city": "Cologne",
        "continent": "Europe",
        "country": "Germany",
        "proposed_city": null,
        "province": null,
        "region": null
    },
    "name": "Lindner Hotel Dom Residence",
    "places": {
        "aka": [],
        "hotel_description": [],
        "hotel_name": []
    },
    "review_count": 339,
    "review_count_current": 27,
    "reviews": [
        {
            "date": "September 13, 2013",
            "detail_rating": {
                "business": null,
                "cleanliness": 5.0,
                "desk": null,
                "location": 4.0,
                "pool": null,
                "restaurant": null,
                "rooms": 5.0,
                "service": 5.0,
                "sleep": null,
                "value": 4.0
            },
            "helpfulness": null,
            "id": 176985339,
            "likes": {
                "disliked": null,
                "liked": null
            },
            "rating": 5.0,
            "stay_parameters": "Stayed August 2013",
            "text": "Stayed for one night. Room was very clean and well stocked.",
            "title": "Very Clean, good service.",
            "user": "enatal"
        },
        {
            "date": "August 18, 2013",
            "detail_rating": {
                "business": null,
                "cleanliness": 4.0,
                "desk": null,
                "location": 5.0,
                "pool": null,
                "restaurant": null,
                "rooms": 4.0,
                "service": 5.0,
                "sleep": 4.0,
                "value": 4.0
            },
            "helpfulness": 2,
            "id": 172884780,
            "likes": {
                "disliked": null,
                "liked": null
            },
            "rating": 4.0,
            "stay_parameters": "Stayed July 2013, traveled with family",
            "text": "Restaurant food well prepared and drlicious. Complete breakfast buffet. Restaurant staff service very good.",
            "title": "Very well located and staff very helpful",
            "user": "LDanczuk"
        },
        {
            "date": "August 17, 2013",
            "detail_rating": {
                "business": null,
                "cleanliness": 4.0,
                "desk": null,
                "location": 4.0,
                "pool": null,
                "restaurant": null,
                "rooms": 4.0,
                "service": 4.0,
                "sleep": 4.0,
                "value": 3.0
            },
            "helpfulness": null,
            "id": 172715891,
            "likes": {
                "disliked": null,
                "liked": null
            },
            "rating": 4.0,
            "stay_parameters": "Stayed July 2013, traveled as a couple",
            "text": "Hotel is located in a business area.",
            "title": "Classy place",
            "user": "Blue-Jeanie"
        },
        {
            "date": "August 10, 2013",
            "detail_rating": {
                "business": null,
                "cleanliness": 4.0,
                "desk": null,
                "location": 5.0,
                "pool": null,
                "restaurant": null,
                "rooms": 3.0,
                "service": 4.0,
                "sleep": 5.0,
                "value": 4.0
            },
            "helpfulness": null,
            "id": 171614323,
            "likes": {
                "disliked": null,
                "liked": null
            },
            "rating": 4.0,
            "stay_parameters": "Stayed August 2013, traveled with family",
            "text": "We spent two days in Koln and stayed at Lindner. The rooms are wide, the breakfast is complete, two blocks from cathedral and staff is helpful.",
            "title": "Great stay",
            "user": "DeeCee2013"
        },
        {
            "date": "August 7, 2013",
            "detail_rating": {
                "business": null,
                "cleanliness": 3.0,
                "desk": null,
                "location": 4.0,
                "pool": null,
                "restaurant": null,
                "rooms": 3.0,
                "service": 3.0,
                "sleep": 3.0,
                "value": 3.0
            },
            "helpfulness": null,
            "id": 171208632,
            "likes": {
                "disliked": null,
                "liked": null
            },
            "rating": 3.0,
            "stay_parameters": "Stayed July 2013, traveled on business",
            "text": "When we arrived the restaurant was already closed, past 11pm but they were able to arrange something for eating.",
            "title": "central...",
            "user": "poonhill"
        },
        {
            "date": "July 23, 2013",
            "detail_rating": {
                "business": null,
                "cleanliness": 5.0,
                "desk": null,
                "location": 5.0,
                "pool": null,
                "restaurant": null,
                "rooms": 4.0,
                "service": 5.0,
                "sleep": null,
                "value": 5.0
            },
            "helpfulness": null,
            "id": 168766140,
            "likes": {
                "disliked": null,
                "liked": null
            },
            "rating": 5.0,
            "stay_parameters": "Stayed July 2013",
            "text": "Great location! Just a five minute walk from the central train station, cathedral, and shops. Staff was courteous and helpful, with good English. Our room was ready early. We paid for the in room wifi, and it worked well.",
            "title": "Great hotel for walking tourists",
            "user": "Nystarn"
        },
        {
            "date": "July 23, 2013",
            "detail_rating": {
                "business": null,
                "cleanliness": 5.0,
                "desk": null,
                "location": 5.0,
                "pool": null,
                "restaurant": null,
                "rooms": 5.0,
                "service": 5.0,
                "sleep": 5.0,
                "value": 5.0
            },
            "helpfulness": null,
            "id": 168756264,
            "likes": {
                "disliked": null,
                "liked": null
            },
            "rating": 4.0,
            "stay_parameters": "Stayed July 2013, traveled with family",
            "text": "Very nice place, quite close to Cologne's Cathedral, yet located in a very quiet and agreeable street. The people of the reception were always super nice to us, spoke perfect English and recommended us places (we were looking for a supermarket and a drugstore). Large, luminous, very clean rooms. Internet for 9 Euros per day! But everything else OK. I would come back.",
            "title": "Great hotel",
            "user": "Cecilia T"
        },
        {
            "date": "July 8, 2013",
            "detail_rating": {
                "business": null,
                "cleanliness": 5.0,
                "desk": null,
                "location": 5.0,
                "pool": null,
                "restaurant": null,
                "rooms": 4.0,
                "service": 4.0,
                "sleep": 5.0,
                "value": 4.0
            },
            "helpfulness": null,
            "id": 166736497,
            "likes": {
                "disliked": null,
                "liked": null
            },
            "rating": 4.0,
            "stay_parameters": "Stayed June 2013, traveled on business",
            "text": "Quite new, close to central station and city center. Friendly staff, solid prices. Breakfast is just ok.",
            "title": "Good to use",
            "user": "Stalevar"
        },
        {
            "date": "July 1, 2013",
            "detail_rating": {
                "business": null,
                "cleanliness": 4.0,
                "desk": null,
                "location": 4.0,
                "pool": null,
                "restaurant": null,
                "rooms": 4.0,
                "service": 4.0,
                "sleep": 4.0,
                "value": 4.0
            },
            "helpfulness": 1,
            "id": 165841412,
            "likes": {
                "disliked": null,
                "liked": null
            },
            "rating": 4.0,
            "stay_parameters": "Stayed June 2013, traveled with family",
            "text": "Wifi is not free in the rooms, but computer is in lobby.",
            "title": "Good hotel for city trip",
            "user": "FrankdeJong_12"
        },
        {
            "date": "June 30, 2013",
            "detail_rating": {
                "business": null,
                "cleanliness": 5.0,
                "desk": null,
                "location": 4.0,
                "pool": null,
                "restaurant": null,
                "rooms": 4.0,
                "service": 5.0,
                "sleep": 5.0,
                "value": 5.0
            },
            "helpfulness": 1,
            "id": 165759850,
            "likes": {
                "disliked": null,
                "liked": null
            },
            "rating": 4.0,
            "stay_parameters": "Stayed June 2013, traveled as a couple",
            "text": "Location of the hotel wins.",
            "title": "Good Location and Service",
            "user": "horhay123"
        },
        {
            "date": "August 21, 2007",
            "detail_rating": {
                "business": 3.0,
                "cleanliness": 5.0,
                "desk": null,
                "front_desk": 4.0,
                "location": 4.0,
                "pool": null,
                "restaurant": null,
                "rooms": 3.0,
                "service": 4.0,
                "sleep": null,
                "value": 4.0
            },
            "helpfulness": null,
            "id": 8462805,
            "likes": {
                "disliked": null,
                "liked": null
            },
            "rating": 4.0,
            "stay_parameters": "Stayed July 2007, traveled on business",
            "text": "Just a quick note....",
            "title": "Great value for Hotel!!!",
            "user": "jbohun"
        },
        {
            "date": "July 26, 2007",
            "detail_rating": {
                "business": null,
                "cleanliness": 5.0,
                "desk": null,
                "front_desk": 4.0,
                "location": 5.0,
                "pool": null,
                "restaurant": null,
                "rooms": 4.0,
                "service": null,
                "sleep": null,
                "value": 5.0
            },
            "helpfulness": null,
            "id": 8238189,
            "likes": {
                "disliked": "\u2014 nothing to dislike",
                "liked": "\u2014 location, pool and rooms"
            },
            "rating": 4.0,
            "stay_parameters": "Stayed July 2007, traveled with family",
            "text": "If you book in advance thru their website, you get a great deal.",
            "title": "Deserves Much Higher Ranking",
            "user": "jskLiverpool"
        },
        {
            "date": "June 13, 2007",
            "detail_rating": {
                "business": null,
                "cleanliness": 3.0,
                "desk": null,
                "front_desk": 2.0,
                "location": 3.0,
                "pool": null,
                "restaurant": null,
                "rooms": 3.0,
                "service": 1.0,
                "sleep": null,
                "value": 1.0
            },
            "helpfulness": 2,
            "id": 7842326,
            "likes": {
                "disliked": "\u2014 THE STAFF",
                "liked": "\u2014 CHECK OUT"
            },
            "rating": 1.0,
            "stay_parameters": "Stayed June 2007, traveled as a couple",
            "text": "The hotel is very clean and the staff is very helpful.",
            "title": "Not value for money!",
            "user": "GATTITTA"
        },
        {
            "date": "May 29, 2007",
            "detail_rating": {
                "business": 2.0,
                "cleanliness": 5.0,
                "desk": null,
                "front_desk": 4.0,
                "location": 5.0,
                "pool": null,
                "restaurant": null,
                "rooms": 5.0,
                "service": 4.0,
                "sleep": null,
                "value": 5.0
            },
            "helpfulness": null,
            "id": 7711270,
            "likes": {
                "disliked": "\u2014 mean: internet should be free nowadays",
                "liked": "\u2014 very good value"
            },
            "rating": 4.0,
            "stay_parameters": "Stayed May 2007, traveled solo",
            "text": "It is right around the corner from the Hilton (and half the price) and 3 or 4 blocks from the catheral.",
            "title": "a slight let-down, but great, overall",
            "user": "JayeffSydney"
        },
        {
            "date": "November 25, 2006",
            "detail_rating": {
                "business": null,
                "cleanliness": 4.0,
                "desk": null,
                "front_desk": 3.0,
                "location": 3.0,
                "pool": null,
                "restaurant": null,
                "rooms": 4.0,
                "service": 3.0,
                "sleep": null,
                "value": 3.0
            },
            "helpfulness": 1,
            "id": 6174813,
            "likes": {
                "disliked": "\u2014 No view.",
                "liked": "\u2014 Location near to the main rail station."
            },
            "rating": 3.0,
            "stay_parameters": "Stayed November 2006, traveled as a couple",
            "text": "I didn't find a major different between the Hilton (where I stayed the last time) and the Linder.",
            "title": "Your average business hotel.",
            "user": "cioccolato"
        },
        {
            "date": "October 10, 2013",
            "detail_rating": {
                "business": null,
                "cleanliness": 5.0,
                "desk": null,
                "location": 4.0,
                "pool": null,
                "restaurant": null,
                "rooms": 5.0,
                "service": 4.0,
                "sleep": 5.0,
                "value": 2.0
            },
            "helpfulness": null,
            "id": 180417943,
            "likes": {
                "disliked": null,
                "liked": null
            },
            "rating": 4.0,
            "stay_parameters": "Stayed October 2013, traveled on business",
            "text": "The location of the hotel is quite good, the rooms are spacious and clean and the breakfast buffet has wide variety.",
            "title": "Great fitness area and spa",
            "user": "irz"
        },
        {
            "date": "October 7, 2013",
            "detail_rating": {
                "business": null,
                "cleanliness": 5.0,
                "desk": null,
                "location": 5.0,
                "pool": null,
                "restaurant": null,
                "rooms": 5.0,
                "service": 5.0,
                "sleep": 5.0,
                "value": 4.0
            },
            "helpfulness": null,
            "id": 180033473,
            "likes": {
                "disliked": null,
                "liked": null
            },
            "rating": 5.0,
            "stay_parameters": "Stayed October 2013, traveled as a couple",
            "text": "But the most pleasant surprise, was the fitness area and swimming pool, were we got to relax after a long day.",
            "title": "Excellent Central Hotel",
            "user": "Ibanez_Artist"
        },
        {
            "date": "September 21, 2013",
            "detail_rating": {
                "business": null,
                "cleanliness": 5.0,
                "desk": null,
                "location": 5.0,
                "pool": null,
                "restaurant": null,
                "rooms": 5.0,
                "service": 5.0,
                "sleep": 5.0,
                "value": 5.0
            },
            "helpfulness": null,
            "id": 178078649,
            "likes": {
                "disliked": null,
                "liked": null
            },
            "rating": 5.0,
            "stay_parameters": "Stayed September 2013, traveled as a couple",
            "text": "We stayed for 4 nights Monday to Friday and were very impressed with the Hotel.",
            "title": "Great Hotel!",
            "user": "Barbara E"
        },
        {
            "date": "September 14, 2013",
            "detail_rating": {
                "business": null,
                "cleanliness": 3.0,
                "desk": null,
                "location": 5.0,
                "pool": null,
                "restaurant": null,
                "rooms": 3.0,
                "service": 3.0,
                "sleep": 3.0,
                "value": 3.0
            },
            "helpfulness": null,
            "id": 177170258,
            "likes": {
                "disliked": null,
                "liked": null
            },
            "rating": 3.0,
            "stay_parameters": "Stayed September 2013, traveled as a couple",
            "text": "Luckily through Hotels.com we had booked a delux room which was a large room on the 7th floor and included Tea & Coffee, bath & shower bits, a safe and Fridge.",
            "title": "15 minutes walk from the Cologne Cathedral...",
            "user": "DHSS"
        },
        {
            "date": "September 14, 2013",
            "detail_rating": {
                "business": null,
                "cleanliness": 4.0,
                "desk": null,
                "location": 5.0,
                "pool": null,
                "restaurant": null,
                "rooms": 3.0,
                "service": 5.0,
                "sleep": 4.0,
                "value": 4.0
            },
            "helpfulness": null,
            "id": 177143459,
            "likes": {
                "disliked": null,
                "liked": null
            },
            "rating": 4.0,
            "stay_parameters": "Stayed September 2013, traveled on business",
            "text": "Breakfast was offered at 23 euro each which we declined as with a fridge and kettle and plenty of supermarkets or cafes close it was easier to cater for ourselves.",
            "title": "Good central hotel",
            "user": "joanne j"
        },
        {
            "date": "June 25, 2013",
            "detail_rating": {
                "business": null,
                "cleanliness": 3.0,
                "desk": null,
                "location": 5.0,
                "pool": null,
                "restaurant": null,
                "rooms": 3.0,
                "service": 3.0,
                "sleep": 3.0,
                "value": 2.0
            },
            "helpfulness": null,
            "id": 165141513,
            "likes": {
                "disliked": null,
                "liked": null
            },
            "rating": 2.0,
            "stay_parameters": "Stayed May 2013, traveled on business",
            "text": "In the overall this hotel is fine only if you are a tourist. However, if you are on business and would like your shifts washed and ironed for an important meeting on Monday, forget it. There is no laundry and since everything is outsourced, it simply cannot be done on Sunday or on public holiday. I was in the middle of the business trip there and had to go to the coin operated laundry around the corner and buy couple of shirts in the shop. Luckilly, shops were opened!",
            "title": "Not for a business traveller",
            "user": "SAvisitor2"
        },
        {
            "date": "June 19, 2013",
            "detail_rating": {
                "business": null,
                "cleanliness": 4.0,
                "desk": null,
                "location": 4.0,
                "pool": null,
                "restaurant": null,
                "rooms": 3.0,
                "service": 5.0,
                "sleep": 4.0,
                "value": 4.0
            },
            "helpfulness": null,
            "id": 164496283,
            "likes": {
                "disliked": null,
                "liked": null
            },
            "rating": 4.0,
            "stay_parameters": "Stayed June 2013, traveled with friends",
            "text": "There are no other standard business facilities, only one computer in the hallway with the printer attached with no instructions how to use it etc. They charge a fee for internet and gym. The room service menu is limited.",
            "title": "Great stay",
            "user": "Tooting"
        },
        {
            "date": "June 16, 2013",
            "detail_rating": {
                "business": null,
                "cleanliness": 5.0,
                "desk": null,
                "location": 5.0,
                "pool": null,
                "restaurant": null,
                "rooms": 5.0,
                "service": 4.0,
                "sleep": 4.0,
                "value": 3.0
            },
            "helpfulness": null,
            "id": 164136032,
            "likes": {
                "disliked": null,
                "liked": null
            },
            "rating": 4.0,
            "stay_parameters": "Stayed May 2013, traveled on business",
            "text": "I booked our international cricket team of 12 people into Dom for 2 nights. Most of the rooms were ready early and the service of the front desk excellent. The rooms were fine for us, the leisure facilities good and the location excellent (especially as we used the train station during our stay as well as drinking in the old quarter).",
            "title": "not quite tops, but better than average",
            "user": "Strollerman"
        },
        {
            "date": "June 5, 2013",
            "detail_rating": {
                "business": null,
                "cleanliness": 4.0,
                "desk": null,
                "location": 5.0,
                "pool": null,
                "restaurant": null,
                "rooms": 4.0,
                "service": 4.0,
                "sleep": 4.0,
                "value": 4.0
            },
            "helpfulness": null,
            "id": 163091761,
            "likes": {
                "disliked": null,
                "liked": null
            },
            "rating": 4.0,
            "stay_parameters": "Stayed May 2013, traveled on business",
            "text": "We didn't have breakfast, want to use the internet or need anything else so I can't offer any complaints at all.",
            "title": "good hotel and location",
            "user": "Janodebilbao"
        },
        {
            "date": "May 29, 2013",
            "detail_rating": {
                "business": null,
                "cleanliness": 5.0,
                "desk": null,
                "location": 5.0,
                "pool": null,
                "restaurant": null,
                "rooms": null,
                "service": 5.0,
                "sleep": null,
                "value": 5.0
            },
            "helpfulness": null,
            "id": 162347328,
            "likes": {
                "disliked": null,
                "liked": null
            },
            "rating": 5.0,
            "stay_parameters": "Stayed May 2013, traveled as a couple",
            "text": "Great stay, highly recommended.",
            "title": "Their Restaurant is a great find",
            "user": "Ingrid4711"
        },
        {
            "date": "October 24, 2006",
            "detail_rating": {
                "business": 4.0,
                "cleanliness": 4.0,
                "desk": null,
                "front_desk": 4.0,
                "location": 5.0,
                "pool": null,
                "restaurant": null,
                "rooms": 4.0,
                "service": 4.0,
                "sleep": null,
                "value": 4.0
            },
            "helpfulness": null,
            "id": 6004771,
            "likes": {
                "disliked": "\u2014 Weak air conditioning",
                "liked": "\u2014 Location"
            },
            "rating": 4.0,
            "stay_parameters": "Stayed September 2006, traveled with friends",
            "text": "Finding the entrance to the car park was challenging, but after that I had a good stay. The room was reasonably sized, and the beds were comfortable. The air conidtioning was only adequate - although it was quite warm outside, it only managed to cool the room down to 23C, which is not cold enough (for me). The pool was medium sized, but the arrangements for getting to it were as complicated as getting into the car park - it seems to be run by the adjacent block of flats and is accessed from what seems to be a fire escape.",
            "title": "Very good",
            "user": "Hampshire-resident"
        },
        {
            "date": "October 16, 2006",
            "detail_rating": {
                "business": 3.0,
                "cleanliness": 5.0,
                "desk": null,
                "front_desk": 5.0,
                "location": 4.0,
                "pool": null,
                "restaurant": null,
                "rooms": 5.0,
                "service": 5.0,
                "sleep": null,
                "value": 5.0
            },
            "helpfulness": 1,
            "id": 5960815,
            "likes": {
                "disliked": "\u2014 Towels",
                "liked": "\u2014 Breakfast"
            },
            "rating": 5.0,
            "stay_parameters": "Stayed August 2006, traveled on business",
            "text": "Breakfast was excellent with a large selection. The location of the hotel was superb - about 5 minutes walk from the Cathedral and Railway station, but in a very quiet street. A nice extra touch was the bowl of fruit outside the lift. Recommended.",
            "title": "Great hotel",
            "user": "Tarheel78"
        }
    ],
    "slim_ranking": 0.0782918149466,
    "stars": 4,
    "tripadvisor": {
        "VISITED": false,
        "country_name": null,
        "locality": null,
        "pic_link": null,
        "street_address": null
    },
    "user_rating": 4.0,
    "variance": {
        "average": 32,
        "excellent": 124,
        "poor": 14,
        "terrible": 6,
        "very good": 163
    }
}