{
    "aka": "Hotel Adele",
    "description": "The Hotel Villa Adele located in Venice-Marghera, very close to the motorway Milano-Venezia-Trieste, short walking distance from the railway station Mestre- Venezia, and a few meters to the bus stop number 6 and 6/ to and from the historical center of Venice. The Hotel Villa Adele has 18 rooms (17 double/triple rooms and 1 single room), elegant and informal atmosphere, located in a very quiet position.",
    "detail_rating": {
        "cleanliness": null,
        "location": null,
        "rooms": null,
        "service": null,
        "sleep": null,
        "value": null
    },
    "location": {
        "city": null,
        "continent": "Europe",
        "country": "Italy",
        "proposed_city": null,
        "province": null,
        "region": "Veneto"
    },
    "name": "Villa Adele Hotel",
    "places": {
        "aka": [],
        "hotel_description": [
            "Mestre",
            "Venice"
        ],
        "hotel_name": []
    },
    "review_count": 258,
    "review_count_current": 20,
    "reviews": [
        {
            "date": "August 27, 2007",
            "detail_rating": {
                "business": 3.0,
                "cleanliness": 4.0,
                "desk": null,
                "front_desk": 4.0,
                "location": 3.0,
                "pool": null,
                "restaurant": null,
                "rooms": 4.0,
                "service": 5.0,
                "sleep": null,
                "value": null
            },
            "helpfulness": 1,
            "id": 8517211,
            "likes": {
                "disliked": "\u2014 Bathrooms were slightly small",
                "liked": "\u2014 The friendly staff"
            },
            "rating": 4.0,
            "stay_parameters": "Stayed May 2007, traveled with friends",
            "text": "My friend and I stayed at the Hotel Villa Adele early May and it was nice. It has a very at home feel to it. We were put off by the expensive rates on the actual island and wanted to stay further out. The staff were fantastic, they were really helpful with directions and provided us with great service. The owner even dropped us off at the local station to get the airport bus when we realised we'd miscalculated the time and had missed the bus. My friend also suffered from a swollen leg and they were great in providing us with fresh ice and clean towels.",
            "title": "Staff were friendly, a pleasant stay",
            "user": "Anna_168"
        },
        {
            "date": "August 1, 2007",
            "detail_rating": {
                "business": 3.0,
                "cleanliness": 5.0,
                "desk": null,
                "front_desk": 4.0,
                "location": 3.0,
                "pool": null,
                "restaurant": null,
                "rooms": 4.0,
                "service": 4.0,
                "sleep": null,
                "value": 5.0
            },
            "helpfulness": 2,
            "id": 8276284,
            "likes": {
                "disliked": "\u2014 empty mini-bar.",
                "liked": "\u2014 price paid & air-conditioning."
            },
            "rating": 4.0,
            "stay_parameters": "Stayed July 2007, traveled solo",
            "text": "I have just returned from my short stay in venice at the villa adele hotel. Accomodation on venice island is very very expensive during peak season;- \u00a390 to \u00a3150 per night, so i opted to stay off the island but close enough to a short transport link to the island. I booked this hotel 2 months before i travelled & paid just \u00a324 a night for 4 nights. You probably won't find a cheaper hotel in or around venice. However the villa adele is not ''cheap''. I read the reviews before i booked & most were spot-on. The villa adele is very clean with excellent air-conditioning, the staff very helpful & a transport link to the island just around the corner. The breakfast on offer was cereal, juice, croiccants & yoghurt. The number 6 bus takes you over the motorway crossing to venice isle in 15 minutes. However if i must gripe it would be that the breakfast room is very small. Barely larger than an extended kitchen. Also the mini-bar is empty & you must ask reception if you require water, beer, juice etc.. These were hardly 'problems' as such but the concept of these reviews is to point out your likes & dislikes. This hotel comes recommended to those, like me, on a mid/moderate budget & to all who object to paying \u00a3100+ per night on the island. A great find. 8/10.",
            "title": "Great hotel for price, cleanliness & air conditioning.",
            "user": "Daveyboy03"
        },
        {
            "date": "July 31, 2007",
            "detail_rating": {
                "business": 3.0,
                "cleanliness": 5.0,
                "desk": null,
                "front_desk": 5.0,
                "location": 4.0,
                "pool": null,
                "restaurant": null,
                "rooms": 4.0,
                "service": 5.0,
                "sleep": null,
                "value": 4.0
            },
            "helpfulness": 1,
            "id": 8267871,
            "likes": {
                "disliked": null,
                "liked": "\u2014 The staff"
            },
            "rating": 4.0,
            "stay_parameters": "Stayed July 2007, traveled as a couple",
            "text": "The hotel was great. We walked there from the train station (wouldn't recommend that on a hot July afternoon but I think there might have been a bus we could have taken we just were not in the mood to figure that out.) The staff was super nice and helpful. They all spoke excellent English. The room was nice, and comfortable with a beautiful bathroom. Breakfast was crossaint, roll, cereal, fruit ,yogurt, juice, coffee/tea, in a nice dining area. The front desk clerk gave us directions to a restaurant a short walk fromt he hotel and it was wonderful. It was very cool looking inside and had menus available in English as well 4 other languages. The food there was also less expensive than the restaurants in Rome and the portions seemed bigger.",
            "title": "Great and Helpful staff",
            "user": "adenny"
        },
        {
            "date": "July 14, 2007",
            "detail_rating": {
                "business": null,
                "cleanliness": null,
                "desk": null,
                "location": null,
                "pool": null,
                "restaurant": null,
                "rooms": null,
                "service": null,
                "sleep": null,
                "value": null
            },
            "helpfulness": 2,
            "id": 8115876,
            "likes": {
                "disliked": null,
                "liked": null
            },
            "rating": 5.0,
            "stay_parameters": null,
            "text": "It was an easy walk to the bus stop that gets you to San Marco and at the front desk the sell bus tickets and traghetti tickets which is really convenient. I would stay here again in a second.",
            "title": "Great hotel, Excellent staff",
            "user": "ABPat"
        },
        {
            "date": "April 13, 2007",
            "detail_rating": {
                "business": null,
                "cleanliness": 5.0,
                "desk": null,
                "front_desk": 5.0,
                "location": 5.0,
                "pool": null,
                "restaurant": null,
                "rooms": 4.0,
                "service": 5.0,
                "sleep": null,
                "value": 5.0
            },
            "helpfulness": 4,
            "id": 7347189,
            "likes": {
                "disliked": "\u2014 Nothing",
                "liked": "\u2014 Everything"
            },
            "rating": 5.0,
            "stay_parameters": "Stayed April 2007, traveled solo",
            "text": "This hotel was a great welcome to Italy. The staff on reception were great, very knowledgeable and helpful and the room was great. Air-con, clean and a shower with jets! Secure car parking and basic but nice breakfast.",
            "title": "Wonderful home-like stay",
            "user": "Melamory"
        },
        {
            "date": "October 26, 2008",
            "detail_rating": {
                "business": null,
                "cleanliness": null,
                "desk": null,
                "location": null,
                "pool": null,
                "restaurant": null,
                "rooms": null,
                "service": null,
                "sleep": null,
                "value": null
            },
            "helpfulness": null,
            "id": 21214272,
            "likes": {
                "disliked": "\u2014 Lack of hospitality",
                "liked": "\u2014 Clean rooms"
            },
            "rating": 3.0,
            "stay_parameters": null,
            "text": "We stayed here for 2 nights in August 2008. We found it difficult to find this hotel, but only because we made the big mistake of not crossing over to the correct side of the tracks at the station. Be warned, there is no other way across if travelling by foot!!",
            "title": "Freshly renovated, staff overworked",
            "user": "xelar8"
        },
        {
            "date": "October 14, 2008",
            "detail_rating": {
                "business": null,
                "cleanliness": 4.0,
                "desk": null,
                "front_desk": 4.0,
                "location": 4.0,
                "pool": null,
                "restaurant": null,
                "rooms": 4.0,
                "service": 4.0,
                "sleep": null,
                "value": 5.0
            },
            "helpfulness": null,
            "id": 20863815,
            "likes": {
                "disliked": "\u2014 no lift",
                "liked": "\u2014 central and good service"
            },
            "rating": 4.0,
            "stay_parameters": "Stayed October 2008, traveled as a couple",
            "text": "The room was modern and comfortable and came with a massage shower (which unfortunately was a bit of a gimmick and was already slightly broken). Breakfast was interesting. We found we had to wait a very long time to be served coffee. We at first thought we were being ignored because we didn't speak italian, because we didn't even get a good morning and others around us appeared to be getting good service. However we will give them the benefit of the doubt and put it down to staff being overworked! We are pretty sure we saw the same staff working late at night, as in the morning, making it a very long shift! The signs regarding internet usage, food in the rooms, etc. are very abrupt and borderline rude. It was too clear that this business was more about profit than hospitality.",
            "title": "very good hotel",
            "user": "corvero"
        },
        {
            "date": "October 12, 2008",
            "detail_rating": {
                "business": null,
                "cleanliness": 5.0,
                "desk": null,
                "front_desk": 4.0,
                "location": 4.0,
                "pool": null,
                "restaurant": null,
                "rooms": 3.0,
                "service": 4.0,
                "sleep": null,
                "value": 4.0
            },
            "helpfulness": null,
            "id": 20814198,
            "likes": {
                "disliked": "\u2014 Air con was very poor",
                "liked": "\u2014 Good location without the high price of Venice"
            },
            "rating": 4.0,
            "stay_parameters": "Stayed October 2008, traveled as a couple",
            "text": "We found this hotel an excellent base to explore Venice and the Veneto. There is a bus stop round the corner with buses heading for Venice stopping frequently. Trip to venice takes c 10min. Also it is only a 5min walk from Mestre train station. The neighbourhood is residential, quiet, and clean. There is a very good pizzeria nearby (Giardinetto). Staff is very friendly and willing to help. Our room was clean, as was the good sized bathroom. A good buffet breakfast is served, though I have seen more abundant ones. Overall highly recommended.",
            "title": "A Good Base",
            "user": "Ajb1207"
        },
        {
            "date": "August 12, 2008",
            "detail_rating": {
                "business": 3.0,
                "cleanliness": 5.0,
                "desk": null,
                "front_desk": 4.0,
                "location": 4.0,
                "pool": null,
                "restaurant": null,
                "rooms": 5.0,
                "service": 4.0,
                "sleep": null,
                "value": 4.0
            },
            "helpfulness": null,
            "id": 18867126,
            "likes": {
                "disliked": null,
                "liked": null
            },
            "rating": 4.0,
            "stay_parameters": "Stayed July 2008, traveled with family",
            "text": "We stayed at the Villa Adele on a three night break to Venice. The Hotel is in a great location with Mestre railway station only a 10 minute walk away. The trains to Venice run regular and cost 1 euro each way. The trip takes 10 minutes or so. The Villa Adele is classed as a 3 star hotel. In fairness to the place I would personally class the place as a good bed and breakfast establishment serving a continental breakfast.The place is very clean and the staff are extremely helpful. I wouldnt hesitate to stay here again. Our room was quite small with en suite facilities. One word of advice...if the weather is good dont have your bedroom window open or you will suffer at the hands of mosquitos!",
            "title": "Nice little hotel",
            "user": "Hiskid"
        },
        {
            "date": "July 17, 2008",
            "detail_rating": {
                "business": 1.0,
                "cleanliness": 5.0,
                "desk": null,
                "front_desk": 4.0,
                "location": 1.0,
                "pool": null,
                "restaurant": null,
                "rooms": 3.0,
                "service": 4.0,
                "sleep": null,
                "value": 3.0
            },
            "helpfulness": null,
            "id": 17986916,
            "likes": {
                "disliked": null,
                "liked": null
            },
            "rating": 3.0,
            "stay_parameters": "Stayed June 2008, traveled as a couple",
            "text": "We enjoyed our stay here; the rooms and beds were comfy and clean, and the air conditioning worked well. Depending on the staff member, they spoke varying degrees of English but they all tried hard and were very kind. I felt embarassed at my terrible lack of Italian.",
            "title": "Average for a 3 star, but this is Venice",
            "user": "Diego_W"
        },
        {
            "date": "February 27, 2008",
            "detail_rating": {
                "business": 4.0,
                "cleanliness": 4.0,
                "desk": null,
                "front_desk": 3.0,
                "location": 4.0,
                "pool": null,
                "restaurant": null,
                "rooms": 4.0,
                "service": 3.0,
                "sleep": null,
                "value": 4.0
            },
            "helpfulness": null,
            "id": 13883892,
            "likes": {
                "disliked": "\u2014 No Opinion",
                "liked": "\u2014 Nice,Clean,Quite,Pleasant"
            },
            "rating": 3.0,
            "stay_parameters": "Stayed July 2007, traveled as a couple",
            "text": "We stayed in Villa Adele for 2 nights. One advantage is that one can chat with Hotel staff on skype.So we had all the info when we reached. For visitors from India who are on their own this was great help. If one is traveling by train than should get down at Mestre station . From station it is walking distance if you don't have heavy luggage.Otherwise it is better to take Taxi.We had asked hotel to keep 36 hrs pass which can be used both for Bus to go to Venice( 10 mts. ride) and Waterbus to reach St Marco's square. Otherwise one has to search for pass,and sometimes it is difficult to get one sufficient for duration of your stay.",
            "title": "Good Hotel",
            "user": "PikeMumbai"
        },
        {
            "date": "February 22, 2008",
            "detail_rating": {
                "business": null,
                "cleanliness": null,
                "desk": null,
                "location": null,
                "pool": null,
                "restaurant": null,
                "rooms": null,
                "service": null,
                "sleep": null,
                "value": null
            },
            "helpfulness": null,
            "id": 13760098,
            "likes": {
                "disliked": null,
                "liked": null
            },
            "rating": 5.0,
            "stay_parameters": null,
            "text": "Hotel is nice and clean.Good A.C.. Toilet had shower with massage facility. Toilet was chic. Breakfast was OK but filling. Transport to Venice is easy as Bus stop is very close to hotel and Route 6 runs late into night. Surrounding area is quite and pleasant. Ali's Supermarket is just round the corner and all the rooms have fridge.",
            "title": "a winner - villa adele",
            "user": "leaverightnow"
        },
        {
            "date": "November 19, 2007",
            "detail_rating": {
                "business": 4.0,
                "cleanliness": 5.0,
                "desk": null,
                "front_desk": 5.0,
                "location": 4.0,
                "pool": null,
                "restaurant": null,
                "rooms": 5.0,
                "service": 5.0,
                "sleep": null,
                "value": 5.0
            },
            "helpfulness": 1,
            "id": 10917269,
            "likes": {
                "disliked": null,
                "liked": "\u2014 Cleanliness, Great breakfasts & coffee, fantastic, friendly service"
            },
            "rating": 5.0,
            "stay_parameters": "Stayed September 2007",
            "text": "Staff is just familiar with English except a lady in Morning shift,who doubles as Manger/accountant and is computer savvy.She helped us out with Train timings and other online info. There is no Room Service and evening and night shift is managed by Temp. staff.",
            "title": "Absolutely Great Value and Service with a Smile!",
            "user": "Tasco1"
        },
        {
            "date": "November 4, 2007",
            "detail_rating": {
                "business": 3.0,
                "cleanliness": 4.0,
                "desk": null,
                "front_desk": 3.0,
                "location": 3.0,
                "pool": null,
                "restaurant": null,
                "rooms": 5.0,
                "service": 4.0,
                "sleep": null,
                "value": 4.0
            },
            "helpfulness": 1,
            "id": 10587678,
            "likes": {
                "disliked": null,
                "liked": null
            },
            "rating": 4.0,
            "stay_parameters": "Stayed October 2007, traveled as a couple",
            "text": "I would recommend this hotel for all Budget travelers.",
            "title": "Good Value",
            "user": "msw_24"
        },
        {
            "date": "September 12, 2007",
            "detail_rating": {
                "business": 4.0,
                "cleanliness": 5.0,
                "desk": null,
                "front_desk": 5.0,
                "location": 5.0,
                "pool": null,
                "restaurant": null,
                "rooms": 5.0,
                "service": 5.0,
                "sleep": null,
                "value": 5.0
            },
            "helpfulness": 2,
            "id": 8700986,
            "likes": {
                "disliked": null,
                "liked": null
            },
            "rating": 5.0,
            "stay_parameters": "Stayed September 2007, traveled as a couple",
            "text": "We are not your average tourists . We wake early, explore and settle early in the evening, however this didn't bother the hotel, a 05.00 need for a breathe of italian air received a \" buon guionorno\"- I apologise for my poor italian. The hotel was wonderful. Small but clean & well appointed room. Excellent en suite. Friendly & helpful staff. 5 minutes from the station with a cheap & regular service all over the veneto ( We rate Verona as superb) & 1 euro & 10 mins into Venice. Local buses are also plentiful. Reviews talk of industrial Magerha & Mestre but the area around the hotel is an oasis of residential calm with some town centre shops & restuarants as well. A Great Place to stay.",
            "title": "Great Hotel, Great People",
            "user": "mfire2"
        },
        {
            "date": "June 1, 2008",
            "detail_rating": {
                "business": null,
                "cleanliness": 5.0,
                "desk": null,
                "front_desk": 5.0,
                "location": 4.0,
                "pool": null,
                "restaurant": null,
                "rooms": 5.0,
                "service": 5.0,
                "sleep": null,
                "value": 5.0
            },
            "helpfulness": null,
            "id": 16549622,
            "likes": {
                "disliked": null,
                "liked": "\u2014 hospitality"
            },
            "rating": 5.0,
            "stay_parameters": "Stayed May 2008, traveled as a couple",
            "text": "A great little hotel just outside of venice.",
            "title": "wonderful hotel !!!",
            "user": "asaf78"
        },
        {
            "date": "May 24, 2008",
            "detail_rating": {
                "business": null,
                "cleanliness": null,
                "desk": null,
                "location": null,
                "pool": null,
                "restaurant": null,
                "rooms": null,
                "service": null,
                "sleep": null,
                "value": null
            },
            "helpfulness": 1,
            "id": 16357999,
            "likes": {
                "disliked": null,
                "liked": null
            },
            "rating": 4.0,
            "stay_parameters": null,
            "text": "Stayed there only for one night but it was enough to see that rooms are clean and new/renovated, excellent shower (with hydromassage!!!), very welcoming and helpful staff and a private parking for guests.",
            "title": "Liked The Hotel Villa Adele",
            "user": "DubyaB"
        },
        {
            "date": "May 23, 2008",
            "detail_rating": {
                "business": 3.0,
                "cleanliness": 5.0,
                "desk": null,
                "front_desk": 5.0,
                "location": 5.0,
                "pool": null,
                "restaurant": null,
                "rooms": 4.0,
                "service": 5.0,
                "sleep": null,
                "value": 5.0
            },
            "helpfulness": null,
            "id": 16352903,
            "likes": {
                "disliked": "\u2014 Small shower. But most of them are small in Italy.",
                "liked": "\u2014 Excellent value. Neat and clean."
            },
            "rating": 5.0,
            "stay_parameters": "Stayed May 2008",
            "text": "Hotel is 15-20 minutes from Venice (by bus) and there's a bus station just outside the hotel, train station is also just a few minutes away.",
            "title": "Excellent Value - Nice Location",
            "user": "hsps2"
        },
        {
            "date": "May 14, 2008",
            "detail_rating": {
                "business": 3.0,
                "cleanliness": 5.0,
                "desk": null,
                "front_desk": 5.0,
                "location": 5.0,
                "pool": null,
                "restaurant": null,
                "rooms": 5.0,
                "service": 5.0,
                "sleep": null,
                "value": 5.0
            },
            "helpfulness": null,
            "id": 16038390,
            "likes": {
                "disliked": "\u2014 none",
                "liked": "\u2014 Qaulity and price"
            },
            "rating": 5.0,
            "stay_parameters": "Stayed April 2008, traveled as a couple",
            "text": "Highly recommended hotel.",
            "title": "Great Hotel, value and location",
            "user": "World-traveler3055"
        },
        {
            "date": "April 30, 2008",
            "detail_rating": {
                "business": 3.0,
                "cleanliness": 5.0,
                "desk": null,
                "front_desk": 5.0,
                "location": 4.0,
                "pool": null,
                "restaurant": null,
                "rooms": 4.0,
                "service": 5.0,
                "sleep": null,
                "value": 5.0
            },
            "helpfulness": null,
            "id": 15515893,
            "likes": {
                "disliked": "\u2014 Breakfast",
                "liked": "\u2014 Value, decent location"
            },
            "rating": 5.0,
            "stay_parameters": "Stayed April 2008, traveled as a couple",
            "text": "My friend and I had a nice stay at the Hotel Villa Adele. The staff was courteous and pleasant during our stay. The staff helped us with directions around Venice as well as the bus schedule to and from the Grand Canal. They also assisted us with our train schedule concerning our venture from Venice to Rome and the return trip to Venice. They also referred us to some great Italian restaurants. They also pre-arranged our departure from the hotel to Marco Polo Airport. The staff also provided us with clean towels, good food for breakfast and use of the internet. I strongly recommend staying there, especially if you like peace and quiet.",
            "title": "Excellent hotel. OK location, great service.",
            "user": "TorontoCart"
        }
    ],
    "slim_ranking": 0.153846153846,
    "stars": 3,
    "tripadvisor": {
        "VISITED": false,
        "country_name": null,
        "locality": null,
        "pic_link": null,
        "street_address": null
    },
    "user_rating": 4.5,
    "variance": {
        "average": 16,
        "excellent": 142,
        "poor": 2,
        "terrible": 3,
        "very good": 95
    }
}