{
    "aka": "Warwick Hotel Philadelphia",
    "description": "Sophisticated. Stylish. Uniquely Philadelphia. Radisson Blu Warwick Hotel is where history meets innovation and culture. This hotel is high on design and style and located in Philadelphia\u2019s most prestigious address, Rittenhouse Square.",
    "detail_rating": {
        "cleanliness": 4.0,
        "location": 4.5,
        "rooms": 4.0,
        "service": 4.0,
        "sleep": 4.0,
        "value": 4.0
    },
    "location": {
        "city": "Philadelphia",
        "continent": null,
        "country": "United States",
        "proposed_city": null,
        "province": null,
        "region": null
    },
    "name": "Radisson Blu Warwick Hotel Philadelphia",
    "places": {
        "aka": [
            "Warwick",
            "Philadelphia"
        ],
        "hotel_description": [
            "Philadelphia",
            "Warwick"
        ],
        "hotel_name": [
            "Warwick",
            "Philadelphia"
        ]
    },
    "review_count": 769,
    "review_count_current": 17,
    "reviews": [
        {
            "date": "July 18, 2005",
            "detail_rating": {
                "business": null,
                "cleanliness": 3.0,
                "desk": null,
                "location": null,
                "pool": null,
                "restaurant": null,
                "rooms": 1.0,
                "service": 4.0,
                "sleep": null,
                "value": 1.0
            },
            "helpfulness": 2,
            "id": 3679076,
            "likes": {
                "disliked": null,
                "liked": null
            },
            "rating": 1.0,
            "stay_parameters": "Stayed July 2005",
            "text": "We booked via internet on the Radisson site for a 2 night hot deal (99 dollars per night plus taxes). I have been to the Radisson in Stockholm and Lisbon, and everything was great. So I was pretty confident in a nice room and a wonderful stay. Not at all. We were first offered a room at the 20th floor (uau!). The only problem is that this floor AC were off (if you've been to Philly during summer time you know what this means) and the room was right in front of the ice machine. So we moved to a room on the 7th floor, enormous, but without the fridge and safe. The internal AC system was broken and flooded the moquette one meter around it. The tapisserie was kept on the walls by means of adhesive naster. Last, but not least we received the confirmation bill outside our door at 2.30 AM (!) of the second night.",
            "title": "Hot deals terrible deals",
            "user": "Alessandro M"
        },
        {
            "date": "July 4, 2005",
            "detail_rating": {
                "business": null,
                "cleanliness": 5.0,
                "desk": null,
                "location": null,
                "pool": null,
                "restaurant": null,
                "rooms": 4.0,
                "service": 5.0,
                "sleep": null,
                "value": 5.0
            },
            "helpfulness": 5,
            "id": 3633710,
            "likes": {
                "disliked": null,
                "liked": null
            },
            "rating": 4.0,
            "stay_parameters": "Stayed June 2005",
            "text": "The reception staff was indeed nice, anyway.",
            "title": "Great Hotel....Great Location!",
            "user": "enmsmommy"
        },
        {
            "date": "June 27, 2005",
            "detail_rating": {
                "business": null,
                "cleanliness": 5.0,
                "desk": null,
                "location": null,
                "pool": null,
                "restaurant": null,
                "rooms": 5.0,
                "service": 5.0,
                "sleep": null,
                "value": 5.0
            },
            "helpfulness": 8,
            "id": 3615312,
            "likes": {
                "disliked": null,
                "liked": null
            },
            "rating": 5.0,
            "stay_parameters": "Stayed June 2005",
            "text": "We booked this hotel on recommendation from Tripadvisor. We were pleasantly surprised. I was traveling with my husband and two small children. The hotel was a nice treat considering we really didn't know what to expect.",
            "title": "I loved it!!",
            "user": "saint82"
        },
        {
            "date": "June 21, 2005",
            "detail_rating": {
                "business": null,
                "cleanliness": 2.0,
                "desk": null,
                "location": null,
                "pool": null,
                "restaurant": null,
                "rooms": 2.0,
                "service": null,
                "sleep": null,
                "value": 3.0
            },
            "helpfulness": 5,
            "id": 3598912,
            "likes": {
                "disliked": null,
                "liked": null
            },
            "rating": 2.0,
            "stay_parameters": "Stayed June 2005",
            "text": "Check-in was easy. The people at the front desk were very courteous and friendly.",
            "title": "Ratskin",
            "user": "NYGirl37"
        },
        {
            "date": "June 7, 2005",
            "detail_rating": {
                "business": null,
                "cleanliness": null,
                "desk": null,
                "location": null,
                "pool": null,
                "restaurant": null,
                "rooms": null,
                "service": null,
                "sleep": null,
                "value": null
            },
            "helpfulness": 8,
            "id": 3537866,
            "likes": {
                "disliked": null,
                "liked": null
            },
            "rating": 4.0,
            "stay_parameters": null,
            "text": "The room was large it had two queen size beds, a little area with a desk and the bathroom. Yes, the room and bathroom could use some updating, but they were very clean and comfortable. This is not a 300$ a night hotel, so I was not expecting silk sheets. We paid $100 a night.",
            "title": "A Very Nice Experience",
            "user": "tootumsgal"
        },
        {
            "date": "May 27, 2005",
            "detail_rating": {
                "business": null,
                "cleanliness": 3.0,
                "desk": null,
                "location": null,
                "pool": null,
                "restaurant": null,
                "rooms": 4.0,
                "service": 1.0,
                "sleep": null,
                "value": 3.0
            },
            "helpfulness": 6,
            "id": 3505020,
            "likes": {
                "disliked": null,
                "liked": null
            },
            "rating": 1.0,
            "stay_parameters": "Stayed May 2005, traveled on business",
            "text": "We had a terrible experience at this hotel while attending the ASI convention in May 24-23 2005. The front desk was rude and very inconsiderate when advising us that our reservation for a king room made over a month ago was over-booked. But they did offer us a pull-out queen sleeper in a room they call the parlor!!! I felt like I was in a seinfeld episode where the manager Dwaine and his 2 flunky assistants at the front desk were convinced that a reservation met nothing and the customer would just go away. If you stay here an experience this situation it is probably because you booked for only one night. Don't let that stop you, call the 1-800 number for radison and complain. The brochures are at the front desk for the number. The corporate headquarters were very helpful and seemed to be as surprized as we were when told of an offer for a queen sleeper. I choose another attendant who was obviously not a manger but was kind enough to verify we indeed did have a king room reservation but it was obvious that the magement hawks would never allow her to check us in. It was pretty apparent that the check in line for one night stays were sent to the managers desk to plead there case. After talking to everyone in line it was apparent that everyone in the managers line was there for the same reason, reservation number in hand but no room and booked for one night. After 1 1/2 hours of complaining and basically making a scene, they finally gave us our room. We refused to be sent down the road to the overflow! I had to insist on a free drink and dinner. After only getting a drink card I warned the manager that my dinner reservation that I missed and the drink card may be a bad combination since I don't drink very well on an empty stomoch. They threw in a dinner at the circle restaraunt with a smirk and please leave us alone look. The dinner at the circle was great so don't believe the bad reviews. Its now under new management (Brian) who was very sympathetic to our experience and made our evening wonderful.",
            "title": "Awful experience!",
            "user": "pa_rookies"
        },
        {
            "date": "April 28, 2005",
            "detail_rating": {
                "business": null,
                "cleanliness": null,
                "desk": null,
                "location": null,
                "pool": null,
                "restaurant": null,
                "rooms": null,
                "service": null,
                "sleep": null,
                "value": null
            },
            "helpfulness": 4,
            "id": 3421115,
            "likes": {
                "disliked": null,
                "liked": null
            },
            "rating": 2.0,
            "stay_parameters": null,
            "text": "BOttom line, ask for Brian in the resteraunt and do stay at this hotel and make the front desk and mangers job as miserable as possible as they are obviously doing for hundreds of people a day. \"Yes...pay backs are OK!\" Donald Trump said this at the ASI conference on dealing with people.",
            "title": "Don't stay here if you want a smoke-free, odor-free environment",
            "user": "A TripAdvisor user"
        },
        {
            "date": "September 6, 2005",
            "detail_rating": {
                "business": null,
                "cleanliness": null,
                "desk": null,
                "location": null,
                "pool": null,
                "restaurant": null,
                "rooms": null,
                "service": null,
                "sleep": null,
                "value": null
            },
            "helpfulness": 4,
            "id": 3847000,
            "likes": {
                "disliked": null,
                "liked": null
            },
            "rating": 4.0,
            "stay_parameters": null,
            "text": "I bid it at priceline and get it for $75/night during Labor Day weekend, comparing to $99 at expedia or travelocity. The hotel is located a little off main attraction areas, Independence Hall and Chinatown. Easy check-in and the receptionist is very polite, with big smile, and very helpful. I requested a king-size bed on 19th floor, which required roomkey to activate the elevator. Absolutely fantastic. HUGE room. Clean and up-to-date bathroom. The hotel even provide bathing robes, cool. Others like safe, coffee maker, CD/FM/AM/Alarm clock, internet (surcharge, $9.95), local magazines. Check out time is 12pm, very nice.",
            "title": "Excellent Hotel!",
            "user": "A TripAdvisor user"
        },
        {
            "date": "August 31, 2005",
            "detail_rating": {
                "business": null,
                "cleanliness": null,
                "desk": null,
                "location": null,
                "pool": null,
                "restaurant": null,
                "rooms": null,
                "service": null,
                "sleep": null,
                "value": null
            },
            "helpfulness": 4,
            "id": 3833472,
            "likes": {
                "disliked": null,
                "liked": null
            },
            "rating": 3.0,
            "stay_parameters": null,
            "text": "Just minor complain, valet parking is $24 overnight(unlimited in and out), which is quite expensive. Self-parking is $20. If you stay on Sat or Sun, park a block down, which is just $9 for whole day.",
            "title": "Clean and Pleasant",
            "user": "A TripAdvisor user"
        },
        {
            "date": "August 24, 2005",
            "detail_rating": {
                "business": null,
                "cleanliness": 4.0,
                "desk": null,
                "location": null,
                "pool": null,
                "restaurant": null,
                "rooms": 4.0,
                "service": 4.0,
                "sleep": null,
                "value": 5.0
            },
            "helpfulness": 4,
            "id": 3804557,
            "likes": {
                "disliked": null,
                "liked": null
            },
            "rating": 4.0,
            "stay_parameters": "Stayed August 2005",
            "text": "Other than that, this is truly a 3 1/2 stars hotel. You'll like it for sure.",
            "title": "Very happy and well worth the price",
            "user": "lenk58"
        },
        {
            "date": "August 14, 2005",
            "detail_rating": {
                "business": null,
                "cleanliness": null,
                "desk": null,
                "location": null,
                "pool": null,
                "restaurant": null,
                "rooms": null,
                "service": null,
                "sleep": null,
                "value": null
            },
            "helpfulness": 3,
            "id": 3761725,
            "likes": {
                "disliked": null,
                "liked": null
            },
            "rating": 4.0,
            "stay_parameters": null,
            "text": "If you want to stay in a luxurious hotel, this is not it. HOWEVER, if you are looking for a clean and friendly place to stay with access to the city and shopping, then you have found your match! I think the radisson employs the friendliest and kindest bunch! George, the check in person called up to the room after we settled in to make sure it was to our liking. There was plenty of room and it was clean, what more can you ask for. The room service was good, i recommend the chocolate mousse. You are near tons of great shopping and some great places to eat. Had a lovely dinner just around the corner on Walnut (b/w 17th and 18th) called Pietro's. That is if you have an inkling for some italian. If your on a budget, and location and cleanliness is important, the Radisson should be high on your list!",
            "title": "pretty good",
            "user": "A TripAdvisor user"
        },
        {
            "date": "August 8, 2005",
            "detail_rating": {
                "business": null,
                "cleanliness": 3.0,
                "desk": null,
                "location": null,
                "pool": null,
                "restaurant": null,
                "rooms": 4.0,
                "service": 4.0,
                "sleep": null,
                "value": 5.0
            },
            "helpfulness": 7,
            "id": 3746053,
            "likes": {
                "disliked": null,
                "liked": null
            },
            "rating": 4.0,
            "stay_parameters": "Stayed August 2005",
            "text": "Stayed on Sun and we really enjoyed the Radisson. The lobby is very nice and classy, the Bartender Mike was extremely friendly as were all the employees. The room was clean and the bath was very nice. The coffee bar was a big hit with my wife and the area is great. We booked a great deal with priceline and I would be glad to stay here again.",
            "title": "Good deal in the heart of Philly",
            "user": "inkwave17"
        },
        {
            "date": "October 27, 2005",
            "detail_rating": {
                "business": null,
                "cleanliness": 4.0,
                "desk": null,
                "location": null,
                "pool": null,
                "restaurant": null,
                "rooms": 4.0,
                "service": 4.0,
                "sleep": null,
                "value": 4.0
            },
            "helpfulness": 8,
            "id": 4055887,
            "likes": {
                "disliked": null,
                "liked": null
            },
            "rating": 4.0,
            "stay_parameters": "Stayed October 2005",
            "text": "We spent 7 nights in this Radisson Hotel and had a very good holiday there. We arrived in a deluge and the weather was drizzly for most of our week which surprised us as we expected better. We don't get so much rain at home!!",
            "title": "Good central position",
            "user": "Iris"
        },
        {
            "date": "October 25, 2005",
            "detail_rating": {
                "business": null,
                "cleanliness": null,
                "desk": null,
                "location": null,
                "pool": null,
                "restaurant": null,
                "rooms": null,
                "service": null,
                "sleep": null,
                "value": null
            },
            "helpfulness": 1,
            "id": 4052733,
            "likes": {
                "disliked": null,
                "liked": null
            },
            "rating": 3.0,
            "stay_parameters": null,
            "text": "George at Reception was charming and when I asked for a spacious room because we were going to be there for a week he gave us a lovely big room which had been refurbished recently. Nice bathroom and two queen beds which were firm and that's how we like them as we both have bad backs.",
            "title": "Radisson Warwick/Locust St/Center City",
            "user": "TisaLisa"
        },
        {
            "date": "October 12, 2005",
            "detail_rating": {
                "business": null,
                "cleanliness": 2.0,
                "desk": null,
                "location": null,
                "pool": null,
                "restaurant": null,
                "rooms": 1.0,
                "service": 3.0,
                "sleep": null,
                "value": 1.0
            },
            "helpfulness": 2,
            "id": 4018440,
            "likes": {
                "disliked": null,
                "liked": null
            },
            "rating": 1.0,
            "stay_parameters": "Stayed October 2005, traveled on business",
            "text": "The tips we left for our housekeeper elicited a lovely Thank you note which was the first time that had ever happened. I feel that housekeepers get forgotten sometimes and I like to remember them.",
            "title": "Radissons in Scandinavia much better than American Radissons",
            "user": "ultra63"
        },
        {
            "date": "October 3, 2005",
            "detail_rating": {
                "business": null,
                "cleanliness": 3.0,
                "desk": null,
                "location": null,
                "pool": null,
                "restaurant": null,
                "rooms": 2.0,
                "service": 3.0,
                "sleep": null,
                "value": 3.0
            },
            "helpfulness": 2,
            "id": 3985291,
            "likes": {
                "disliked": null,
                "liked": null
            },
            "rating": 4.0,
            "stay_parameters": "Stayed September 2005",
            "text": "Dinner in The Prime Rib(under separate management) was memorable. Just fabulous but expensive. They do an early bird menu for $30 which was great value but it was very early so it might not suit everybody.",
            "title": "So nearly luxurious...",
            "user": "rls1016"
        },
        {
            "date": "October 1, 2005",
            "detail_rating": {
                "business": null,
                "cleanliness": 1.0,
                "desk": null,
                "location": null,
                "pool": null,
                "restaurant": null,
                "rooms": 2.0,
                "service": 3.0,
                "sleep": null,
                "value": 3.0
            },
            "helpfulness": 3,
            "id": 3983111,
            "likes": {
                "disliked": null,
                "liked": null
            },
            "rating": 2.0,
            "stay_parameters": "Stayed September 2005",
            "text": "Little Pete's Diner across the street is fantastic value and good food so we breakfasted there every morning. Pietro's Italian a few 100 yards away is also a good place to eat especially for families.",
            "title": "It is ok, sorta",
            "user": "LaniLaniLa"
        }
    ],
    "slim_ranking": 0.333333333333,
    "stars": 4,
    "tripadvisor": {
        "VISITED": false,
        "country_name": null,
        "locality": null,
        "pic_link": null,
        "street_address": null
    },
    "user_rating": 4.0,
    "variance": {
        "average": 117,
        "excellent": 243,
        "poor": 41,
        "terrible": 35,
        "very good": 333
    }
}