{
    "aka": "Eleven Westgate Pickering, Yorkshire",
    "description": "Eleven Westgate is an elegant Victorian home retaining many of its original features, which have been carefully restored to provide light airy rooms with a relaxed homely feel. The deceptively large house has quality furnished rooms, all en-suite with lots of home comforts. There is a large lounge where you can relax in front of a log burner for cosy evenings in with loads of books and current magazines to read or put your feet up and watch Sky+HD or a DVD. We are close to the centre of Pickering where there are many great shops with loads of places to eat and drink, all just a short stroll away.",
    "detail_rating": {
        "cleanliness": null,
        "location": null,
        "rooms": null,
        "service": null,
        "sleep": null,
        "value": null
    },
    "location": {
        "city": null,
        "continent": "Europe",
        "country": "United Kingdom (UK)",
        "proposed_city": "Pickering",
        "province": null,
        "region": null
    },
    "name": "Eleven Westgate",
    "places": {
        "aka": [
            "Pickering"
        ],
        "hotel_description": [
            "Pickering"
        ],
        "hotel_name": []
    },
    "review_count": 163,
    "review_count_current": 20,
    "reviews": [
        {
            "date": "June 15, 2009",
            "detail_rating": {
                "business": null,
                "cleanliness": 5.0,
                "desk": null,
                "location": 5.0,
                "pool": null,
                "restaurant": null,
                "rooms": 5.0,
                "service": 5.0,
                "sleep": null,
                "value": 5.0
            },
            "helpfulness": null,
            "id": 32397466,
            "likes": {
                "disliked": null,
                "liked": null
            },
            "rating": 5.0,
            "stay_parameters": "Stayed June 2009, traveled with friends",
            "text": "A weekend with friends is always a pleasure, but a weekend with friends where you are looked after by Mike and Amanda (and their charming children!) is a rare treat. If you want a genuinely warm welcome, a quality breakfast and comfort like you get at home (but without all the hard work!), look no further than Eleven Westgate. We will definitely be back.",
            "title": "Think home from home, then double it!",
            "user": "HumptyDumpty0"
        },
        {
            "date": "June 12, 2009",
            "detail_rating": {
                "business": null,
                "cleanliness": 5.0,
                "desk": null,
                "location": 5.0,
                "pool": null,
                "restaurant": null,
                "rooms": 5.0,
                "service": 5.0,
                "sleep": null,
                "value": 5.0
            },
            "helpfulness": null,
            "id": 32165237,
            "likes": {
                "disliked": null,
                "liked": null
            },
            "rating": 5.0,
            "stay_parameters": "Stayed June 2009, traveled as a couple",
            "text": "We had a package of 2 nights b & b and a day of mountain bike skills instruction which worked out very good value. The b & b is very well set up for mountain bikers but would also be great for walkers or anyone wanting to explore the area. The skills instruction was a fantastic day and the rooms are really comfortable, all en-suite. I would definitely consider another trip with the instruction.",
            "title": "Just what I had hoped for.",
            "user": "geckoSheffield"
        },
        {
            "date": "May 31, 2009",
            "detail_rating": {
                "business": null,
                "cleanliness": 5.0,
                "desk": null,
                "location": 5.0,
                "pool": null,
                "restaurant": null,
                "rooms": 5.0,
                "service": 5.0,
                "sleep": null,
                "value": 5.0
            },
            "helpfulness": null,
            "id": 31236005,
            "likes": {
                "disliked": null,
                "liked": null
            },
            "rating": 5.0,
            "stay_parameters": "Stayed May 2009, traveled as a couple",
            "text": "The weekend started with a warm welcome from our hostess Amanda. On arrival we were shown to a cosy en suite room, and offered afternoon tea and homemade cakes.",
            "title": "Welcoming hosts, who took us from novice to expert...!",
            "user": "Trekers2"
        },
        {
            "date": "April 26, 2009",
            "detail_rating": {
                "business": null,
                "cleanliness": 5.0,
                "desk": null,
                "location": 5.0,
                "pool": null,
                "restaurant": null,
                "rooms": 5.0,
                "service": 5.0,
                "sleep": null,
                "value": 5.0
            },
            "helpfulness": null,
            "id": 28811566,
            "likes": {
                "disliked": null,
                "liked": null
            },
            "rating": 5.0,
            "stay_parameters": "Stayed April 2009, traveled with family",
            "text": "There was a varied and excellent choice at breakfast, which set us up for the day ahead with our host/instructor, Mike.",
            "title": "It's not just for mountain bikers!",
            "user": "Doolot"
        },
        {
            "date": "April 3, 2009",
            "detail_rating": {
                "business": null,
                "cleanliness": 5.0,
                "desk": null,
                "location": 5.0,
                "pool": null,
                "restaurant": null,
                "rooms": 5.0,
                "service": 5.0,
                "sleep": null,
                "value": 5.0
            },
            "helpfulness": null,
            "id": 27357875,
            "likes": {
                "disliked": null,
                "liked": null
            },
            "rating": 5.0,
            "stay_parameters": "Stayed March 2009, traveled as a couple",
            "text": "It was with trepidation and knees knocking (not good when going mountain biking) I agreed to go on a days mountain bike instruction with my husband, (a keen mountain biker).",
            "title": "Great stay at 'Number Eleven'",
            "user": "jenBristol"
        },
        {
            "date": "September 8, 2009",
            "detail_rating": {
                "business": null,
                "cleanliness": 5.0,
                "desk": null,
                "location": 5.0,
                "pool": null,
                "restaurant": null,
                "rooms": 5.0,
                "service": 5.0,
                "sleep": null,
                "value": 5.0
            },
            "helpfulness": 1,
            "id": 40147618,
            "likes": {
                "disliked": null,
                "liked": null
            },
            "rating": 5.0,
            "stay_parameters": "Stayed September 2009, traveled with friends",
            "text": "The location, accommodation , hosts were excellent. We travelled with some friends for a nice relaxing weekend which is exactly what we got. Amanda helped us in supplying all the information regarding places too eat and visit that we requested. The start of each day was to be served with a very good breakfast, good choice, even Whitby kippers.",
            "title": "excellent all round experience",
            "user": "DaxieConsett"
        },
        {
            "date": "September 8, 2009",
            "detail_rating": {
                "business": null,
                "cleanliness": 5.0,
                "desk": null,
                "location": 5.0,
                "pool": null,
                "restaurant": null,
                "rooms": 5.0,
                "service": 5.0,
                "sleep": null,
                "value": 5.0
            },
            "helpfulness": 1,
            "id": 40143957,
            "likes": {
                "disliked": null,
                "liked": null
            },
            "rating": 5.0,
            "stay_parameters": "Stayed July 2009, traveled with family",
            "text": "For the steam train enthusiasts the station is only a 5 minute walk away . All in all a very good base to explore the delights of North Yorkshire.",
            "title": "An unforgettable weekend",
            "user": "OlegV"
        },
        {
            "date": "September 3, 2009",
            "detail_rating": {
                "business": null,
                "cleanliness": 5.0,
                "desk": null,
                "location": 5.0,
                "pool": null,
                "restaurant": null,
                "rooms": 5.0,
                "service": 5.0,
                "sleep": null,
                "value": 5.0
            },
            "helpfulness": 1,
            "id": 39700549,
            "likes": {
                "disliked": null,
                "liked": null
            },
            "rating": 5.0,
            "stay_parameters": "Stayed July 2009, traveled with family",
            "text": "Thanks to Mike and Amanda we had a PERFECT weekend: it all started with a good night of rest in tastefully decorated, comfortable, modern rooms, followed by a delicious breakfast cooked out of farm-fresh ingredients (I'm missing that porridge with honey already!). We then had a whole day of mountain biking instruction by Mike in Dalby forest. Mike is a fantastic coach: on the first morning we only started suspecting that most of our ideas on how to ride a mountain bike were wrong, but by night we were completely converted into the new technique and had a full complement of the most up-to-date riding skills to take home and practice! The greatest fun was to test the tricks Mike taught us on all those berms, drop-offs and bomb holes which I never thought I'd be able to ride. When we came back we were treated to some delicious flapjacks cooked by Amanda. Outrageously good! And the best thing ever? In the morning we had to do it all over again! We will be coming back for more, especially because Amanda is getting her instructor's badge soon \u2013 we need all the instruction we can get!",
            "title": "Brilliant for anyone who loves ridin!!!",
            "user": "Russianmtb"
        },
        {
            "date": "July 29, 2009",
            "detail_rating": {
                "business": null,
                "cleanliness": null,
                "desk": null,
                "location": null,
                "pool": null,
                "restaurant": null,
                "rooms": null,
                "service": null,
                "sleep": null,
                "value": null
            },
            "helpfulness": 1,
            "id": 36161955,
            "likes": {
                "disliked": null,
                "liked": null
            },
            "rating": 5.0,
            "stay_parameters": null,
            "text": "This trip is a great one, for anyone wishing to develop their skills. Coaching was really good, I learnt a lot about body positions, and how to conquer technical pieces of terrain. Lessons are all done in a friendly environment, with only positive criticism, which really helped me to see my mistakes. The accommodation was brilliant, clean and comfortable, with delicious cooked breakfasts in the morning and flapjacks for when you get off the trails. The instructor also runs a local bike shop which sorted out all the damages on my bike, very good service. I would really enjoy coming back here, and hopefully will.",
            "title": "Great stay",
            "user": "smoggy31"
        },
        {
            "date": "July 28, 2009",
            "detail_rating": {
                "business": null,
                "cleanliness": 5.0,
                "desk": null,
                "location": 5.0,
                "pool": null,
                "restaurant": null,
                "rooms": 5.0,
                "service": 5.0,
                "sleep": null,
                "value": 5.0
            },
            "helpfulness": null,
            "id": 36062680,
            "likes": {
                "disliked": null,
                "liked": null
            },
            "rating": 5.0,
            "stay_parameters": "Stayed July 2009, traveled as a couple",
            "text": "We had an excellent stay at Number 11. Very warm welcome by Amanda on arrival. Our room was spacious and very clean and comfortable. Breakfast was delicious and certainly set us up for the day. Information in our room was helpful as were the maps and walking books we could make use of. We can highly recommend this bed and breakfast in Pickering which has many restaurants to choose from too and a great location to explore the North York Moors and coast.",
            "title": "Dream home from home!",
            "user": "EssexSmithy34"
        },
        {
            "date": "July 16, 2009",
            "detail_rating": {
                "business": null,
                "cleanliness": 5.0,
                "desk": null,
                "location": 5.0,
                "pool": null,
                "restaurant": null,
                "rooms": 5.0,
                "service": 5.0,
                "sleep": null,
                "value": 5.0
            },
            "helpfulness": null,
            "id": 34900713,
            "likes": {
                "disliked": null,
                "liked": null
            },
            "rating": 5.0,
            "stay_parameters": "Stayed July 2009, traveled with friends",
            "text": "Well located B&B on the edge of the North Yorkshire moors. Wonderful accommodation and extremely good breakfasts using locally sourced produce, well presented by Amanda. Charming and chatty children. Lots of choice locally for evening meals. Would recommend highly. Liz & Tony Roberts, Milton Keynes",
            "title": "Very welcoming family B&B with excellent accommodation and 5 star food.",
            "user": "bizzilizzie"
        },
        {
            "date": "June 28, 2009",
            "detail_rating": {
                "business": null,
                "cleanliness": 5.0,
                "desk": null,
                "location": 5.0,
                "pool": null,
                "restaurant": null,
                "rooms": 5.0,
                "service": 5.0,
                "sleep": null,
                "value": 5.0
            },
            "helpfulness": null,
            "id": 33397629,
            "likes": {
                "disliked": null,
                "liked": null
            },
            "rating": 5.0,
            "stay_parameters": "Stayed June 2009, traveled with friends",
            "text": "Having stayed at this B & B for a girlie mountain biking week-end with instruction from the host last November, we took our seasoned biker husbands with us this week-end for another ride in the amazing Dalby Forest. Even though I had stayed before Mike and Amanda exceeded my expectations and my husband, who does not normally enjoy Bed & Breakfast establishments couldn't fault the place or the excellent welcome and service given by our hosts. The house and rooms were still immaculate, the beds are so comfy, and the breakfast is the best you will experience in a b & b with all produce locally sourced and cooked so that your full english is actually healthy! Mike & Amanda even gave us all lifts to a concert they happened to be going to as well. If you ever need to stay in a B & B for any reason, in Pickering, do not give Eleven Westgate a miss!",
            "title": "Beyond Expectation - everything has been thought about and nothing is too much trouble.",
            "user": "TTTLincolnshire"
        },
        {
            "date": "June 25, 2009",
            "detail_rating": {
                "business": null,
                "cleanliness": 5.0,
                "desk": null,
                "location": 5.0,
                "pool": null,
                "restaurant": null,
                "rooms": 5.0,
                "service": 5.0,
                "sleep": null,
                "value": 5.0
            },
            "helpfulness": null,
            "id": 33153319,
            "likes": {
                "disliked": null,
                "liked": null
            },
            "rating": 5.0,
            "stay_parameters": "Stayed June 2009, traveled with friends",
            "text": "We had an absolutley great time. We were there to Mountain Bike and found both the accommodation and guiding excellent. The rooms are spotless with ensuite facilities and breakfast was spot on also with a good selection of cereals. Mike does the cooking and I can highly recommend the full cooked breakfast, just what you need before a ride in Dalby or the moors.",
            "title": "Midweek Perfection",
            "user": "weeman32"
        },
        {
            "date": "June 25, 2009",
            "detail_rating": {
                "business": null,
                "cleanliness": 5.0,
                "desk": null,
                "location": 5.0,
                "pool": null,
                "restaurant": null,
                "rooms": 5.0,
                "service": 5.0,
                "sleep": null,
                "value": 5.0
            },
            "helpfulness": null,
            "id": 33132329,
            "likes": {
                "disliked": null,
                "liked": null
            },
            "rating": 5.0,
            "stay_parameters": "Stayed June 2009, traveled with friends",
            "text": "We were made to feel very welcome by all the family. An excellent place and one we will visit again soon.",
            "title": "Too good to be true....",
            "user": "qcamel"
        },
        {
            "date": "June 15, 2009",
            "detail_rating": {
                "business": null,
                "cleanliness": 5.0,
                "desk": null,
                "location": 5.0,
                "pool": null,
                "restaurant": null,
                "rooms": 5.0,
                "service": 5.0,
                "sleep": null,
                "value": 5.0
            },
            "helpfulness": null,
            "id": 32402298,
            "likes": {
                "disliked": null,
                "liked": null
            },
            "rating": 5.0,
            "stay_parameters": "Stayed June 2009, traveled with friends",
            "text": "5 of us travelled from the North East of England, an area laden with great MTB opportunities to experiance the North Yorkshire Moors and Dalby Forest. Having found Big Bear Active in a magazine classified section we booked up based on nothing more than a gut feeling and a few friendly emails.",
            "title": "The Ultimate Rough with the Smooth",
            "user": "hodgieleeds"
        },
        {
            "date": "March 30, 2009",
            "detail_rating": {
                "business": null,
                "cleanliness": 5.0,
                "desk": null,
                "location": 5.0,
                "pool": null,
                "restaurant": null,
                "rooms": 5.0,
                "service": 5.0,
                "sleep": null,
                "value": 5.0
            },
            "helpfulness": null,
            "id": 27081791,
            "likes": {
                "disliked": null,
                "liked": null
            },
            "rating": 5.0,
            "stay_parameters": "Stayed March 2009, traveled on business",
            "text": "Mike and Amanda have created a unique B&B experience. With every base covered, from a very warm welcome, perfect bedrooms and the best breakfast to set you up for the day.",
            "title": "Fantastic accomodation and the warmest welcome",
            "user": "CTC-MTB"
        },
        {
            "date": "March 28, 2009",
            "detail_rating": {
                "business": null,
                "cleanliness": 5.0,
                "desk": null,
                "location": 5.0,
                "pool": null,
                "restaurant": null,
                "rooms": 5.0,
                "service": 5.0,
                "sleep": null,
                "value": 4.0
            },
            "helpfulness": null,
            "id": 26966751,
            "likes": {
                "disliked": null,
                "liked": null
            },
            "rating": 5.0,
            "stay_parameters": "Stayed March 2009, traveled on business",
            "text": "If you\u2019re mountain biking its perfect, a real home from home with everything you need from bike wash facilities and a workshop through to secure bike storage for that additional piece of mind.",
            "title": "What a place to go mountainbiking from",
            "user": "GetAGripMTB"
        },
        {
            "date": "March 27, 2009",
            "detail_rating": {
                "business": null,
                "cleanliness": 5.0,
                "desk": null,
                "location": 5.0,
                "pool": null,
                "restaurant": null,
                "rooms": 5.0,
                "service": 5.0,
                "sleep": null,
                "value": 5.0
            },
            "helpfulness": null,
            "id": 26928034,
            "likes": {
                "disliked": null,
                "liked": null
            },
            "rating": 5.0,
            "stay_parameters": "Stayed November 2008, traveled with friends",
            "text": "A warm, friendly welcome from Mike and Amanda. The room and facilities for bikes were absolutely great.",
            "title": "First rate accommadation & the ultimate biking weekend!",
            "user": "mbrwidow"
        },
        {
            "date": "March 25, 2009",
            "detail_rating": {
                "business": null,
                "cleanliness": 5.0,
                "desk": null,
                "location": 5.0,
                "pool": null,
                "restaurant": null,
                "rooms": 5.0,
                "service": 5.0,
                "sleep": null,
                "value": 5.0
            },
            "helpfulness": null,
            "id": 26791295,
            "likes": {
                "disliked": null,
                "liked": null
            },
            "rating": 5.0,
            "stay_parameters": "Stayed March 2009, traveled as a couple",
            "text": "It felt just like home from home, which was lovely.",
            "title": "Lovely stay",
            "user": "IansBedford"
        },
        {
            "date": "March 6, 2009",
            "detail_rating": {
                "business": null,
                "cleanliness": 5.0,
                "desk": null,
                "location": 5.0,
                "pool": null,
                "restaurant": null,
                "rooms": 5.0,
                "service": 5.0,
                "sleep": null,
                "value": 5.0
            },
            "helpfulness": null,
            "id": 25702794,
            "likes": {
                "disliked": null,
                "liked": null
            },
            "rating": 5.0,
            "stay_parameters": "Stayed February 2009, traveled on business",
            "text": "Good to know my bike was clean, safe and secure, and that it would get fixed if I managed to break it!",
            "title": "I want to move in!",
            "user": "Nat00"
        }
    ],
    "slim_ranking": 0.0425531914894,
    "stars": null,
    "tripadvisor": {
        "VISITED": false,
        "country_name": null,
        "locality": null,
        "pic_link": null,
        "street_address": null
    },
    "user_rating": 5.0,
    "variance": {
        "average": 0,
        "excellent": 161,
        "poor": 0,
        "terrible": 0,
        "very good": 2
    }
}