{
    "aka": "Hyatt Regency Phoenix Hotel Phoenix",
    "description": "Experience the ultimate destination for business or pleasure in the city's dynamic downtown area. A towering 8-story atrium provides an inspiring atmosphere perfect for events of all types and sizes.",
    "detail_rating": {
        "cleanliness": 4.0,
        "location": 4.5,
        "rooms": 4.0,
        "service": 4.0,
        "sleep": 4.0,
        "value": 4.0
    },
    "location": {
        "city": null,
        "continent": null,
        "country": "United States",
        "proposed_city": "Phoenix",
        "province": null,
        "region": null
    },
    "name": "Hyatt Regency Phoenix",
    "places": {
        "aka": [
            "Phoenix"
        ],
        "hotel_description": [],
        "hotel_name": [
            "Phoenix"
        ]
    },
    "review_count": 474,
    "review_count_current": 54,
    "reviews": [
        {
            "date": "September 3, 2013",
            "detail_rating": {
                "business": null,
                "cleanliness": 5.0,
                "desk": null,
                "location": 5.0,
                "pool": null,
                "restaurant": null,
                "rooms": 5.0,
                "service": 5.0,
                "sleep": 5.0,
                "value": 5.0
            },
            "helpfulness": 2,
            "id": 175629508,
            "likes": {
                "disliked": null,
                "liked": null
            },
            "rating": 5.0,
            "stay_parameters": "Stayed July 2013, traveled solo",
            "text": "Stayed here plenty of times (too many to remember) with conventions just down the street, this time it was a smaller convention in the hotel. The restaurants are great in the hotel and surrounding area and the hotel bar \"Networks\" is always a great meeting place and the staff there is always fast and friendly. The front desk is very friendly and helpful with anything I have ever needed. The doormen are always in the know of anything going on in town and where to find the best local foods and entertainment. The rooms are always clean and spotless and I've never had a bad experience here during any of my stays. Beds are comfortable and the shower has plenty of pressure which is always an important feature!",
            "title": "For a Convention Stay it is Perfect !",
            "user": "TheTater"
        },
        {
            "date": "September 3, 2013",
            "detail_rating": {
                "business": null,
                "cleanliness": 5.0,
                "desk": null,
                "location": 5.0,
                "pool": null,
                "restaurant": null,
                "rooms": 5.0,
                "service": 5.0,
                "sleep": 5.0,
                "value": 5.0
            },
            "helpfulness": 2,
            "id": 175551979,
            "likes": {
                "disliked": null,
                "liked": null
            },
            "rating": 5.0,
            "stay_parameters": "Stayed August 2013, traveled on business",
            "text": "I have read some reviews that the decor is considered dated in the lobby but I don't have that opinion of it. If it is dated as they are claiming, then in a few years it will be considered retro. If you have to stay in the area for a convention then this is the place to stay....anything comparable as far as hotel star ratings in the surrounding area will be much more expensive and anything less expensive farther out will cost you a taxi ride to and from and will add up to no savings in the end or maybe even more expensive. This is the best place to stay for a convention or even if visiting the downtown area for a get-away! You will not be disappointed.",
            "title": "One of the best!",
            "user": "Cookiebrandt"
        },
        {
            "date": "August 29, 2013",
            "detail_rating": {
                "business": null,
                "cleanliness": 5.0,
                "desk": null,
                "location": 5.0,
                "pool": null,
                "restaurant": null,
                "rooms": 4.0,
                "service": 5.0,
                "sleep": null,
                "value": 5.0
            },
            "helpfulness": 2,
            "id": 174716561,
            "likes": {
                "disliked": null,
                "liked": null
            },
            "rating": 4.0,
            "stay_parameters": "Stayed August 2013",
            "text": "I have stayed in more than a few hotels in Downtown Phoenix, and this is one of the best. The service is wonderful, the food is excellent and for sure, I will stay there again! Their breakfast buffet is very good, and the servers in the restaurant are very friendly. The light rail station is a block away and it is perfect to go to local attractions, like the Art Museum and the Heard Museum.",
            "title": "Great stay at a great price",
            "user": "Chris6998"
        },
        {
            "date": "August 25, 2013",
            "detail_rating": {
                "business": null,
                "cleanliness": 5.0,
                "desk": null,
                "location": 5.0,
                "pool": null,
                "restaurant": null,
                "rooms": 5.0,
                "service": 5.0,
                "sleep": 5.0,
                "value": 5.0
            },
            "helpfulness": 3,
            "id": 174039229,
            "likes": {
                "disliked": null,
                "liked": null
            },
            "rating": 5.0,
            "stay_parameters": "Stayed August 2013, traveled on business",
            "text": "Easy check in. Nice clean room and facilities. Pool was shallow but enjoyable. Gym was well equipped. Easy access to restaurants. Grill located in lobby had very good food. Only complaints are the a/c barely kept the room cool and the bed was not very comfortable. Would return here.",
            "title": "Awesome hotel and staff",
            "user": "Kathy O"
        },
        {
            "date": "August 20, 2013",
            "detail_rating": {
                "business": null,
                "cleanliness": 3.0,
                "desk": null,
                "location": 4.0,
                "pool": null,
                "restaurant": null,
                "rooms": 3.0,
                "service": 4.0,
                "sleep": 3.0,
                "value": 3.0
            },
            "helpfulness": null,
            "id": 173264343,
            "likes": {
                "disliked": null,
                "liked": null
            },
            "rating": 3.0,
            "stay_parameters": "Stayed August 2013, traveled on business",
            "text": "As a government meeting planner, I must watch cost, especially now with the budget cuts and sequestration. When I contacted this hotel as a potential place to house the meetings I was planning, the experience was top-notch right from the start. My sales manager made my job a whole lot easier, then my banquets manager picked up where the sales manager left off. It was a pleasant experience from start to finish. Then when I arrived at the hotel I was treated like royalty. Everybody did their best to make me and my attendees (well over 200) feel like we were 'part of the family'. No matter where I went within the hotel, the employees knew me by name and were very willing to be of service. LT was my on site contact. She was absolutely fabulous. She came by several times a day to make sure things were running smoothly. If I needed anything, she was more than willing to see that I got what I needed. The food was wonderful as well. Einsteins Cafe was right up there with Starbucks. The lodging rooms were clean and comfortable. The rest rooms by the meeting rooms were well stocked and very clean. I don't see how anyone could complain about this hotel or the staff. I guess you can't please everyone. I can't say enough good things about the Hyatt Regency Downtown Phoenix. The proximity to area restaurants within walking distance was wonderful. It was good to get out after being inside with meetings all day. The weather was hot, but not unbearable. I would definitely take another meeting back to this hotel and I would recommend this hotel to anyone for business or pleasure.",
            "title": "Decent stay with this place",
            "user": "mstsc"
        },
        {
            "date": "September 13, 2013",
            "detail_rating": {
                "business": null,
                "cleanliness": 5.0,
                "desk": null,
                "location": 5.0,
                "pool": null,
                "restaurant": null,
                "rooms": 5.0,
                "service": 5.0,
                "sleep": 4.0,
                "value": 5.0
            },
            "helpfulness": 2,
            "id": 176989906,
            "likes": {
                "disliked": null,
                "liked": null
            },
            "rating": 4.0,
            "stay_parameters": "Stayed September 2013, traveled on business",
            "text": "Close to everything, great view, wonderful restaurant on the top floor. I had room 1639 at the end of the hall. Great room!!! Very quiet. Others from my conference complained about noise in their room at night. Not so from higher floors. Staff were all great. My only complaint is the pool. The pool area is lovely with nice deck chairs and lots of umbrellas. Nice for relaxing, reading. But the pool itself is terrible other than it was cool water. It needs relining in the worst way. Every time you take a step its like walking on a floating carpet. I imagine those who are unsteady on their feet could have trouble. Otherwise I will come back to this hotel for sure especially for extended business travel.",
            "title": "Would come back",
            "user": "Anita K"
        },
        {
            "date": "September 12, 2013",
            "detail_rating": {
                "business": null,
                "cleanliness": 5.0,
                "desk": null,
                "location": 5.0,
                "pool": null,
                "restaurant": null,
                "rooms": 5.0,
                "service": 5.0,
                "sleep": 3.0,
                "value": 5.0
            },
            "helpfulness": 1,
            "id": 176889277,
            "likes": {
                "disliked": null,
                "liked": null
            },
            "rating": 5.0,
            "stay_parameters": "Stayed September 2013, traveled on business",
            "text": "I stayed for a little over a week and loved my stay. It is so conveniently located and staff both friendly and helpful. Got great recommendations for nightlife nearby. The Best chocolate cake ever in the restaurant off the lobby! there is an excellent gym if you want exercise and beautiful views from both rooms and the glass enclosed elevator!",
            "title": "Loved it!",
            "user": "Eliz H"
        },
        {
            "date": "September 9, 2013",
            "detail_rating": {
                "business": null,
                "cleanliness": 5.0,
                "desk": null,
                "location": 5.0,
                "pool": null,
                "restaurant": null,
                "rooms": 5.0,
                "service": 5.0,
                "sleep": 4.0,
                "value": 3.0
            },
            "helpfulness": 1,
            "id": 176536450,
            "likes": {
                "disliked": null,
                "liked": null
            },
            "rating": 5.0,
            "stay_parameters": "Stayed September 2013, traveled on business",
            "text": "great location right in downtown. It is close to virtually everything and exceptionally nice. The reception area is modern and well decorated. The rooms are comfortable and beds are relatively comfortable. The workout room is great and the pool ok for a dip, not much else. Really can't do laps in it. The only poor thing was the selection of TV channels. pretty limited and some did not work and some in Spanish.",
            "title": "Still an excellent place to stay in Phoenix",
            "user": "BaronFoer"
        },
        {
            "date": "September 5, 2013",
            "detail_rating": {
                "business": null,
                "cleanliness": 5.0,
                "desk": null,
                "location": 5.0,
                "pool": null,
                "restaurant": null,
                "rooms": 5.0,
                "service": 5.0,
                "sleep": 5.0,
                "value": 4.0
            },
            "helpfulness": 2,
            "id": 175916860,
            "likes": {
                "disliked": null,
                "liked": null
            },
            "rating": 5.0,
            "stay_parameters": "Stayed August 2013, traveled as a couple",
            "text": "I recommend this for the location.",
            "title": "stayed for our anniversary",
            "user": "Jessica B"
        },
        {
            "date": "September 4, 2013",
            "detail_rating": {
                "business": null,
                "cleanliness": 5.0,
                "desk": null,
                "location": 5.0,
                "pool": null,
                "restaurant": null,
                "rooms": 5.0,
                "service": 4.0,
                "sleep": 4.0,
                "value": 4.0
            },
            "helpfulness": 2,
            "id": 175729820,
            "likes": {
                "disliked": null,
                "liked": null
            },
            "rating": 4.0,
            "stay_parameters": "Stayed October 2012, traveled on business",
            "text": "If you find this helpful please mark it so.",
            "title": "High above Downtown Phoenix",
            "user": "Brian J"
        },
        {
            "date": "June 27, 2008",
            "detail_rating": {
                "business": null,
                "cleanliness": 5.0,
                "desk": null,
                "front_desk": 5.0,
                "location": 5.0,
                "pool": null,
                "restaurant": null,
                "rooms": 5.0,
                "service": 4.0,
                "sleep": null,
                "value": 4.0
            },
            "helpfulness": null,
            "id": 17291947,
            "likes": {
                "disliked": "\u2014 Parking",
                "liked": "\u2014 Beds"
            },
            "rating": 5.0,
            "stay_parameters": "Stayed June 2008, traveled on business",
            "text": "We came in at 1:00 am and checked out at 8:00am so it was a short stay, but we were impressed with the hotel, we would stay there again at a better price. Paid 149.00 Auto Club discount. I'm sure it can be booked elsewhere for cheaper. Beautiful lobby would have loved to lounge for awhile but no time. Very polite staff throughout.",
            "title": "Elegant Hotel",
            "user": "cinderella4jc"
        },
        {
            "date": "June 16, 2008",
            "detail_rating": {
                "business": null,
                "cleanliness": null,
                "desk": null,
                "location": null,
                "pool": null,
                "restaurant": null,
                "rooms": null,
                "service": null,
                "sleep": null,
                "value": null
            },
            "helpfulness": 3,
            "id": 16974786,
            "likes": {
                "disliked": null,
                "liked": null
            },
            "rating": 2.0,
            "stay_parameters": null,
            "text": "Close to ASU downtown campus , walking distance if not hot out, we were there for my son's orientation. Awesome view of Chase field and all of Phoenix. Awesome, great beds,wish we could take them home with us.",
            "title": "Beware the car service scam",
            "user": "BayeriaMN"
        },
        {
            "date": "June 13, 2008",
            "detail_rating": {
                "business": null,
                "cleanliness": null,
                "desk": null,
                "location": null,
                "pool": null,
                "restaurant": null,
                "rooms": null,
                "service": null,
                "sleep": null,
                "value": null
            },
            "helpfulness": 4,
            "id": 16890883,
            "likes": {
                "disliked": null,
                "liked": null
            },
            "rating": 1.0,
            "stay_parameters": null,
            "text": "We are usually a Hilton family, but this is our second time staying at Hyatt and we may be switching.",
            "title": "Beware the car service scam",
            "user": "BayeriaMN"
        },
        {
            "date": "May 6, 2008",
            "detail_rating": {
                "business": null,
                "cleanliness": 3.0,
                "desk": null,
                "front_desk": 5.0,
                "location": 4.0,
                "pool": null,
                "restaurant": null,
                "rooms": 2.0,
                "service": 5.0,
                "sleep": null,
                "value": 3.0
            },
            "helpfulness": 1,
            "id": 15713797,
            "likes": {
                "disliked": "\u2014 bathroom lighting",
                "liked": "\u2014 Closeness to the convention center"
            },
            "rating": 3.0,
            "stay_parameters": "Stayed May 2008, traveled on business",
            "text": "Only downside, parking structure is across small street and you have to take elevator down from garage and walk across street to hotel, but ok.",
            "title": "Not one of the best Hyatts",
            "user": "MHS8874"
        },
        {
            "date": "April 8, 2008",
            "detail_rating": {
                "business": null,
                "cleanliness": null,
                "desk": null,
                "location": null,
                "pool": null,
                "restaurant": null,
                "rooms": null,
                "service": null,
                "sleep": null,
                "value": null
            },
            "helpfulness": 3,
            "id": 14895464,
            "likes": {
                "disliked": null,
                "liked": null
            },
            "rating": 2.0,
            "stay_parameters": null,
            "text": "Starbucks just across street, oh yeah!",
            "title": "What a disappointment!",
            "user": "R_Bear"
        },
        {
            "date": "April 8, 2007",
            "detail_rating": {
                "business": null,
                "cleanliness": null,
                "desk": null,
                "location": null,
                "pool": null,
                "restaurant": null,
                "rooms": null,
                "service": null,
                "sleep": null,
                "value": null
            },
            "helpfulness": 2,
            "id": 7293603,
            "likes": {
                "disliked": null,
                "liked": null
            },
            "rating": 2.0,
            "stay_parameters": null,
            "text": "I booked a room online in January for a July stay. I wanted to cancel 3 months prior to July, but Hyatt charges $50 to cancel. They would not even let me transfer my payment to another Hyatt. No other hotel I deal with (major or minor) has this policy. Most hotels will allow cancellation outside 72 hours.",
            "title": "Nonrefundable deposit - beware",
            "user": "moyockmover"
        },
        {
            "date": "January 31, 2007",
            "detail_rating": {
                "business": 4.0,
                "cleanliness": 4.0,
                "desk": null,
                "front_desk": 4.0,
                "location": 5.0,
                "pool": null,
                "restaurant": null,
                "rooms": 2.0,
                "service": 4.0,
                "sleep": null,
                "value": 3.0
            },
            "helpfulness": 3,
            "id": 6719324,
            "likes": {
                "disliked": "\u2014 outdated decor, hard mattresses and lack of restaurants",
                "liked": "\u2014 service and location"
            },
            "rating": 3.0,
            "stay_parameters": "Stayed January 2007, traveled on business",
            "text": "Beware of this before you book online.",
            "title": "Good location",
            "user": "funsandiego"
        },
        {
            "date": "October 11, 2006",
            "detail_rating": {
                "business": null,
                "cleanliness": null,
                "desk": null,
                "location": null,
                "pool": null,
                "restaurant": null,
                "rooms": null,
                "service": null,
                "sleep": null,
                "value": null
            },
            "helpfulness": 5,
            "id": 5938983,
            "likes": {
                "disliked": null,
                "liked": null
            },
            "rating": 1.0,
            "stay_parameters": null,
            "text": "Typical Hyatt located in downtown Phoenix with great access to museums and cultural events. Towering, open lobby. Staff is very nice and accommodating. Rooms really need updating - popcorn ceilings, 1970's decor; very hard mattresses. Although it caters to conventions, it is a relatively quite hotel. Aside from the outdated decor, the other major drawback are the restaurants. There is only one main restaurant - the Compass - but it is very hard to get a reservation as it is always full. The Bar and Grill is also always full and the other restaurant (The Terrace Cafe) is only open for breakfast and lunch. There is an Einstein Bagels in the main lobby, but all the times we've stayed at the Hyatt we have had to either order room service or go next door to the Westin because the two restaurants in the Hyatt were full.",
            "title": "Unfortunate Changes",
            "user": "catham"
        },
        {
            "date": "October 8, 2006",
            "detail_rating": {
                "business": 5.0,
                "cleanliness": 5.0,
                "desk": null,
                "front_desk": 5.0,
                "location": 5.0,
                "pool": null,
                "restaurant": null,
                "rooms": 4.0,
                "service": 5.0,
                "sleep": null,
                "value": 4.0
            },
            "helpfulness": 9,
            "id": 5927549,
            "likes": {
                "disliked": "\u2014 Lack of activities/dining in downtown Phoenix. It is practically dead.",
                "liked": "\u2014 Proximity to the Convention Center."
            },
            "rating": 4.0,
            "stay_parameters": "Stayed September 2006, traveled on business",
            "text": "We live in the Phoenix area and planned to eat at the Hyatt before hearing the Phoenix Symphony across the street. We've done that for years. As we entered the lobby, I was surprised at how dingy the carpet and uhpholstery had become. We took the elevator to the Compass Room, a revolving restaurant on the top floor. When I said, \"We'd just like to head for the bar,\" the host said tersely, \"We don't have a bar. We have a cocktail lounge with sitdown service and a $15 minimum.\" Okay, there's a view and sometimes you have to pay for a view. The bar was nearly deserted. We had our wine and moved on. There was something ungracious and unsavory about the whole experience. Our plan was to move down to the Hyatt's Terrace Cafe for a light supper. On a Saturday night it was closed--already set up for breakfast. Next, we tried the sports bar off the lobby. But we were headed for the symphony and the cigarette smoke and big screens just didn't work. Three strikes and we were out of there. We won't be back.",
            "title": "Long stay, nice property, a few problems",
            "user": "cburley"
        },
        {
            "date": "October 18, 2013",
            "detail_rating": {
                "business": null,
                "cleanliness": 5.0,
                "desk": null,
                "location": 5.0,
                "pool": null,
                "restaurant": null,
                "rooms": 5.0,
                "service": 5.0,
                "sleep": 5.0,
                "value": 4.0
            },
            "helpfulness": 1,
            "id": 181496708,
            "likes": {
                "disliked": null,
                "liked": null
            },
            "rating": 5.0,
            "stay_parameters": "Stayed October 2013, traveled on business",
            "text": "My first trip (ever) to downtown Phoenix brought me on business to the Hyatt Regency. A national convention was held across the street in the Phoenix Convention Center and thus the location of the Hyatt Regency was spot on perfect. The bellmen was quick to take my bags to my room after a check-in process that was fast and friendly. A Sunday night arrival meant little or no downtown traffic and I quickly got setteld in for a 4 day convention. I discovered that the bar in the lobby served great food and was an excellent place for watching sports and chatting with other conventioneers which I ended up doing all 3 nights of my stay. My room was comfortable, the bathroom was a little small but the bed was just right. I ate breakfast in the main restaurant one morning and the food was fine and the service was very good. I used the fitness center twice (very nice) and the swimming pool once (average and somewhat cramped). I would stay here again for business but probably not for a family trip or shopping. The proximity to the ball parks is excellent though and sports fans would probably like this property.",
            "title": "Well Done Hyatt!",
            "user": "GOmaha"
        },
        {
            "date": "October 17, 2013",
            "detail_rating": {
                "business": null,
                "cleanliness": null,
                "desk": null,
                "location": null,
                "pool": null,
                "restaurant": null,
                "rooms": null,
                "service": null,
                "sleep": null,
                "value": null
            },
            "helpfulness": null,
            "id": 181400731,
            "likes": {
                "disliked": null,
                "liked": null
            },
            "rating": 3.0,
            "stay_parameters": null,
            "text": "In a meeting you always enjoy having an opportunity to go outside. Having breakout rooms with a outside courtyard allowed a great opportunity to get sun Sun and experience Phoenix weather. The beds were comfy and room was clean. The food could have been upgraded. Never experienced a good meal while there the entire time.",
            "title": "Good meeting facilities",
            "user": "Justin K"
        },
        {
            "date": "October 17, 2013",
            "detail_rating": {
                "business": null,
                "cleanliness": 5.0,
                "desk": null,
                "location": 5.0,
                "pool": null,
                "restaurant": null,
                "rooms": 5.0,
                "service": 5.0,
                "sleep": 5.0,
                "value": 4.0
            },
            "helpfulness": 1,
            "id": 181384555,
            "likes": {
                "disliked": null,
                "liked": null
            },
            "rating": 4.0,
            "stay_parameters": "Stayed October 2013, traveled on business",
            "text": "We recently stayed here during a convention trip. We stayed here of one week. This gave us a couple days before and after the convention to see the area. The hotel was nice. there was a problem with our room keys losing its programing. This happend 4 timnes during the first two days. It happen to another couple we were traveling with as well. It was solved when maintenance reprogrammed the door lock. The concierge, James, was extremely helpful. He helped iron out many of our last minute plans to go sight seeing of were to go for dinner. Ryan the bar tender at Networks was fun and helpful as well. Al staff were pleasnat and friendly. The only real issue was that the hotel only open thier buffet brackfast once the hotel reached a certain occupancy. Well, on days that it was not open, service was slow to say the least. Extra staff would have been greatlly apprciated. The staff that were there were runnig around but just could not keep up with everything and everyone. The hotel is centrally located and has many dinning options near-by. The pool small and there is an outdoor hottub. But we always found a chase recliner each time we went. The bed was very comfortable. I have back problems but unlike many places I have stayed I had no issues. Housekeeping was attentive as well.",
            "title": "Convention trip",
            "user": "krash28"
        },
        {
            "date": "October 15, 2013",
            "detail_rating": {
                "business": null,
                "cleanliness": 4.0,
                "desk": null,
                "location": 5.0,
                "pool": null,
                "restaurant": null,
                "rooms": 4.0,
                "service": 4.0,
                "sleep": 4.0,
                "value": 4.0
            },
            "helpfulness": 1,
            "id": 181139603,
            "likes": {
                "disliked": null,
                "liked": null
            },
            "rating": 4.0,
            "stay_parameters": "Stayed October 2013, traveled with friends",
            "text": "We stayed 4 nights at the Hyatt Regency hotel while attending a music gathering. On check in, we were shown to a room which was nice, but not what we had asked for. We had asked for a room with direct access to the pool. So they switched us to room 310 right then and there, which is a handicap room, and did have a sliding door to the pool area.",
            "title": "Very friendly to our group",
            "user": "Hedo-goer"
        },
        {
            "date": "October 11, 2013",
            "detail_rating": {
                "business": null,
                "cleanliness": null,
                "desk": null,
                "location": null,
                "pool": null,
                "restaurant": null,
                "rooms": null,
                "service": null,
                "sleep": null,
                "value": null
            },
            "helpfulness": 1,
            "id": 180645925,
            "likes": {
                "disliked": null,
                "liked": null
            },
            "rating": 4.0,
            "stay_parameters": null,
            "text": "This room was huge, with a large bathroom which had a shower that had no tub (for easy handicap access). Our shower did have shower curtains which reached the floor (as another reviewer complained theirs was lacking), and leakage from the shower was non-existent.",
            "title": "Exceeded expectations",
            "user": "RaeToGo"
        },
        {
            "date": "October 3, 2013",
            "detail_rating": {
                "business": null,
                "cleanliness": 4.0,
                "desk": null,
                "location": 5.0,
                "pool": null,
                "restaurant": null,
                "rooms": 4.0,
                "service": 4.0,
                "sleep": 4.0,
                "value": 4.0
            },
            "helpfulness": 2,
            "id": 179632350,
            "likes": {
                "disliked": null,
                "liked": null
            },
            "rating": 4.0,
            "stay_parameters": "Stayed September 2013, traveled with family",
            "text": "When we pulled up we were quickly greeted by a bellhop person...while it was great to be greeted we felt really rushed to quickly unload our car and have them valet park it. Check in was quick and we our room for the night was located on the 19th floor. If you are scared of heights do not stay high up, as the elevator has windows and moves very quickly. Our 2 year old was freighted! Room service was overpriced...Overall our stay was good...I really do not feel this is a good hotel with younger children. I think my husband would return if we were catching a concert/game downtown, as the location cannot be beat!",
            "title": "Great downtown location!",
            "user": "Elchuchoperucho"
        },
        {
            "date": "October 3, 2013",
            "detail_rating": {
                "business": null,
                "cleanliness": 5.0,
                "desk": null,
                "location": 5.0,
                "pool": null,
                "restaurant": null,
                "rooms": 5.0,
                "service": 5.0,
                "sleep": 5.0,
                "value": 5.0
            },
            "helpfulness": 2,
            "id": 179584456,
            "likes": {
                "disliked": null,
                "liked": null
            },
            "rating": 5.0,
            "stay_parameters": "Stayed September 2013, traveled on business",
            "text": "I was in Phoenix for a tradeshow at the convention center which is conveniently located right across the street from the Hyatt Regency. I'm a Platinum member of another hotel program so I normally use them. The Hyatt was so convenient that I decided to give them a try and was quite impressed. I've joined their program too now. The bellmen helped with my bags and rounding up several boxes that I had shipped to them. The concierge helped me print some FedEx labels and boarding passes, and the front desk was great. I ate at all three restaurants in the hotel (separate reviews coming) and they were all good.",
            "title": "Very Nice Stay in a Friendly Hotel",
            "user": "stcroixscuba"
        },
        {
            "date": "October 2, 2013",
            "detail_rating": {
                "business": null,
                "cleanliness": 2.0,
                "desk": null,
                "location": 4.0,
                "pool": null,
                "restaurant": null,
                "rooms": 2.0,
                "service": 2.0,
                "sleep": null,
                "value": 2.0
            },
            "helpfulness": null,
            "id": 179409370,
            "likes": {
                "disliked": null,
                "liked": null
            },
            "rating": 2.0,
            "stay_parameters": "Stayed September 2013",
            "text": "The hotel sent a questionnaire to me after checkout asking about my stay. One of the sections was about the restaurants. There was one (Einstein Bagels) that I didn't rate as highly as others and I received an email from the manager who was concerned. As I wrote back to her, there was absolutely nothing wrong, but how could I rate a take-out bagel breakfast place the same as the excellent Compass restaurant at the top of the hotel where I enjoyed a great steak and bottle of wine with a wonderful view?",
            "title": "Not what you would expect from a Hyatt Regency.",
            "user": "luv2bmum"
        },
        {
            "date": "September 30, 2013",
            "detail_rating": {
                "business": null,
                "cleanliness": 5.0,
                "desk": null,
                "location": 5.0,
                "pool": null,
                "restaurant": null,
                "rooms": 4.0,
                "service": 4.0,
                "sleep": 4.0,
                "value": 4.0
            },
            "helpfulness": 1,
            "id": 179270523,
            "likes": {
                "disliked": null,
                "liked": null
            },
            "rating": 4.0,
            "stay_parameters": "Stayed May 2013, traveled on business",
            "text": "As a result of this Hyatt I'll probably be choosing their brand more often.",
            "title": "Well run convention; downtown Phoenix",
            "user": "Matt V"
        },
        {
            "date": "September 24, 2013",
            "detail_rating": {
                "business": null,
                "cleanliness": 5.0,
                "desk": null,
                "location": 5.0,
                "pool": null,
                "restaurant": null,
                "rooms": 5.0,
                "service": 5.0,
                "sleep": 5.0,
                "value": 5.0
            },
            "helpfulness": 1,
            "id": 178441651,
            "likes": {
                "disliked": null,
                "liked": null
            },
            "rating": 5.0,
            "stay_parameters": "Stayed September 2013, traveled on business",
            "text": "We checked into our room and from the start our family was disappointed. After we waited for someone to assist us we unloaded our vehicle ourself placing all our luggage on a cart then wheeling it to the front door. the bell boy who was watching us unload stopped us and said we were not allowed to use the cart and he would have to help us to our room. This is the same employee who watched us holding two young children while unloading. We got to our room which was dirty. Dust on the lamp shades dirty toilet and bathroom the carpet floors caused my one year old sons feet to become black from walking around barefoot in the room. I am disappointed with the Hyatt. I have stayed at others with a better experence. Asked for two queen beds got two full size beds. Ridiculous. Not family friendly.",
            "title": "Hotel stay and Compass Restaurant",
            "user": "Nancy301"
        },
        {
            "date": "September 4, 2007",
            "detail_rating": {
                "business": null,
                "cleanliness": 4.0,
                "desk": null,
                "front_desk": 5.0,
                "location": 4.0,
                "pool": null,
                "restaurant": null,
                "rooms": 4.0,
                "service": 4.0,
                "sleep": null,
                "value": 4.0
            },
            "helpfulness": 1,
            "id": 8655364,
            "likes": {
                "disliked": "\u2014 Food after midnight",
                "liked": "\u2014 Location; full service"
            },
            "rating": 4.0,
            "stay_parameters": "Stayed August 2007, traveled with friends",
            "text": "We got a real cheap rate, as we were going to Arizona in August. We were in town to see the Diamondbacks, and the ballpark is in reasonable walking distance, even in the (dry) heat. The arena is also nearby.",
            "title": "Nice place; great weekend rate",
            "user": "GFKelly"
        },
        {
            "date": "June 25, 2007",
            "detail_rating": {
                "business": 2.0,
                "cleanliness": 3.0,
                "desk": null,
                "front_desk": 4.0,
                "location": 3.0,
                "pool": null,
                "restaurant": null,
                "rooms": 3.0,
                "service": 3.0,
                "sleep": null,
                "value": 4.0
            },
            "helpfulness": 5,
            "id": 7989468,
            "likes": {
                "disliked": null,
                "liked": null
            },
            "rating": 3.0,
            "stay_parameters": "Stayed June 2007, traveled on business",
            "text": "The front desk was real helpful, and the doormen were helpful.",
            "title": "standard average",
            "user": "lat13"
        },
        {
            "date": "June 19, 2007",
            "detail_rating": {
                "business": null,
                "cleanliness": null,
                "desk": null,
                "location": null,
                "pool": null,
                "restaurant": null,
                "rooms": null,
                "service": null,
                "sleep": null,
                "value": null
            },
            "helpfulness": 4,
            "id": 7939436,
            "likes": {
                "disliked": null,
                "liked": null
            },
            "rating": 2.0,
            "stay_parameters": null,
            "text": "There is nothing as far as food after midnight at the hotel or anywhere close to the hotel, whcih can be a bummer. The pool was nice, though it is not for swimming.",
            "title": "Medicore Hyatt Regency",
            "user": "4ofakindLasVegas"
        },
        {
            "date": "June 11, 2007",
            "detail_rating": {
                "business": null,
                "cleanliness": 5.0,
                "desk": null,
                "front_desk": 5.0,
                "location": 5.0,
                "pool": null,
                "restaurant": null,
                "rooms": 4.0,
                "service": null,
                "sleep": null,
                "value": 5.0
            },
            "helpfulness": 2,
            "id": 7835773,
            "likes": {
                "disliked": "\u2014 Lack of shops/restaurants in the area",
                "liked": "\u2014 Proximity to the stadium/concert arena"
            },
            "rating": 5.0,
            "stay_parameters": "Stayed June 2007, traveled as a couple",
            "text": "One of the cheapest Hyatts around but still delivers the standard-average dose of cookie-cutter, chain appointments and service. The only thing really distinctive about the property is the revolving restaurant, which though pricey for Phoenix does offer nice views of the sprawling accidental metropolis. The main annoyances were the nit-picky charges for valet parking and internet access, $19 and $12 respectively, and the disingenous notes posted in the room about various exorbitant convenience charges and the chain's purported \"concern for the environment\" as a motivation for not washing towels and bedding. Note: Navigating Downtown Phoenix is challenging currently due to ubiquitous construction for the new light-rail lines.",
            "title": "Great Stay",
            "user": "Baileybasset"
        },
        {
            "date": "June 9, 2007",
            "detail_rating": {
                "business": 2.0,
                "cleanliness": 3.0,
                "desk": null,
                "front_desk": 1.0,
                "location": 5.0,
                "pool": null,
                "restaurant": null,
                "rooms": 3.0,
                "service": 2.0,
                "sleep": null,
                "value": 2.0
            },
            "helpfulness": 2,
            "id": 7809352,
            "likes": {
                "disliked": null,
                "liked": null
            },
            "rating": 2.0,
            "stay_parameters": "Stayed January 2007",
            "text": "This is the worst Hyatt Regency I have ever stayed at. The hotel rooms do not have the new \"Hyatt Beds\" and Egyptian towels. Our room looked like a throw back from the 80's. Bathroom was very small. Hotel needs renovation to get back to Regency standards.",
            "title": "Nice place with a staff that could use some training",
            "user": "JerryLG"
        },
        {
            "date": "February 24, 2008",
            "detail_rating": {
                "business": 4.0,
                "cleanliness": 5.0,
                "desk": null,
                "front_desk": 5.0,
                "location": 5.0,
                "pool": null,
                "restaurant": null,
                "rooms": 5.0,
                "service": null,
                "sleep": null,
                "value": 4.0
            },
            "helpfulness": null,
            "id": 13810629,
            "likes": {
                "disliked": null,
                "liked": null
            },
            "rating": 4.0,
            "stay_parameters": "Stayed February 2008, traveled on business",
            "text": "Attended a business meeting in downtown Phoenix and stayed at Hyatt. Great location; easy walking distance to many attractions in downtown Phoenix. Short shuttle ride from Phoenix Sky Harbor Airport. Had a room on the 21st floor with great view of the city. Beds were heavenly and covered with light down comforter. The only negative is you have to pay $12.95 for a day for internet access. Would have thought this would be complimentary.",
            "title": "Great Downtown Location",
            "user": "Dadecat"
        },
        {
            "date": "February 23, 2008",
            "detail_rating": {
                "business": null,
                "cleanliness": null,
                "desk": null,
                "location": null,
                "pool": null,
                "restaurant": null,
                "rooms": null,
                "service": null,
                "sleep": null,
                "value": null
            },
            "helpfulness": 2,
            "id": 13797097,
            "likes": {
                "disliked": null,
                "liked": null
            },
            "rating": 2.0,
            "stay_parameters": null,
            "text": "My cousin and I planned a spring '07 girls vacation to the Phoenix area. We got a great combo package that included staying here at the Hyatt. The hotel was nice and clean, friendly staff, and had a small but nice pool. The rooms were smaller and darker than we'd imagined, but not bad. Parking was a problem - they have a garage but you have to walk a bit. You might want to call ahead to make sure parking is available, as we had to deal with construction and finding OUR OWN PARKING for half of our stay. There is a cute/quaint outdoor shopping complex within walking distance - starbucks, pizza, subway, cute shops and a couple restaurants. We also walked to an Aveda Salon where we had a great time getting facials and manicures/pedicures. The girls there were very nice and personable. If you are coming to Phoenix for a professional sporting event, you can walk from the Hyatt. However, there's not much else around the hotel. We were disappointed to not be able to walk to restaurants or bars, or really even drive a short distance to any. If you are looking for more attractions - shopping, dining, nightlife, I'd recommend staying further out a bit. The weather was perfect the entire week. Scottsdale is a short drive away, and has several different style shopping/artsy areas with plenty of restaurants and entertainment. Sedona is a two hour drive but absolutely worth the trip! Another unique trait of downtown Phoenix was the helpful people who's job is to actually walk around the city looking to help people find their way! That was a welcome treat! Overall, our trip was very nice, and for the price (about $650 for air/hotel/rental car for a week pp), I would stay at the Hyatt again, and just have to drive a bit to find things to do.",
            "title": "Nice hotel...close to sporting events...but not much else",
            "user": "ranns826"
        },
        {
            "date": "January 7, 2008",
            "detail_rating": {
                "business": 3.0,
                "cleanliness": 5.0,
                "desk": null,
                "front_desk": 4.0,
                "location": 3.0,
                "pool": null,
                "restaurant": null,
                "rooms": 5.0,
                "service": 5.0,
                "sleep": null,
                "value": 4.0
            },
            "helpfulness": 1,
            "id": 12397661,
            "likes": {
                "disliked": "\u2014 Strange coffee experiences",
                "liked": "\u2014 Location was convenient to many downtown Phoenix facilities."
            },
            "rating": 4.0,
            "stay_parameters": "Stayed January 2008, traveled on business",
            "text": "Stayed here for two nights for a conference. It is located within a short walk to the USAirways Center ( Phoenix Suns basketball) and Chase Field ( Arizona Diamondbacks baseball) also near some of the Civic Center/auditoriums for concerts. Many good restautrants of all types within 2-3 blocks. When you go out in the day or night, you'll notice MANY City emplyees who are there to give directions and provide a feeling of safety. They, like the hotel staff, are also very friendly - a good experience, especially for the heart of a city. There is valet parking at the hotel ($16). I self-parked at a Visitor Center garage next door - $10/day with no in & out privileges. The hotel will \"validate\" for in & out privileges but that's another $6. Relatively small - but new and clean gym with fee weights and cross-trainers, treadmills and bikes - personal TV's and headphones. Conference rooms were spacious, well-lit, good sound. Function food was average.",
            "title": "Great Location - Safe downtown Area - Coffee Hi-jinx",
            "user": "Royzee"
        },
        {
            "date": "January 4, 2008",
            "detail_rating": {
                "business": 4.0,
                "cleanliness": 5.0,
                "desk": null,
                "front_desk": 5.0,
                "location": 5.0,
                "pool": null,
                "restaurant": null,
                "rooms": 5.0,
                "service": 5.0,
                "sleep": null,
                "value": 4.0
            },
            "helpfulness": 1,
            "id": 12321874,
            "likes": {
                "disliked": "\u2014 Downtown Phoenix is boooooring",
                "liked": "\u2014 Great and helpful staff"
            },
            "rating": 5.0,
            "stay_parameters": "Stayed January 2008, traveled as a couple",
            "text": "The funny thing was that I could not get a decent cup of coffee at this hotel. The housekeeping staff kept stocking me up with de-caf only; the function coffee just wasn't very good. And the Einstein's Bagels in the hotel had Vanilla Hazelnut in the dispenser labeled \"French Roast\". There is a Starbucks in the Civic Center across the street and I'm sure there are some good coffee places nearby.",
            "title": "Very Nice Hotel",
            "user": "dredlockesq"
        },
        {
            "date": "October 5, 2007",
            "detail_rating": {
                "business": 3.0,
                "cleanliness": 2.0,
                "desk": null,
                "front_desk": 3.0,
                "location": 2.0,
                "pool": null,
                "restaurant": null,
                "rooms": 2.0,
                "service": 2.0,
                "sleep": null,
                "value": null
            },
            "helpfulness": 4,
            "id": 10043147,
            "likes": {
                "disliked": null,
                "liked": null
            },
            "rating": 2.0,
            "stay_parameters": "Stayed September 2007",
            "text": "The rooms were very clean and mine was quite large; and the Beds were A-plus comfy. I'd stay here again.",
            "title": "No thanks",
            "user": "NYerUWS"
        },
        {
            "date": "August 20, 2006",
            "detail_rating": {
                "business": null,
                "cleanliness": null,
                "desk": null,
                "location": null,
                "pool": null,
                "restaurant": null,
                "rooms": null,
                "service": null,
                "sleep": null,
                "value": null
            },
            "helpfulness": 4,
            "id": 5630228,
            "likes": {
                "disliked": null,
                "liked": null
            },
            "rating": 1.0,
            "stay_parameters": null,
            "text": "You think Hyatt you think quality......not this time. The pool was so filthy that even the Mgr Sasha apologized for it. We were in Phoenix AZ durring August on a long weekend and were unable to use the pool because of its condition. Now thats bad....but not as bad as when we tried to sleep that night in our bed. Hard as a hardwood floor but even that wasn't as bad as the sheets...something out of a no-name Motel....they scratched you like they were made of sand paper. We spoke to the Mgr about all of this and to his credit he apologized and said the monies were not allowed at this time to up-grade the property....which really had NOT been looked after at all. We were supposed to stay thru Sun nite after arriving Thurs afternoon....we left Friday morning as fast as we could.",
            "title": "Yuck......don't do it",
            "user": "GetFletch"
        },
        {
            "date": "July 24, 2006",
            "detail_rating": {
                "business": null,
                "cleanliness": 5.0,
                "desk": null,
                "front_desk": 5.0,
                "location": 5.0,
                "pool": null,
                "restaurant": null,
                "rooms": 5.0,
                "service": 5.0,
                "sleep": null,
                "value": 5.0
            },
            "helpfulness": 3,
            "id": 5503516,
            "likes": {
                "disliked": null,
                "liked": null
            },
            "rating": 5.0,
            "stay_parameters": "Stayed July 2006, traveled with family",
            "text": "Was looking for a weekend getaway when we stumbled upon the Hyatt. They have a great package available in conjunction with the Diamondbacks. Staff was quick and friendly and property location was great. Room was clean and the food, it was great! Just a couple blocks from Chase Field. Downtown Phoenix has come a long way and is really cleaned up from previous visits. My family and I would not hesitate to stay there again, in fact we already have reservations to do so!",
            "title": "Great Service, Great Location",
            "user": "TS20Travel"
        },
        {
            "date": "July 14, 2006",
            "detail_rating": {
                "business": null,
                "cleanliness": null,
                "desk": null,
                "location": null,
                "pool": null,
                "restaurant": null,
                "rooms": null,
                "service": null,
                "sleep": null,
                "value": null
            },
            "helpfulness": 3,
            "id": 5466750,
            "likes": {
                "disliked": null,
                "liked": null
            },
            "rating": 2.0,
            "stay_parameters": null,
            "text": "The people that work here are so nice...it's a shame that nothing else seems to work. I was put in a room that had no hot water, so then i switched to another room...upon returning home to that room later, the AC did not go below 73 degrees and my room had not been made up. So...they moved me to another room. At this point, i could live with the luke warm shower and another day when the building's AC went down (it's over 110 degrees in phoenix right now). Internet cut out for a few hours too. I paid $7 to pick up a package that was delivered to me (\"handling fee\"). Everything here is really nice to look at, it's just a huge bummer that i was thwarted at every turn. Very frustrating hotel to be stuck in for a week.",
            "title": "Worst Stay Of 2006 - Bummer",
            "user": "A TripAdvisor user"
        },
        {
            "date": "July 12, 2006",
            "detail_rating": {
                "business": null,
                "cleanliness": 5.0,
                "desk": null,
                "location": null,
                "pool": null,
                "restaurant": null,
                "rooms": 5.0,
                "service": 5.0,
                "sleep": null,
                "value": 5.0
            },
            "helpfulness": 3,
            "id": 5460077,
            "likes": {
                "disliked": null,
                "liked": null
            },
            "rating": 5.0,
            "stay_parameters": "Stayed June 2006",
            "text": "I received a great deal for a Friday night on Priceline. They fulfilled my room preferences. They brought up a toothbrush quickly upon my request. Everything was perfect. Unless you grew up on Sunnybrook Farm, the area is fine. Parking was $14 with in-and-out, but with the deal I received, I couldn't object. Convenient to the airport, sports venues and interstates. Highly recommend.",
            "title": "Great Stay",
            "user": "norscio"
        },
        {
            "date": "January 22, 2006",
            "detail_rating": {
                "business": null,
                "cleanliness": null,
                "desk": null,
                "location": null,
                "pool": null,
                "restaurant": null,
                "rooms": null,
                "service": null,
                "sleep": null,
                "value": null
            },
            "helpfulness": 6,
            "id": 4369671,
            "likes": {
                "disliked": null,
                "liked": null
            },
            "rating": 2.0,
            "stay_parameters": null,
            "text": "I stayed for two nights because of a business convention. Rooms were OK, beds were not very comfortable. Also, as another reviewer mentioned, the doors of the TV cabinet don't open all the way, which makes for strange TV viewing. The view from the elevators was beautiful. Pool seemed fine; I didn't have time to try it.",
            "title": "Convenient location, not good service",
            "user": "A TripAdvisor user"
        },
        {
            "date": "January 4, 2006",
            "detail_rating": {
                "business": null,
                "cleanliness": 3.0,
                "desk": null,
                "location": null,
                "pool": null,
                "restaurant": null,
                "rooms": 3.0,
                "service": 2.0,
                "sleep": null,
                "value": 3.0
            },
            "helpfulness": 6,
            "id": 4325386,
            "likes": {
                "disliked": null,
                "liked": null
            },
            "rating": 2.0,
            "stay_parameters": "Stayed December 2005",
            "text": "We stayed at this Hyatt facility for two nights, namely December 10 and 11, 2005. Overall, we rated this hotel as a decent place to sleep; most guests would not find the facility attractive enough to do anything there except sleep at night and leave.",
            "title": "Just Okay/A Place to Sleep",
            "user": "annenorman"
        },
        {
            "date": "November 14, 2005",
            "detail_rating": {
                "business": null,
                "cleanliness": 4.0,
                "desk": null,
                "location": null,
                "pool": null,
                "restaurant": null,
                "rooms": 2.0,
                "service": 1.0,
                "sleep": null,
                "value": 3.0
            },
            "helpfulness": 13,
            "id": 4111276,
            "likes": {
                "disliked": null,
                "liked": null
            },
            "rating": 2.0,
            "stay_parameters": "Stayed September 2005",
            "text": "The property is bland. There is nothing visually appealing about this hotel. It has floors, ceilings, walls, lights and a few pieces of bad art. The rooms are ordinary, basic, even simple. The bathrooms are very small. The hallways are dull and lifeless.",
            "title": "Funny angled TV",
            "user": "Treborwf"
        },
        {
            "date": "October 3, 2005",
            "detail_rating": {
                "business": null,
                "cleanliness": 4.0,
                "desk": null,
                "location": null,
                "pool": null,
                "restaurant": null,
                "rooms": 4.0,
                "service": 4.0,
                "sleep": null,
                "value": 3.0
            },
            "helpfulness": 3,
            "id": 3985697,
            "likes": {
                "disliked": null,
                "liked": null
            },
            "rating": 4.0,
            "stay_parameters": "Stayed September 2005, traveled on business",
            "text": "With one exception, the staff was not stimulating or even modestly attentive. We recall the neutral greeting when we approached the desk Saturday morning to check in. This young woman either was having a bad day or absolutely hated her job. The doormen were okay, mildly pleasant. We did not encounter any of the housekeepers. The most attentive person we encountered after two nights was the man at the desk when we checked out early Monday morning. He was focused, charming and engaging -- a major, and positive, departure from the other persons we met while at this hotel.",
            "title": "Good room, thin walls",
            "user": "antshe"
        },
        {
            "date": "August 5, 2005",
            "detail_rating": {
                "business": null,
                "cleanliness": 3.0,
                "desk": null,
                "location": null,
                "pool": null,
                "restaurant": null,
                "rooms": 4.0,
                "service": 3.0,
                "sleep": null,
                "value": 4.0
            },
            "helpfulness": 5,
            "id": 3738837,
            "likes": {
                "disliked": null,
                "liked": null
            },
            "rating": 3.0,
            "stay_parameters": "Stayed July 2005",
            "text": "We relied on the concierge to select a restaurant outside the hotel for dinner one night. He recommmended an Italian restaurant (we have forgotten the name, for reasons detailed below) located about ten minutes away by car. The food was very poor. The service was good. The facility had not been renovated since the 1970's. The recommendation was so poor that it made us wonder about the motivations of this hotel representative to recommend this place -- did he really dislike us that much, or did he have a personal interest in our visit?",
            "title": "great location for baseball",
            "user": "micheleSc"
        },
        {
            "date": "June 18, 2005",
            "detail_rating": {
                "business": null,
                "cleanliness": null,
                "desk": null,
                "location": null,
                "pool": null,
                "restaurant": null,
                "rooms": null,
                "service": null,
                "sleep": null,
                "value": null
            },
            "helpfulness": 7,
            "id": 3574102,
            "likes": {
                "disliked": null,
                "liked": null
            },
            "rating": 5.0,
            "stay_parameters": null,
            "text": "We had breakfast at the hotel one morning. The food was poor, in taste, quality and presentation. The service was okay. The buffet -- an option we did not select -- looked like the food items had been recycled recently. It was expensive, though.",
            "title": "A Terrific Hotel",
            "user": "A TripAdvisor user"
        },
        {
            "date": "September 3, 2008",
            "detail_rating": {
                "business": null,
                "cleanliness": 5.0,
                "desk": null,
                "front_desk": 5.0,
                "location": 5.0,
                "pool": null,
                "restaurant": null,
                "rooms": 5.0,
                "service": 5.0,
                "sleep": null,
                "value": 5.0
            },
            "helpfulness": null,
            "id": 19717894,
            "likes": {
                "disliked": "\u2014 parking",
                "liked": "\u2014 parking"
            },
            "rating": 4.0,
            "stay_parameters": "Stayed August 2008, traveled as a couple",
            "text": "We stayed one night in Phoenix at the end of our roadtrip through Arizona. We purchased a king room at the Hyatt Regency on Hotwire for $66+fees per night. Probably a steal for this impressive hotel!",
            "title": "Good deal through Hotwire",
            "user": "JayJayBee"
        },
        {
            "date": "August 25, 2008",
            "detail_rating": {
                "business": 5.0,
                "cleanliness": 5.0,
                "desk": null,
                "front_desk": 5.0,
                "location": 5.0,
                "pool": null,
                "restaurant": null,
                "rooms": 4.0,
                "service": 5.0,
                "sleep": null,
                "value": 5.0
            },
            "helpfulness": null,
            "id": 19360451,
            "likes": {
                "disliked": "\u2014 Restaurants within hotel very expensive.",
                "liked": "\u2014 Location, friendly staff and super clean property."
            },
            "rating": 5.0,
            "stay_parameters": "Stayed August 2008, traveled on business",
            "text": "Fortunately I thought to inquire about parking before we arrived, but the parking was still a bit of a hassle. You can valet park for over $20 with in and out privileges, or park yourself at a nearby garage (on the next block) for $10, or $16 with in and out privileges. In and out privileges at the garage are purchased through the front desk of the hotel and charged to your room. Does that make sense?",
            "title": "Elegant hotel - great location!",
            "user": "RLTR10M"
        },
        {
            "date": "August 8, 2008",
            "detail_rating": {
                "business": 5.0,
                "cleanliness": 4.0,
                "desk": null,
                "front_desk": 3.0,
                "location": 4.0,
                "pool": null,
                "restaurant": null,
                "rooms": 4.0,
                "service": null,
                "sleep": null,
                "value": 4.0
            },
            "helpfulness": null,
            "id": 18733703,
            "likes": {
                "disliked": "\u2014 Staff could have improved stay by sharing a little time",
                "liked": "\u2014 Internet service"
            },
            "rating": 5.0,
            "stay_parameters": "Stayed July 2008, traveled on business",
            "text": "Our 5th floor room was really nice with a down comforter, a desk, a desk chair, an armchair, a table, a armoire with a cable TV, a coffeemaker, and a hairdryer. But unfortunately, it did not have a refrigerator, and interestingly, the TV was at an angle such that you could not watch from the bed. The room overlooked the pool/lounge area on the third floor.",
            "title": "What a regal hotel",
            "user": "wantingbetterservice"
        },
        {
            "date": "August 3, 2008",
            "detail_rating": {
                "business": null,
                "cleanliness": 4.0,
                "desk": null,
                "front_desk": 3.0,
                "location": 4.0,
                "pool": null,
                "restaurant": null,
                "rooms": 5.0,
                "service": null,
                "sleep": null,
                "value": 4.0
            },
            "helpfulness": null,
            "id": 18582739,
            "likes": {
                "disliked": "\u2014 parking",
                "liked": "\u2014 parking"
            },
            "rating": 4.0,
            "stay_parameters": "Stayed May 2008, traveled as a couple",
            "text": "It was a very nice hotel, but it seemed to lack character after visiting other charming hotels and cabins across Arizona. Since we were staying only one night, we also didn\u2019t have the opportunity to fully explore what the hotel and the neighboring area had to offer (although it\u2019s right downtown, near a thriving nightlife area, and just blocks from the Diamondbacks stadium).",
            "title": "A very nice hotel",
            "user": "sketchy321"
        },
        {
            "date": "July 21, 2008",
            "detail_rating": {
                "business": null,
                "cleanliness": 4.0,
                "desk": null,
                "front_desk": 5.0,
                "location": 5.0,
                "pool": null,
                "restaurant": null,
                "rooms": 4.0,
                "service": 5.0,
                "sleep": null,
                "value": 5.0
            },
            "helpfulness": 1,
            "id": 18107758,
            "likes": {
                "disliked": null,
                "liked": "\u2014 Location and close proximity of meal options"
            },
            "rating": 5.0,
            "stay_parameters": "Stayed July 2008, traveled with family",
            "text": "I enjoyed this hotel very much. The hotel employees were very friendly and helpful. It is located in downtown Phoenix within walking distance of restaurants and bars. The convention center is directly across the street. It is very clean and elegant. This is not your run-of-the-mill hotel. It is old-style with marble and soaring open spaces. The statuary and art is modern American-Western. There are doormen and bellhops. The revolving restaurant on the 24th floor reveals a panoramic view of the downtown Phoenix area, which is especially lovely at night. Do skip the valet parking for $23. You can park yourself for $10, and the parking garage is 1/2 block from the front door. I would gladly stay here again!",
            "title": "Nice Downtown Hyatt!!",
            "user": "Katsandcards_8"
        }
    ],
    "slim_ranking": 0.322033898305,
    "stars": 3.5,
    "tripadvisor": {
        "VISITED": false,
        "country_name": null,
        "locality": null,
        "pic_link": null,
        "street_address": null
    },
    "user_rating": 4.0,
    "variance": {
        "average": 84,
        "excellent": 137,
        "poor": 43,
        "terrible": 23,
        "very good": 187
    }
}