{
    "aka": null,
    "description": null,
    "detail_rating": {
        "cleanliness": null,
        "location": null,
        "rooms": null,
        "service": null,
        "sleep": null,
        "value": null
    },
    "location": {
        "city": null,
        "continent": "Europe",
        "country": "Italy",
        "proposed_city": null,
        "province": null,
        "region": "Piedmont"
    },
    "name": "Hotel Des Alpes",
    "places": {
        "aka": [],
        "hotel_description": [],
        "hotel_name": []
    },
    "review_count": 28,
    "review_count_current": 1,
    "reviews": [
        {
            "date": "September 22, 2009",
            "detail_rating": {
                "business": null,
                "cleanliness": 4.0,
                "desk": null,
                "location": 3.0,
                "pool": null,
                "restaurant": null,
                "rooms": 3.0,
                "service": 4.0,
                "sleep": null,
                "value": 3.0
            },
            "helpfulness": null,
            "id": 43563230,
            "likes": {
                "disliked": null,
                "liked": null
            },
            "rating": 3.0,
            "stay_parameters": "Stayed July 2009, traveled as a couple",
            "text": "This is a typical 1960/70s Italian hotel - very dull, sparsely furnished rooms. It's in the middle of a strip of commerce/industry. But the restaurant was surprisingly pleasant - relatively small and cosy, with good food.",
            "title": "Very dull",
            "user": "salmoneater"
        }
    ],
    "slim_ranking": 1.0,
    "stars": null,
    "tripadvisor": {
        "VISITED": false,
        "country_name": null,
        "locality": null,
        "pic_link": null,
        "street_address": null
    },
    "user_rating": 4.0,
    "variance": {
        "average": 8,
        "excellent": 4,
        "poor": 0,
        "terrible": 0,
        "very good": 16
    }
}