{
    "aka": null,
    "description": "Elegant modern true sea front guest house with superb sea views. 2 Panorama Suites, 3 stylish Atlantic Garden Rooms, all sea facing. Here you will enjoy some of the finest sea views in South Africa.",
    "detail_rating": {
        "cleanliness": null,
        "location": null,
        "rooms": null,
        "service": null,
        "sleep": null,
        "value": null
    },
    "location": {
        "city": null,
        "continent": "Africa",
        "country": "South Africa",
        "proposed_city": null,
        "province": null,
        "region": null
    },
    "name": "Crayfish Lodge Sea & Country Guest House",
    "places": {
        "aka": [],
        "hotel_description": [],
        "hotel_name": []
    },
    "review_count": 258,
    "review_count_current": 20,
    "reviews": [
        {
            "date": "June 6, 2012",
            "detail_rating": {
                "business": null,
                "cleanliness": 5.0,
                "desk": null,
                "location": 5.0,
                "pool": null,
                "restaurant": null,
                "rooms": 5.0,
                "service": 5.0,
                "sleep": 5.0,
                "value": 5.0
            },
            "helpfulness": null,
            "id": 131414371,
            "likes": {
                "disliked": null,
                "liked": null
            },
            "rating": 5.0,
            "stay_parameters": "Stayed May 2012, traveled as a couple",
            "text": "First of all, the views are simply beyond- this gorgeous modern home is directly on the rocks overlooking the sea. Our lovely host Sandra spent a lot of time making us feel welcome and recommending one of our best meals in South Africa at the charming Rosemary's just a few minutes away (like Grandma's quaint antiques-filed house but with WAY better food!). Sandra and Reinhard thought of everything when they built this house for guests, from the chic furnishings and very well-appointed bathrooms (ahhh the shower!), to their vast DVD collection, down to the heated floors that perfectly took the chill off our wintertime visit. Wish we had had more time to spend here- next time maybe we'll catch sight of the whales! Note: our rented Garmin GPS system for some reason directed us a block away, so do follow the posted signs (or enter \"Cryfish\" Lodge and then Garmin will direct you to the right place).",
            "title": "Stunning seaside experience",
            "user": "CiaoHolly"
        },
        {
            "date": "May 17, 2012",
            "detail_rating": {
                "business": null,
                "cleanliness": 5.0,
                "desk": null,
                "location": 5.0,
                "pool": null,
                "restaurant": null,
                "rooms": 5.0,
                "service": 5.0,
                "sleep": 5.0,
                "value": 5.0
            },
            "helpfulness": null,
            "id": 130132902,
            "likes": {
                "disliked": null,
                "liked": null
            },
            "rating": 5.0,
            "stay_parameters": "Stayed April 2012, traveled with friends",
            "text": "My wife, myself, and a friend spent two nights at the Crayfish lodge in late April and highly recommend it to anyone looking for a wonderful experience. Sandra and Reinhard were very welcoming, very informative, and gracious. Every recommendation was spot on - coastal flight with Evan, dinner, wineries, walking routes, and the local pub (like going back in time). Spring for the suite and you will not be disappointed - the sunsets were glorious!",
            "title": "Wonderful Experience",
            "user": "John J"
        },
        {
            "date": "May 1, 2012",
            "detail_rating": {
                "business": null,
                "cleanliness": 5.0,
                "desk": null,
                "location": 5.0,
                "pool": null,
                "restaurant": null,
                "rooms": 5.0,
                "service": 5.0,
                "sleep": 5.0,
                "value": 5.0
            },
            "helpfulness": 1,
            "id": 129172086,
            "likes": {
                "disliked": null,
                "liked": null
            },
            "rating": 5.0,
            "stay_parameters": "Stayed May 2012, traveled as a couple",
            "text": "We just got back from a trip around the Western Cape and stayed at Crayfishlodge for our last night.",
            "title": "PERFECT in every way",
            "user": "BRITTINAFRIKA"
        },
        {
            "date": "March 24, 2012",
            "detail_rating": {
                "business": null,
                "cleanliness": 5.0,
                "desk": null,
                "location": 5.0,
                "pool": null,
                "restaurant": null,
                "rooms": 5.0,
                "service": 5.0,
                "sleep": 5.0,
                "value": 5.0
            },
            "helpfulness": 1,
            "id": 126583267,
            "likes": {
                "disliked": null,
                "liked": null
            },
            "rating": 5.0,
            "stay_parameters": "Stayed February 2012, traveled as a couple",
            "text": "I recommend it wholeheartedly! Reinhard and Sandra are the most wonderful hosts, making us feel special from the minute we arrived to the minute we left with just the right measure of attention and at the same time giving us space. It felt like home. In the Luxury Travel business attention to detail is extremely important. As a tour operator I enjoy visiting guesthouses and lodges to make sure I really know what I am recommending to travelers. Well, I sure found a gem!",
            "title": "WARM AND WELCOMING",
            "user": "sunny c"
        },
        {
            "date": "March 20, 2012",
            "detail_rating": {
                "business": null,
                "cleanliness": 5.0,
                "desk": null,
                "location": 5.0,
                "pool": null,
                "restaurant": null,
                "rooms": 5.0,
                "service": 5.0,
                "sleep": 5.0,
                "value": 5.0
            },
            "helpfulness": null,
            "id": 126390612,
            "likes": {
                "disliked": null,
                "liked": null
            },
            "rating": 5.0,
            "stay_parameters": "Stayed March 2012, traveled with family",
            "text": "Crayfishlodgge has exceeded our expectations in every way: Warm and friendly service, fantastic location overlooking the ocean and with direct access to a lovely walking trail along the coast and a little beach just below. there is a lot of stuff to do in the area, from Sharkcage diving to Whale Watching in season, Kajaking, coastal walks and beaches good for swimming nearby. There are several wineroutes nearby that can be visited, art and craft shops - and Sandra and Reinhard are always updated about the new and exciting things happening in the Gansbaai and Hermanus area, and eager to share their knowledge with their guests.",
            "title": "PERFECTION!!",
            "user": "Nancy N"
        },
        {
            "date": "August 23, 2013",
            "detail_rating": {
                "business": null,
                "cleanliness": 5.0,
                "desk": null,
                "location": 5.0,
                "pool": null,
                "restaurant": null,
                "rooms": 5.0,
                "service": 5.0,
                "sleep": 5.0,
                "value": 5.0
            },
            "helpfulness": null,
            "id": 173613869,
            "likes": {
                "disliked": null,
                "liked": null
            },
            "rating": 5.0,
            "stay_parameters": "Stayed August 2013, traveled with family",
            "text": "Crayfish lodge is a modern, well equipped guest house in an excellent location with great views over the sea. We stayed for two nights on a family holiday and were slightly apprehensive as we don't normally stay in guest houses. However, we need not have feared. From the sight of its great architecture and interior fit out to the warm welcome from Sandra and her husband Reinhard we were immediately at ease. The bedrooms are comfortable and well equipped and the public rooms are airy and well designed with views over the coast. There is a private path down to the coast for those who want to walk along and watch whales from the coastal path. Although evening meals are not available we were offered the opportunity when booking to pre book dinners in the restaurant at the nearby Grootbos Nature Reserve. This is well worth taking advantage of for the excellent location, food and great value for money. Sandra's breakfasts were excellent with options that would suit everyone.",
            "title": "A very warm welcome",
            "user": "John H"
        },
        {
            "date": "June 27, 2013",
            "detail_rating": {
                "business": null,
                "cleanliness": 5.0,
                "desk": null,
                "location": 5.0,
                "pool": null,
                "restaurant": null,
                "rooms": 5.0,
                "service": 5.0,
                "sleep": 5.0,
                "value": 5.0
            },
            "helpfulness": 1,
            "id": 165463047,
            "likes": {
                "disliked": null,
                "liked": null
            },
            "rating": 5.0,
            "stay_parameters": "Stayed April 2013, traveled as a couple",
            "text": "We have been staying at Crayfish Lodge for five days and we enjoyed every minute! It is a beautiful guesthouse next to the sea. There is a small footpath that takes you straight down to the water. Don\u2019t miss the stunning hike along the coast!",
            "title": "Outstanding!",
            "user": "Smarty156"
        },
        {
            "date": "March 19, 2013",
            "detail_rating": {
                "business": null,
                "cleanliness": 5.0,
                "desk": null,
                "location": 5.0,
                "pool": null,
                "restaurant": null,
                "rooms": 5.0,
                "service": 5.0,
                "sleep": 5.0,
                "value": 4.0
            },
            "helpfulness": null,
            "id": 155042161,
            "likes": {
                "disliked": null,
                "liked": null
            },
            "rating": 5.0,
            "stay_parameters": "Stayed March 2013, traveled as a couple",
            "text": "We stayed in a very nice room with lovely sea view. Great breakfast! Don\u2019t waste your time looking for other places \u2013 you can\u2019t find a better one!",
            "title": "So memorable!",
            "user": "Lawrence P"
        },
        {
            "date": "March 12, 2013",
            "detail_rating": {
                "business": null,
                "cleanliness": 5.0,
                "desk": null,
                "location": 5.0,
                "pool": null,
                "restaurant": null,
                "rooms": 5.0,
                "service": 5.0,
                "sleep": 5.0,
                "value": 5.0
            },
            "helpfulness": 1,
            "id": 154318088,
            "likes": {
                "disliked": null,
                "liked": null
            },
            "rating": 5.0,
            "stay_parameters": "Stayed March 2013, traveled as a couple",
            "text": "We were only able to stay for 2 nights as they were fully booked, but we wanted to stay for more and we plan to return. Reinhard and Sandra are the most perfect hosts, nothing was too much trouble and Sandra gave us so much information. Breakfast was gorgeous, the room was marvellous, and the view was stunning. What more can one say?",
            "title": "A time to remember",
            "user": "Jacques T"
        },
        {
            "date": "March 4, 2013",
            "detail_rating": {
                "business": null,
                "cleanliness": 5.0,
                "desk": null,
                "location": 5.0,
                "pool": null,
                "restaurant": null,
                "rooms": 5.0,
                "service": 5.0,
                "sleep": 5.0,
                "value": 5.0
            },
            "helpfulness": 2,
            "id": 153658822,
            "likes": {
                "disliked": null,
                "liked": null
            },
            "rating": 5.0,
            "stay_parameters": "Stayed February 2013, traveled as a couple",
            "text": "My wife and I needed a special place to celebrate our 27th wedding anniversary . We had the privilege to spend a night at crayfish lodge. We will go back again anytime even just to say hallo to Sandra and Reinhard. We can recommend the Crayfish lodge for a lot of reasons but go and see the view from your bedroom balcony and you will agree with us",
            "title": "One of the best Guest House with fantastic hosts.",
            "user": "Foule"
        },
        {
            "date": "August 20, 2012",
            "detail_rating": {
                "business": null,
                "cleanliness": 4.0,
                "desk": null,
                "location": 5.0,
                "pool": null,
                "restaurant": null,
                "rooms": 5.0,
                "service": 5.0,
                "sleep": 4.0,
                "value": 3.0
            },
            "helpfulness": 1,
            "id": 137702366,
            "likes": {
                "disliked": null,
                "liked": null
            },
            "rating": 5.0,
            "stay_parameters": "Stayed August 2012, traveled with family",
            "text": "This is a fantastic place, right on the seashore, with a fantastic view of the ocean. We had a beautiful morning walk along the beach, leaving straight from our room, along the beaches, and saw whales in the distant. The day after we saw 4 whales playing in the bay, 5 min walking from the lodge. The inside is marvellously furbished, the breakfast is home made and great. The hosts, Sandra and Reinhard, are very warm and friendly, happy to help and give valuable advises (e.g. about where to eat and to whom to go out for a whale watching trip). This is a must place if you go to the area and want to see whales!",
            "title": "Fantastic place with stunning view over bay and whales!",
            "user": "Roberto B"
        },
        {
            "date": "August 19, 2012",
            "detail_rating": {
                "business": null,
                "cleanliness": 5.0,
                "desk": null,
                "location": 5.0,
                "pool": null,
                "restaurant": null,
                "rooms": 5.0,
                "service": 5.0,
                "sleep": 5.0,
                "value": 3.0
            },
            "helpfulness": null,
            "id": 137661733,
            "likes": {
                "disliked": null,
                "liked": null
            },
            "rating": 5.0,
            "stay_parameters": "Stayed August 2012, traveled with family",
            "text": "We stayed at Crayfish in August 2012 for one night only - we found the place over the internet and did not know what to expect. The lodge is beautiful, with a great communal space with a double height glass wall overlooking the most amazing sea view. We also discovered that the place is actually better than Hermanous for whale watching. Directions to a nearby hike took us on one of our best walks while in South Africa.",
            "title": "Great place and great support!",
            "user": "gioia g"
        },
        {
            "date": "August 14, 2012",
            "detail_rating": {
                "business": null,
                "cleanliness": 5.0,
                "desk": null,
                "location": 5.0,
                "pool": null,
                "restaurant": null,
                "rooms": 5.0,
                "service": 5.0,
                "sleep": 5.0,
                "value": 5.0
            },
            "helpfulness": null,
            "id": 137154269,
            "likes": {
                "disliked": null,
                "liked": null
            },
            "rating": 5.0,
            "stay_parameters": "Stayed August 2012, traveled with friends",
            "text": "Breakfast was a feast of home made cooking. What made our stay very special though is that our 18 old daughter unexpectedly had to deal promptly with a number of admin tasks relating to her university accommodation. Our hosts, SAndra and Rehinard went totally out of their way when we drove back to the lodge (after having already left for Cape Town), and ended up spending the morning there using their computers, fax machines and telephones to sort her out. Not only that, when we called back from Cape Town they booked for us the most amazing \"sea safari\", with a reputable, environmentally conscious company, again going out of their way to provide us with directions when we got lost on our way to the boat. Our only regret is that we stayed only one night, we will definitely go back!",
            "title": "Perfect again",
            "user": "mousjes"
        },
        {
            "date": "August 8, 2012",
            "detail_rating": {
                "business": null,
                "cleanliness": null,
                "desk": null,
                "location": null,
                "pool": null,
                "restaurant": null,
                "rooms": null,
                "service": null,
                "sleep": null,
                "value": null
            },
            "helpfulness": 1,
            "id": 136581964,
            "likes": {
                "disliked": null,
                "liked": null
            },
            "rating": 5.0,
            "stay_parameters": null,
            "text": "We stayed last week with friends at Crayfish Lodge. It was wonderful, as always. Warm rooms, very comfortable beds, good shower. Just perfect. We saw the whales jumping while lying on our bed. Very nice breakfast.",
            "title": "Staying at Crayfish Lodge, spectacular",
            "user": "Danny H"
        },
        {
            "date": "July 21, 2012",
            "detail_rating": {
                "business": null,
                "cleanliness": 5.0,
                "desk": null,
                "location": 5.0,
                "pool": null,
                "restaurant": null,
                "rooms": 5.0,
                "service": 5.0,
                "sleep": 5.0,
                "value": 5.0
            },
            "helpfulness": null,
            "id": 134973029,
            "likes": {
                "disliked": null,
                "liked": null
            },
            "rating": 5.0,
            "stay_parameters": "Stayed July 2012, traveled as a couple",
            "text": "What a warm welcome we received by owners and hosts Sandra and Reinhard in beautifull Crayfish lodge. Our room was really very luxerious and nice and warm, because of the cold weather this was appriciated very much aswell. Comfortable beds and stunning views over the bay made the stay complete. In de morning wales could be seen from our own room and from the wide balcony at the grand lounge.",
            "title": "Simply Spectacular",
            "user": "DAWN D"
        },
        {
            "date": "February 13, 2013",
            "detail_rating": {
                "business": null,
                "cleanliness": 5.0,
                "desk": null,
                "location": 5.0,
                "pool": null,
                "restaurant": null,
                "rooms": 4.0,
                "service": 5.0,
                "sleep": 4.0,
                "value": 4.0
            },
            "helpfulness": null,
            "id": 152055431,
            "likes": {
                "disliked": null,
                "liked": null
            },
            "rating": 5.0,
            "stay_parameters": "Stayed December 2012, traveled with friends",
            "text": "This was a secret tip by a friend and I am so glad we went there. We had a wonderful time at the Crayfish Lodge. The service was amazing and the hosts ever so friendly and welcoming. We had a great room with a view. I could have spent the whole day there just looking out onto the ocean. We even had breafkast watching the whales as they were playing just by the bay. A wonderful place. I can only recommend it and hope to go back there very soon.",
            "title": "Wonderful place",
            "user": "Steph B"
        },
        {
            "date": "December 24, 2012",
            "detail_rating": {
                "business": null,
                "cleanliness": 5.0,
                "desk": null,
                "location": 5.0,
                "pool": null,
                "restaurant": null,
                "rooms": 5.0,
                "service": 5.0,
                "sleep": 5.0,
                "value": 4.0
            },
            "helpfulness": null,
            "id": 147992776,
            "likes": {
                "disliked": null,
                "liked": null
            },
            "rating": 5.0,
            "stay_parameters": "Stayed December 2012, traveled as a couple",
            "text": "We have been to South Africa a number of times and always been surprised by the quality of the properties that we have stayed in, Crayfish Lodge is up there with the very best. We booked a panorama suite not cheap but fantastic value for money, the bathroom was stunning and the views amazing. De Kelders is a little off the beaten path but in my opinion offers the best whale watching in South Africa, with sightings even this late in the season. The hospitality is wonderful, as are the breakfasts. One word of warning though. the daily aqua gym is not for beginners. just ask Thomas from Zurich.",
            "title": "Crayfish Lodge a little slice of heaven.",
            "user": "Ian G"
        },
        {
            "date": "December 8, 2012",
            "detail_rating": {
                "business": null,
                "cleanliness": 5.0,
                "desk": null,
                "location": 5.0,
                "pool": null,
                "restaurant": null,
                "rooms": 5.0,
                "service": 5.0,
                "sleep": 4.0,
                "value": 4.0
            },
            "helpfulness": null,
            "id": 146996133,
            "likes": {
                "disliked": null,
                "liked": null
            },
            "rating": 5.0,
            "stay_parameters": "Stayed November 2012, traveled with family",
            "text": "A fab view! Even before you can properly greet the owners, you cannot help but look out over the sea and the wonderful view. Charming owners too. They cannot do too much for the guests. Comfortable bedrooms and while the suites up top are much more expensive, my friends who opted for one of those rooms, couldn't run out barefoot in the morning and down the grass to the little beach! So each has its pluses and minuses. Breakfast was delightfully different: home cooked goodies that broke the mould of South African breakfasts and lots of choices. Good coffee and teas, and the wine in the evening was also delicious. It is a lovely place, and I hope to return. It is not cheap - by local standards and certainly not by European standards - but sometimes you have to treat yourself!",
            "title": "Luxury with great views",
            "user": "NoniNichols"
        },
        {
            "date": "November 28, 2012",
            "detail_rating": {
                "business": null,
                "cleanliness": 5.0,
                "desk": null,
                "location": 5.0,
                "pool": null,
                "restaurant": null,
                "rooms": 5.0,
                "service": 5.0,
                "sleep": 4.0,
                "value": 4.0
            },
            "helpfulness": null,
            "id": 146356876,
            "likes": {
                "disliked": null,
                "liked": null
            },
            "rating": 5.0,
            "stay_parameters": "Stayed November 2012, traveled as a couple",
            "text": "We stayed at the Crayfish Lodge for two nights. We were in the beautiful top floor suite with a private balcony and wonderful view of the sea and it was magnificent. The owners were charming and very hospitable and the breakfast was as good as described by other reviewers.",
            "title": "Beautiful Home away from home",
            "user": "jains100"
        },
        {
            "date": "October 18, 2012",
            "detail_rating": {
                "business": null,
                "cleanliness": 5.0,
                "desk": null,
                "location": 5.0,
                "pool": null,
                "restaurant": null,
                "rooms": 5.0,
                "service": 5.0,
                "sleep": 5.0,
                "value": 5.0
            },
            "helpfulness": null,
            "id": 143156286,
            "likes": {
                "disliked": null,
                "liked": null
            },
            "rating": 5.0,
            "stay_parameters": "Stayed October 2012, traveled solo",
            "text": "I would recommend the place without hesitation (and the dinner at Grootbos which was amazing !).",
            "title": "I Hope I Can Return!",
            "user": "TamarainMontana"
        }
    ],
    "slim_ranking": 0.08,
    "stars": 5,
    "tripadvisor": {
        "VISITED": false,
        "country_name": null,
        "locality": null,
        "pic_link": null,
        "street_address": null
    },
    "user_rating": 5.0,
    "variance": {
        "average": 6,
        "excellent": 245,
        "poor": 0,
        "terrible": 0,
        "very good": 7
    }
}