{
    "aka": "Riva Hotel Menton",
    "description": null,
    "detail_rating": {
        "cleanliness": null,
        "location": null,
        "rooms": null,
        "service": null,
        "sleep": null,
        "value": null
    },
    "location": {
        "city": null,
        "continent": "Europe",
        "country": "France",
        "proposed_city": "Menton",
        "province": null,
        "region": "Provence"
    },
    "name": "Hotel Riva",
    "places": {
        "aka": [
            "Menton"
        ],
        "hotel_description": [],
        "hotel_name": []
    },
    "review_count": 166,
    "review_count_current": 20,
    "reviews": [
        {
            "date": "May 18, 2013",
            "detail_rating": {
                "business": null,
                "cleanliness": 4.0,
                "desk": null,
                "location": 5.0,
                "pool": null,
                "restaurant": null,
                "rooms": 4.0,
                "service": 4.0,
                "sleep": null,
                "value": 5.0
            },
            "helpfulness": 1,
            "id": 161083235,
            "likes": {
                "disliked": null,
                "liked": null
            },
            "rating": 5.0,
            "stay_parameters": "Stayed May 2013",
            "text": "Planned to stay for 1 night but stayed for 2. Very clean and updated modern decor. Right on promenade with bright colourful lobby and very helpful staff. It was the nicest hotel over our 2 weeks travelling vacation. The hotel is booked solid over the Formula 1 race this coming weekend with returning clients over the past couple of years. Menton is a refreshing place to stay over the crazy prices and crowds of Monte Carlo and Nice...you will love the Riva Hotel!!!",
            "title": "Best Hotel for valve and location in Menton Monoco",
            "user": "aircooled993"
        },
        {
            "date": "May 9, 2013",
            "detail_rating": {
                "business": null,
                "cleanliness": 5.0,
                "desk": null,
                "location": 5.0,
                "pool": null,
                "restaurant": null,
                "rooms": 4.0,
                "service": 4.0,
                "sleep": 5.0,
                "value": 4.0
            },
            "helpfulness": null,
            "id": 160132548,
            "likes": {
                "disliked": null,
                "liked": null
            },
            "rating": 4.0,
            "stay_parameters": "Stayed May 2013, traveled as a couple",
            "text": "While driving from France to Italy my wife and I looked for a hotel to stay the night. It was 2am and using the TA app we found this hotel.",
            "title": "Excellent hotel!",
            "user": "Zorba139"
        },
        {
            "date": "April 26, 2013",
            "detail_rating": {
                "business": null,
                "cleanliness": 5.0,
                "desk": null,
                "location": 5.0,
                "pool": null,
                "restaurant": null,
                "rooms": 4.0,
                "service": 5.0,
                "sleep": 4.0,
                "value": 4.0
            },
            "helpfulness": null,
            "id": 158839386,
            "likes": {
                "disliked": null,
                "liked": null
            },
            "rating": 4.0,
            "stay_parameters": "Stayed April 2013, traveled as a couple",
            "text": "It was perfect for our needs.",
            "title": "Nice hotel...great location",
            "user": "PetrStadler"
        },
        {
            "date": "February 26, 2013",
            "detail_rating": {
                "business": null,
                "cleanliness": 4.0,
                "desk": null,
                "location": 4.0,
                "pool": null,
                "restaurant": null,
                "rooms": 4.0,
                "service": 4.0,
                "sleep": 4.0,
                "value": 3.0
            },
            "helpfulness": 1,
            "id": 153177135,
            "likes": {
                "disliked": null,
                "liked": null
            },
            "rating": 4.0,
            "stay_parameters": "Stayed February 2013, traveled with friends",
            "text": "We were lucky to find parking just in front of the hotel and were given a room on the 5th floor.",
            "title": "Second stay - still good.",
            "user": "SteveG226"
        },
        {
            "date": "November 22, 2012",
            "detail_rating": {
                "business": null,
                "cleanliness": 5.0,
                "desk": null,
                "location": 5.0,
                "pool": null,
                "restaurant": null,
                "rooms": 4.0,
                "service": 4.0,
                "sleep": 4.0,
                "value": 5.0
            },
            "helpfulness": 6,
            "id": 145941910,
            "likes": {
                "disliked": null,
                "liked": null
            },
            "rating": 4.0,
            "stay_parameters": "Stayed September 2012, traveled as a couple",
            "text": "Since there was no big difference (10 Euro) between the front sea view and back rooms we chose the sea view ones and this was great!",
            "title": "Great location",
            "user": "gypsype"
        },
        {
            "date": "November 9, 2012",
            "detail_rating": {
                "business": null,
                "cleanliness": 5.0,
                "desk": null,
                "location": 5.0,
                "pool": null,
                "restaurant": null,
                "rooms": 4.0,
                "service": 4.0,
                "sleep": 5.0,
                "value": 4.0
            },
            "helpfulness": 2,
            "id": 145043884,
            "likes": {
                "disliked": null,
                "liked": null
            },
            "rating": 4.0,
            "stay_parameters": "Stayed October 2012, traveled as a couple",
            "text": "Great location on the sea. Modern, nicely decorated, smallish room but big marble/granite bathroom. Why all the hotels have a tub with a hand-held wand that does not have a place to hook it high enough to be a shower is beyond me\u2026must be a chick thing. Room 304 with large balcony to the sea. Safe, flat screen TV, Kleenex, mini-bar but no coffee maker. Good bedside reading lights. Parking with a reservation but we found street parking on a Sunday in mid-October. Free wee-fee (wi-fi). Fully controllable a/c. Well soundproofed to shield you from the pounding Med. We recommend it. They were closing November 2012 for \"renovations\". There is a rooftop solarium with two sort of hot tubs that we did not use..see pictures.",
            "title": "Stay here if you can",
            "user": "ppilot"
        },
        {
            "date": "November 9, 2012",
            "detail_rating": {
                "business": null,
                "cleanliness": 5.0,
                "desk": null,
                "location": 4.0,
                "pool": null,
                "restaurant": null,
                "rooms": 5.0,
                "service": 3.0,
                "sleep": 4.0,
                "value": 3.0
            },
            "helpfulness": 1,
            "id": 145039405,
            "likes": {
                "disliked": null,
                "liked": null
            },
            "rating": 5.0,
            "stay_parameters": "Stayed September 2012, traveled as a couple",
            "text": "Stayed at this hotel for two nights in September 2012. We found the hotel rooms very clean, spacious and comfortable, but a little on the pricey side for late September at 125 euro a night plus 11 euros per person for breakfast. The staff were very pleasant and helpful and spoke very good English.",
            "title": "Nice hotel",
            "user": "COLCHRISNIC"
        },
        {
            "date": "November 5, 2012",
            "detail_rating": {
                "business": null,
                "cleanliness": 4.0,
                "desk": null,
                "location": 4.0,
                "pool": null,
                "restaurant": null,
                "rooms": 4.0,
                "service": 4.0,
                "sleep": 4.0,
                "value": 5.0
            },
            "helpfulness": null,
            "id": 144636724,
            "likes": {
                "disliked": null,
                "liked": null
            },
            "rating": 4.0,
            "stay_parameters": "Stayed October 2012, traveled as a couple",
            "text": "Hotel Riva is situatted on the water front, with a small road (with quite a lot of traffic) between the ocean and the hotel. The sound of the ocean is however so \"noisy\" so it nearly neutralizes the traffic . The view over the ocean is great and the hotel is in general of a high 3 star standard. The swimmingpool area were closed for the season, however I believe that this is a nice spot during summer.",
            "title": "Good value proposition",
            "user": "FLIDK"
        },
        {
            "date": "October 22, 2012",
            "detail_rating": {
                "business": null,
                "cleanliness": 4.0,
                "desk": null,
                "location": 4.0,
                "pool": null,
                "restaurant": null,
                "rooms": 3.0,
                "service": 3.0,
                "sleep": 4.0,
                "value": 2.0
            },
            "helpfulness": 1,
            "id": 143425810,
            "likes": {
                "disliked": null,
                "liked": null
            },
            "rating": 3.0,
            "stay_parameters": "Stayed September 2012, traveled as a couple",
            "text": "We could park free of charge just in the front of the hotel, as a few parking spots belongs to Hotel Riva, however otherwise there is parking nearby.",
            "title": "Late season facilities let down, otherwise OK",
            "user": "Rob373"
        },
        {
            "date": "October 16, 2012",
            "detail_rating": {
                "business": null,
                "cleanliness": 5.0,
                "desk": null,
                "location": 5.0,
                "pool": null,
                "restaurant": null,
                "rooms": 5.0,
                "service": 5.0,
                "sleep": 5.0,
                "value": 4.0
            },
            "helpfulness": null,
            "id": 142961670,
            "likes": {
                "disliked": null,
                "liked": null
            },
            "rating": 5.0,
            "stay_parameters": "Stayed October 2012, traveled on business",
            "text": "The rooms are of a reasonable size/quality and so are the bathrooms,",
            "title": "Fab-U-lous!!",
            "user": "Jelly4fish"
        },
        {
            "date": "August 27, 2013",
            "detail_rating": {
                "business": null,
                "cleanliness": 5.0,
                "desk": null,
                "location": 4.0,
                "pool": null,
                "restaurant": null,
                "rooms": 4.0,
                "service": 4.0,
                "sleep": 4.0,
                "value": 5.0
            },
            "helpfulness": 2,
            "id": 174282196,
            "likes": {
                "disliked": null,
                "liked": null
            },
            "rating": 5.0,
            "stay_parameters": "Stayed August 2013, traveled as a couple",
            "text": "Hotel Riva is excellent value for your money. Very easy access by bus from Nice, the bus stop is right next to the hotel. Hotel is clean and fresh, they have a good AC and a secure luggage room in case you need one.",
            "title": "Clean, comfortable and easy access!",
            "user": "Auli_K"
        },
        {
            "date": "July 18, 2013",
            "detail_rating": {
                "business": null,
                "cleanliness": 4.0,
                "desk": null,
                "location": 4.0,
                "pool": null,
                "restaurant": null,
                "rooms": 4.0,
                "service": 3.0,
                "sleep": 3.0,
                "value": 3.0
            },
            "helpfulness": 4,
            "id": 168018198,
            "likes": {
                "disliked": null,
                "liked": null
            },
            "rating": 4.0,
            "stay_parameters": "Stayed July 2013, traveled as a couple",
            "text": "Hotel Riva is just across the street from the nearest beach and rooms facing the sea have the most amazing view. Breakfast is quite expensive, but you can always enjoy your own breakfast sitting on the balcony admiring the fantastic view!",
            "title": "excellent location",
            "user": "califon"
        },
        {
            "date": "July 18, 2013",
            "detail_rating": {
                "business": null,
                "cleanliness": null,
                "desk": null,
                "location": null,
                "pool": null,
                "restaurant": null,
                "rooms": null,
                "service": null,
                "sleep": null,
                "value": null
            },
            "helpfulness": 1,
            "id": 168011294,
            "likes": {
                "disliked": null,
                "liked": null
            },
            "rating": 4.0,
            "stay_parameters": null,
            "text": "we stayed here for a week recently. had a room with a balcony, 3rd floor overlooking the sea. was excellent.",
            "title": "Nice place to relax",
            "user": "ThorBendik"
        },
        {
            "date": "June 30, 2013",
            "detail_rating": {
                "business": null,
                "cleanliness": 5.0,
                "desk": null,
                "location": 5.0,
                "pool": null,
                "restaurant": null,
                "rooms": 4.0,
                "service": 5.0,
                "sleep": 5.0,
                "value": 5.0
            },
            "helpfulness": 1,
            "id": 165783689,
            "likes": {
                "disliked": null,
                "liked": null
            },
            "rating": 5.0,
            "stay_parameters": "Stayed June 2013, traveled as a couple",
            "text": "sound proofing was not great so if that's an issue that may be not so good for you. the housekeeping staff were excellent, the hotel staff were maybe a bit aloof........ certainly not friendly...... on the day we were checking out we had checked the time for check out and it was 12 noon...... as we were not leaving Menton till that evening we ahd wanted to stay in room till nearer 12 but were still going to make sure we were checked out BY 12. at 11.30 there was a phone call from reception just to make sure we were definitely going..... I don't think this was needed. Also we hired bikes and attempted to leave them on the deserted terrace and the \"barman\" who had never spoken to us before rushed out and said we couldn't leave them there and suggested putting them between guests parked cars and the railings on the other side..... potentially damaging the car........",
            "title": "Nice style, great location",
            "user": "winetraveller01"
        },
        {
            "date": "June 21, 2013",
            "detail_rating": {
                "business": null,
                "cleanliness": 5.0,
                "desk": null,
                "location": 5.0,
                "pool": null,
                "restaurant": null,
                "rooms": 4.0,
                "service": 5.0,
                "sleep": 5.0,
                "value": 5.0
            },
            "helpfulness": 2,
            "id": 164749594,
            "likes": {
                "disliked": null,
                "liked": null
            },
            "rating": 4.0,
            "stay_parameters": "Stayed June 2013, traveled with friends",
            "text": "Very polite and service minded personel at nice and quiet hotel. The hotel is located about 10 min. nice walk from the Old Town and just across the water front. Unfortunatly, we did not have rooms with seaview, which we at a sligthly higher cost absolutely should prioritize. Nice and clean rooms with balcony, aircondition and ok beds. A nice breakfast buffet with possibility to eat outside.",
            "title": "Pleasant stay Riva Hotel",
            "user": "Christie0906"
        },
        {
            "date": "September 15, 2013",
            "detail_rating": {
                "business": null,
                "cleanliness": 5.0,
                "desk": null,
                "location": 5.0,
                "pool": null,
                "restaurant": null,
                "rooms": 4.0,
                "service": 5.0,
                "sleep": 5.0,
                "value": 5.0
            },
            "helpfulness": 1,
            "id": 177261526,
            "likes": {
                "disliked": null,
                "liked": null
            },
            "rating": 5.0,
            "stay_parameters": "Stayed August 2013, traveled as a couple",
            "text": "We really enjoyed our stay at this hotel. The reception area and dining room, together with the deck facilities on the roof have been fully modernized snd the interior is fresh, open and clean. The full breakfast each day was a good start to the day, together with the great service. We loved being on the front of the hotel with views over the sea. The rooms are a little dated but the bed was good and the place was spotless. Would we recommend this place to our friends and family? Definitely.",
            "title": "Great little hotel",
            "user": "pattieTheNetherlands"
        },
        {
            "date": "September 8, 2013",
            "detail_rating": {
                "business": null,
                "cleanliness": 4.0,
                "desk": null,
                "location": 5.0,
                "pool": null,
                "restaurant": null,
                "rooms": 4.0,
                "service": 5.0,
                "sleep": 4.0,
                "value": 4.0
            },
            "helpfulness": 1,
            "id": 176256856,
            "likes": {
                "disliked": null,
                "liked": null
            },
            "rating": 4.0,
            "stay_parameters": "Stayed September 2013, traveled as a couple",
            "text": "We stayed for three nights at this hotel, the room was bright and airy and well maintained.",
            "title": "Good place to stay",
            "user": "alexanderSpain"
        },
        {
            "date": "September 5, 2013",
            "detail_rating": {
                "business": null,
                "cleanliness": 4.0,
                "desk": null,
                "location": 4.0,
                "pool": null,
                "restaurant": null,
                "rooms": 3.0,
                "service": 4.0,
                "sleep": 4.0,
                "value": 3.0
            },
            "helpfulness": 5,
            "id": 175872826,
            "likes": {
                "disliked": null,
                "liked": null
            },
            "rating": 4.0,
            "stay_parameters": "Stayed October 2012, traveled with family",
            "text": "Small fridge was useful and the closet large and capable. There was a small safe that we did not use.",
            "title": "Very nice hotel",
            "user": "Layover007"
        },
        {
            "date": "September 4, 2013",
            "detail_rating": {
                "business": null,
                "cleanliness": 5.0,
                "desk": null,
                "location": 5.0,
                "pool": null,
                "restaurant": null,
                "rooms": 5.0,
                "service": 5.0,
                "sleep": 5.0,
                "value": 5.0
            },
            "helpfulness": 1,
            "id": 175660189,
            "likes": {
                "disliked": null,
                "liked": null
            },
            "rating": 5.0,
            "stay_parameters": "Stayed September 2013, traveled as a couple",
            "text": "The only comment about the bathroom was the shower fixing ,a point that everyone seems to note.",
            "title": "Splendid Hotel",
            "user": "xjosettex"
        },
        {
            "date": "August 28, 2013",
            "detail_rating": {
                "business": null,
                "cleanliness": 5.0,
                "desk": null,
                "location": 3.0,
                "pool": null,
                "restaurant": null,
                "rooms": 5.0,
                "service": 5.0,
                "sleep": 5.0,
                "value": 4.0
            },
            "helpfulness": 1,
            "id": 174461111,
            "likes": {
                "disliked": null,
                "liked": null
            },
            "rating": 5.0,
            "stay_parameters": "Stayed August 2013, traveled with family",
            "text": "The balcony looked out to see and along the coast, we were on the second floor and their was traffic noise with the balcony door open ,this was mainly the very annoying motor scooters.",
            "title": "Excellent hotel",
            "user": "MihaiPopa"
        }
    ],
    "slim_ranking": 0.0322580645161,
    "stars": 3,
    "tripadvisor": {
        "VISITED": false,
        "country_name": null,
        "locality": null,
        "pic_link": null,
        "street_address": null
    },
    "user_rating": 4.5,
    "variance": {
        "average": 9,
        "excellent": 68,
        "poor": 3,
        "terrible": 0,
        "very good": 86
    }
}