{
    "aka": "Wyndham Riverfront New Orleans Hotel",
    "description": null,
    "detail_rating": {
        "cleanliness": 4.0,
        "location": 4.5,
        "rooms": 4.0,
        "service": 4.0,
        "sleep": 4.0,
        "value": 4.0
    },
    "location": {
        "city": "New Orleans",
        "continent": null,
        "country": "United States",
        "proposed_city": "Orleans",
        "province": null,
        "region": null
    },
    "name": "Wyndham Riverfront New Orleans",
    "places": {
        "aka": [
            "Orleans"
        ],
        "hotel_description": [],
        "hotel_name": [
            "Orleans"
        ]
    },
    "review_count": 643,
    "review_count_current": 20,
    "reviews": [
        {
            "date": "August 30, 2007",
            "detail_rating": {
                "business": 4.0,
                "cleanliness": 4.0,
                "desk": null,
                "front_desk": 4.0,
                "location": 4.0,
                "pool": null,
                "restaurant": null,
                "rooms": 4.0,
                "service": 4.0,
                "sleep": null,
                "value": 4.0
            },
            "helpfulness": 1,
            "id": 8588609,
            "likes": {
                "disliked": "\u2014 A/C vent couldn't be moved",
                "liked": "\u2014 The bed"
            },
            "rating": 4.0,
            "stay_parameters": "Stayed August 2007, traveled on business",
            "text": "This hotel is a old building but has been restored to a beautiful hotel. Our room was great, clean and cool in the New orleans heat. The staff was very nice and helpful. The only thing I was upset about, was when I booked the room I was told about the valet parking (this is the only parking for the hotel, you can,t park yourself) but was not told until we got out of our car about the $28.00 per night fee for valet parking. Needless to say I left my bags in the lobby and went to park my car in the Casino,s parking lot next door for free.",
            "title": "Great Rooms, but no 'free' parking",
            "user": "HammondTraveler"
        },
        {
            "date": "August 23, 2007",
            "detail_rating": {
                "business": 5.0,
                "cleanliness": 5.0,
                "desk": null,
                "front_desk": 5.0,
                "location": 3.0,
                "pool": null,
                "restaurant": null,
                "rooms": 5.0,
                "service": 5.0,
                "sleep": null,
                "value": 5.0
            },
            "helpfulness": 2,
            "id": 8489292,
            "likes": {
                "disliked": "\u2014 No fridge or microwave in room.",
                "liked": "\u2014 The two story room!"
            },
            "rating": 5.0,
            "stay_parameters": "Stayed August 2007, traveled on business",
            "text": "This hotel has been simply perfect! Everyone from the valet parking guy, to he front desk, to the employees in the restaurant were very friendly. Housekeeping did an amazing job everytime they came in. The room itself was to die for! Upon checking in, I was upgraded to a two story suite! I loved it. The breakfast was wonderful at 7 on Fulton (this was also included in my price). I paid 99.00 a night and got free valet parking and breakfast!! I would stay here again in a heartbeat!",
            "title": "Couldn't Be Better!!",
            "user": "jae_mye"
        },
        {
            "date": "August 10, 2007",
            "detail_rating": {
                "business": null,
                "cleanliness": 5.0,
                "desk": null,
                "front_desk": 5.0,
                "location": 5.0,
                "pool": null,
                "restaurant": null,
                "rooms": 5.0,
                "service": 5.0,
                "sleep": null,
                "value": 5.0
            },
            "helpfulness": 1,
            "id": 8392565,
            "likes": {
                "disliked": "\u2014 Nothing. Everything was EXCELLLENT",
                "liked": "\u2014 Friendly staff, good food, cleanliness and high quality"
            },
            "rating": 5.0,
            "stay_parameters": "Stayed August 2007, traveled with family",
            "text": "While surfing the web we got this awesome A#1 hotel for about 80.00 per night. We stayed two nights, got free valet parking and free breakfasts for two days, anything on the menu for free. The food was EXCELLENT. The staff was awesome. the room was clean. The beds and the room smelled wonderfully fresh. The desk clerk was extremely friendly and helpful.",
            "title": "The best Place To Stay",
            "user": "husbandkeeper"
        },
        {
            "date": "July 24, 2007",
            "detail_rating": {
                "business": 3.0,
                "cleanliness": 4.0,
                "desk": null,
                "front_desk": 5.0,
                "location": 4.0,
                "pool": null,
                "restaurant": null,
                "rooms": 3.0,
                "service": 3.0,
                "sleep": null,
                "value": 3.0
            },
            "helpfulness": null,
            "id": 8228414,
            "likes": {
                "disliked": "\u2014 Lack of maid srvices.",
                "liked": "\u2014 Location and fast check in."
            },
            "rating": 2.0,
            "stay_parameters": "Stayed June 2007, traveled with family",
            "text": "I have never stayed at a motel that I was so totally 100% satisfied with until we stayed at this one. My daughter and I felt very secure and safe here. Directly across from the Riverwalk. If we ever go back to new Orleans, this is the place we will stay again. The bell boy was very frienldy and so were the attendants parking the cars. You WILL like this place.",
            "title": "Nothing to Rave about OK in my ESTIMATION.",
            "user": "NJlawgirl"
        },
        {
            "date": "July 20, 2007",
            "detail_rating": {
                "business": null,
                "cleanliness": 5.0,
                "desk": null,
                "front_desk": 5.0,
                "location": 5.0,
                "pool": null,
                "restaurant": null,
                "rooms": 4.0,
                "service": 5.0,
                "sleep": null,
                "value": 5.0
            },
            "helpfulness": null,
            "id": 8205536,
            "likes": {
                "disliked": null,
                "liked": null
            },
            "rating": 5.0,
            "stay_parameters": "Stayed July 2007, traveled on business",
            "text": "I",
            "title": "Great hotel, location",
            "user": "Jester4"
        },
        {
            "date": "February 28, 2008",
            "detail_rating": {
                "business": null,
                "cleanliness": 4.0,
                "desk": null,
                "front_desk": 3.0,
                "location": 4.0,
                "pool": null,
                "restaurant": null,
                "rooms": 4.0,
                "service": 3.0,
                "sleep": null,
                "value": 4.0
            },
            "helpfulness": 2,
            "id": 13913021,
            "likes": {
                "disliked": null,
                "liked": null
            },
            "rating": 4.0,
            "stay_parameters": "Stayed February 2008, traveled as a couple",
            "text": "Stayed here for one night. Arrived early, but they let us check in to our room, which was great. Room was nice, spacious enough, complimentary water bottles and Wolfgang Puck coffee. Bath was fine, nice toiletries. Location right across the street from Riverfront shopping, which we didn't even get to. Short walk from French Quarter attractions. Booked through harrahs.com and it's a block and a half from Harrah's. Close to CBD restaurants, etc. also. Would recommend this hotel and stay here again. Very good bed with comfy mattress and linens.",
            "title": "Nice stay at Wyndham",
            "user": "steptravel"
        },
        {
            "date": "February 25, 2008",
            "detail_rating": {
                "business": null,
                "cleanliness": 5.0,
                "desk": null,
                "front_desk": 5.0,
                "location": 5.0,
                "pool": null,
                "restaurant": null,
                "rooms": 4.0,
                "service": 4.0,
                "sleep": null,
                "value": 4.0
            },
            "helpfulness": 1,
            "id": 13840957,
            "likes": {
                "disliked": "\u2014 Had to come back home to 10 degrees!",
                "liked": "\u2014 Close to borbon street, had to walk a little bit. Close to riverwalk."
            },
            "rating": 4.0,
            "stay_parameters": "Stayed February 2008, traveled as a couple",
            "text": "I went through harrahs.com. It is a nice hotel with a wonderful staff.Always helpful. Would recommend.",
            "title": "Great place to stay",
            "user": "beerdrinker1"
        },
        {
            "date": "January 29, 2008",
            "detail_rating": {
                "business": null,
                "cleanliness": null,
                "desk": null,
                "location": null,
                "pool": null,
                "restaurant": null,
                "rooms": null,
                "service": null,
                "sleep": null,
                "value": null
            },
            "helpfulness": 1,
            "id": 13094344,
            "likes": {
                "disliked": null,
                "liked": null
            },
            "rating": 5.0,
            "stay_parameters": null,
            "text": "I was in NO for a 5Linx national convention from KC, MO. Had a great time the hotel was beautiful!",
            "title": "Nice Hotel and great convention center location!",
            "user": "missbap"
        },
        {
            "date": "January 8, 2008",
            "detail_rating": {
                "business": null,
                "cleanliness": 5.0,
                "desk": null,
                "front_desk": 5.0,
                "location": 4.0,
                "pool": null,
                "restaurant": null,
                "rooms": 5.0,
                "service": 5.0,
                "sleep": null,
                "value": 5.0
            },
            "helpfulness": null,
            "id": 12449615,
            "likes": {
                "disliked": "\u2014 we liked everything.",
                "liked": "\u2014 The quality of the furnishings and the excellent clean atmosphere,"
            },
            "rating": 5.0,
            "stay_parameters": "Stayed December 2007, traveled as a couple",
            "text": "One key point: ask to be close to the elevator for your room type. The building hallways wind and I was in room 620 and there is one way to the room and one way back to the elevator...long windy hallway that takes you in a circle!",
            "title": "Classy Hotel",
            "user": "10buck10"
        },
        {
            "date": "January 4, 2008",
            "detail_rating": {
                "business": 4.0,
                "cleanliness": 5.0,
                "desk": null,
                "front_desk": 5.0,
                "location": 5.0,
                "pool": null,
                "restaurant": null,
                "rooms": 5.0,
                "service": 5.0,
                "sleep": null,
                "value": 4.0
            },
            "helpfulness": 2,
            "id": 12333088,
            "likes": {
                "disliked": null,
                "liked": null
            },
            "rating": 4.0,
            "stay_parameters": "Stayed January 2008, traveled as a couple",
            "text": "Plush beds, clean bathrooms and iron in room! Some of my team stayed in the Embassy around the corner....Wyndahm had better bathrooms and beds than the Embassy-I saw first hand! (And was $50 cheaper!/night!)",
            "title": "Great location",
            "user": "kupaua"
        },
        {
            "date": "December 30, 2007",
            "detail_rating": {
                "business": null,
                "cleanliness": 5.0,
                "desk": null,
                "front_desk": 4.0,
                "location": 5.0,
                "pool": null,
                "restaurant": null,
                "rooms": 5.0,
                "service": 5.0,
                "sleep": null,
                "value": 5.0
            },
            "helpfulness": 4,
            "id": 12095846,
            "likes": {
                "disliked": "\u2014 unable to get front desk to get us room service menu in timely manner",
                "liked": "\u2014 location"
            },
            "rating": 5.0,
            "stay_parameters": "Stayed December 2007",
            "text": "Great location! First let me say everyone told me to make sure I stayed in the french quarters, how wrong they were.The quarters is filled with people and hotel on top of hotel its a great place to visit,shop and eat but when it came time to rest it did not get any better than the Wyndham Riverfront. It sits across the street from the riverfront and streetcars that that takes you everywhere for $1.25 and .40 cents for seniors. The hotel is only six stories high it sits in warehouse district up and trendy where you find galleries and great local places to eat and listen to some great New Orleans music. When I searched the websites looking at hotels I found lots with that old New Orleans feel but that wasnt what we wanted. We wnted something contemporary and new with clean lines. When I saw the picture of white down comforters I knew I had found it and I was right. The hotel was modern clean and very comfortable.The staff was wonderful from doormen,room service, dry cleaning ,maid service and setting up our return flight. I found out while there they had two story rooms that that are very ice and very reasonable priced. My hat off to most of the staff especially Danny Noel who manages the restaurant 7 located in the hotel .I give the place 5+",
            "title": "Great Choice",
            "user": "greatstay2007"
        },
        {
            "date": "November 18, 2007",
            "detail_rating": {
                "business": null,
                "cleanliness": 4.0,
                "desk": null,
                "front_desk": 2.0,
                "location": 5.0,
                "pool": null,
                "restaurant": null,
                "rooms": 4.0,
                "service": 4.0,
                "sleep": null,
                "value": 4.0
            },
            "helpfulness": 1,
            "id": 10902487,
            "likes": {
                "disliked": "\u2014 smoking rooms",
                "liked": "\u2014 location"
            },
            "rating": 5.0,
            "stay_parameters": "Stayed November 2007, traveled on business",
            "text": "If you have business at the New Orleans Convention Center, this is the place to stay. A short two minute walk will get you there and it's only about 10 minutes to the French Quarter.",
            "title": "AAO meeting across the street",
            "user": "DavidCrescentCity_CA"
        },
        {
            "date": "October 31, 2007",
            "detail_rating": {
                "business": null,
                "cleanliness": 5.0,
                "desk": null,
                "front_desk": 5.0,
                "location": 4.0,
                "pool": null,
                "restaurant": null,
                "rooms": 5.0,
                "service": 4.0,
                "sleep": null,
                "value": 5.0
            },
            "helpfulness": 5,
            "id": 10477622,
            "likes": {
                "disliked": "\u2014 leaving",
                "liked": "\u2014 The room"
            },
            "rating": 5.0,
            "stay_parameters": "Stayed October 2007, traveled as a couple",
            "text": "New Orleans is trying very hard to present its best face to visitors and it's working. The area around the Convention Center is spotless. I couldn't find a piece of trash on any street. The trees were freshly planted and everything looked fresh. I heard all the homeless now live in Houston and would have to believe that. The streets were filled with only tourists or business people.",
            "title": "A Wonderful Hotel",
            "user": "Jeannie4253"
        },
        {
            "date": "September 7, 2007",
            "detail_rating": {
                "business": null,
                "cleanliness": null,
                "desk": null,
                "location": null,
                "pool": null,
                "restaurant": null,
                "rooms": null,
                "service": null,
                "sleep": null,
                "value": null
            },
            "helpfulness": 1,
            "id": 8670099,
            "likes": {
                "disliked": null,
                "liked": null
            },
            "rating": 5.0,
            "stay_parameters": null,
            "text": "The hotel informed me they were \"over-booked\" when I checked in about 6 p.m. and they would therefore give me only smoking rooms. Since the town was full for the convention, I had no other choice. Try as best I could, the room never lost that stench from smoking and my clothes still reek of it as they hang in my closet at home. Oh well.",
            "title": "Loved the Wyndham!!",
            "user": "LBlowers48"
        },
        {
            "date": "September 5, 2007",
            "detail_rating": {
                "business": null,
                "cleanliness": 5.0,
                "desk": null,
                "front_desk": 4.0,
                "location": 2.0,
                "pool": null,
                "restaurant": null,
                "rooms": 4.0,
                "service": 4.0,
                "sleep": null,
                "value": 3.0
            },
            "helpfulness": 4,
            "id": 8662534,
            "likes": {
                "disliked": "\u2014 Location a little bit further away from other Hotels.",
                "liked": "\u2014 New and clean hotel."
            },
            "rating": 3.0,
            "stay_parameters": "Stayed August 2007, traveled with friends",
            "text": "Otherwise, the staff were very friendly and helpful. I ate several times at the downstairs restaurant and enjoyed quick service, good food and reasonable prices.",
            "title": "Nice Renovated Hotel, A Little Bit Further Walk from Everything",
            "user": "duytrader"
        },
        {
            "date": "July 11, 2007",
            "detail_rating": {
                "business": 3.0,
                "cleanliness": 5.0,
                "desk": null,
                "front_desk": 5.0,
                "location": 5.0,
                "pool": null,
                "restaurant": null,
                "rooms": 4.0,
                "service": 5.0,
                "sleep": null,
                "value": 4.0
            },
            "helpfulness": null,
            "id": 8101584,
            "likes": {
                "disliked": "\u2014 Had to pay for internet service.",
                "liked": "\u2014 Views and closeness to The French Quarter"
            },
            "rating": 4.0,
            "stay_parameters": "Stayed July 2007, traveled solo",
            "text": "I arrived in New Orleans for the Essence Music Festival expecting to see blighted buildings and rebuilding going on following the devastation from Katrina less than two years ago. What I found was a city thriving.",
            "title": "Close to everything",
            "user": "stevelydell"
        },
        {
            "date": "May 16, 2007",
            "detail_rating": {
                "business": null,
                "cleanliness": 5.0,
                "desk": null,
                "front_desk": 4.0,
                "location": 4.0,
                "pool": null,
                "restaurant": null,
                "rooms": 5.0,
                "service": 4.0,
                "sleep": null,
                "value": 4.0
            },
            "helpfulness": null,
            "id": 7632829,
            "likes": {
                "disliked": null,
                "liked": "\u2014 room comfort, cleanliness, updated"
            },
            "rating": 5.0,
            "stay_parameters": "Stayed May 2007, traveled as a couple",
            "text": "I stayed at The Wyndham for three wonderful days and nights.",
            "title": "Loved everything about it.",
            "user": "HoosierTraveler14"
        },
        {
            "date": "May 14, 2007",
            "detail_rating": {
                "business": null,
                "cleanliness": null,
                "desk": null,
                "location": null,
                "pool": null,
                "restaurant": null,
                "rooms": null,
                "service": null,
                "sleep": null,
                "value": null
            },
            "helpfulness": null,
            "id": 7598930,
            "likes": {
                "disliked": null,
                "liked": null
            },
            "rating": 5.0,
            "stay_parameters": null,
            "text": "The hotel borders the French Quarter, so it is quiet (unlike the Quarter at 4 a.m.) It never seems to stop.",
            "title": "Comfy!!",
            "user": "vnessr78"
        },
        {
            "date": "April 30, 2007",
            "detail_rating": {
                "business": 2.0,
                "cleanliness": 5.0,
                "desk": null,
                "front_desk": 5.0,
                "location": 3.0,
                "pool": null,
                "restaurant": null,
                "rooms": 3.0,
                "service": 4.0,
                "sleep": null,
                "value": 5.0
            },
            "helpfulness": 1,
            "id": 7486417,
            "likes": {
                "disliked": "\u2014 location",
                "liked": "\u2014 price and comfy bed"
            },
            "rating": 4.0,
            "stay_parameters": "Stayed April 2007, traveled with friends",
            "text": "The staff really impressed me: friendly, and offering insight and assistance with great recommendations of what to see off the beaten path and the best way to get there.",
            "title": "Lovely Hotel!!",
            "user": "flygirl6393"
        },
        {
            "date": "February 28, 2007",
            "detail_rating": {
                "business": 3.0,
                "cleanliness": 5.0,
                "desk": null,
                "front_desk": 4.0,
                "location": 4.0,
                "pool": null,
                "restaurant": null,
                "rooms": 5.0,
                "service": 5.0,
                "sleep": null,
                "value": 5.0
            },
            "helpfulness": 4,
            "id": 6893065,
            "likes": {
                "disliked": "\u2014 the views are not the greatest",
                "liked": "\u2014 attitude of the staff"
            },
            "rating": 5.0,
            "stay_parameters": "Stayed February 2007, traveled on business",
            "text": "The hotel is right by the river and the only paddle wheeler still in use. Take the ride and eat on-board. The food was great (try the jambalaya.)",
            "title": "They aim to please!",
            "user": "BlobKnoxville"
        }
    ],
    "slim_ranking": 0.44966442953,
    "stars": 3.5,
    "tripadvisor": {
        "VISITED": false,
        "country_name": null,
        "locality": null,
        "pic_link": null,
        "street_address": null
    },
    "user_rating": 4.0,
    "variance": {
        "average": 126,
        "excellent": 228,
        "poor": 48,
        "terrible": 26,
        "very good": 215
    }
}