{
    "aka": "Relais La Corte Dei Papi Hotel Cortona",
    "description": "Immersed in the Tuscan countryside, just few minutes from Cortona, La Corte dei Papi is an oasis of peace and quiet, ideal for those who like to enjoy traditional local atmosphere. All rooms are each unique in decor with handmade antique furnishings and fine crafted linens. Our restaurant offers guests traditional Tuscan dishes alongside with more modern and elaborate culinary combinations. To add to atmosphere, during summer, guests can dine outside, around the swimming pool.",
    "detail_rating": {
        "cleanliness": null,
        "location": null,
        "rooms": null,
        "service": null,
        "sleep": null,
        "value": null
    },
    "location": {
        "city": null,
        "continent": "Europe",
        "country": "Italy",
        "proposed_city": null,
        "province": null,
        "region": "Tuscany"
    },
    "name": "Relais La Corte dei Papi",
    "places": {
        "aka": [],
        "hotel_description": [],
        "hotel_name": []
    },
    "review_count": 344,
    "review_count_current": 20,
    "reviews": [
        {
            "date": "June 12, 2013",
            "detail_rating": {
                "business": null,
                "cleanliness": 5.0,
                "desk": null,
                "location": 5.0,
                "pool": null,
                "restaurant": null,
                "rooms": null,
                "service": 5.0,
                "sleep": null,
                "value": 5.0
            },
            "helpfulness": null,
            "id": 163825751,
            "likes": {
                "disliked": null,
                "liked": null
            },
            "rating": 5.0,
            "stay_parameters": "Stayed June 2013, traveled with family",
            "text": "We were staying at nearby Casa Bacanella and drove past this beautifully manicured stone facade and decided to turn in to see what was there and we came upon the magical Relais La Corte dei Papi. The beautiful rustic buildings and the well manicured grounds gave a hint",
            "title": "Magical Tuscan Retreat",
            "user": "brandbridgeltd"
        },
        {
            "date": "June 12, 2013",
            "detail_rating": {
                "business": null,
                "cleanliness": null,
                "desk": null,
                "location": null,
                "pool": null,
                "restaurant": null,
                "rooms": null,
                "service": 5.0,
                "sleep": null,
                "value": null
            },
            "helpfulness": null,
            "id": 163775070,
            "likes": {
                "disliked": null,
                "liked": null
            },
            "rating": 5.0,
            "stay_parameters": "Stayed June 2013, traveled with friends",
            "text": "to the pride and care put into this unique retreat in the rolling valley just outside the town of Cortona.",
            "title": "Lovely, stress-free vacation",
            "user": "Susan W"
        },
        {
            "date": "June 11, 2013",
            "detail_rating": {
                "business": null,
                "cleanliness": 5.0,
                "desk": null,
                "location": 4.0,
                "pool": null,
                "restaurant": null,
                "rooms": 5.0,
                "service": 5.0,
                "sleep": 4.0,
                "value": 3.0
            },
            "helpfulness": null,
            "id": 163733113,
            "likes": {
                "disliked": null,
                "liked": null
            },
            "rating": 4.0,
            "stay_parameters": "Stayed May 2013, traveled as a couple",
            "text": "We went in to take a peak and were greeted by owner David Papi who could not have been more friendly and warm. So excited to see a beautiful dining room with the look and feel that you imagine only exists in movies, we made reservations for dinner that evening.",
            "title": "Fantastic spot a few minutes' drive from the Cortona townsite",
            "user": "Viajero123456"
        },
        {
            "date": "June 7, 2013",
            "detail_rating": {
                "business": null,
                "cleanliness": 5.0,
                "desk": null,
                "location": 4.0,
                "pool": null,
                "restaurant": null,
                "rooms": 5.0,
                "service": 5.0,
                "sleep": 5.0,
                "value": 4.0
            },
            "helpfulness": null,
            "id": 163255179,
            "likes": {
                "disliked": null,
                "liked": null
            },
            "rating": 5.0,
            "stay_parameters": "Stayed June 2013, traveled as a couple",
            "text": "Everything about the meal was just perfect. The service was attentive without being intrusive,",
            "title": "Beautiful Tuscan Retreat",
            "user": "Rachel B"
        },
        {
            "date": "June 6, 2013",
            "detail_rating": {
                "business": null,
                "cleanliness": 5.0,
                "desk": null,
                "location": 5.0,
                "pool": null,
                "restaurant": null,
                "rooms": 5.0,
                "service": 5.0,
                "sleep": null,
                "value": 5.0
            },
            "helpfulness": null,
            "id": 163216163,
            "likes": {
                "disliked": null,
                "liked": null
            },
            "rating": 5.0,
            "stay_parameters": "Stayed May 2013",
            "text": "the food was fresh with the simple Tuscan style that makes it so authentically delicious.",
            "title": "David is a terrific host!",
            "user": "StevenGreenberg"
        },
        {
            "date": "May 10, 2013",
            "detail_rating": {
                "business": null,
                "cleanliness": null,
                "desk": null,
                "location": null,
                "pool": null,
                "restaurant": null,
                "rooms": null,
                "service": null,
                "sleep": null,
                "value": null
            },
            "helpfulness": null,
            "id": 160302350,
            "likes": {
                "disliked": null,
                "liked": null
            },
            "rating": 5.0,
            "stay_parameters": null,
            "text": "I traveled with my daughter and granddaughter, three generations exploring the sites of Italy.",
            "title": "\"THE HIGHLIGHT\"of our trip to Italy",
            "user": "A TripAdvisor user"
        },
        {
            "date": "April 4, 2013",
            "detail_rating": {
                "business": null,
                "cleanliness": 5.0,
                "desk": null,
                "location": 5.0,
                "pool": null,
                "restaurant": null,
                "rooms": 4.0,
                "service": 5.0,
                "sleep": null,
                "value": 4.0
            },
            "helpfulness": 1,
            "id": 156560572,
            "likes": {
                "disliked": null,
                "liked": null
            },
            "rating": 5.0,
            "stay_parameters": "Stayed August 2012, traveled with friends",
            "text": "Relais \"La Corte dei Papi\" was a exquisite property with an amazing host, David, who made his",
            "title": "Fabulous hotel and restaurant",
            "user": "Belfasttravel596"
        },
        {
            "date": "January 13, 2013",
            "detail_rating": {
                "business": null,
                "cleanliness": 5.0,
                "desk": null,
                "location": 5.0,
                "pool": null,
                "restaurant": null,
                "rooms": 5.0,
                "service": 5.0,
                "sleep": null,
                "value": 5.0
            },
            "helpfulness": 2,
            "id": 149587523,
            "likes": {
                "disliked": null,
                "liked": null
            },
            "rating": 5.0,
            "stay_parameters": "Stayed September 2012, traveled as a couple",
            "text": "home our home for four fabulous days. His accommodations and restaurant are beautiful and inviting. Breakfasts were just as appealing as the delicious evening meals. He truly made us",
            "title": "Beautiful Place with Wonderful Restaurant",
            "user": "skotfila"
        },
        {
            "date": "January 6, 2013",
            "detail_rating": {
                "business": null,
                "cleanliness": 5.0,
                "desk": null,
                "location": 5.0,
                "pool": null,
                "restaurant": null,
                "rooms": null,
                "service": 5.0,
                "sleep": null,
                "value": 5.0
            },
            "helpfulness": 4,
            "id": 148999001,
            "likes": {
                "disliked": null,
                "liked": null
            },
            "rating": 5.0,
            "stay_parameters": "Stayed September 2012, traveled as a couple",
            "text": "feel special. He is expanding the hotel and restaurant area and was gracious to show us all",
            "title": "Amazing Experience",
            "user": "Clint I"
        },
        {
            "date": "December 17, 2012",
            "detail_rating": {
                "business": null,
                "cleanliness": 5.0,
                "desk": null,
                "location": 5.0,
                "pool": null,
                "restaurant": null,
                "rooms": 5.0,
                "service": 5.0,
                "sleep": 5.0,
                "value": 5.0
            },
            "helpfulness": 2,
            "id": 147626277,
            "likes": {
                "disliked": null,
                "liked": null
            },
            "rating": 5.0,
            "stay_parameters": "Stayed September 2012, traveled with friends",
            "text": "the new spa rooms, restaurant and new outdoor pool area. It was truly a fabulous \"Italian\" experience!!",
            "title": "What a memory!!!!!",
            "user": "Lindy R"
        },
        {
            "date": "May 24, 2013",
            "detail_rating": {
                "business": null,
                "cleanliness": 5.0,
                "desk": null,
                "location": 5.0,
                "pool": null,
                "restaurant": null,
                "rooms": 5.0,
                "service": 5.0,
                "sleep": 5.0,
                "value": 5.0
            },
            "helpfulness": null,
            "id": 161712014,
            "likes": {
                "disliked": null,
                "liked": null
            },
            "rating": 5.0,
            "stay_parameters": "Stayed May 2013, traveled as a couple",
            "text": "We stayed 5 nights at Relais La Corte dei Papi, and could easily have stayed 5 more. It is an amazing property located very close to Cortona (a gorgeous town) and many other sites in Tuscany. The owner and tireless host, David Papi, was charming and welcoming, and definitely made our experience at the Relais that much better. We stayed in one of the cottages, which had it's own little front patio, perfect for drinking wine in the afternoon. Also, the restaurant is an experience not to be missed. We had three delicious dinners there - the highlight being the tagliata. And we highly recommend the cooking class - a very fun experience and a great introduction to Tuscan cuisine. We will definitely be back, and can't wait to stay in one of the brand-new gorgeous spa rooms!!",
            "title": "Amazing Honeymoon",
            "user": "Stephanie B"
        },
        {
            "date": "May 19, 2013",
            "detail_rating": {
                "business": null,
                "cleanliness": 5.0,
                "desk": null,
                "location": 3.0,
                "pool": null,
                "restaurant": null,
                "rooms": 4.0,
                "service": 5.0,
                "sleep": 4.0,
                "value": 3.0
            },
            "helpfulness": 1,
            "id": 161193952,
            "likes": {
                "disliked": null,
                "liked": null
            },
            "rating": 4.0,
            "stay_parameters": "Stayed May 2013, traveled as a couple",
            "text": "We saw several rooms, and all were pretty much over-decorated in an antique style. The manager, David Papi, is very charming and attentive, and is working very hard to make this a high end destination, which it is not, at least not yet. But it is very good, and the fixed price dinner is better than very good. The clientele is international, and my impression is that guests were, for the most part, seasoned travelers. I would stay here again.",
            "title": "An experience",
            "user": "Michael G"
        },
        {
            "date": "May 19, 2013",
            "detail_rating": {
                "business": null,
                "cleanliness": 5.0,
                "desk": null,
                "location": 5.0,
                "pool": null,
                "restaurant": null,
                "rooms": 5.0,
                "service": 5.0,
                "sleep": 5.0,
                "value": 5.0
            },
            "helpfulness": null,
            "id": 161162488,
            "likes": {
                "disliked": null,
                "liked": null
            },
            "rating": 5.0,
            "stay_parameters": "Stayed May 2013, traveled with friends",
            "text": "Upon arrival at La Corte dei Papi we felt at home. The staff was very kind and helpful but David Papi's genuine and welcoming personality is really the highlight of this place. From the recommendations for day trips, restaurants in the area and wineries to visit, everything was spot on.",
            "title": "Amazing Amazing Amazing",
            "user": "11-robbyinnyc-11"
        },
        {
            "date": "May 14, 2013",
            "detail_rating": {
                "business": null,
                "cleanliness": 5.0,
                "desk": null,
                "location": 4.0,
                "pool": null,
                "restaurant": null,
                "rooms": 4.0,
                "service": 5.0,
                "sleep": 4.0,
                "value": 3.0
            },
            "helpfulness": 1,
            "id": 160752299,
            "likes": {
                "disliked": null,
                "liked": null
            },
            "rating": 4.0,
            "stay_parameters": "Stayed August 2012, traveled as a couple",
            "text": "Perhaps the most incredible surprise was the restaurant -- we stayed three nights and ate there twice. The menu is small but varied and I savored every bite of the local and seasonal delicacies. Oh, and the wine selection was of course spectacular. You can't go wrong with any of David's recommendations.",
            "title": "Very welcoming & charming",
            "user": "TonySopranosVest"
        },
        {
            "date": "May 14, 2013",
            "detail_rating": {
                "business": null,
                "cleanliness": 5.0,
                "desk": null,
                "location": 5.0,
                "pool": null,
                "restaurant": null,
                "rooms": 5.0,
                "service": 5.0,
                "sleep": 5.0,
                "value": 5.0
            },
            "helpfulness": null,
            "id": 160739630,
            "likes": {
                "disliked": null,
                "liked": null
            },
            "rating": 5.0,
            "stay_parameters": "Stayed April 2013, traveled as a couple",
            "text": "I will be back!",
            "title": "La Corte dei Papi is a gem.",
            "user": "Dory92064"
        },
        {
            "date": "June 4, 2013",
            "detail_rating": {
                "business": null,
                "cleanliness": 5.0,
                "desk": null,
                "location": 5.0,
                "pool": null,
                "restaurant": null,
                "rooms": 5.0,
                "service": 5.0,
                "sleep": 5.0,
                "value": null
            },
            "helpfulness": null,
            "id": 162950004,
            "likes": {
                "disliked": null,
                "liked": null
            },
            "rating": 5.0,
            "stay_parameters": "Stayed May 2013, traveled with friends",
            "text": "our last two nights of a backroads cycling trip were spent here. Outstanding service, immaculate and over the top room, utterly incredible dinner. An absolute must if you area exploring Tuscany! The host Davide greeted us as warmly as if we were family, and treated us exceptionally well.",
            "title": "Pure Heaven!",
            "user": "Germaine T"
        },
        {
            "date": "June 3, 2013",
            "detail_rating": {
                "business": null,
                "cleanliness": 5.0,
                "desk": null,
                "location": 5.0,
                "pool": null,
                "restaurant": null,
                "rooms": 5.0,
                "service": 5.0,
                "sleep": 5.0,
                "value": 5.0
            },
            "helpfulness": null,
            "id": 162885179,
            "likes": {
                "disliked": null,
                "liked": null
            },
            "rating": 5.0,
            "stay_parameters": "Stayed May 2013, traveled with family",
            "text": "My husband and I stayed at Corte dei Papi for two nights in May 2013 and it was absolutely amazing. We were greeted by David Papi, whose family has owned this estate for centuries, and the grounds were gorgeous, and the rooms spacious and clean. We wished that we could've stayed longer. David was a wonderful host, very friendly and helpful. He worked tirelessly to make our experience special. We ate one night in the restaurant on the property and the food was delicious and the wine list was long and diverse. For sure order the pasta, and the chocolate dessert was to die for. The second night, we wanted casual so David suggested the local pizza restaurant which was a short taxi away. It was fabulous and full of local families enjoying a night out. Breakfast at Corte dei Papi consisted of fresh baked breads, yogurts, granola, cheeses, salamis, and fruit and of course lots and lots of cappuccino. The town of Cortona was a 5 minute car ride away and we loved walking the narrow cobble stone streets and ducking in and out of wine shops and cafes. Our bike ride from Corte dei Papi to Tuoro and back was challenging but gorgeous...I would do it again in a heartbeat. I can't wait to go back and visit David and stay in one of the new rooms...grazie mille David and staff for a wonderful beginning to our amazing biking and hiking trip through Tuscany!",
            "title": "Biking and touring around Tuscany",
            "user": "Nancy S"
        },
        {
            "date": "June 3, 2013",
            "detail_rating": {
                "business": null,
                "cleanliness": 5.0,
                "desk": null,
                "location": 5.0,
                "pool": null,
                "restaurant": null,
                "rooms": 5.0,
                "service": 5.0,
                "sleep": 5.0,
                "value": 5.0
            },
            "helpfulness": null,
            "id": 162834586,
            "likes": {
                "disliked": null,
                "liked": null
            },
            "rating": 5.0,
            "stay_parameters": "Stayed May 2013, traveled as a couple",
            "text": "After 3 days in Lucca, we headed here by car for 5 nights in May using Cortona as a base to explore the Tuscan Hill towns (recommend Montepulciano, Pienza and Val D'Orcia especially!). This is a truly special Hotel with a fabulous gourmet restaurant. We strongly recommend it. The landscaping and pool area are lovely too (I just wish the weather had been a bit better so we could have enjoyed it more). It is expensive but well worth it. After a day of traveling around the countryside this was the perfect place to return, relax, enjoy a Prosecco by the pool, and a lovely dinner (the food is fabulous!).",
            "title": "Fabulous base to explore Tuscan hill towns",
            "user": "S-B_from_Boston_area"
        },
        {
            "date": "May 29, 2013",
            "detail_rating": {
                "business": null,
                "cleanliness": 5.0,
                "desk": null,
                "location": 5.0,
                "pool": null,
                "restaurant": null,
                "rooms": 5.0,
                "service": 5.0,
                "sleep": 5.0,
                "value": 5.0
            },
            "helpfulness": 1,
            "id": 162315581,
            "likes": {
                "disliked": null,
                "liked": null
            },
            "rating": 5.0,
            "stay_parameters": "Stayed May 2013, traveled as a couple",
            "text": "The host David Papi is wonderful. He is truly passionate about his work and this property (which was in his family for generations). He talks about having grown up here with his grandfather and you can tell this is not just a job but a dream come true for him to have turned this property into an amazingly beautiful and elegant hotel and restaurant. David is invested in every detail in insuring his guests are well cared for. The rest of his staff is great as well; even his mother is there quietly helping out!",
            "title": "An Anniversary like no Other....",
            "user": "distribution_guy"
        },
        {
            "date": "May 28, 2013",
            "detail_rating": {
                "business": null,
                "cleanliness": 5.0,
                "desk": null,
                "location": 3.0,
                "pool": null,
                "restaurant": null,
                "rooms": 5.0,
                "service": 5.0,
                "sleep": 5.0,
                "value": 4.0
            },
            "helpfulness": null,
            "id": 162201014,
            "likes": {
                "disliked": null,
                "liked": null
            },
            "rating": 5.0,
            "stay_parameters": "Stayed May 2013, traveled as a couple",
            "text": "Lots to like.. definitely consider this Relais if heading to Tuscany. Note: it was an easy drive back to Florence from here. We dropped our car at the Florence airport and took a taxi into Florence (don't want a car there).. just another idea if you are heading this way!",
            "title": "Can't add anything to the other excellent reviews...",
            "user": "Ed_Scarmoosh"
        }
    ],
    "slim_ranking": 0.136363636364,
    "stars": 4,
    "tripadvisor": {
        "VISITED": false,
        "country_name": null,
        "locality": null,
        "pic_link": null,
        "street_address": null
    },
    "user_rating": 5.0,
    "variance": {
        "average": 6,
        "excellent": 308,
        "poor": 6,
        "terrible": 2,
        "very good": 22
    }
}