{
    "aka": "El Diplomatico Hotel",
    "description": null,
    "detail_rating": {
        "cleanliness": null,
        "location": null,
        "rooms": null,
        "service": null,
        "sleep": null,
        "value": null
    },
    "location": {
        "city": "Mexico City",
        "continent": null,
        "country": "Mexico",
        "proposed_city": null,
        "province": null,
        "region": "Central Mexico and Gulf Coast"
    },
    "name": "Hotel El Diplomatico",
    "places": {
        "aka": [],
        "hotel_description": [],
        "hotel_name": []
    },
    "review_count": 73,
    "review_count_current": 10,
    "reviews": [
        {
            "date": "November 1, 2004",
            "detail_rating": {
                "business": null,
                "cleanliness": null,
                "desk": null,
                "location": null,
                "pool": null,
                "restaurant": null,
                "rooms": null,
                "service": null,
                "sleep": null,
                "value": null
            },
            "helpfulness": 5,
            "id": 2799903,
            "likes": {
                "disliked": null,
                "liked": null
            },
            "rating": 2.0,
            "stay_parameters": null,
            "text": "This hotel on the outside appearance seems really nice, and along with its decent price and close proximity to the World Trade Center does really well. But it does need to update it's decor inside, along with updating the rooms so that you don't hear the person in the next room sneezing or their intimate activities. The phone in the room had a lot of static making it very difficult for people to contact me in my room instead of on my cell phone. There was no voice mail system, so callers had to either call my cell phone for voicemail or trust the front desk to slip a note under my door. The television never worked, even after calling maintenance. And the controls for the air conditioner worked only after spending a half hour pressing the buttons really hard in order to get them to work. However, the hotel staff was more than outstanding. If anything, that is what made the stay bearable. But there is no bar, no gift ship, or mini bar. I do not recommend this hotel for business travel.",
            "title": "Hotel Not Recommended...",
            "user": "A TripAdvisor user"
        },
        {
            "date": "July 15, 2004",
            "detail_rating": {
                "business": null,
                "cleanliness": null,
                "desk": null,
                "location": null,
                "pool": null,
                "restaurant": null,
                "rooms": null,
                "service": 1.0,
                "sleep": null,
                "value": null
            },
            "helpfulness": 5,
            "id": 2301562,
            "likes": {
                "disliked": null,
                "liked": null
            },
            "rating": 1.0,
            "stay_parameters": "Stayed July 2004, traveled on business",
            "text": "Tried to stay a couple of nights at El Diplomatico, as it is close to the National University, but it turned out to be a waste of time and money! I called them to make a reservation, and they ensured me they had available rooms for the next day, and I could walk directly to the front desk. What a mistake I made trusting the info they gave me over the phone! When I arrived to the front desk coming directly from the bus terminal with all my luggage, they simply told me they had no rooms, and didn't even offer an apology for giving me misleading information the day before!!! No one seemed to care about the situation, nobody offered any help. I had to call Hotel Sevilla (where I regularly stay but it is a little far away from the University Campus) to make a last minute reservation, and pay a taxi from El Diplomatico to Hotel Sevilla... In 4 years visiting Mexico City regularly, this is the first time I got such a poor service from a Mexican hotel!!! Needless to say, I will never try El Diplomatico again.",
            "title": "A waste of time and money",
            "user": "vaquitaflor"
        },
        {
            "date": "June 14, 2004",
            "detail_rating": {
                "business": null,
                "cleanliness": null,
                "desk": null,
                "location": null,
                "pool": null,
                "restaurant": null,
                "rooms": null,
                "service": null,
                "sleep": null,
                "value": null
            },
            "helpfulness": 3,
            "id": 2187422,
            "likes": {
                "disliked": null,
                "liked": null
            },
            "rating": 5.0,
            "stay_parameters": null,
            "text": "Great food, good service and well located.",
            "title": "good hotel in mexico",
            "user": "A TripAdvisor user"
        },
        {
            "date": "January 4, 2004",
            "detail_rating": {
                "business": null,
                "cleanliness": null,
                "desk": null,
                "location": null,
                "pool": null,
                "restaurant": null,
                "rooms": null,
                "service": null,
                "sleep": null,
                "value": null
            },
            "helpfulness": 1,
            "id": 1537820,
            "likes": {
                "disliked": null,
                "liked": null
            },
            "rating": 4.0,
            "stay_parameters": null,
            "text": "Hotel is very clean and the people are friendly.",
            "title": "Good central location",
            "user": "Shannon067"
        },
        {
            "date": "March 30, 2003",
            "detail_rating": {
                "business": null,
                "cleanliness": 3.0,
                "desk": null,
                "location": null,
                "pool": null,
                "restaurant": null,
                "rooms": 2.0,
                "service": 3.0,
                "sleep": null,
                "value": 3.0
            },
            "helpfulness": 15,
            "id": 926651,
            "likes": {
                "disliked": null,
                "liked": null
            },
            "rating": 3.0,
            "stay_parameters": "Stayed March 2003, traveled on business",
            "text": "This hotel is very well situated. We never had to wait more than 30 seconds for a bus or taxi, and were at our destination in good time.",
            "title": "Fine. Just fine.",
            "user": "OftenContentFlyer"
        },
        {
            "date": "August 26, 2008",
            "detail_rating": {
                "business": 2.0,
                "cleanliness": 2.0,
                "desk": null,
                "front_desk": 3.0,
                "location": 4.0,
                "pool": null,
                "restaurant": null,
                "rooms": 2.0,
                "service": 3.0,
                "sleep": null,
                "value": 3.0
            },
            "helpfulness": 2,
            "id": 19383333,
            "likes": {
                "disliked": null,
                "liked": null
            },
            "rating": 2.0,
            "stay_parameters": "Stayed August 2008, traveled on business",
            "text": "I stayed here in connection with a meeting so I didn't have much choice. It's pretty cheap but you get what you pay for. My room smelled funny and had a really loud AC unit. Also the room faced the main drag on the 4th floor and was really loud. I'd definitely advise if you stay here to try and get something that doesn't face Insurgentes if you can. As another reviewer mentioned there's a loud -- really loud restaurant across the street that stays open late.",
            "title": "Not Horrible but not great either",
            "user": "lbmore"
        },
        {
            "date": "March 20, 2008",
            "detail_rating": {
                "business": 1.0,
                "cleanliness": 2.0,
                "desk": null,
                "front_desk": 1.0,
                "location": 1.0,
                "pool": null,
                "restaurant": null,
                "rooms": 2.0,
                "service": 1.0,
                "sleep": null,
                "value": 1.0
            },
            "helpfulness": 2,
            "id": 14414392,
            "likes": {
                "disliked": "\u2014 everything after check in and before leaving.",
                "liked": "\u2014 Leaving it."
            },
            "rating": 1.0,
            "stay_parameters": "Stayed March 2008, traveled with family",
            "text": "But, generally the hotel was pretty clean and again, fairly cheap. Still, I think you can find much better in Mexico City. Look a little harder!",
            "title": "Absolutely the worst",
            "user": "EMQB"
        },
        {
            "date": "November 15, 2007",
            "detail_rating": {
                "business": 3.0,
                "cleanliness": 4.0,
                "desk": null,
                "front_desk": 1.0,
                "location": 4.0,
                "pool": null,
                "restaurant": null,
                "rooms": 4.0,
                "service": 2.0,
                "sleep": null,
                "value": 4.0
            },
            "helpfulness": 4,
            "id": 10837087,
            "likes": {
                "disliked": null,
                "liked": null
            },
            "rating": 3.0,
            "stay_parameters": "Stayed November 2007",
            "text": "Major dissapointment from the start.",
            "title": "Convenient Hotel with Poor Staff.",
            "user": "Torero"
        },
        {
            "date": "March 2, 2006",
            "detail_rating": {
                "business": null,
                "cleanliness": 5.0,
                "desk": null,
                "location": null,
                "pool": null,
                "restaurant": null,
                "rooms": 5.0,
                "service": 5.0,
                "sleep": null,
                "value": 5.0
            },
            "helpfulness": 2,
            "id": 4568165,
            "likes": {
                "disliked": null,
                "liked": null
            },
            "rating": 4.0,
            "stay_parameters": "Stayed February 2006, traveled on business",
            "text": "Got in late in the evening and was met by a staff that spoke zero english. In a big international city like Mexico City I would have expected better.",
            "title": "Good, comfortable, friendly staff, but...",
            "user": "Itiofele"
        },
        {
            "date": "November 17, 2005",
            "detail_rating": {
                "business": null,
                "cleanliness": 3.0,
                "desk": null,
                "location": null,
                "pool": null,
                "restaurant": null,
                "rooms": 5.0,
                "service": 3.0,
                "sleep": null,
                "value": 5.0
            },
            "helpfulness": 2,
            "id": 4124182,
            "likes": {
                "disliked": null,
                "liked": null
            },
            "rating": 4.0,
            "stay_parameters": "Stayed October 2005",
            "text": "Rooms looked passable enough so we settled in and ordered room service. It was awful...undercooked fish and shrimp so tough even my easy going husband got frustrated and gave up on it.",
            "title": "great room for a great price",
            "user": "rosalinda22"
        }
    ],
    "slim_ranking": 0.676579925651,
    "stars": 2.5,
    "tripadvisor": {
        "VISITED": false,
        "country_name": null,
        "locality": null,
        "pic_link": null,
        "street_address": null
    },
    "user_rating": 3.0,
    "variance": {
        "average": 23,
        "excellent": 7,
        "poor": 8,
        "terrible": 14,
        "very good": 21
    }
}