{
    "aka": "Angsana Riads Collection Morocco - Riad Dar Zaouia Hotel",
    "description": null,
    "detail_rating": {
        "cleanliness": null,
        "location": null,
        "rooms": null,
        "service": null,
        "sleep": null,
        "value": null
    },
    "location": {
        "city": "Marrakech",
        "continent": "Africa",
        "country": "Morocco",
        "proposed_city": null,
        "province": null,
        "region": "Marrakech-Tensift-El Haouz Region"
    },
    "name": "Angsana Riads Collection Morocco - Riad Dar Zaouia",
    "places": {
        "aka": [],
        "hotel_description": [],
        "hotel_name": []
    },
    "review_count": 29,
    "review_count_current": 1,
    "reviews": [
        {
            "date": "April 20, 2006",
            "detail_rating": {
                "business": null,
                "cleanliness": null,
                "desk": null,
                "location": null,
                "pool": null,
                "restaurant": null,
                "rooms": null,
                "service": null,
                "sleep": null,
                "value": null
            },
            "helpfulness": 1,
            "id": 4990202,
            "likes": {
                "disliked": null,
                "liked": null
            },
            "rating": 2.0,
            "stay_parameters": null,
            "text": "We just returned from 2 days at Dar zaouia in Marrakech; the location of the riad is great, closed to the center, but the riad is dark, the rooms have low ceiling and the decoration is not delicate.",
            "title": "noisy and dark riad",
            "user": "ValParis"
        }
    ],
    "slim_ranking": 0.567328918322,
    "stars": null,
    "tripadvisor": {
        "VISITED": false,
        "country_name": null,
        "locality": null,
        "pic_link": null,
        "street_address": null
    },
    "user_rating": 4.5,
    "variance": {
        "average": 0,
        "excellent": 19,
        "poor": 1,
        "terrible": 0,
        "very good": 9
    }
}