{
    "aka": "Pineapple Fields Hotel",
    "description": "The resort and restaurant are located on the most beautiful beach in the Out Islands. The property features an oversized pool, acres of lush tropical landscape, a gourmet deli, boutique and sporting/rental shop. One-bedroom units feature a master bedroom and bath, living room with a queen size pull out sofa-bed, full kitchens, verandas with teak furniture, cable TV, ceiling fans, AC, wireless internet and in-room phones. Two-bedroom units include a second bath and bedroom with (2) twin beds.",
    "detail_rating": {
        "cleanliness": null,
        "location": null,
        "rooms": null,
        "service": null,
        "sleep": null,
        "value": null
    },
    "location": {
        "city": null,
        "continent": null,
        "country": "Caribbean",
        "proposed_city": null,
        "province": null,
        "region": null
    },
    "name": "Pineapple Fields Resort",
    "places": {
        "aka": [],
        "hotel_description": [],
        "hotel_name": []
    },
    "review_count": 220,
    "review_count_current": 7,
    "reviews": [
        {
            "date": "October 18, 2006",
            "detail_rating": {
                "business": null,
                "cleanliness": 5.0,
                "desk": null,
                "front_desk": 5.0,
                "location": 5.0,
                "pool": null,
                "restaurant": null,
                "rooms": 5.0,
                "service": 5.0,
                "sleep": null,
                "value": 5.0
            },
            "helpfulness": 19,
            "id": 5967257,
            "likes": {
                "disliked": "\u2014 stairs from parking lot to buildings",
                "liked": "\u2014 The setting-plus like new condition"
            },
            "rating": 5.0,
            "stay_parameters": "Stayed September 2006, traveled as a couple",
            "text": "Pineapple Fields exceeded all of our expectations! Wonderful central Eleuthra location-Some units still under construction (but that did not bother us). The units are like a small one bedroom apartment-fully equipped-kitchen, open to the living room ,covered porch--washer/dryer/separate spacious bedroom, Everything you need except beach towels and beach chairs. You need to bring everything-coffee, sugar, etc-you can pack a cooler and check with your luggage. Bring cash-most places do not take credit cards....",
            "title": "Pineapple Fields, Eleuthra",
            "user": "mizloi"
        },
        {
            "date": "January 8, 2006",
            "detail_rating": {
                "business": null,
                "cleanliness": null,
                "desk": null,
                "location": null,
                "pool": null,
                "restaurant": null,
                "rooms": null,
                "service": null,
                "sleep": null,
                "value": null
            },
            "helpfulness": 47,
            "id": 4331887,
            "likes": {
                "disliked": null,
                "liked": null
            },
            "rating": 5.0,
            "stay_parameters": null,
            "text": "There is a great deli as well as Their resturant \"Tippy's\" is wonderful-right on the property--beach front, to be exact Beautiful pool area in the center of the complex. The people of Eleuthra are the most friendly and accomidating--We can not wait to go back! We walked the beach every day and did not see anyone else. This is the place to go for peace and quiet-hardly any nite life or shopping. While we were there the phones went out (get a local cell phone at the airport-US phones do not work). We never could figure out the tv (thank goodness)...and one day we did not have water---Like I said we can not wait to go back!",
            "title": "Don't miss it!",
            "user": "sberthusen"
        },
        {
            "date": "August 12, 2007",
            "detail_rating": {
                "business": null,
                "cleanliness": 5.0,
                "desk": null,
                "front_desk": 5.0,
                "location": 4.0,
                "pool": null,
                "restaurant": null,
                "rooms": 5.0,
                "service": 4.0,
                "sleep": null,
                "value": 4.0
            },
            "helpfulness": 12,
            "id": 8399587,
            "likes": {
                "disliked": null,
                "liked": null
            },
            "rating": 4.0,
            "stay_parameters": "Stayed August 2007, traveled with family",
            "text": "This is a new property (timeshare/rental). Construction has ended. However, some cosmetic work is still being done on some of the units as well as some of the landscaping. The property is located across the street from the beach.",
            "title": "Home away from home",
            "user": "MrsTraveler"
        },
        {
            "date": "June 30, 2007",
            "detail_rating": {
                "business": null,
                "cleanliness": 5.0,
                "desk": null,
                "front_desk": 4.0,
                "location": 4.0,
                "pool": null,
                "restaurant": null,
                "rooms": 5.0,
                "service": 5.0,
                "sleep": null,
                "value": 5.0
            },
            "helpfulness": 13,
            "id": 8031298,
            "likes": {
                "disliked": null,
                "liked": "\u2014 Privacy, comfort, & views"
            },
            "rating": 5.0,
            "stay_parameters": "Stayed May 2007, traveled as a couple",
            "text": "We stayed in a spacious upper level one bedroom apartment (#722). The decoration is light and airy. Everything looks very new and very pretty. There's a living room, bedroom, small kitchen (with all the cooking appliances and dinnerware), bathroom, and 2 decks (front and back). The unit has a.c., ceiling fans, washer/dryer, a safe, tv/dvd player in bedroom and living room, tape/cd player in living room. There is daily maid service. A nice pool is located in the middle of the property (deepest depth 4.5 feet). I read in an earlier review to bring your own beach towels. We did. But there were e beach towels in our unit. Pineapple Fields was definitely a home away from home. We loved it.",
            "title": "Stay Left!",
            "user": "surfplace"
        },
        {
            "date": "June 15, 2007",
            "detail_rating": {
                "business": null,
                "cleanliness": 5.0,
                "desk": null,
                "location": 5.0,
                "pool": null,
                "restaurant": null,
                "rooms": 5.0,
                "service": 5.0,
                "sleep": null,
                "value": 5.0
            },
            "helpfulness": 4,
            "id": 7851992,
            "likes": {
                "disliked": "\u2014 Nothing",
                "liked": "\u2014 Great apartment, close to beach"
            },
            "rating": 5.0,
            "stay_parameters": "Stayed May 2007, traveled with family",
            "text": "Some negatives:",
            "title": "Lovely place to stay",
            "user": "RAOLondon"
        },
        {
            "date": "February 25, 2007",
            "detail_rating": {
                "business": null,
                "cleanliness": null,
                "desk": null,
                "location": null,
                "pool": null,
                "restaurant": null,
                "rooms": null,
                "service": null,
                "sleep": null,
                "value": null
            },
            "helpfulness": 32,
            "id": 6837528,
            "likes": {
                "disliked": null,
                "liked": null
            },
            "rating": 5.0,
            "stay_parameters": null,
            "text": "--I had a big issue with holes in the ground that weren't covered properly. Not a good thing if you have kids running around.",
            "title": "Field of Dreams",
            "user": "Dangank"
        },
        {
            "date": "January 17, 2007",
            "detail_rating": {
                "business": null,
                "cleanliness": null,
                "desk": null,
                "location": null,
                "pool": null,
                "restaurant": null,
                "rooms": null,
                "service": null,
                "sleep": null,
                "value": null
            },
            "helpfulness": 5,
            "id": 6612539,
            "likes": {
                "disliked": null,
                "liked": null
            },
            "rating": 5.0,
            "stay_parameters": null,
            "text": "--The landscaping around our building wasn't done, so the immediate surrounding area wasn't very pretty to look at.",
            "title": "The Dreaming Place",
            "user": "Enjoymylive"
        }
    ],
    "slim_ranking": 0.153846153846,
    "stars": 4,
    "tripadvisor": {
        "VISITED": false,
        "country_name": null,
        "locality": null,
        "pic_link": null,
        "street_address": null
    },
    "user_rating": 5.0,
    "variance": {
        "average": 5,
        "excellent": 170,
        "poor": 0,
        "terrible": 0,
        "very good": 45
    }
}