{
  "id": "038",
  "title": "hostel vienna single room",
  "description": "Which hostels in vienna offer single rooms?",
  "narrative": "The review must belong to a Hostel in Vienna, not a Hotel. The review hast to describe or imply, that the hostel offers single rooms.",
  "relevances": [
    {
      "hotelId": -1606644795,
      "reviewId": 77492908,
      "isRelevant": 1
    },
    {
      "hotelId": -1606644795,
      "reviewId": 93088914,
      "isRelevant": 0
    },
    {
      "hotelId": -1606644795,
      "reviewId": 71290945,
      "isRelevant": 0
    },
    {
      "hotelId": -1606644795,
      "reviewId": 92820681,
      "isRelevant": 0
    },
    {
      "hotelId": -1606644795,
      "reviewId": 78194301,
      "isRelevant": 1
    },
    {
      "hotelId": -1606644795,
      "reviewId": 109803093,
      "isRelevant": 0
    },
    {
      "hotelId": -1606644795,
      "reviewId": 97660466,
      "isRelevant": 0
    },
    {
      "hotelId": -1606644795,
      "reviewId": 82780036,
      "isRelevant": 0
    },
    {
      "hotelId": -1606644795,
      "reviewId": 110679368,
      "isRelevant": 0
    },
    {
      "hotelId": -1606644795,
      "reviewId": 87966259,
      "isRelevant": 0
    },
    {
      "hotelId": -530177401,
      "reviewId": 64796753,
      "isRelevant": 0
    },
    {
      "hotelId": -530177401,
      "reviewId": 67860446,
      "isRelevant": 0
    },
    {
      "hotelId": -530177401,
      "reviewId": 76533623,
      "isRelevant": 0
    },
    {
      "hotelId": -530177401,
      "reviewId": 59206261,
      "isRelevant": 0
    },
    {
      "hotelId": -530177401,
      "reviewId": 67739498,
      "isRelevant": 0
    },
    {
      "hotelId": -530177401,
      "reviewId": 59577052,
      "isRelevant": 0
    },
    {
      "hotelId": -530177401,
      "reviewId": 61290016,
      "isRelevant": 0
    },
    {
      "hotelId": -530177401,
      "reviewId": 77595196,
      "isRelevant": 0
    },
    {
      "hotelId": -530177401,
      "reviewId": 69525008,
      "isRelevant": 0
    },
    {
      "hotelId": -530177401,
      "reviewId": 62974291,
      "isRelevant": 0
    },
    {
      "hotelId": -1795530741,
      "reviewId": 118102722,
      "isRelevant": 0
    },
    {
      "hotelId": -1795530741,
      "reviewId": 117805302,
      "isRelevant": 0
    },
    {
      "hotelId": -1795530741,
      "reviewId": 6801399,
      "isRelevant": 0
    },
    {
      "hotelId": -1795530741,
      "reviewId": 7155334,
      "isRelevant": 0
    },
    {
      "hotelId": -1795530741,
      "reviewId": 5236423,
      "isRelevant": 0
    },
    {
      "hotelId": -1795530741,
      "reviewId": 5013139,
      "isRelevant": 0
    },
    {
      "hotelId": -1795530741,
      "reviewId": 5432257,
      "isRelevant": 0
    },
    {
      "hotelId": -1795530741,
      "reviewId": 5317326,
      "isRelevant": 0
    },
    {
      "hotelId": -1795530741,
      "reviewId": 118268809,
      "isRelevant": 0
    },
    {
      "hotelId": -1795530741,
      "reviewId": 8261401,
      "isRelevant": 0
    },
    {
      "hotelId": -1840639897,
      "reviewId": 150123923,
      "isRelevant": 0
    },
    {
      "hotelId": -1840639897,
      "reviewId": 154484525,
      "isRelevant": 0
    },
    {
      "hotelId": -1840639897,
      "reviewId": 152762598,
      "isRelevant": 0
    },
    {
      "hotelId": -1840639897,
      "reviewId": 155068733,
      "isRelevant": 0
    },
    {
      "hotelId": -1840639897,
      "reviewId": 151199269,
      "isRelevant": 0
    },
    {
      "hotelId": -1840639897,
      "reviewId": 157539455,
      "isRelevant": 0
    },
    {
      "hotelId": -1840639897,
      "reviewId": 158008736,
      "isRelevant": 0
    },
    {
      "hotelId": -1840639897,
      "reviewId": 151685047,
      "isRelevant": 0
    },
    {
      "hotelId": -1840639897,
      "reviewId": 157513701,
      "isRelevant": 0
    },
    {
      "hotelId": -1840639897,
      "reviewId": 156242540,
      "isRelevant": 0
    },
    {
      "hotelId": -117459216,
      "reviewId": 154337208,
      "isRelevant": 0
    },
    {
      "hotelId": -117459216,
      "reviewId": 158055845,
      "isRelevant": 0
    },
    {
      "hotelId": -117459216,
      "reviewId": 157326739,
      "isRelevant": 0
    },
    {
      "hotelId": -117459216,
      "reviewId": 165756312,
      "isRelevant": 0
    },
    {
      "hotelId": -117459216,
      "reviewId": 155510110,
      "isRelevant": 0
    },
    {
      "hotelId": -117459216,
      "reviewId": 151741698,
      "isRelevant": 0
    },
    {
      "hotelId": -117459216,
      "reviewId": 165839795,
      "isRelevant": 0
    },
    {
      "hotelId": -117459216,
      "reviewId": 169554636,
      "isRelevant": 0
    },
    {
      "hotelId": -117459216,
      "reviewId": 157574152,
      "isRelevant": 0
    },
    {
      "hotelId": -117459216,
      "reviewId": 155181272,
      "isRelevant": 0
    },
    {
      "hotelId": -6958113,
      "reviewId": 6089996,
      "isRelevant": 0
    },
    {
      "hotelId": -6958113,
      "reviewId": 6548211,
      "isRelevant": 0
    },
    {
      "hotelId": -6958113,
      "reviewId": 5776004,
      "isRelevant": 0
    },
    {
      "hotelId": -6958113,
      "reviewId": 7332201,
      "isRelevant": 0
    },
    {
      "hotelId": -6958113,
      "reviewId": 7286092,
      "isRelevant": 0
    },
    {
      "hotelId": -6958113,
      "reviewId": 5957733,
      "isRelevant": 0
    },
    {
      "hotelId": -6958113,
      "reviewId": 5789318,
      "isRelevant": 0
    },
    {
      "hotelId": -6958113,
      "reviewId": 5694011,
      "isRelevant": 0
    },
    {
      "hotelId": -6958113,
      "reviewId": 6570659,
      "isRelevant": 0
    },
    {
      "hotelId": -6958113,
      "reviewId": 6168442,
      "isRelevant": 0
    },
    {
      "hotelId": 1395198537,
      "reviewId": 157877731,
      "isRelevant": 0
    },
    {
      "hotelId": 1395198537,
      "reviewId": 157695150,
      "isRelevant": 0
    },
    {
      "hotelId": 1395198537,
      "reviewId": 157028898,
      "isRelevant": 0
    },
    {
      "hotelId": 1395198537,
      "reviewId": 156493781,
      "isRelevant": 0
    },
    {
      "hotelId": 1395198537,
      "reviewId": 153403171,
      "isRelevant": 0
    },
    {
      "hotelId": 1395198537,
      "reviewId": 155467379,
      "isRelevant": 0
    },
    {
      "hotelId": 1395198537,
      "reviewId": 159529109,
      "isRelevant": 0
    },
    {
      "hotelId": 1395198537,
      "reviewId": 154893616,
      "isRelevant": 0
    },
    {
      "hotelId": 1395198537,
      "reviewId": 153469952,
      "isRelevant": 0
    },
    {
      "hotelId": 1395198537,
      "reviewId": 158245073,
      "isRelevant": 0
    },
    {
      "hotelId": 545376374,
      "reviewId": 155905791,
      "isRelevant": 0
    },
    {
      "hotelId": 545376374,
      "reviewId": 161428710,
      "isRelevant": 0
    },
    {
      "hotelId": 545376374,
      "reviewId": 163099615,
      "isRelevant": 0
    },
    {
      "hotelId": 545376374,
      "reviewId": 158688861,
      "isRelevant": 0
    },
    {
      "hotelId": 545376374,
      "reviewId": 152628027,
      "isRelevant": 0
    },
    {
      "hotelId": 545376374,
      "reviewId": 158674709,
      "isRelevant": 0
    },
    {
      "hotelId": 545376374,
      "reviewId": 160719394,
      "isRelevant": 0
    },
    {
      "hotelId": 545376374,
      "reviewId": 151984319,
      "isRelevant": 0
    },
    {
      "hotelId": 545376374,
      "reviewId": 156764145,
      "isRelevant": 0
    },
    {
      "hotelId": 545376374,
      "reviewId": 153189148,
      "isRelevant": 0
    },
    {
      "hotelId": -889638517,
      "reviewId": 116892523,
      "isRelevant": 0
    },
    {
      "hotelId": -889638517,
      "reviewId": 115872694,
      "isRelevant": 0
    },
    {
      "hotelId": -889638517,
      "reviewId": 118122235,
      "isRelevant": 0
    },
    {
      "hotelId": -889638517,
      "reviewId": 110527348,
      "isRelevant": 0
    },
    {
      "hotelId": -889638517,
      "reviewId": 116716738,
      "isRelevant": 0
    },
    {
      "hotelId": -889638517,
      "reviewId": 118813660,
      "isRelevant": 0
    },
    {
      "hotelId": -889638517,
      "reviewId": 114807998,
      "isRelevant": 0
    },
    {
      "hotelId": -889638517,
      "reviewId": 111448032,
      "isRelevant": 0
    },
    {
      "hotelId": 520302854,
      "reviewId": 93405798,
      "isRelevant": 0
    },
    {
      "hotelId": 520302854,
      "reviewId": 91914665,
      "isRelevant": 0
    },
    {
      "hotelId": 520302854,
      "reviewId": 92752097,
      "isRelevant": 0
    },
    {
      "hotelId": 520302854,
      "reviewId": 91973265,
      "isRelevant": 0
    },
    {
      "hotelId": 520302854,
      "reviewId": 90954160,
      "isRelevant": 0
    },
    {
      "hotelId": 520302854,
      "reviewId": 91847712,
      "isRelevant": 0
    },
    {
      "hotelId": 520302854,
      "reviewId": 91040961,
      "isRelevant": 0
    },
    {
      "hotelId": 520302854,
      "reviewId": 93731485,
      "isRelevant": 0
    },
    {
      "hotelId": 520302854,
      "reviewId": 92766201,
      "isRelevant": 0
    },
    {
      "hotelId": 520302854,
      "reviewId": 91996644,
      "isRelevant": 0
    }
  ]
}