{
    "aka": "Le Clos De Mutigny France/Champagne-Ardenne - Marne",
    "description": "An elegant residence where fresh air and tranquillity offer the perfect setting for relaxation. Perfectly located for surrounding vineyards. Our restaurant offers a nice view on the river and fine cuisine, interesting wine and Champagne list",
    "detail_rating": {
        "cleanliness": null,
        "location": null,
        "rooms": null,
        "service": null,
        "sleep": null,
        "value": null
    },
    "location": {
        "city": null,
        "continent": "Europe",
        "country": "France",
        "proposed_city": null,
        "province": null,
        "region": "Champagne-Ardenne"
    },
    "name": "Le Clos de Mutigny",
    "places": {
        "aka": [],
        "hotel_description": [],
        "hotel_name": []
    },
    "review_count": 78,
    "review_count_current": 15,
    "reviews": [
        {
            "date": "September 25, 2009",
            "detail_rating": {
                "business": null,
                "cleanliness": 5.0,
                "desk": null,
                "location": 4.0,
                "pool": null,
                "restaurant": null,
                "rooms": 4.0,
                "service": 4.0,
                "sleep": null,
                "value": 4.0
            },
            "helpfulness": 2,
            "id": 44363589,
            "likes": {
                "disliked": null,
                "liked": null
            },
            "rating": 4.0,
            "stay_parameters": "Stayed July 2009, traveled as a couple",
            "text": "It's worth the detour - although not far away from the motorway. A very pleasant summer stop. We had no trouble with the room, although we weren't on the side near the noisy river. Nice gardens. Excellent dinner on the terrace, and good breakfast.",
            "title": "Worth the detour",
            "user": "salmoneater"
        },
        {
            "date": "September 16, 2009",
            "detail_rating": {
                "business": null,
                "cleanliness": 4.0,
                "desk": null,
                "location": 2.0,
                "pool": null,
                "restaurant": null,
                "rooms": 3.0,
                "service": 4.0,
                "sleep": null,
                "value": 4.0
            },
            "helpfulness": 3,
            "id": 42245534,
            "likes": {
                "disliked": null,
                "liked": null
            },
            "rating": 4.0,
            "stay_parameters": "Stayed September 2009, traveled as a couple",
            "text": "Service:",
            "title": "Very pleasant small hotel with excellent restaurant",
            "user": "MaKSiNG"
        },
        {
            "date": "August 4, 2009",
            "detail_rating": {
                "business": null,
                "cleanliness": 4.0,
                "desk": null,
                "location": 2.0,
                "pool": null,
                "restaurant": null,
                "rooms": 2.0,
                "service": 4.0,
                "sleep": null,
                "value": 5.0
            },
            "helpfulness": null,
            "id": 36698442,
            "likes": {
                "disliked": null,
                "liked": null
            },
            "rating": 3.0,
            "stay_parameters": "Stayed July 2009, traveled as a couple",
            "text": "Very friendly staff. You get the feel of a small, family run hotel.",
            "title": "OK, but that's all",
            "user": "Jilbo"
        },
        {
            "date": "August 1, 2009",
            "detail_rating": {
                "business": null,
                "cleanliness": 5.0,
                "desk": null,
                "location": 5.0,
                "pool": null,
                "restaurant": null,
                "rooms": 4.0,
                "service": 5.0,
                "sleep": null,
                "value": 4.0
            },
            "helpfulness": 1,
            "id": 36404275,
            "likes": {
                "disliked": null,
                "liked": null
            },
            "rating": 5.0,
            "stay_parameters": "Stayed July 2009, traveled as a couple",
            "text": "Room:",
            "title": "Very welcoming, charming location - great food!",
            "user": "SallyHTHQ"
        },
        {
            "date": "June 25, 2009",
            "detail_rating": {
                "business": null,
                "cleanliness": 5.0,
                "desk": null,
                "location": 5.0,
                "pool": null,
                "restaurant": null,
                "rooms": 4.0,
                "service": 5.0,
                "sleep": null,
                "value": 5.0
            },
            "helpfulness": 2,
            "id": 33132273,
            "likes": {
                "disliked": null,
                "liked": null
            },
            "rating": 5.0,
            "stay_parameters": "Stayed June 2009",
            "text": "Room was on the small side but this did not count against it. It was cosy. We also had twin beds but this was the only room left since we booked very late. Room was clean and nice. Not modern but tastefully decorated.",
            "title": "Excellent",
            "user": "vaclovers"
        },
        {
            "date": "June 5, 2009",
            "detail_rating": {
                "business": null,
                "cleanliness": 5.0,
                "desk": null,
                "location": 5.0,
                "pool": null,
                "restaurant": null,
                "rooms": 5.0,
                "service": 5.0,
                "sleep": null,
                "value": 5.0
            },
            "helpfulness": 3,
            "id": 31643318,
            "likes": {
                "disliked": null,
                "liked": null
            },
            "rating": 5.0,
            "stay_parameters": "Stayed May 2009, traveled with friends",
            "text": "We found this to be a very friendly and welcoming hotel, just a short drive south of Reims and therefore convenient for the channel ports if on a motoring holiday. Access is easy, just off the main road (N44), but the village is by-passed, so there's no noise. The hotel is in a large garden with a mill stream flowing through it. Plenty of parking, but be wary of parking under the trees as the birds that roost in them like taking target practice on cars! The owners speak good English and are very welcoming and attentive. The rooms are quite small, but perfectly adequate and the beds are comfortable. Everuthing was spotlessly clean. The resyaurant is also first class with a good selection to choose from. BReakfast is a buffet with a wide selection.",
            "title": "Great overnight stop and restaurant",
            "user": "kevinw1957"
        },
        {
            "date": "June 1, 2009",
            "detail_rating": {
                "business": null,
                "cleanliness": 5.0,
                "desk": null,
                "location": 5.0,
                "pool": null,
                "restaurant": null,
                "rooms": 5.0,
                "service": 5.0,
                "sleep": null,
                "value": 5.0
            },
            "helpfulness": 2,
            "id": 31267827,
            "likes": {
                "disliked": null,
                "liked": null
            },
            "rating": 5.0,
            "stay_parameters": "Stayed May 2009, traveled with family",
            "text": "We had a stop over here on the way back to Calais, I wish we could have stayed longer! It is about 15mins off motorway, wonderful location right by the river. Lovely welcoming atmosphere, friendly staff, great evening meal.",
            "title": "A true gem, beautiful location, friendly staff, great value",
            "user": "whizzylala"
        },
        {
            "date": "January 20, 2009",
            "detail_rating": {
                "business": null,
                "cleanliness": 5.0,
                "desk": null,
                "front_desk": 4.0,
                "location": 3.0,
                "pool": null,
                "restaurant": null,
                "rooms": 4.0,
                "service": 5.0,
                "sleep": null,
                "value": 4.0
            },
            "helpfulness": 4,
            "id": 23725433,
            "likes": {
                "disliked": "\u2014 room was a bit dark",
                "liked": "\u2014 Service of the staff"
            },
            "rating": 4.0,
            "stay_parameters": "Stayed October 2008, traveled with family",
            "text": "The grounds are lovely with a great play area for small children.",
            "title": "New owners-looks promising",
            "user": "goudhurstgirl"
        },
        {
            "date": "August 23, 2008",
            "detail_rating": {
                "business": 2.0,
                "cleanliness": 1.0,
                "desk": null,
                "front_desk": 2.0,
                "location": 1.0,
                "pool": null,
                "restaurant": null,
                "rooms": 1.0,
                "service": 2.0,
                "sleep": null,
                "value": 1.0
            },
            "helpfulness": 1,
            "id": 19276722,
            "likes": {
                "disliked": "\u2014 Damp and smelly room, disfunctioning shower drainage and very loud music on the terrace",
                "liked": "\u2014 Gated car park"
            },
            "rating": 1.0,
            "stay_parameters": "Stayed June 2008, traveled as a couple",
            "text": "Our room was very practical, comfortable and with a small bedroom off it for the childrens bunk beds aswell as the ensuite.",
            "title": "Stay away from their 'pavilion'",
            "user": "Ausmary"
        },
        {
            "date": "May 4, 2008",
            "detail_rating": {
                "business": null,
                "cleanliness": 5.0,
                "desk": null,
                "front_desk": 4.0,
                "location": 4.0,
                "pool": null,
                "restaurant": null,
                "rooms": 4.0,
                "service": 5.0,
                "sleep": null,
                "value": 5.0
            },
            "helpfulness": 2,
            "id": 15628018,
            "likes": {
                "disliked": null,
                "liked": "\u2014 Very friendly owners"
            },
            "rating": 5.0,
            "stay_parameters": "Stayed April 2008, traveled with family",
            "text": "We will definitley return to this hotel and would highly recommend it to anyone.",
            "title": "Friendly quiet hotel in rural France",
            "user": "looz"
        },
        {
            "date": "July 17, 2007",
            "detail_rating": {
                "business": null,
                "cleanliness": null,
                "desk": null,
                "location": null,
                "pool": null,
                "restaurant": null,
                "rooms": null,
                "service": null,
                "sleep": null,
                "value": null
            },
            "helpfulness": 1,
            "id": 8133834,
            "likes": {
                "disliked": null,
                "liked": null
            },
            "rating": 1.0,
            "stay_parameters": null,
            "text": "We arrived having driven all day from Pisa. Despite an email confirmation of our booking the manager said he had sold our room to someone else and only had room 13 in the annexe available! It was cold and damp (in July!) and in a room for two, there was one towel. We left at 8am the following day feeling glad to put it behind us. What was most frustrating was that the manager really couldn't be bothered - all enquiries met with one word answers. Have stayed in much better and much cheaper hotels in France.",
            "title": "Give it a miss",
            "user": "London_UKDavid"
        },
        {
            "date": "October 19, 2006",
            "detail_rating": {
                "business": null,
                "cleanliness": 3.0,
                "desk": null,
                "front_desk": 1.0,
                "location": 1.0,
                "pool": null,
                "restaurant": null,
                "rooms": 3.0,
                "service": 1.0,
                "sleep": null,
                "value": 1.0
            },
            "helpfulness": 2,
            "id": 5970806,
            "likes": {
                "disliked": "\u2014 everything else",
                "liked": "\u2014 The garden"
            },
            "rating": 2.0,
            "stay_parameters": "Stayed September 2006",
            "text": "I shall give them the benefit of the doubt. It was Sunday, and not many hotels in the area will accept you on a Sunday. Nevertheless, since they belong to the Qualit\u00e9 Tourisme and Logis de France organisations, you expect that they would at least aspire to provide some semblance of a welcome. In the event, neither this, nor any solicited information about places to see, was forthcoming.",
            "title": "Avoid on Sundays",
            "user": "sqvrti"
        },
        {
            "date": "August 31, 2006",
            "detail_rating": {
                "business": 2.0,
                "cleanliness": 2.0,
                "desk": null,
                "front_desk": 1.0,
                "location": 2.0,
                "pool": null,
                "restaurant": null,
                "rooms": 2.0,
                "service": 1.0,
                "sleep": null,
                "value": 1.0
            },
            "helpfulness": 1,
            "id": 5730518,
            "likes": {
                "disliked": "\u2014 The appalling rudeness of owner/manager",
                "liked": "\u2014 The ducks in the garden"
            },
            "rating": 1.0,
            "stay_parameters": "Stayed August 2006, traveled with family",
            "text": "The room was clean and comfortable but quite small. The en suite bathroom was fine. Breakfast was below average.",
            "title": "Appalling service",
            "user": "EllenBarkin"
        },
        {
            "date": "May 16, 2005",
            "detail_rating": {
                "business": null,
                "cleanliness": null,
                "desk": null,
                "location": null,
                "pool": null,
                "restaurant": null,
                "rooms": null,
                "service": null,
                "sleep": null,
                "value": null
            },
            "helpfulness": 6,
            "id": 3477443,
            "likes": {
                "disliked": null,
                "liked": null
            },
            "rating": 1.0,
            "stay_parameters": null,
            "text": "The hotel itself, which is quite large, looked very interesting: the gardens were the only commendable aspect of this visit. The village has nothing, and the closest big town, Chalons-en-Champagne is not too interesting either.",
            "title": "Avoid!!!",
            "user": "A TripAdvisor user"
        },
        {
            "date": "October 12, 2003",
            "detail_rating": {
                "business": null,
                "cleanliness": null,
                "desk": null,
                "location": null,
                "pool": null,
                "restaurant": null,
                "rooms": null,
                "service": null,
                "sleep": null,
                "value": null
            },
            "helpfulness": 8,
            "id": 1385543,
            "likes": {
                "disliked": null,
                "liked": null
            },
            "rating": 5.0,
            "stay_parameters": null,
            "text": "We arrived a party of 6 including my father aged 66 and youngest child aged 4 on Sunday 26th August having travelled from Mulheim in Germany all day by car. We were all extemely tired and looking forward to some country hospitality. How wrong we were. The host is quite the rudest man I have ever had the misfortune to meet. The kitchens were closed on Sunday and despite our exhaustion he was unprepared to even offer a sandwich or coffee by way of room service. He made no attempt to show us to our rooms or help with bags and was surly and curt on proffering our keys. The hotel itself may be charming to look at but is located in a quiet backwater offering a goat farm or pizzeria a drive away. Finding the hotel in the first place had us lost many times and it should be made clear that it is not in the town of Chalons en champagne as we had expected. A huge and bitter disappointment. How does it keep its two stars?",
            "title": "Great Exerience",
            "user": "A TripAdvisor user"
        }
    ],
    "slim_ranking": 0.5,
    "stars": 3,
    "tripadvisor": {
        "VISITED": false,
        "country_name": null,
        "locality": null,
        "pic_link": null,
        "street_address": null
    },
    "user_rating": 4.0,
    "variance": {
        "average": 6,
        "excellent": 27,
        "poor": 5,
        "terrible": 4,
        "very good": 36
    }
}