{
    "aka": "Chelsea Hotel New York City",
    "description": "The Hotel Chelsea is a world renowned residence for artists, musicians, writers, philosophers, and characters of the most singular and eccentric stripe which the imagination might conjure.",
    "detail_rating": {
        "cleanliness": null,
        "location": null,
        "rooms": null,
        "service": null,
        "sleep": null,
        "value": null
    },
    "location": {
        "city": "New York City",
        "continent": null,
        "country": "United States",
        "proposed_city": "Chelsea",
        "province": null,
        "region": null
    },
    "name": "Chelsea Hotel",
    "places": {
        "aka": [
            "Chelsea",
            "York"
        ],
        "hotel_description": [
            "Chelsea"
        ],
        "hotel_name": [
            "Chelsea"
        ]
    },
    "review_count": 298,
    "review_count_current": 20,
    "reviews": [
        {
            "date": "April 13, 2009",
            "detail_rating": {
                "business": null,
                "cleanliness": 1.0,
                "desk": null,
                "location": 4.0,
                "pool": null,
                "restaurant": null,
                "rooms": 3.0,
                "service": 1.0,
                "sleep": null,
                "value": 1.0
            },
            "helpfulness": 1,
            "id": 27902877,
            "likes": {
                "disliked": null,
                "liked": null
            },
            "rating": 2.0,
            "stay_parameters": "Stayed March 2009, traveled with friends",
            "text": "The only reason why I am giving this a two is because the location hotel is nice, I love the artwork displayed in the hallway, it's historic value and I believe that some of the rooms are beautiful.",
            "title": "I guess you could say that my room had historic trash",
            "user": "synthdoll"
        },
        {
            "date": "March 9, 2009",
            "detail_rating": {
                "business": null,
                "cleanliness": 4.0,
                "desk": null,
                "location": 5.0,
                "pool": null,
                "restaurant": null,
                "rooms": 3.0,
                "service": 3.0,
                "sleep": null,
                "value": 5.0
            },
            "helpfulness": 2,
            "id": 25896762,
            "likes": {
                "disliked": null,
                "liked": null
            },
            "rating": 5.0,
            "stay_parameters": "Stayed March 2009, traveled as a couple",
            "text": "However, my room, 722 needed help. The room itself is beautifully decorated, it is a room with pink furnishings and a black -white kitchen. Although it really needs an update since there was paint was peeling, tiles on the floor were missing, the wood from the floor was missing and the material in the room looked seriously worn. I tried to let that get to me, but as I unpacked my bags and explored further, I noticed how many issues my room had.",
            "title": "Don't let the haters scare you...",
            "user": "SherpaDan"
        },
        {
            "date": "March 2, 2009",
            "detail_rating": {
                "business": null,
                "cleanliness": 3.0,
                "desk": null,
                "location": 3.0,
                "pool": null,
                "restaurant": null,
                "rooms": 3.0,
                "service": 2.0,
                "sleep": null,
                "value": 3.0
            },
            "helpfulness": null,
            "id": 25476294,
            "likes": {
                "disliked": null,
                "liked": null
            },
            "rating": 3.0,
            "stay_parameters": "Stayed June 2008, traveled as a couple",
            "text": "Along with those issues, here are the other issues I didn't expect from the hotel:",
            "title": "There's something about the Chelsea...",
            "user": "Inkblotspot"
        },
        {
            "date": "March 2, 2009",
            "detail_rating": {
                "business": null,
                "cleanliness": 4.0,
                "desk": null,
                "location": 4.0,
                "pool": null,
                "restaurant": null,
                "rooms": 4.0,
                "service": 4.0,
                "sleep": null,
                "value": 3.0
            },
            "helpfulness": 1,
            "id": 25469285,
            "likes": {
                "disliked": null,
                "liked": null
            },
            "rating": 5.0,
            "stay_parameters": "Stayed February 2009, traveled as a couple",
            "text": "Door would not lock or shut",
            "title": "Greatest hotel in the World",
            "user": "spanishjohn"
        },
        {
            "date": "January 11, 2009",
            "detail_rating": {
                "business": 3.0,
                "cleanliness": 3.0,
                "desk": null,
                "front_desk": 5.0,
                "location": 5.0,
                "pool": null,
                "restaurant": null,
                "rooms": 3.0,
                "service": 4.0,
                "sleep": null,
                "value": 4.0
            },
            "helpfulness": 1,
            "id": 23460236,
            "likes": {
                "disliked": "\u2014 nothing",
                "liked": "\u2014 The general atmosphere and the lobby"
            },
            "rating": 5.0,
            "stay_parameters": "Stayed December 2007",
            "text": "Noticed crumpled cookies from the previous dwellers",
            "title": "Most fun hotel ever!",
            "user": "KarenBee"
        },
        {
            "date": "January 2, 2009",
            "detail_rating": {
                "business": 4.0,
                "cleanliness": 5.0,
                "desk": null,
                "front_desk": 4.0,
                "location": 5.0,
                "pool": null,
                "restaurant": null,
                "rooms": 5.0,
                "service": 4.0,
                "sleep": null,
                "value": 4.0
            },
            "helpfulness": 2,
            "id": 23199442,
            "likes": {
                "disliked": "\u2014 absolutely nothing",
                "liked": "\u2014 the funky ambiance, the amazing room, the area"
            },
            "rating": 5.0,
            "stay_parameters": "Stayed December 2008, traveled as a couple",
            "text": "We read the reviews, but still decided it was 'for us' - largely because my partner's grandmother lived at the Chelsea in the 60s... and we decided to pay top dollar (ie, nearly $300 per night) for a good room. And very very good room it was too. Room 715, if someone wants a recommendation! Enormous for most cities, let alone NYC. Kitchenette with fridge / hob / microwave and cupboard space, huge balcony with french windows opening onto it, hardwood floors, walk-in closet, flat-screen tv, vast bathroom with fresh new tiling and mirrored cabinet, and one of the most comfortable hotel beds I've slept on.",
            "title": "You get what you pay for - and it can be marvellous!",
            "user": "EveManchester"
        },
        {
            "date": "November 27, 2008",
            "detail_rating": {
                "business": null,
                "cleanliness": null,
                "desk": null,
                "location": null,
                "pool": null,
                "restaurant": null,
                "rooms": null,
                "service": null,
                "sleep": null,
                "value": null
            },
            "helpfulness": 1,
            "id": 22245953,
            "likes": {
                "disliked": null,
                "liked": null
            },
            "rating": 5.0,
            "stay_parameters": null,
            "text": "When we checked in, the friendly desk guy said it was one of their most recently refurbed rooms - and it showed. So, ask for a refurbed room, and be prepared to pay for it is my advice. Sure, the rooms for $99 look pretty crummy \u2013 but $99 in NYC? In Chelsea? What on earth do you expect?",
            "title": "what an experience",
            "user": "weenikkib"
        },
        {
            "date": "November 26, 2008",
            "detail_rating": {
                "business": null,
                "cleanliness": 4.0,
                "desk": null,
                "front_desk": 5.0,
                "location": 4.0,
                "pool": null,
                "restaurant": null,
                "rooms": 5.0,
                "service": 5.0,
                "sleep": null,
                "value": 4.0
            },
            "helpfulness": 3,
            "id": 22205139,
            "likes": {
                "disliked": "\u2014 Nothing",
                "liked": "\u2014 Atmosphere, staff, room, artwork"
            },
            "rating": 5.0,
            "stay_parameters": "Stayed November 2008, traveled as a couple",
            "text": "As for the desk staff, I treated them with respect and found most of them responded to it well (some were tougher nuts to crack, admittedly). The maids, ditto. I smiled, and they smiled back. Yes, they didn\u2019t replace our shampoo & soap, so I asked. Nicely. And got an armful (Yay for souvenirs!). Just as others have said, they didn\u2019t change the bedsheets in 5 days (probably would have if I\u2019d asked but we aren\u2019t that grubby\u2026) BUT we did get more clean fluffy white towels than you can shake a stick at.",
            "title": "Glorious",
            "user": "Abesaywhat"
        },
        {
            "date": "November 25, 2008",
            "detail_rating": {
                "business": 1.0,
                "cleanliness": 1.0,
                "desk": null,
                "front_desk": 1.0,
                "location": 1.0,
                "pool": null,
                "restaurant": null,
                "rooms": 1.0,
                "service": 1.0,
                "sleep": null,
                "value": 1.0
            },
            "helpfulness": 1,
            "id": 22159645,
            "likes": {
                "disliked": "\u2014 everything",
                "liked": "\u2014 nothing"
            },
            "rating": 1.0,
            "stay_parameters": "Stayed September 2008, traveled with friends",
            "text": "Our room was at the front of the hotel, and duh, surprise, it was noisy. For those who moan about NYC being noisy \u2013 go stay in a forest. It\u2019s a city, for crying out loud! (I travel everywhere with earplugs). It was worth the noise to stand on the lovely balcony every night, looking up West 23rd Street at the flickering lights and taxis whizzing past.",
            "title": "Rude Staff Noisy Hotel Horrible Experience !!",
            "user": "area51alien"
        },
        {
            "date": "November 23, 2008",
            "detail_rating": {
                "business": null,
                "cleanliness": 3.0,
                "desk": null,
                "front_desk": 4.0,
                "location": 5.0,
                "pool": null,
                "restaurant": null,
                "rooms": 3.0,
                "service": 4.0,
                "sleep": null,
                "value": 3.0
            },
            "helpfulness": 3,
            "id": 22118350,
            "likes": {
                "disliked": "\u2014 price",
                "liked": "\u2014 the ambience, location"
            },
            "rating": 3.0,
            "stay_parameters": "Stayed November 2008, traveled with family",
            "text": "And what an amazing ambience. The art, the oddballs, the straggly residents, the kind old ladies who spoke to me in the lobby, and oh, that astounding staircase!",
            "title": "Hotel Chelsea: an old palazzo, not a Holiday Inn",
            "user": "kim45"
        },
        {
            "date": "May 20, 2009",
            "detail_rating": {
                "business": null,
                "cleanliness": 3.0,
                "desk": null,
                "location": 4.0,
                "pool": null,
                "restaurant": null,
                "rooms": 3.0,
                "service": 4.0,
                "sleep": null,
                "value": 3.0
            },
            "helpfulness": 1,
            "id": 30363047,
            "likes": {
                "disliked": null,
                "liked": null
            },
            "rating": 5.0,
            "stay_parameters": "Stayed April 2009, traveled as a couple",
            "text": "We loved our stay at the Chelsea. It was liking staying in a gallery for a night. We wondered around enjoying the art covering walls and the general ambienance of the hotel. A piece of New York's cultural histrory.",
            "title": "Don't miss out on staying here",
            "user": "jellcup"
        },
        {
            "date": "April 24, 2009",
            "detail_rating": {
                "business": null,
                "cleanliness": 5.0,
                "desk": null,
                "location": 5.0,
                "pool": null,
                "restaurant": null,
                "rooms": 4.0,
                "service": 4.0,
                "sleep": null,
                "value": 5.0
            },
            "helpfulness": null,
            "id": 28687214,
            "likes": {
                "disliked": null,
                "liked": null
            },
            "rating": 5.0,
            "stay_parameters": "Stayed May 2008, traveled with family",
            "text": "The room we had included a kitchenette and bathroom, and although honestly the furniture and decor looked old and cheap, it all suited feel of the hotel and was confortable enough. We loved our windows opening on to a balconette with a great view of the hotel's classic neon sign.",
            "title": "Staying at the Chealsea really made our trip",
            "user": "zobot"
        },
        {
            "date": "April 15, 2009",
            "detail_rating": {
                "business": null,
                "cleanliness": 3.0,
                "desk": null,
                "location": 5.0,
                "pool": null,
                "restaurant": null,
                "rooms": 5.0,
                "service": 5.0,
                "sleep": null,
                "value": 5.0
            },
            "helpfulness": 2,
            "id": 28118230,
            "likes": {
                "disliked": null,
                "liked": null
            },
            "rating": 5.0,
            "stay_parameters": "Stayed April 2009, traveled solo",
            "text": "The bakery on the corner was fantastic and the thai further down is also highly recommened.",
            "title": "Chelsea--Not For Everyone, But It Doesn't Claim to Be",
            "user": "JzeroT1937"
        },
        {
            "date": "April 15, 2009",
            "detail_rating": {
                "business": null,
                "cleanliness": 3.0,
                "desk": null,
                "location": 5.0,
                "pool": null,
                "restaurant": null,
                "rooms": 4.0,
                "service": 4.0,
                "sleep": null,
                "value": 5.0
            },
            "helpfulness": null,
            "id": 28108380,
            "likes": {
                "disliked": null,
                "liked": null
            },
            "rating": 4.0,
            "stay_parameters": "Stayed March 2009, traveled as a couple",
            "text": "It's set in a great area. We were in New York visiting my brother who lives in Williamsburg and going to some friends' art shows and generally hanging out. We were right near all the art galleries and found some great little pubs and restaurants nearby. But it was the hotel that mad the trip. Great, characterful staff, amazing lobby, very clean and grand (if a bit rough around the edges in a charming way) room with lovey big windows and balcony.",
            "title": "don't change it- great atmosphere.",
            "user": "bernadetteCo_donegal"
        },
        {
            "date": "April 14, 2009",
            "detail_rating": {
                "business": null,
                "cleanliness": null,
                "desk": null,
                "location": null,
                "pool": null,
                "restaurant": null,
                "rooms": null,
                "service": null,
                "sleep": null,
                "value": null
            },
            "helpfulness": 1,
            "id": 28044075,
            "likes": {
                "disliked": null,
                "liked": null
            },
            "rating": 2.0,
            "stay_parameters": null,
            "text": "A highlight of our stay has to be the mature lady in a silver suit in the lobby with her 4 matching dogs.",
            "title": "Unusual and Strange",
            "user": "wanderingsiren"
        },
        {
            "date": "June 30, 2009",
            "detail_rating": {
                "business": null,
                "cleanliness": 5.0,
                "desk": null,
                "location": 5.0,
                "pool": null,
                "restaurant": null,
                "rooms": 5.0,
                "service": 5.0,
                "sleep": null,
                "value": 5.0
            },
            "helpfulness": null,
            "id": 33616357,
            "likes": {
                "disliked": null,
                "liked": null
            },
            "rating": 5.0,
            "stay_parameters": "Stayed June 2009, traveled as a couple",
            "text": "Much has been written about the Chelsea Hotel but nothing compares with the actual experience. There is something magic about it. The art and history are very rich and the building is beautiful.",
            "title": "A Cultural Treasure that MUST be experienced Please don't change it.",
            "user": "travelerseattle"
        },
        {
            "date": "June 25, 2009",
            "detail_rating": {
                "business": null,
                "cleanliness": null,
                "desk": null,
                "location": null,
                "pool": null,
                "restaurant": null,
                "rooms": null,
                "service": null,
                "sleep": null,
                "value": null
            },
            "helpfulness": null,
            "id": 33187117,
            "likes": {
                "disliked": null,
                "liked": null
            },
            "rating": 4.0,
            "stay_parameters": null,
            "text": "I have visited the hotel lobby before and finally got to stay. We can't quit talking about our experiences there and want to return soon.",
            "title": "Low-Key Getaway",
            "user": "aroundtworld"
        },
        {
            "date": "June 25, 2009",
            "detail_rating": {
                "business": null,
                "cleanliness": 5.0,
                "desk": null,
                "location": 4.0,
                "pool": null,
                "restaurant": null,
                "rooms": 4.0,
                "service": 5.0,
                "sleep": null,
                "value": 5.0
            },
            "helpfulness": 1,
            "id": 33130575,
            "likes": {
                "disliked": null,
                "liked": null
            },
            "rating": 4.0,
            "stay_parameters": "Stayed May 2009, traveled with friends",
            "text": "We want to especially thank Jerry and the rest of the staff. They made our stay memorable and interesting.",
            "title": "Unique - a landmark worth the hype!",
            "user": "paatelainen"
        },
        {
            "date": "June 13, 2009",
            "detail_rating": {
                "business": null,
                "cleanliness": 1.0,
                "desk": null,
                "location": 3.0,
                "pool": null,
                "restaurant": null,
                "rooms": 1.0,
                "service": 1.0,
                "sleep": null,
                "value": 1.0
            },
            "helpfulness": 1,
            "id": 32258077,
            "likes": {
                "disliked": null,
                "liked": null
            },
            "rating": 1.0,
            "stay_parameters": "Stayed March 2009, traveled on business",
            "text": "The Chelsea Hotel represents those who have gone before and, hopefully, those still to follow. We live in Seattle and there was an article in our local paper about the changes at the Chelsea. It is our hope that the tradition of the Hotel does not change.",
            "title": "Unbelievable - Stayed one night and this was one night to many.",
            "user": "ArneOnAJourney"
        },
        {
            "date": "June 9, 2009",
            "detail_rating": {
                "business": null,
                "cleanliness": null,
                "desk": null,
                "location": null,
                "pool": null,
                "restaurant": null,
                "rooms": null,
                "service": null,
                "sleep": null,
                "value": null
            },
            "helpfulness": 2,
            "id": 31975305,
            "likes": {
                "disliked": null,
                "liked": null
            },
            "rating": 5.0,
            "stay_parameters": null,
            "text": "Also don't miss the El Quixote next door. We were fortunate to meet a long term artist tenant of the Chelsea there.",
            "title": "Unique!",
            "user": "TwoMusicians"
        }
    ],
    "slim_ranking": 0.79683972912,
    "stars": null,
    "tripadvisor": {
        "VISITED": false,
        "country_name": null,
        "locality": null,
        "pic_link": null,
        "street_address": null
    },
    "user_rating": 3.0,
    "variance": {
        "average": 39,
        "excellent": 74,
        "poor": 30,
        "terrible": 72,
        "very good": 83
    }
}