{
    "aka": "Suriwongse Hotel Chiang Mai",
    "description": "Suriwongse Hotel Chiang Mai is perfectly located on the corner of Loikoh and Changklan Road, right at the heart of Chiang Mai\u2019s landmark the \u201cNight Bazaar\u201d. The hotel is a short distance from Chiang Mai International Airport, the railway and bus stations.Conveniently located in the heart of the ancient city, The Suriwongse Hotel Chiang Mai is perfect for leisure and business travellers alike. The hotel is close to the city\u2019s main business district and many of the major attractions are within walking distance. And when the evening comes, you are just a few steps away from the famous Night Bazaar, where you can enjoy a lively blend of shopping and entertainment. The hotel is only a ten-minute drive from Chiang Mai\u2019s International Airport, and within easy reach of the city\u2019s outskirts if you want to get away for a round of golf or to enjoy a day trip in the hills.A few steps from the famous Night Bazaar, the hotel is perfectly located for exploring Chiang Mai\u2019s many cultural sights and attractions. The Suriwongse Hotel Chiang Mai caters to cultural adventure seekers embraced by the warmth of local treat combined with quality service. Its contemporary interior blends in perfect harmony with the traditional Thai Lanna style architecture, creating a warm ambience. In a buzzing and vibrant atmosphere, we present exciting dining options with inter-active show kitchens.The traditional influences of the north\u2019s ancient Lanna Kingdom are incorporated into the decor of each of our rooms and suites. Suriwongse Hotel Chiang Mai\u2019s rooms and suites, enjoy either restful views of the city center or look out over the majestic misty mountain of Doi Suthep. While inside, a range of modern amenities create a haven of comfort where weary travellers can rest and recharge.",
    "detail_rating": {
        "cleanliness": null,
        "location": null,
        "rooms": null,
        "service": null,
        "sleep": null,
        "value": null
    },
    "location": {
        "city": "Chiang Mai",
        "continent": "Asia",
        "country": "Thailand",
        "proposed_city": null,
        "province": null,
        "region": null
    },
    "name": "Suriwongse Hotel",
    "places": {
        "aka": [],
        "hotel_description": [],
        "hotel_name": []
    },
    "review_count": 391,
    "review_count_current": 16,
    "reviews": [
        {
            "date": "December 20, 2010",
            "detail_rating": {
                "business": null,
                "cleanliness": 1.0,
                "desk": null,
                "location": 3.0,
                "pool": null,
                "restaurant": null,
                "rooms": 1.0,
                "service": 2.0,
                "sleep": 1.0,
                "value": 1.0
            },
            "helpfulness": null,
            "id": 90346408,
            "likes": {
                "disliked": null,
                "liked": null
            },
            "rating": 1.0,
            "stay_parameters": "Stayed December 2010, traveled with family",
            "text": "Hotel rooms reek of stale smell, the toilet flush not effective at all, you got to flush it several times. All sorts of noise I guess must be pump working as it appears everytime you uses the tap. The carpet is terribly stained and they don't even provide house slippers! The room that we were given had a curtain that somewhat didn't reaches the floor and you get the glare from the outside which is a busy street. We ask for a double and guess what a double means two single bed pushed together! I now moved to the cafe. The seats are all badly stained. Breakfast is passable. The choice is not too bad just that they are either lukewarm or cold saved for the hot soya milk which is good. The reception service is alright. Overall I strongly advise to stay clear of this hotel.",
            "title": "Avoid at all cost",
            "user": "JinCher"
        },
        {
            "date": "December 18, 2010",
            "detail_rating": {
                "business": null,
                "cleanliness": 2.0,
                "desk": null,
                "location": 5.0,
                "pool": null,
                "restaurant": null,
                "rooms": 2.0,
                "service": 2.0,
                "sleep": 3.0,
                "value": 3.0
            },
            "helpfulness": null,
            "id": 90139363,
            "likes": {
                "disliked": null,
                "liked": null
            },
            "rating": 2.0,
            "stay_parameters": "Stayed November 2010, traveled as a couple",
            "text": "Upon arrival, reception was welcoming until we enquired if an upgrade was possible. We were upgraded, however, in the OLD wing. We stayed in the \"suite\" which was in poor condition. It was on the topmost floor, we had to take the stairs since the elevator didint go all the way to the top. The bathroom lighting was very dim, the TV remote was broken, We stayed for 3 hours until we saw a lizard. We contacted reception and requested for the room we reserved originally. The receptionist said there were no rooms available, we kept asking until we were shown to the new wing.",
            "title": "Too many negatives during our long stay",
            "user": "JessG08"
        },
        {
            "date": "October 24, 2010",
            "detail_rating": {
                "business": null,
                "cleanliness": 4.0,
                "desk": null,
                "location": 5.0,
                "pool": null,
                "restaurant": null,
                "rooms": 4.0,
                "service": 5.0,
                "sleep": 4.0,
                "value": 5.0
            },
            "helpfulness": 2,
            "id": 84600877,
            "likes": {
                "disliked": null,
                "liked": null
            },
            "rating": 4.0,
            "stay_parameters": "Stayed October 2010, traveled with family",
            "text": "We were aware of the new wing but thought since we were upgraded in the old wing that maybe the new wing was still under renovation. What we didint realize is that we had reserved a room in the new orchid wing. We were given a room with two seperate beds. The new room was modern and clean unlike the old one.",
            "title": "Enjoyable stay",
            "user": "winnieleong"
        },
        {
            "date": "September 7, 2010",
            "detail_rating": {
                "business": null,
                "cleanliness": 4.0,
                "desk": null,
                "location": 5.0,
                "pool": null,
                "restaurant": null,
                "rooms": 3.0,
                "service": 2.0,
                "sleep": 3.0,
                "value": 3.0
            },
            "helpfulness": null,
            "id": 78649055,
            "likes": {
                "disliked": null,
                "liked": null
            },
            "rating": 2.0,
            "stay_parameters": "Stayed September 2010, traveled with friends",
            "text": "Reception should inform guests that the pool is under construction. Also, we were provided with 2 complimentary bottles of water on the 1st night,we consumed 1, The next day, we were provided with just 1, and the third with none since we threw the empty bottles in the trashbin. Strange.....we just purchased our own water.",
            "title": "Pretty grim...",
            "user": "googlejoe"
        },
        {
            "date": "April 17, 2010",
            "detail_rating": {
                "business": null,
                "cleanliness": 3.0,
                "desk": null,
                "location": 4.0,
                "pool": null,
                "restaurant": null,
                "rooms": 3.0,
                "service": 3.0,
                "sleep": 3.0,
                "value": 4.0
            },
            "helpfulness": 2,
            "id": 61734114,
            "likes": {
                "disliked": null,
                "liked": null
            },
            "rating": 3.0,
            "stay_parameters": "Stayed July 2009, traveled with friends",
            "text": "The bathroom sinks,floors and doors were not clean and some appliances did not work",
            "title": "Great location",
            "user": "Traveller11Malaysia"
        },
        {
            "date": "April 27, 2011",
            "detail_rating": {
                "business": null,
                "cleanliness": 4.0,
                "desk": null,
                "location": 4.0,
                "pool": null,
                "restaurant": null,
                "rooms": 5.0,
                "service": 3.0,
                "sleep": 4.0,
                "value": 5.0
            },
            "helpfulness": 2,
            "id": 105735503,
            "likes": {
                "disliked": null,
                "liked": null
            },
            "rating": 4.0,
            "stay_parameters": "Stayed April 2011, traveled as a couple",
            "text": "We stayed in this hotel for 5 nights in April,We booked this hotel for location and the location was fantastic..",
            "title": "Great location and fantastic rooms",
            "user": "JOANNE028"
        },
        {
            "date": "April 21, 2011",
            "detail_rating": {
                "business": null,
                "cleanliness": 5.0,
                "desk": null,
                "location": 5.0,
                "pool": null,
                "restaurant": null,
                "rooms": 5.0,
                "service": 5.0,
                "sleep": 5.0,
                "value": 4.0
            },
            "helpfulness": 1,
            "id": 104900718,
            "likes": {
                "disliked": null,
                "liked": null
            },
            "rating": 5.0,
            "stay_parameters": "Stayed April 2011, traveled with family",
            "text": "WE were picked up from the hotel with the private taxi service at 180bhat per person and the driver was at Chiang mai int airport with my name on a board(great start) a fantastic air con bus for 5 adults and 5 big Suitcases.",
            "title": "exelent, choice location, very very helpful staff,room clean good water ect",
            "user": "wayneleo"
        },
        {
            "date": "March 27, 2011",
            "detail_rating": {
                "business": null,
                "cleanliness": 5.0,
                "desk": null,
                "location": 5.0,
                "pool": null,
                "restaurant": null,
                "rooms": 5.0,
                "service": 5.0,
                "sleep": 5.0,
                "value": 5.0
            },
            "helpfulness": 3,
            "id": 101716729,
            "likes": {
                "disliked": null,
                "liked": null
            },
            "rating": 4.0,
            "stay_parameters": "Stayed March 2011, traveled with family",
            "text": "We were checked in at the new recepition of the hotel and greeted with a fantastic Thai smile...We were then shown to our two rooms Orchid deluxe rooms in the new wing on level 7..Fantastic upgraded rooms with amazing space with a ultra large double bed and massive three seater sofa and two chairs and table..The bathroom had a sunken bath and its own private shower with the other bits and bobs..The breakfast was ok but you could fill your self up for the day ahead..",
            "title": "Large rooms, great for families - great location",
            "user": "Kimmy80"
        },
        {
            "date": "January 21, 2011",
            "detail_rating": {
                "business": null,
                "cleanliness": 3.0,
                "desk": null,
                "location": 5.0,
                "pool": null,
                "restaurant": null,
                "rooms": 2.0,
                "service": 3.0,
                "sleep": 2.0,
                "value": 4.0
            },
            "helpfulness": 2,
            "id": 93951799,
            "likes": {
                "disliked": null,
                "liked": null
            },
            "rating": 3.0,
            "stay_parameters": "Stayed January 2011, traveled with family",
            "text": "The swimming pool was closed at the hotel but they give us a ticket to use at the ECO LODGE fantastic swimming pool with free transfers if not a tuk tuk was 100baht so not bad at all.",
            "title": "Lots of negative points but nice location and budget.",
            "user": "yukiku"
        },
        {
            "date": "January 20, 2011",
            "detail_rating": {
                "business": null,
                "cleanliness": 4.0,
                "desk": null,
                "location": 5.0,
                "pool": null,
                "restaurant": null,
                "rooms": 5.0,
                "service": 4.0,
                "sleep": 4.0,
                "value": 4.0
            },
            "helpfulness": 2,
            "id": 93823718,
            "likes": {
                "disliked": null,
                "liked": null
            },
            "rating": 5.0,
            "stay_parameters": "Stayed January 2011, traveled on business",
            "text": "The travel agent on site was great with the trips and we booked the flying with the gibbions ...Now that was fantastic.",
            "title": "the heart of the chiang mai city Unforgettable",
            "user": "missy_nancy2011"
        },
        {
            "date": "February 23, 2010",
            "detail_rating": {
                "business": null,
                "cleanliness": 1.0,
                "desk": null,
                "location": 5.0,
                "pool": null,
                "restaurant": null,
                "rooms": 4.0,
                "service": 2.0,
                "sleep": 3.0,
                "value": 3.0
            },
            "helpfulness": 1,
            "id": 56940992,
            "likes": {
                "disliked": null,
                "liked": null
            },
            "rating": 1.0,
            "stay_parameters": "Stayed January 2010, traveled as a couple",
            "text": "We spent one week at the Suriwongse hotel in January. We stayed there several times previously, the last time being four years ago. I thought then the hotel was starting to look shabby but without checking further, assumed there had been renovatiions. WAS I WRONG. The upholstered furniture that bothered us the most were the dining room chairs - literally covered with stains. It was so bad that although the breakfast buffet was varied and very good, we ate very little thinking of the condition of the kitchen.",
            "title": "Upholstered furniture covered with stains",
            "user": "MimgPao"
        },
        {
            "date": "October 30, 2011",
            "detail_rating": {
                "business": null,
                "cleanliness": 4.0,
                "desk": null,
                "location": 5.0,
                "pool": null,
                "restaurant": null,
                "rooms": 5.0,
                "service": 5.0,
                "sleep": 3.0,
                "value": 5.0
            },
            "helpfulness": null,
            "id": 119887628,
            "likes": {
                "disliked": null,
                "liked": null
            },
            "rating": 4.0,
            "stay_parameters": "Stayed October 2011, traveled with friends",
            "text": "The location is one of the best in Chiang Mai - Right next door to the Night Market, walking distance to the Sunday Market, lots of massages, food, laundry shops and many tuk2, and taxis passing. The Orchid Room is very spacious with full toiletries. The room, despite being a smoking room, smelled nice. Another good thing is the window can be opened wide.",
            "title": "Excellent Location and Great Value for Money",
            "user": "MelKualaLumpur"
        },
        {
            "date": "August 27, 2011",
            "detail_rating": {
                "business": null,
                "cleanliness": 3.0,
                "desk": null,
                "location": null,
                "pool": null,
                "restaurant": null,
                "rooms": null,
                "service": 2.0,
                "sleep": 4.0,
                "value": 3.0
            },
            "helpfulness": 4,
            "id": 117301984,
            "likes": {
                "disliked": null,
                "liked": null
            },
            "rating": 3.0,
            "stay_parameters": "Stayed August 2011, traveled with family",
            "text": "Service was good. Our request for extra blanket was met with no hesitance.",
            "title": "Full of Potential, but Really Just Average",
            "user": "qasr"
        },
        {
            "date": "August 7, 2011",
            "detail_rating": {
                "business": null,
                "cleanliness": 4.0,
                "desk": null,
                "location": null,
                "pool": null,
                "restaurant": null,
                "rooms": null,
                "service": 4.0,
                "sleep": 3.0,
                "value": 5.0
            },
            "helpfulness": 3,
            "id": 116386697,
            "likes": {
                "disliked": null,
                "liked": null
            },
            "rating": 4.0,
            "stay_parameters": "Stayed July 2011, traveled with friends",
            "text": "The hotel is pretty old though. The way to the lobby was isolated and depressing. However, our room was newly renovated.",
            "title": "Very good!",
            "user": "indy781"
        },
        {
            "date": "May 11, 2011",
            "detail_rating": {
                "business": null,
                "cleanliness": 4.0,
                "desk": null,
                "location": 4.0,
                "pool": null,
                "restaurant": null,
                "rooms": 4.0,
                "service": 3.0,
                "sleep": 4.0,
                "value": 4.0
            },
            "helpfulness": 1,
            "id": 107880983,
            "likes": {
                "disliked": null,
                "liked": null
            },
            "rating": 4.0,
            "stay_parameters": "Stayed May 2011",
            "text": "The other negative thing for the room is the information that the sofa in the Orchid Deluxe Room is a sofa bed but in actual fact it is a mere sofa (but comfortable though). The bed was slightly too hard for my taste.",
            "title": "clean and spacious",
            "user": "judykl"
        },
        {
            "date": "May 3, 2011",
            "detail_rating": {
                "business": null,
                "cleanliness": 4.0,
                "desk": null,
                "location": 5.0,
                "pool": null,
                "restaurant": null,
                "rooms": 5.0,
                "service": 3.0,
                "sleep": 5.0,
                "value": 3.0
            },
            "helpfulness": 2,
            "id": 106603429,
            "likes": {
                "disliked": null,
                "liked": null
            },
            "rating": 3.0,
            "stay_parameters": "Stayed April 2011, traveled with friends",
            "text": "Our room faces the back with no view whatsoever. We also had some problem with the hot water supply.",
            "title": "Old Wing but good clean rooms",
            "user": "Rosie6529"
        }
    ],
    "slim_ranking": 0.162576687117,
    "stars": 3,
    "tripadvisor": {
        "VISITED": false,
        "country_name": null,
        "locality": null,
        "pic_link": null,
        "street_address": null
    },
    "user_rating": 4.0,
    "variance": {
        "average": 68,
        "excellent": 95,
        "poor": 31,
        "terrible": 15,
        "very good": 181
    }
}