{
    "aka": "Mercure Fontenay Sous Bois Hotel",
    "description": "Located halfway between Disneyland and Paris. 10 min drive from Paris. 133 air-conditioned rooms, including 6 junior suites. 15 min to the centre by subway (RER). Restaurant and bar. Meeting facilities. Disabled rooms. Ideal for business / leisure stays.",
    "detail_rating": {
        "cleanliness": null,
        "location": null,
        "rooms": null,
        "service": null,
        "sleep": null,
        "value": null
    },
    "location": {
        "city": null,
        "continent": "Europe",
        "country": "France",
        "proposed_city": "Paris",
        "province": null,
        "region": "Ile-de-France"
    },
    "name": "Mercure Fontenay sous Bois",
    "places": {
        "aka": [],
        "hotel_description": [
            "Paris"
        ],
        "hotel_name": []
    },
    "review_count": 113,
    "review_count_current": 19,
    "reviews": [
        {
            "date": "October 22, 2011",
            "detail_rating": {
                "business": null,
                "cleanliness": 4.0,
                "desk": null,
                "location": 3.0,
                "pool": null,
                "restaurant": null,
                "rooms": 3.0,
                "service": 3.0,
                "sleep": 3.0,
                "value": 4.0
            },
            "helpfulness": 1,
            "id": 119574552,
            "likes": {
                "disliked": null,
                "liked": null
            },
            "rating": 3.0,
            "stay_parameters": "Stayed October 2011, traveled with family",
            "text": "We stayed there only 1 night as we went with bus tour from Germany. So I didn\u2019t deal with the check in. the group of let\u2019s say 40 pax arrived 1 pm. but one elevator is broken. The elevator itself is quite small. I think can fit 5 people with baggage. Many have to use stair. I used stair for 4th floor only let my mom get in. The room is okay. Extra bed is not so nice. They put the futon instead of mattress so my bed was a bit too soft. Breakfast is fine. They have champagne for breakfast I guess it\u2019s a Paris thing. The waitress saw us and suddenly took to the room with Chinese group. The black waiter came and asked us room no., he checked and brought us outside. (as we came with German tour group) Breakfast is acceptable for 3 stars hotel. There is metro station near the hotel but we didn\u2019t use. Overall if you want a short stay with the better price, It\u2019s not too bad otherwise you can pay more and stay closer to Paris.",
            "title": "Reasonable for short stay",
            "user": "r_noi"
        },
        {
            "date": "October 13, 2011",
            "detail_rating": {
                "business": null,
                "cleanliness": 3.0,
                "desk": null,
                "location": 3.0,
                "pool": null,
                "restaurant": null,
                "rooms": 4.0,
                "service": 2.0,
                "sleep": 4.0,
                "value": 3.0
            },
            "helpfulness": null,
            "id": 119277511,
            "likes": {
                "disliked": null,
                "liked": null
            },
            "rating": 3.0,
            "stay_parameters": "Stayed September 2011, traveled as a couple",
            "text": "We stayed at this hotel for 3 nights. As others have commented, the location is on the regional rail line, not the Metro. However, it is only 10-15 minutes to the city centre via the train and it only costs you an extra Euro or so for the trip, so if you get the hotel quite cheaply, it works out well for you. Taxi travel there would be costly.",
            "title": "Reasonable for the price - service poor",
            "user": "letyoursoulglo"
        },
        {
            "date": "August 22, 2011",
            "detail_rating": {
                "business": null,
                "cleanliness": 4.0,
                "desk": null,
                "location": null,
                "pool": null,
                "restaurant": null,
                "rooms": null,
                "service": 3.0,
                "sleep": 4.0,
                "value": 4.0
            },
            "helpfulness": 1,
            "id": 117084917,
            "likes": {
                "disliked": null,
                "liked": null
            },
            "rating": 3.0,
            "stay_parameters": "Stayed June 2011, traveled on business",
            "text": "Others have noted that the area surrounding the hotel is a little shady. I would say it's an area with mostly workers and offices during the day; I personally did not feel unsafe but the bus terminal adjoining the train station is poorly lit so some may feel nervous about this. There is a shopping centre directly behind the hotel which is convenient.",
            "title": "Reasonable hotel",
            "user": "vampgirl"
        },
        {
            "date": "July 27, 2011",
            "detail_rating": {
                "business": null,
                "cleanliness": 4.0,
                "desk": null,
                "location": null,
                "pool": null,
                "restaurant": null,
                "rooms": null,
                "service": 2.0,
                "sleep": 4.0,
                "value": 3.0
            },
            "helpfulness": null,
            "id": 115854928,
            "likes": {
                "disliked": null,
                "liked": null
            },
            "rating": 2.0,
            "stay_parameters": "Stayed July 2011, traveled as a couple",
            "text": "As for the hotel - the room was a decent size. Cleanliness was of an acceptable level. I did not eat any food there, so cannot comment (I ate at a wonderful bakery behind the hotel - highly recommended). The shower head holder was broken in the bathroom, so it flooded the bathroom floor as a result. I had varying temperature showers for two mornings - I presumed this was usual \"everyone using it at the same time\" so didn't bother to report it.",
            "title": "VERY VERY POOR",
            "user": "Jeeps3082"
        },
        {
            "date": "July 27, 2011",
            "detail_rating": {
                "business": null,
                "cleanliness": 3.0,
                "desk": null,
                "location": null,
                "pool": null,
                "restaurant": null,
                "rooms": null,
                "service": 1.0,
                "sleep": 3.0,
                "value": 2.0
            },
            "helpfulness": null,
            "id": 115841875,
            "likes": {
                "disliked": null,
                "liked": null
            },
            "rating": 1.0,
            "stay_parameters": "Stayed July 2011, traveled with friends",
            "text": "There was a reason I didn't bother reporting it - the staff were very rude. I don't mean in a \"French people are rude\"-stereotypical fashion, they were just - well, rude. We checked into the hotel at 1am after a long travel day, so I fumbled with my French, then just went for English - I was told that I should \"speak French, then English\". When we checked out, they claimed we hadn't paid when we had. The desk clerk had not seen the email confirming we had. She fought us for a while, then when she realised her mistake, was absolutely frosty. The only person who was nice was one of the female desk clerks, who was only nice after she had to tell us bad news. The bad news was that despite the brochure claiming that laundry was available Monday to Saturday and could be picked up by 8pm same day if put in by 9am, we attempted to put through laundry on a Friday morning before 9am and were told it wouldn't be ready until after the weekend. Reason why? \"The laundry is not open on the weekend\". Paris is not filled with laundrettes, so we ended up with dirty clothes until Berlin.",
            "title": "Bad location and would not recommend this hotel",
            "user": "lindar59"
        },
        {
            "date": "July 13, 2011",
            "detail_rating": {
                "business": null,
                "cleanliness": null,
                "desk": null,
                "location": null,
                "pool": null,
                "restaurant": null,
                "rooms": null,
                "service": null,
                "sleep": null,
                "value": null
            },
            "helpfulness": 2,
            "id": 115329161,
            "likes": {
                "disliked": null,
                "liked": null
            },
            "rating": 4.0,
            "stay_parameters": null,
            "text": "slightly far away from Paris City center,but convenient to metro station(across the hotel).",
            "title": "very good",
            "user": "A TripAdvisor user"
        },
        {
            "date": "June 26, 2011",
            "detail_rating": {
                "business": null,
                "cleanliness": 4.0,
                "desk": null,
                "location": null,
                "pool": null,
                "restaurant": null,
                "rooms": null,
                "service": 1.0,
                "sleep": 3.0,
                "value": 2.0
            },
            "helpfulness": 1,
            "id": 114764348,
            "likes": {
                "disliked": null,
                "liked": null
            },
            "rating": 2.0,
            "stay_parameters": "Stayed June 2011, traveled with family",
            "text": "if one does not mind to ride 20 mins in Metro to the city center, I recommend this hotel. As the hotel rate is good and the room is spaceous.",
            "title": "Does not improve a coach trip",
            "user": "Dobbysdeathwaswrong"
        },
        {
            "date": "May 25, 2011",
            "detail_rating": {
                "business": null,
                "cleanliness": 3.0,
                "desk": null,
                "location": 2.0,
                "pool": null,
                "restaurant": null,
                "rooms": 2.0,
                "service": null,
                "sleep": 2.0,
                "value": null
            },
            "helpfulness": null,
            "id": 109852345,
            "likes": {
                "disliked": null,
                "liked": null
            },
            "rating": 2.0,
            "stay_parameters": "Stayed May 2011",
            "text": "Our room was very clean yet other reviews suggest this was a one off. The shower is a bit dodgy, the water pressure if fine but the shower attachment is so poor that the whole floor will be able to accomadate Nemo by the time your shower is over. The television channels are all in French bar BBC world news however it is not specific to any continent so you will find it impossible to get specific news. Do not let small children near the windows as they are very wide and open fully so children need to be constantly supervised. Breakfast is a bit dodgy, it's mainly continental and consists of 10% fruit yogurt, croissants, make it yourself toast and some abigiuous looking sausage and bacon and some distinctly saw dust looking scrambled eggs. If you are going in the week you will probably be ok because there is a restaurant however we came at the weekend and there is no restaurant and there is also no room service so the only way to get food is to go around the corner of the hotel to a kind of mini mall which has restaurants like mcdonalds, kfc, a pizza place amongst others as well as some nice shops but the area is questionable. Some people have commented how they feel unsafe and there are some \"suspicious\" looking people outside that some people may find unnerving. Staff are not particulary helpful or friendly and seem unaccustomed to dealing with people so aren't much help if you require it. It is also important to note that this hotel is not particularly close to central Paris. But as mentioned earlier it's very clean which is good however that is just our experience we have heard from other guests that their rooms are dirty and have things like cracked tiles in them. Another comment would be that, in our case, we booked a twin bed room but we were given a room with a double bed, not a huge problem but could be for others. Also you can hear you can hear everything that goes on in the floors above. The lifts are quite cramped and can only hold a small number of 4/5 at a time which may be an issue for some people. There isn't anything really to do in the hotel if you don't want to go out given the lack of television or in-hotel entertainment, the shops close at 8pm every day except for Sunday when they are all shut so it would be advisable to bring some sort of entertainment with you. An important tip to anyone going to stay here would be to bring some food as well as entertainment just in case because their isn't anything avaliable in the hotel. Good option possibly for anyone using this hotel on a business trip but not a holiday, personally we would not book this hotel again.",
            "title": "Would not recommend",
            "user": "scmommy8"
        },
        {
            "date": "June 1, 2010",
            "detail_rating": {
                "business": null,
                "cleanliness": 3.0,
                "desk": null,
                "location": 1.0,
                "pool": null,
                "restaurant": null,
                "rooms": 1.0,
                "service": 1.0,
                "sleep": 1.0,
                "value": 3.0
            },
            "helpfulness": 1,
            "id": 66023926,
            "likes": {
                "disliked": null,
                "liked": null
            },
            "rating": 2.0,
            "stay_parameters": "Stayed May 2010",
            "text": "I stayed here as part of a group of college students I was helping to lead around Europe, and this was one of our least favorite hotels. The downstairs area was alright, but the rooms were pretty bad - ripped carpet, wallpaper, box springs, etc. It was also extremely noisy. I'm not sure if they were doing construction or what but at times it sounded like someone was going to come through the roof. Also, even though they supposedly have air conditioning, it didn't work in any one of the 8 rooms we had for our group. The breakfast didn't really have much to offer, and the location is pretty far outside of Paris. It took us a good 45 minutes to get anywhere in downtown Paris via local transport.",
            "title": "Don't Expect Much",
            "user": "iseult72petunia"
        },
        {
            "date": "August 21, 2009",
            "detail_rating": {
                "business": null,
                "cleanliness": 5.0,
                "desk": null,
                "location": 2.0,
                "pool": null,
                "restaurant": null,
                "rooms": 5.0,
                "service": 1.0,
                "sleep": null,
                "value": 2.0
            },
            "helpfulness": null,
            "id": 38378398,
            "likes": {
                "disliked": null,
                "liked": null
            },
            "rating": 2.0,
            "stay_parameters": "Stayed July 2009",
            "text": "The two positives were that the metro station was literally across the street and there was free internet (although not for programs such as Skype). Unless you're really on a tight budget for Paris I would suggest finding a different hotel.",
            "title": "Don't expect a welcome from the staff",
            "user": "whiterose43"
        },
        {
            "date": "August 17, 2009",
            "detail_rating": {
                "business": null,
                "cleanliness": 3.0,
                "desk": null,
                "location": 2.0,
                "pool": null,
                "restaurant": null,
                "rooms": 1.0,
                "service": 2.0,
                "sleep": null,
                "value": 1.0
            },
            "helpfulness": null,
            "id": 37976349,
            "likes": {
                "disliked": null,
                "liked": null
            },
            "rating": 1.0,
            "stay_parameters": "Stayed August 2009",
            "text": "THIS HOTEL IS UNDERGOING RENOVATIONS - MAJOR ELECTRICAL PROBLEMS! Day 1 - Our 5th floor room lights & tv flickered on/off all evening. During the night (lights / tv were off) our TV short- circuited. We saw a bright white flash and smoke/ burning smell coming from TV. The staff was unconcerned & blamed it on the electricians who went home hours ago. I checked for fire exits near our room!",
            "title": "AVOID THIS HOTEL - SAFETY ISSUES!",
            "user": "TrishGraies"
        },
        {
            "date": "March 31, 2008",
            "detail_rating": {
                "business": 3.0,
                "cleanliness": 4.0,
                "desk": null,
                "front_desk": 4.0,
                "location": 4.0,
                "pool": null,
                "restaurant": null,
                "rooms": 4.0,
                "service": 4.0,
                "sleep": null,
                "value": 4.0
            },
            "helpfulness": null,
            "id": 14697471,
            "likes": {
                "disliked": "\u2014 business area",
                "liked": "\u2014 location"
            },
            "rating": 4.0,
            "stay_parameters": "Stayed March 2008",
            "text": "Day 2 - our room had NO electricity when we returned at 11:30 p.m. We were moved to 3rd floor room at midnight. That room had NO working lights in the bathroom. We had to ask for a flashlight so we could collect our belongings from the dark 5th floor room and for use in the bathroom in the 3rd floor room. Again, staff blamed the problems on the electricians who were off for the weekend!",
            "title": "Close to the RER",
            "user": "rem123sa"
        },
        {
            "date": "September 4, 2007",
            "detail_rating": {
                "business": null,
                "cleanliness": 5.0,
                "desk": null,
                "front_desk": 4.0,
                "location": 3.0,
                "pool": null,
                "restaurant": null,
                "rooms": 3.0,
                "service": 3.0,
                "sleep": null,
                "value": 3.0
            },
            "helpfulness": 1,
            "id": 8619612,
            "likes": {
                "disliked": "\u2014 pillows",
                "liked": "\u2014 clean"
            },
            "rating": 3.0,
            "stay_parameters": "Stayed September 2007, traveled as a couple",
            "text": "Several other families in our tour had to be moved to other rooms for lack of electricity. One mother & small boy stayed in a room with NO electricity & were given a flashlight by the staff. I think these accomodations are potentially dangerous and wonder if legal!",
            "title": "Overall Good Hotel",
            "user": "mrsshoeqn"
        },
        {
            "date": "August 25, 2006",
            "detail_rating": {
                "business": 3.0,
                "cleanliness": 3.0,
                "desk": null,
                "front_desk": 3.0,
                "location": 1.0,
                "pool": null,
                "restaurant": null,
                "rooms": 2.0,
                "service": 2.0,
                "sleep": null,
                "value": 2.0
            },
            "helpfulness": 1,
            "id": 5708896,
            "likes": {
                "disliked": "\u2014 Location and lack of food service",
                "liked": "\u2014 location"
            },
            "rating": 2.0,
            "stay_parameters": "Stayed July 2006",
            "text": "Traveling with large (32) student group. Located next to the RER - which made it excellent for sightseeing and excursions. Hotel was very nice - clean, rooms nice size, full bath and shower. Seemed unsafe at night between the RER and hotel entrance - but if you travel with others this should not be a problem. We stayed over a weekend - so most businesses in the area were closed.",
            "title": "Would pass on this hotel for vacationing",
            "user": "trvlgrl422"
        },
        {
            "date": "April 12, 2006",
            "detail_rating": {
                "business": null,
                "cleanliness": null,
                "desk": null,
                "location": null,
                "pool": null,
                "restaurant": null,
                "rooms": null,
                "service": null,
                "sleep": null,
                "value": null
            },
            "helpfulness": 8,
            "id": 4966391,
            "likes": {
                "disliked": null,
                "liked": null
            },
            "rating": 5.0,
            "stay_parameters": null,
            "text": "I just returned from a stay at the Mercure Fontenay Sous Bois. The hotel was overall a good place to stay. The train station is right across the street and the rooms are clean. The only problem I had was there was a fire in the hotel and one of the staff knocked on our door to tell us but it was all in French so I couldn't understand him. I actually thought he was trying to clean our room until I saw people running down the stars. You would think there would at least be a fire alarm. I would also bring you own pillows with you because the pillows they give you are really flat. There was a large spread for breakfast including eggs, sausage, croissants, and cereal. Try to get down for breakfast as fast as you can because the eggs and sausage where cold. Other than that the hotel was not too bad and I would return.",
            "title": "Loved the place! , the price, the location etc..",
            "user": "A TripAdvisor user"
        },
        {
            "date": "June 15, 2012",
            "detail_rating": {
                "business": null,
                "cleanliness": 2.0,
                "desk": null,
                "location": 1.0,
                "pool": null,
                "restaurant": null,
                "rooms": 2.0,
                "service": 1.0,
                "sleep": 3.0,
                "value": 1.0
            },
            "helpfulness": 1,
            "id": 132018505,
            "likes": {
                "disliked": null,
                "liked": null
            },
            "rating": 1.0,
            "stay_parameters": "Stayed June 2012, traveled on business",
            "text": "As you approach the hotel and see the surrounding area, you already get put off. The hotel is by no means 4 star standard, nor what you would expect from a Mercure. It is in need of urgent refurbishment, and a complete staff retraining. My room was failry large, but spartan and cold (in the month of June). The service in the bar and restaurante was sub-standard, and the staff had no desire to attend customers. The bar had no clean glasses, and had to get some from the restaurant kitchen. It was also ditry and untidy. The restaurant was unwelcoming (looked like we were disturbing the staff who had nothing to do), the waiter stank of cigarette smoke, the food was overpriced, overcooked, and tasteless. There was a line of 15 people at checkout, and the process was agonisingly slow. Not a place to come back to!!",
            "title": "Awful hotel!",
            "user": "BraddyBarcelona"
        },
        {
            "date": "April 27, 2012",
            "detail_rating": {
                "business": null,
                "cleanliness": 3.0,
                "desk": null,
                "location": 3.0,
                "pool": null,
                "restaurant": null,
                "rooms": 3.0,
                "service": 3.0,
                "sleep": 4.0,
                "value": 3.0
            },
            "helpfulness": 1,
            "id": 128765260,
            "likes": {
                "disliked": null,
                "liked": null
            },
            "rating": 3.0,
            "stay_parameters": "Stayed March 2012, traveled on business",
            "text": "This hotel, another from the Mercure chain is decently located with good interiors. Rooms are quite spacious though quite old and are in need of a facelift. Restaurant is good and food variety is good.",
            "title": "Good Hotel",
            "user": "joymumu"
        },
        {
            "date": "March 8, 2012",
            "detail_rating": {
                "business": null,
                "cleanliness": 4.0,
                "desk": null,
                "location": 4.0,
                "pool": null,
                "restaurant": null,
                "rooms": 4.0,
                "service": 4.0,
                "sleep": 5.0,
                "value": 4.0
            },
            "helpfulness": 3,
            "id": 125820950,
            "likes": {
                "disliked": null,
                "liked": null
            },
            "rating": 4.0,
            "stay_parameters": "Stayed March 2012, traveled with friends",
            "text": "I stayed here with a group of friends for the Paris Half-marathon. The room was fine, a double bed and a further metal-framed sofa bed. The bathroom was clean with a good powerful shower and a bath. The room temperature was great.",
            "title": "Perfectly adequate for a short stay",
            "user": "winniefree"
        },
        {
            "date": "November 23, 2011",
            "detail_rating": {
                "business": null,
                "cleanliness": null,
                "desk": null,
                "location": null,
                "pool": null,
                "restaurant": null,
                "rooms": null,
                "service": null,
                "sleep": null,
                "value": null
            },
            "helpfulness": 2,
            "id": 120955172,
            "likes": {
                "disliked": null,
                "liked": null
            },
            "rating": 1.0,
            "stay_parameters": null,
            "text": "Breakfast was good, really fresh pastries, choice of fruit, yoghurt, a limited selection of cereals, cheese and cold meat but something for everyone.",
            "title": "Terrible",
            "user": "A TripAdvisor user"
        }
    ],
    "slim_ranking": 0.666666666667,
    "stars": 4,
    "tripadvisor": {
        "VISITED": false,
        "country_name": null,
        "locality": null,
        "pic_link": null,
        "street_address": null
    },
    "user_rating": 3.0,
    "variance": {
        "average": 36,
        "excellent": 7,
        "poor": 26,
        "terrible": 12,
        "very good": 32
    }
}