{
    "aka": "Palazzo Versace Hotel",
    "description": "Nestled between the Pacific Ocean and the Gold Coast Broadwater, Palazzo Versace Gold Coast is \u2018a destination within a destination\u2019. A waterfront setting, spectacular architecture, Italian furnishings, extraordinary service and an ambience of pure glamour. Palazzo Versace is everything you would expect from the world\u2019s first fully fashion-branded hotel; home to three award winning restaurants, famed day spa, Fitness & Wellbeing Centre, private marina, Versace Boutique and access to Australia\u2019s first Water Salon poolside cabana experience. Housing 200 light-filled rooms in timeless craftsmanship accessorised by Bespoke Versace furnishing and a \u2018Juliet\u2019 balcony inviting the Gold Coast sunshine and azure skies to pour in.With a glorious sub-tropical climate; cosmopolitan approach to life; and the beauty of a Renaissance palace, Palazzo Versace creates the perfect holiday and the ultimate escapism.",
    "detail_rating": {
        "cleanliness": 4.5,
        "location": 4.0,
        "rooms": 4.5,
        "service": 4.0,
        "sleep": 4.5,
        "value": 4.0
    },
    "location": {
        "city": null,
        "continent": "South Pacific",
        "country": "Australia",
        "proposed_city": null,
        "province": null,
        "region": null
    },
    "name": "Palazzo Versace",
    "places": {
        "aka": [],
        "hotel_description": [],
        "hotel_name": []
    },
    "review_count": 752,
    "review_count_current": 20,
    "reviews": [
        {
            "date": "November 30, 2007",
            "detail_rating": {
                "business": 3.0,
                "cleanliness": 2.0,
                "desk": null,
                "front_desk": 1.0,
                "location": 4.0,
                "pool": null,
                "restaurant": null,
                "rooms": 2.0,
                "service": 4.0,
                "sleep": null,
                "value": 1.0
            },
            "helpfulness": 4,
            "id": 11173112,
            "likes": {
                "disliked": "\u2014 Generally run down (dusty, nice pool but dirty ,torn sheet , lost laundry )",
                "liked": "\u2014 Location"
            },
            "rating": 1.0,
            "stay_parameters": "Stayed November 2007, traveled with family",
            "text": "Stayed for a week and started off with wrong room allocation after having confirmed room requirements 2 months earlier.Lost our laundry and wanted to charge us for the cleaning. No compensation offered even though housekeeping admitted item lost ( they finally relented after going through 4 \"managers\" ).",
            "title": "Very overrated at 5 stars",
            "user": "SAM3756"
        },
        {
            "date": "November 14, 2007",
            "detail_rating": {
                "business": null,
                "cleanliness": 4.0,
                "desk": null,
                "front_desk": 3.0,
                "location": 2.0,
                "pool": null,
                "restaurant": null,
                "rooms": 2.0,
                "service": 4.0,
                "sleep": null,
                "value": 3.0
            },
            "helpfulness": 4,
            "id": 10818074,
            "likes": {
                "disliked": null,
                "liked": null
            },
            "rating": 3.0,
            "stay_parameters": "Stayed October 2007, traveled as a couple",
            "text": "Pool dirty , torn sheets and generally run down compared to previous visit 2-3 years earlier . Much better value elsewhere eg Sheraton Mirage .",
            "title": "Opulent, but not my style",
            "user": "MirandaUK"
        },
        {
            "date": "October 22, 2007",
            "detail_rating": {
                "business": 3.0,
                "cleanliness": 5.0,
                "desk": null,
                "front_desk": 4.0,
                "location": 4.0,
                "pool": null,
                "restaurant": null,
                "rooms": 5.0,
                "service": 4.0,
                "sleep": null,
                "value": 4.0
            },
            "helpfulness": 2,
            "id": 10219417,
            "likes": {
                "disliked": "\u2014 breakfast",
                "liked": "\u2014 the bathrooms"
            },
            "rating": 4.0,
            "stay_parameters": "Stayed November 2006, traveled as a couple",
            "text": "Will not return to Versace !!!",
            "title": "Classy. Perfect for our honeymoon",
            "user": "rishabh001"
        },
        {
            "date": "October 2, 2007",
            "detail_rating": {
                "business": 5.0,
                "cleanliness": 5.0,
                "desk": null,
                "front_desk": 5.0,
                "location": 3.0,
                "pool": null,
                "restaurant": null,
                "rooms": 5.0,
                "service": 5.0,
                "sleep": null,
                "value": 3.0
            },
            "helpfulness": 4,
            "id": 10033233,
            "likes": {
                "disliked": "\u2014 Price",
                "liked": "\u2014 Service"
            },
            "rating": 4.0,
            "stay_parameters": "Stayed May 2005, traveled with family",
            "text": "We stayed here for two nights in October 2007. The lobby has a quiet opulence, and upon entering, you immediately notice a pleasant, spicy scent that is apparent throughout the hotel. We wondered if it was fed through the air conditioning system! Reception staff were friendly, though slightly aloof. We had booked a superior room which was beautifully furnished but very small. A large spa bath occupies one end of the room (the bathroom area is not closed off from the rest of the room), and the toilet and shower are separated by frosted glass panels. This is not a place to stay if you are shy around your travelling companion! We were surprised to find one of the sink taps chipped and loose. Staff were helpful with any requests. One useful tip - hotel postcards will be franked for free if you hand them in to reception. The pool area is beautiful and particularly nice for breakfast and snacks. I probably wouldn't stay here again; although I'm glad I had the experience, it really wasn't my style,and for the money I believe I can find more informal accommodation elsewhere on the Gold Coast.",
            "title": "Nice if you're into that style",
            "user": "anahira21"
        },
        {
            "date": "September 12, 2007",
            "detail_rating": {
                "business": null,
                "cleanliness": 5.0,
                "desk": null,
                "front_desk": 4.0,
                "location": 4.0,
                "pool": null,
                "restaurant": null,
                "rooms": 5.0,
                "service": 4.0,
                "sleep": null,
                "value": 4.0
            },
            "helpfulness": 8,
            "id": 8704504,
            "likes": {
                "disliked": "\u2014 our first room",
                "liked": "\u2014 restaurants"
            },
            "rating": 5.0,
            "stay_parameters": "Stayed September 2007, traveled with family",
            "text": "A very stylish hotel. We did not leave our room for most of the time we spent at the hotel. It is not as big as one would expect for a five star but had a class of its own.",
            "title": "the best place on the gold coast",
            "user": "fussymum"
        },
        {
            "date": "June 3, 2008",
            "detail_rating": {
                "business": 4.0,
                "cleanliness": 5.0,
                "desk": null,
                "front_desk": 5.0,
                "location": 5.0,
                "pool": null,
                "restaurant": null,
                "rooms": 5.0,
                "service": 5.0,
                "sleep": null,
                "value": 5.0
            },
            "helpfulness": 3,
            "id": 16634317,
            "likes": {
                "disliked": "\u2014 nothing to complain about",
                "liked": "\u2014 evrything was great no favourite thing"
            },
            "rating": 5.0,
            "stay_parameters": "Stayed May 2008, traveled as a couple",
            "text": "my husband and i stayed at palazzzo versace from 21 may to 1 june, best hotel ever visited we stayed 11 nights and had the time best time ever the staff were very freindly and helpful, buffet breakfast was 5 star and had everything you could imagine. we will definitley go again only with children next time also cannot wait for dubai palazzo versace to be finished and to go and stay there.",
            "title": "paula",
            "user": "ssjgohan"
        },
        {
            "date": "May 28, 2008",
            "detail_rating": {
                "business": null,
                "cleanliness": 5.0,
                "desk": null,
                "front_desk": 5.0,
                "location": 3.0,
                "pool": null,
                "restaurant": null,
                "rooms": 5.0,
                "service": 5.0,
                "sleep": null,
                "value": 4.0
            },
            "helpfulness": 3,
            "id": 16472333,
            "likes": {
                "disliked": null,
                "liked": "\u2014 very luxurious"
            },
            "rating": 5.0,
            "stay_parameters": "Stayed June 2004, traveled as a couple",
            "text": "We were there on our honeymoon...I loved the hotel :)",
            "title": "LOOOOVED IT :)",
            "user": "nouf4476"
        },
        {
            "date": "April 11, 2008",
            "detail_rating": {
                "business": 1.0,
                "cleanliness": 2.0,
                "desk": null,
                "front_desk": 1.0,
                "location": 4.0,
                "pool": null,
                "restaurant": null,
                "rooms": 2.0,
                "service": 2.0,
                "sleep": null,
                "value": null
            },
            "helpfulness": 4,
            "id": 14951522,
            "likes": {
                "disliked": "\u2014 Service",
                "liked": "\u2014 Restaurants"
            },
            "rating": 2.0,
            "stay_parameters": "Stayed February 2008, traveled on business",
            "text": "The rooms were spacious and beautifully decorated..everything was \"Versace\".",
            "title": "Huge dissapointment",
            "user": "Travelwithme123"
        },
        {
            "date": "April 7, 2008",
            "detail_rating": {
                "business": 4.0,
                "cleanliness": 5.0,
                "desk": null,
                "front_desk": 5.0,
                "location": 4.0,
                "pool": null,
                "restaurant": null,
                "rooms": 5.0,
                "service": 5.0,
                "sleep": null,
                "value": 4.0
            },
            "helpfulness": 3,
            "id": 14870800,
            "likes": {
                "disliked": "\u2014 nothing",
                "liked": "\u2014 room, location, staff, food"
            },
            "rating": 5.0,
            "stay_parameters": "Stayed December 2007, traveled as a couple",
            "text": "The lobby was so romantic at night..they used tealights and lamps which gave the place a very warm touch.",
            "title": "Absolutely Amazing",
            "user": "luke_brisbane"
        },
        {
            "date": "March 15, 2008",
            "detail_rating": {
                "business": 5.0,
                "cleanliness": 5.0,
                "desk": null,
                "front_desk": 5.0,
                "location": 5.0,
                "pool": null,
                "restaurant": null,
                "rooms": 5.0,
                "service": 5.0,
                "sleep": null,
                "value": 5.0
            },
            "helpfulness": 2,
            "id": 14293003,
            "likes": {
                "disliked": null,
                "liked": null
            },
            "rating": 5.0,
            "stay_parameters": "Stayed March 2008, traveled with family",
            "text": "Be sure to try the inroom spa packages. I personally chose the marshmallow bath and it was above my expectations.",
            "title": "Exceeded expectations - Highly Recommend this hotel",
            "user": "matthew76"
        },
        {
            "date": "September 1, 2008",
            "detail_rating": {
                "business": null,
                "cleanliness": 5.0,
                "desk": null,
                "front_desk": 5.0,
                "location": 5.0,
                "pool": null,
                "restaurant": null,
                "rooms": 5.0,
                "service": 5.0,
                "sleep": null,
                "value": 4.0
            },
            "helpfulness": 2,
            "id": 19624974,
            "likes": {
                "disliked": "\u2014 Noisy pool guests at unreasonable hours of the morning!",
                "liked": "\u2014 Staff"
            },
            "rating": 5.0,
            "stay_parameters": "Stayed August 2008, traveled on business",
            "text": "My husband and I stayed here for 2 nights in early August and we thoroughly enjoyed our stay. I guess it's easier to give a positive review when we weren't the one's paying for the room, but it was still a great experience.",
            "title": "Fabulous Experience",
            "user": "AJCairns"
        },
        {
            "date": "August 18, 2008",
            "detail_rating": {
                "business": 5.0,
                "cleanliness": 4.0,
                "desk": null,
                "front_desk": 5.0,
                "location": 5.0,
                "pool": null,
                "restaurant": null,
                "rooms": 5.0,
                "service": 5.0,
                "sleep": null,
                "value": 4.0
            },
            "helpfulness": 2,
            "id": 19071710,
            "likes": {
                "disliked": "\u2014 Nothing",
                "liked": "\u2014 Comfortable beds, very large and sumptuous"
            },
            "rating": 5.0,
            "stay_parameters": "Stayed September 2007, traveled as a couple",
            "text": "The rooms were lovely, EVERYTHING bears the Versace touch and logo, so I can understand why some people have labelled the place overdone and tacky, but it is the Gold Coast, so it works.",
            "title": "It is a sliceof heaven",
            "user": "maggannie"
        },
        {
            "date": "August 8, 2008",
            "detail_rating": {
                "business": null,
                "cleanliness": 4.0,
                "desk": null,
                "front_desk": 1.0,
                "location": null,
                "pool": null,
                "restaurant": null,
                "rooms": 3.0,
                "service": 1.0,
                "sleep": null,
                "value": 1.0
            },
            "helpfulness": 4,
            "id": 18741172,
            "likes": {
                "disliked": "\u2014 Service",
                "liked": "\u2014 Pool Area"
            },
            "rating": 1.0,
            "stay_parameters": "Stayed April 2008, traveled as a couple",
            "text": "I loved the complimentary fragrances in the rooms, the spa bath was divine as was the comfort of the beds. Our room had a lagoon view and that was gorgeous, apart from some noisy guests around the pool area at 12-1am!",
            "title": "Tacky & Overrated!!",
            "user": "jayjay01"
        },
        {
            "date": "July 20, 2008",
            "detail_rating": {
                "business": 5.0,
                "cleanliness": 5.0,
                "desk": null,
                "front_desk": 5.0,
                "location": 5.0,
                "pool": null,
                "restaurant": null,
                "rooms": 4.0,
                "service": 5.0,
                "sleep": null,
                "value": 5.0
            },
            "helpfulness": 4,
            "id": 18054752,
            "likes": {
                "disliked": "\u2014 Lack of Storage space in bathroom",
                "liked": "\u2014 Quality"
            },
            "rating": 4.0,
            "stay_parameters": "Stayed July 2008, traveled with family",
            "text": "The staff were extremely attentive, friendly and professional at ALL times during our stay - couldn't fault them.",
            "title": "5 star all the way",
            "user": "KMPAdelaide"
        },
        {
            "date": "July 3, 2008",
            "detail_rating": {
                "business": null,
                "cleanliness": 5.0,
                "desk": null,
                "front_desk": 5.0,
                "location": 3.0,
                "pool": null,
                "restaurant": null,
                "rooms": 4.0,
                "service": 5.0,
                "sleep": null,
                "value": 3.0
            },
            "helpfulness": 4,
            "id": 17479412,
            "likes": {
                "disliked": "\u2014 The cost!",
                "liked": "\u2014 Friendly staff, Breakfast and the pool!!!"
            },
            "rating": 4.0,
            "stay_parameters": "Stayed July 2008, traveled with family",
            "text": "The breakfast selection is like nothing I've ever seen before. Fabuous! They serve anything you could possibly want for breakfast in elegant surrounds and on their gorgeous Versace dinnerware.",
            "title": "Great Service!",
            "user": "lov2getaway"
        },
        {
            "date": "February 25, 2008",
            "detail_rating": {
                "business": 3.0,
                "cleanliness": 4.0,
                "desk": null,
                "front_desk": 2.0,
                "location": 3.0,
                "pool": null,
                "restaurant": null,
                "rooms": 3.0,
                "service": 2.0,
                "sleep": null,
                "value": 1.0
            },
            "helpfulness": 3,
            "id": 13824727,
            "likes": {
                "disliked": "\u2014 everything else",
                "liked": "\u2014 the bathroom"
            },
            "rating": 1.0,
            "stay_parameters": "Stayed October 2007, traveled on business",
            "text": "We stayed at the Versace last year. Our planned stay was for 4 days, however for my son and I it was only one night as a 100kg flower urn by the pool fell onto his leg crushing it and we spent the next 3 weeks in hospital. The hotel were helpful while we were in Queensland. We transfered to a NSW hospital as soon as we could. The urn and the rest of the urns in the pool area were unsafe and my son is lucky to be alive. I am advised that they are now all re-enforced with steel. This obviously has coloured my experience of the hotel but I must say that proir to that the service was patchy, some good some totaly indifferent. The food was average. It is packed to the gunnels with bling and Versace over the topness. Personally I found it garish and ugly. I wouldn't reccomend this hotel to families as there are so many dangers for children around the pool area. To get to the lift from the pool there is an acre of marble floor which the slightest wet foot will slip on. The afore mentioned urns. The high walls around the edge, very pretty but an easy place for a toddler to fall off etc etc.",
            "title": "Not worth it",
            "user": "Beanie94"
        },
        {
            "date": "February 5, 2008",
            "detail_rating": {
                "business": 1.0,
                "cleanliness": 1.0,
                "desk": null,
                "front_desk": 1.0,
                "location": 5.0,
                "pool": null,
                "restaurant": null,
                "rooms": 1.0,
                "service": 1.0,
                "sleep": null,
                "value": 1.0
            },
            "helpfulness": 10,
            "id": 13297984,
            "likes": {
                "disliked": "\u2014 Staying There for as long as i did",
                "liked": "\u2014 Checking Out Early"
            },
            "rating": 1.0,
            "stay_parameters": "Stayed December 2007, traveled with family",
            "text": "We have stayed at many luxury hotels over the world. This is one of the WORST!!! This is supposed to be a Leading Hotel of The World... Its an absolute joke.",
            "title": "Do Not Stay Here - What a Disaster",
            "user": "Tell_It_Like_It_Is_8"
        },
        {
            "date": "January 8, 2008",
            "detail_rating": {
                "business": 5.0,
                "cleanliness": 5.0,
                "desk": null,
                "front_desk": 5.0,
                "location": 3.0,
                "pool": null,
                "restaurant": null,
                "rooms": 5.0,
                "service": 5.0,
                "sleep": null,
                "value": 3.0
            },
            "helpfulness": 8,
            "id": 12454625,
            "likes": {
                "disliked": "\u2014 the cost",
                "liked": "\u2014 The beautiful room"
            },
            "rating": 5.0,
            "stay_parameters": "Stayed December 2007, traveled as a couple",
            "text": "IF YOU UNDERSTAND THE SIMPLE POINT THAT THE MONEY YOU WORK HARD FOR IS EXCHANGED FOR A LEVEL OF SERVICE AND EXCLUSIVE AMMENETIES AT A HOTEL THEN DONT STAY AT THE PALAZO VERSACE!!!",
            "title": "Fantatsic start to our Honeymoon",
            "user": "NRD80Y"
        },
        {
            "date": "January 8, 2008",
            "detail_rating": {
                "business": 5.0,
                "cleanliness": 5.0,
                "desk": null,
                "front_desk": 5.0,
                "location": 5.0,
                "pool": null,
                "restaurant": null,
                "rooms": 5.0,
                "service": 5.0,
                "sleep": null,
                "value": 5.0
            },
            "helpfulness": 2,
            "id": 12452048,
            "likes": {
                "disliked": "\u2014 The location",
                "liked": "\u2014 The luxury accomodation"
            },
            "rating": 5.0,
            "stay_parameters": "Stayed October 2007, traveled with friends",
            "text": "IF YOU WANT TO STAY THERE CAUSE ITS THE VERSACE HOTEL THEN CONTACT ME AND I'LL SEND YOU A PICTURE OF MY ROOM SERVICE FOOD... THAT SHOULD PUT YOU OFF!!!",
            "title": "Loved the Palazzo Versace - even if overpriced",
            "user": "kellyectf"
        },
        {
            "date": "December 9, 2007",
            "detail_rating": {
                "business": null,
                "cleanliness": 5.0,
                "desk": null,
                "front_desk": 5.0,
                "location": 4.0,
                "pool": null,
                "restaurant": null,
                "rooms": 5.0,
                "service": 5.0,
                "sleep": null,
                "value": 5.0
            },
            "helpfulness": 4,
            "id": 11361056,
            "likes": {
                "disliked": "\u2014 It's across the road from the beach....and it's a busy road.",
                "liked": "\u2014 100% quality the whole way through"
            },
            "rating": 5.0,
            "stay_parameters": "Stayed June 2007, traveled with family",
            "text": "We stayed in a Lagoon View Room with a seperate living area and a balcony (About the size of box of paper)",
            "title": "Wow",
            "user": "TheClairvoyant"
        }
    ],
    "slim_ranking": 0.666666666667,
    "stars": 5,
    "tripadvisor": {
        "VISITED": false,
        "country_name": null,
        "locality": null,
        "pic_link": null,
        "street_address": null
    },
    "user_rating": 4.5,
    "variance": {
        "average": 73,
        "excellent": 456,
        "poor": 36,
        "terrible": 37,
        "very good": 150
    }
}