{
    "aka": null,
    "description": "Hotel JL No76 is located in two 18th-century mansions in the heart of Amsterdam, right in the middle of the museum & fashion district. Leidseplein, Vondelpark, Concert Hall and its two sister hotels, Hotel Vondel and Hotel Roemer are a stone\u2019s throw away. Hotel JL No76 has 39 luxurious rooms, a lounge, honesty bar, restaurant and a private inner garden. The honesty bar allows guests to make or serve a drink or bite at any convenient time. The hotel is decorated in boutique style with the use of high quality materials and has a large collection of art on display. Barbara Broekman, a well-known Dutch artist, has designed a special range of wallpaper for each of the 39 rooms. This wallpaper is based on details enlargement of originally embroidered artworks. The rooms are decorated in 5 ambiances and are equipped with modern facilities like free use of iPad, wireless internet, iPod dock station, Nespresso coffee machine, Flat Screen TV, DVD player and DVD library. All executive rooms have a Jacuzzi with built-in TVs. The comfortable COCO-MAT beds in all rooms ensure a relaxing stay.",
    "detail_rating": {
        "cleanliness": null,
        "location": null,
        "rooms": null,
        "service": null,
        "sleep": null,
        "value": null
    },
    "location": {
        "city": "Amsterdam",
        "continent": "Europe",
        "country": "The Netherlands",
        "proposed_city": "Amsterdam",
        "province": null,
        "region": null
    },
    "name": "Hotel JL No76",
    "places": {
        "aka": [],
        "hotel_description": [
            "Amsterdam"
        ],
        "hotel_name": []
    },
    "review_count": 229,
    "review_count_current": 5,
    "reviews": [
        {
            "date": "November 16, 2013",
            "detail_rating": {
                "business": null,
                "cleanliness": 5.0,
                "desk": null,
                "location": 5.0,
                "pool": null,
                "restaurant": null,
                "rooms": 3.0,
                "service": 4.0,
                "sleep": 5.0,
                "value": 3.0
            },
            "helpfulness": null,
            "id": 184885280,
            "likes": {
                "disliked": null,
                "liked": null
            },
            "rating": 4.0,
            "stay_parameters": "Stayed November 2013, traveled as a couple",
            "text": "this is a good and comfortable hotel in an excellent location. minutes walk from the main museums of Amsterdam and with excellent public transport to the center of Amsterdam just across the road.",
            "title": "location and comfort, a bit cramped",
            "user": "edgarsz"
        },
        {
            "date": "November 13, 2013",
            "detail_rating": {
                "business": null,
                "cleanliness": 5.0,
                "desk": null,
                "location": 4.0,
                "pool": null,
                "restaurant": null,
                "rooms": 5.0,
                "service": 5.0,
                "sleep": 5.0,
                "value": null
            },
            "helpfulness": null,
            "id": 184620559,
            "likes": {
                "disliked": null,
                "liked": null
            },
            "rating": 5.0,
            "stay_parameters": "Stayed November 2013, traveled on business",
            "text": "The rooms are modern and well equipped but on the small side and if you are a large person or two large people you will fill a bit cramped. Wifi is free.",
            "title": "Elegant and homely hotel in Amsterdam",
            "user": "JDP73"
        },
        {
            "date": "November 9, 2013",
            "detail_rating": {
                "business": null,
                "cleanliness": 4.0,
                "desk": null,
                "location": 4.0,
                "pool": null,
                "restaurant": null,
                "rooms": 2.0,
                "service": 5.0,
                "sleep": 5.0,
                "value": 1.0
            },
            "helpfulness": 1,
            "id": 184167717,
            "likes": {
                "disliked": null,
                "liked": null
            },
            "rating": 3.0,
            "stay_parameters": "Stayed November 2013, traveled as a couple",
            "text": "Ask for a high floor facing the nice tree lined street, and beware of the lower ground floor.",
            "title": "don't book the deluxe room",
            "user": "fodors14_2"
        },
        {
            "date": "November 4, 2013",
            "detail_rating": {
                "business": null,
                "cleanliness": 5.0,
                "desk": null,
                "location": 4.0,
                "pool": null,
                "restaurant": null,
                "rooms": 5.0,
                "service": 4.0,
                "sleep": 5.0,
                "value": 3.0
            },
            "helpfulness": null,
            "id": 183572585,
            "likes": {
                "disliked": null,
                "liked": null
            },
            "rating": 4.0,
            "stay_parameters": "Stayed October 2013, traveled as a couple",
            "text": "It will allow you a late check out for a fee, which may be very convenient if you have a late flight.",
            "title": "Very pleasant stay in nice, quiet location",
            "user": "tom g"
        },
        {
            "date": "October 29, 2013",
            "detail_rating": {
                "business": null,
                "cleanliness": 5.0,
                "desk": null,
                "location": 4.0,
                "pool": null,
                "restaurant": null,
                "rooms": 5.0,
                "service": 4.0,
                "sleep": 5.0,
                "value": 4.0
            },
            "helpfulness": null,
            "id": 182876063,
            "likes": {
                "disliked": null,
                "liked": null
            },
            "rating": 4.0,
            "stay_parameters": "Stayed October 2013, traveled as a couple",
            "text": "As all reasonable hotels in Amsterdam it is on the expensive side.",
            "title": "Stylish and well located",
            "user": "dublin_boy"
        }
    ],
    "slim_ranking": 0.161764705882,
    "stars": 4,
    "tripadvisor": {
        "VISITED": false,
        "country_name": null,
        "locality": null,
        "pic_link": null,
        "street_address": null
    },
    "user_rating": 4.0,
    "variance": {
        "average": 26,
        "excellent": 109,
        "poor": 7,
        "terrible": 4,
        "very good": 83
    }
}