{
    "aka": null,
    "description": "The Ibis St Rambert d'Albon hotel is located among the orchards of the Dr\u00f4me, 60 km south of Lyon, close to an exit of the A7, on the RN7 leading to Valence. It is close to the Facteur Cheval museum, the Safari Parc de Peaugres and Albon golf centre. The hotel offers 70 air-conditioned rooms with Wifi connection, including 3 adapted for disabled guests, and 1 meeting room. A restaurant, a bar, snacks 24/24, a terrace and closed parking are at your disposal. Pets accepted.",
    "detail_rating": {
        "cleanliness": null,
        "location": null,
        "rooms": null,
        "service": null,
        "sleep": null,
        "value": null
    },
    "location": {
        "city": null,
        "continent": "Europe",
        "country": "France",
        "proposed_city": "Lyon",
        "province": null,
        "region": "Rhone-Alpes"
    },
    "name": "Ibis Lyon Sud Saint Rambert d'Albon",
    "places": {
        "aka": [],
        "hotel_description": [
            "Lyon",
            "Valence"
        ],
        "hotel_name": [
            "Lyon"
        ]
    },
    "review_count": 118,
    "review_count_current": 5,
    "reviews": [
        {
            "date": "February 16, 2012",
            "detail_rating": {
                "business": null,
                "cleanliness": 4.0,
                "desk": null,
                "location": 2.0,
                "pool": null,
                "restaurant": null,
                "rooms": 3.0,
                "service": 4.0,
                "sleep": 4.0,
                "value": 4.0
            },
            "helpfulness": null,
            "id": 124686790,
            "likes": {
                "disliked": null,
                "liked": null
            },
            "rating": 3.0,
            "stay_parameters": "Stayed February 2012, traveled on business",
            "text": "Pretty much a \"motel\", but rooms quite sufficient, well heated (it was well below zero outside), staff friendly and willing to please, and the bar/restaurant quite cosy.",
            "title": "Better than expected!",
            "user": "BraddyBarcelona"
        },
        {
            "date": "August 3, 2011",
            "detail_rating": {
                "business": null,
                "cleanliness": null,
                "desk": null,
                "location": null,
                "pool": null,
                "restaurant": null,
                "rooms": null,
                "service": null,
                "sleep": null,
                "value": null
            },
            "helpfulness": null,
            "id": 116221395,
            "likes": {
                "disliked": null,
                "liked": null
            },
            "rating": 4.0,
            "stay_parameters": null,
            "text": "The stay we had had this hotel was extremely good. The room was very clean and the bed very comfortable.",
            "title": "St Rambert d'Albon",
            "user": "A TripAdvisor user"
        },
        {
            "date": "September 7, 2010",
            "detail_rating": {
                "business": null,
                "cleanliness": 4.0,
                "desk": null,
                "location": 3.0,
                "pool": null,
                "restaurant": null,
                "rooms": 2.0,
                "service": 2.0,
                "sleep": 3.0,
                "value": 3.0
            },
            "helpfulness": null,
            "id": 78567758,
            "likes": {
                "disliked": null,
                "liked": null
            },
            "rating": 3.0,
            "stay_parameters": "Stayed August 2010, traveled with family",
            "text": "We had an evening meal in the restaurant and this was excellent. The service was also very good.",
            "title": "Small rooms",
            "user": "RickChester"
        },
        {
            "date": "August 4, 2010",
            "detail_rating": {
                "business": null,
                "cleanliness": 4.0,
                "desk": null,
                "location": 4.0,
                "pool": null,
                "restaurant": null,
                "rooms": 4.0,
                "service": 4.0,
                "sleep": 3.0,
                "value": 4.0
            },
            "helpfulness": null,
            "id": 73721354,
            "likes": {
                "disliked": null,
                "liked": null
            },
            "rating": 3.0,
            "stay_parameters": "Stayed June 2010, traveled as a couple",
            "text": "We would recommend this hotel to others",
            "title": "a like it",
            "user": "carnieleo"
        },
        {
            "date": "August 10, 2006",
            "detail_rating": {
                "business": 3.0,
                "cleanliness": 3.0,
                "desk": null,
                "front_desk": 5.0,
                "location": 5.0,
                "pool": null,
                "restaurant": null,
                "rooms": 3.0,
                "service": 3.0,
                "sleep": null,
                "value": 4.0
            },
            "helpfulness": null,
            "id": 5593796,
            "likes": {
                "disliked": "\u2014 nothing",
                "liked": "\u2014 Somewhere to walk the dog"
            },
            "rating": 4.0,
            "stay_parameters": "Stayed August 2006, traveled as a couple",
            "text": "Ibis are a major player but they need to re-evaluate their rooms. We are a family of three and the rooms are so small compared to newer competitors that offer family rooms. They are clean and and the food is OK (unfortunately that is going downhill though). I feel that competitors will start to take the market away from Accorr though if they don't improve what they offer.",
            "title": "Halfway house",
            "user": "G07"
        }
    ],
    "slim_ranking": 1.0,
    "stars": null,
    "tripadvisor": {
        "VISITED": false,
        "country_name": null,
        "locality": null,
        "pic_link": null,
        "street_address": null
    },
    "user_rating": 3.5,
    "variance": {
        "average": 32,
        "excellent": 14,
        "poor": 12,
        "terrible": 0,
        "very good": 60
    }
}