{
    "aka": "Premier Inn Newcastle (Team Valley) Hotel Gateshead",
    "description": null,
    "detail_rating": {
        "cleanliness": null,
        "location": null,
        "rooms": null,
        "service": null,
        "sleep": null,
        "value": null
    },
    "location": {
        "city": null,
        "continent": "Europe",
        "country": "United Kingdom (UK)",
        "proposed_city": "Newcastle",
        "province": null,
        "region": null
    },
    "name": "Premier Inn Newcastle - Team Valley",
    "places": {
        "aka": [
            "Newcastle",
            "Gateshead"
        ],
        "hotel_description": [],
        "hotel_name": [
            "Newcastle"
        ]
    },
    "review_count": 287,
    "review_count_current": 20,
    "reviews": [
        {
            "date": "December 11, 2012",
            "detail_rating": {
                "business": null,
                "cleanliness": 5.0,
                "desk": null,
                "location": 5.0,
                "pool": null,
                "restaurant": null,
                "rooms": 5.0,
                "service": 5.0,
                "sleep": 5.0,
                "value": 5.0
            },
            "helpfulness": null,
            "id": 147255916,
            "likes": {
                "disliked": null,
                "liked": null
            },
            "rating": 5.0,
            "stay_parameters": "Stayed November 2012, traveled with family",
            "text": "3rd time I have stayed here this time with my mum, 2 aunties and sister-in-law for a family get together and to do some shopping at the Metro Centre.",
            "title": "Excellent stay - staff could not have been more helpful",
            "user": "RandGP"
        },
        {
            "date": "December 3, 2012",
            "detail_rating": {
                "business": null,
                "cleanliness": 5.0,
                "desk": null,
                "location": 5.0,
                "pool": null,
                "restaurant": null,
                "rooms": 4.0,
                "service": 5.0,
                "sleep": 5.0,
                "value": 4.0
            },
            "helpfulness": null,
            "id": 146722268,
            "likes": {
                "disliked": null,
                "liked": null
            },
            "rating": 5.0,
            "stay_parameters": "Stayed December 2012, traveled with family",
            "text": "The reception staff were very welcoming and nothing was too much trouble for them. The same with the restaurant and bar staff.",
            "title": "Great location for metro centre",
            "user": "lizalexander"
        },
        {
            "date": "December 3, 2012",
            "detail_rating": {
                "business": null,
                "cleanliness": 3.0,
                "desk": null,
                "location": 4.0,
                "pool": null,
                "restaurant": null,
                "rooms": 3.0,
                "service": 2.0,
                "sleep": 2.0,
                "value": 3.0
            },
            "helpfulness": null,
            "id": 146684061,
            "likes": {
                "disliked": null,
                "liked": null
            },
            "rating": 3.0,
            "stay_parameters": "Stayed November 2012, traveled as a couple",
            "text": "Room very large and clean, twins have 2 double beds which are very comfortable.",
            "title": "Naked guy at the door at 4am !",
            "user": "cjad30"
        },
        {
            "date": "December 3, 2012",
            "detail_rating": {
                "business": null,
                "cleanliness": 4.0,
                "desk": null,
                "location": 4.0,
                "pool": null,
                "restaurant": null,
                "rooms": 4.0,
                "service": 5.0,
                "sleep": 4.0,
                "value": 4.0
            },
            "helpfulness": null,
            "id": 146683909,
            "likes": {
                "disliked": null,
                "liked": null
            },
            "rating": 4.0,
            "stay_parameters": "Stayed December 2012, traveled with family",
            "text": "We ate in the restaurant in the evening and could not fault the food or the breakfast in the morning.",
            "title": "Team Valley Premier Inn",
            "user": "johnjoewood"
        },
        {
            "date": "November 30, 2012",
            "detail_rating": {
                "business": null,
                "cleanliness": 5.0,
                "desk": null,
                "location": 3.0,
                "pool": null,
                "restaurant": null,
                "rooms": 5.0,
                "service": 5.0,
                "sleep": 5.0,
                "value": 5.0
            },
            "helpfulness": null,
            "id": 146501721,
            "likes": {
                "disliked": null,
                "liked": null
            },
            "rating": 4.0,
            "stay_parameters": "Stayed November 2012, traveled as a couple",
            "text": "We were due to check out on the Saturday at 12.00noon however one of my auties was unwell in the night (not the food) and was unable to travel. Michelle on reception could not be more accommodating, she arranged for my auntie to have a late check out and also asked if there was anything else she required (toast, tea etc). This was fantastic service which was above and beyond. Special thanks to Michelle as she also arranged for the domestic staff not to disturb my auntie whilst she slept.",
            "title": "Good value",
            "user": "EileenUV"
        },
        {
            "date": "November 3, 2012",
            "detail_rating": {
                "business": null,
                "cleanliness": 4.0,
                "desk": null,
                "location": 3.0,
                "pool": null,
                "restaurant": null,
                "rooms": 3.0,
                "service": 4.0,
                "sleep": 4.0,
                "value": 4.0
            },
            "helpfulness": null,
            "id": 144373580,
            "likes": {
                "disliked": null,
                "liked": null
            },
            "rating": 4.0,
            "stay_parameters": "Stayed November 2012, traveled on business",
            "text": "As always very nice staff.",
            "title": "A nice evening stay",
            "user": "Paul L"
        },
        {
            "date": "November 1, 2012",
            "detail_rating": {
                "business": null,
                "cleanliness": 5.0,
                "desk": null,
                "location": 4.0,
                "pool": null,
                "restaurant": null,
                "rooms": 5.0,
                "service": 5.0,
                "sleep": 2.0,
                "value": 4.0
            },
            "helpfulness": 1,
            "id": 144214723,
            "likes": {
                "disliked": null,
                "liked": null
            },
            "rating": 4.0,
            "stay_parameters": "Stayed October 2012, traveled with family",
            "text": "One bonus was that the receptionist offered two room cards, one to gain access to the room and the other to keep in the slot on the wall to keep the power on to ensure the room remained warm. Having spent two nights at two other premier inn this week, and been cold, this was an unprompted offer and well received. Food was standard issue premier inn fayre, pleasant enough and reasonable value for money.",
            "title": "Family visit to Newcastle",
            "user": "smf64"
        },
        {
            "date": "October 27, 2012",
            "detail_rating": {
                "business": null,
                "cleanliness": 5.0,
                "desk": null,
                "location": 3.0,
                "pool": null,
                "restaurant": null,
                "rooms": 4.0,
                "service": 5.0,
                "sleep": 4.0,
                "value": 3.0
            },
            "helpfulness": 1,
            "id": 143857667,
            "likes": {
                "disliked": null,
                "liked": null
            },
            "rating": 4.0,
            "stay_parameters": "Stayed October 2012, traveled on business",
            "text": "Great standard of rooms and the breakfasts are MUCH better than Travelodge, which is the budget chain we usually choose. However, my wife does like a bath, and there were only showers in the rooms - but it is a GREAT shower! The breakfast buffet uses very good ingredients, and they are cooked well. For this reason aloe, I'd be happy to go back to a Premier Inn. However, the mattress really spoilt our sleep - just a bit too lumpy.",
            "title": "Great for business stays",
            "user": "Frenchchelsea"
        },
        {
            "date": "October 24, 2012",
            "detail_rating": {
                "business": null,
                "cleanliness": 5.0,
                "desk": null,
                "location": 4.0,
                "pool": null,
                "restaurant": null,
                "rooms": 5.0,
                "service": 5.0,
                "sleep": 5.0,
                "value": 5.0
            },
            "helpfulness": 2,
            "id": 143597757,
            "likes": {
                "disliked": null,
                "liked": null
            },
            "rating": 5.0,
            "stay_parameters": "Stayed October 2012, traveled with family",
            "text": "I chose this hotel for convenience of its location. Staff were very friendly and welcoming. Room was clean and spacious and perfect for a business stay.",
            "title": "A comfortable and relaxing stay",
            "user": "Julie E"
        },
        {
            "date": "October 19, 2012",
            "detail_rating": {
                "business": null,
                "cleanliness": 5.0,
                "desk": null,
                "location": 5.0,
                "pool": null,
                "restaurant": null,
                "rooms": 5.0,
                "service": 5.0,
                "sleep": 2.0,
                "value": 4.0
            },
            "helpfulness": 1,
            "id": 143231804,
            "likes": {
                "disliked": null,
                "liked": null
            },
            "rating": 4.0,
            "stay_parameters": "Stayed October 2012, traveled on business",
            "text": "If you want to eat out then you need to take a taxi or drive as the hotel is on the team valley business estate and not in town. However the hotel restaurant has a good menu and is reasonably priced. The wifi was a bit of a nightmare to login to and kept connected. Can Premier Inn not just charge an extra \u00a33 per night (cost of 24hr wifi) as standard??",
            "title": "Not at all bad",
            "user": "Steve H"
        },
        {
            "date": "November 27, 2012",
            "detail_rating": {
                "business": null,
                "cleanliness": 5.0,
                "desk": null,
                "location": 5.0,
                "pool": null,
                "restaurant": null,
                "rooms": 4.0,
                "service": 5.0,
                "sleep": 5.0,
                "value": 5.0
            },
            "helpfulness": null,
            "id": 146293966,
            "likes": {
                "disliked": null,
                "liked": null
            },
            "rating": 5.0,
            "stay_parameters": "Stayed November 2012, traveled with family",
            "text": "Booked this hotel for \u00a319 for a trip to Newcastle to meet friends. We have stayed in the hotel before and experienced the same level of customer care as before. All staff were very friendly and helpful.",
            "title": "Good hotel in a good location",
            "user": "Kylos30"
        },
        {
            "date": "November 25, 2012",
            "detail_rating": {
                "business": null,
                "cleanliness": 5.0,
                "desk": null,
                "location": 4.0,
                "pool": null,
                "restaurant": null,
                "rooms": 5.0,
                "service": 5.0,
                "sleep": null,
                "value": 5.0
            },
            "helpfulness": null,
            "id": 146155455,
            "likes": {
                "disliked": null,
                "liked": null
            },
            "rating": 5.0,
            "stay_parameters": "Stayed November 2012",
            "text": "We stayed in room 217 (family room), which was very spacious but without a bath.",
            "title": "Great night's sleep",
            "user": "studenteternal"
        },
        {
            "date": "November 24, 2012",
            "detail_rating": {
                "business": null,
                "cleanliness": 4.0,
                "desk": null,
                "location": 2.0,
                "pool": null,
                "restaurant": null,
                "rooms": 5.0,
                "service": 5.0,
                "sleep": 5.0,
                "value": 4.0
            },
            "helpfulness": null,
            "id": 146088094,
            "likes": {
                "disliked": null,
                "liked": null
            },
            "rating": 4.0,
            "stay_parameters": "Stayed November 2012, traveled on business",
            "text": "We would recommend this to other people looking for a good hotel and we didn't mind staying away from the centre as we know the area well. The fact that it's just off the A1 within Team Valley make it easier to check out and travel home without having to battle through a city centre.",
            "title": "First time at a Premier Inn, hopefully not the last",
            "user": "pula888"
        },
        {
            "date": "November 18, 2012",
            "detail_rating": {
                "business": null,
                "cleanliness": 5.0,
                "desk": null,
                "location": 5.0,
                "pool": null,
                "restaurant": null,
                "rooms": 5.0,
                "service": 5.0,
                "sleep": 5.0,
                "value": 5.0
            },
            "helpfulness": null,
            "id": 145682902,
            "likes": {
                "disliked": null,
                "liked": null
            },
            "rating": 5.0,
            "stay_parameters": "Stayed November 2012, traveled with family",
            "text": "I stayed here for a night with a coach load of ladies on a shopping trip to the Metro Centre and Newcastle.",
            "title": "wonderful hotel",
            "user": "bellamish"
        },
        {
            "date": "November 12, 2012",
            "detail_rating": {
                "business": null,
                "cleanliness": null,
                "desk": null,
                "location": null,
                "pool": null,
                "restaurant": null,
                "rooms": null,
                "service": null,
                "sleep": null,
                "value": null
            },
            "helpfulness": null,
            "id": 145257723,
            "likes": {
                "disliked": null,
                "liked": null
            },
            "rating": 5.0,
            "stay_parameters": null,
            "text": "It is a short drive from the Metro centre and was an ideal base for us. The reception and lounge bar area is an ideal area to relax and we found the staff friendly and helpful when we needed to book a taxi to go out for dinner. They have a good restaurant but we only ate breakfast there. Breakfast was varied and plentiful amd good quality. Worth the money.",
            "title": "Great inn!",
            "user": "Mike M"
        },
        {
            "date": "October 15, 2012",
            "detail_rating": {
                "business": null,
                "cleanliness": 5.0,
                "desk": null,
                "location": 5.0,
                "pool": null,
                "restaurant": null,
                "rooms": 5.0,
                "service": 5.0,
                "sleep": 5.0,
                "value": 5.0
            },
            "helpfulness": 1,
            "id": 142902278,
            "likes": {
                "disliked": null,
                "liked": null
            },
            "rating": 5.0,
            "stay_parameters": "Stayed October 2012, traveled with family",
            "text": "Booked this premier inn as a treat for my daughter . Stayed here before with a friend love the location and the staff . We had the meal deal (evening meal and breakfast ) well worth the money 3 courses for evening meal plus drink then full buffet breakfast eat as much as you like , The rooms are gorgeous spotlessly clean and comfortable very relaxing cannot fault anything at all love love premier inns",
            "title": "Another great stay",
            "user": "bubbleshardglitz"
        },
        {
            "date": "October 14, 2012",
            "detail_rating": {
                "business": null,
                "cleanliness": 5.0,
                "desk": null,
                "location": 5.0,
                "pool": null,
                "restaurant": null,
                "rooms": 5.0,
                "service": 5.0,
                "sleep": null,
                "value": 5.0
            },
            "helpfulness": null,
            "id": 142793230,
            "likes": {
                "disliked": null,
                "liked": null
            },
            "rating": 5.0,
            "stay_parameters": "Stayed October 2012",
            "text": "After arriving I realised when I booked online I had made a typo and actually booked to stay in November rather than October after a rather red face the receptionist refunded my booking and got me a room, the room was spacious and clean , the restaurant was not too busy and choice of food good, staff were very friendly and although I only stayed overnight Will stay here again and recommend to anyone",
            "title": "A great hotel to stay",
            "user": "adavies32"
        },
        {
            "date": "October 6, 2012",
            "detail_rating": {
                "business": null,
                "cleanliness": 5.0,
                "desk": null,
                "location": 4.0,
                "pool": null,
                "restaurant": null,
                "rooms": 4.0,
                "service": 5.0,
                "sleep": 4.0,
                "value": 5.0
            },
            "helpfulness": null,
            "id": 142157638,
            "likes": {
                "disliked": null,
                "liked": null
            },
            "rating": 5.0,
            "stay_parameters": "Stayed October 2012, traveled as a couple",
            "text": "Can certainly recommend this Premier Inn. We stayed for just one night but our experience was a very good one. Our room was clean and comfortable and we received a very warm welcome from the friendly and efficient Reception staff. We have stayed in more expensive hotels and not had such good accommodation. We had a great night's sleep - no noise interference as can sometimes be the case in a city weekend stay.",
            "title": "Great value! Great accommodation! Great service!",
            "user": "happyviator"
        },
        {
            "date": "October 5, 2012",
            "detail_rating": {
                "business": null,
                "cleanliness": 5.0,
                "desk": null,
                "location": 5.0,
                "pool": null,
                "restaurant": null,
                "rooms": 5.0,
                "service": 5.0,
                "sleep": 5.0,
                "value": 5.0
            },
            "helpfulness": null,
            "id": 142057062,
            "likes": {
                "disliked": null,
                "liked": null
            },
            "rating": 5.0,
            "stay_parameters": "Stayed October 2012, traveled solo",
            "text": "Stayed last night at the hotel.",
            "title": "Excellent quality",
            "user": "Ann W"
        },
        {
            "date": "September 18, 2012",
            "detail_rating": {
                "business": null,
                "cleanliness": 5.0,
                "desk": null,
                "location": 5.0,
                "pool": null,
                "restaurant": null,
                "rooms": 5.0,
                "service": 5.0,
                "sleep": 5.0,
                "value": 5.0
            },
            "helpfulness": null,
            "id": 140643794,
            "likes": {
                "disliked": null,
                "liked": null
            },
            "rating": 5.0,
            "stay_parameters": "Stayed September 2012, traveled with family",
            "text": "Lovely service from friendly staff",
            "title": "Excellent hotel",
            "user": "Sharon451967"
        }
    ],
    "slim_ranking": 0.190476190476,
    "stars": null,
    "tripadvisor": {
        "VISITED": false,
        "country_name": null,
        "locality": null,
        "pic_link": null,
        "street_address": null
    },
    "user_rating": 4.5,
    "variance": {
        "average": 22,
        "excellent": 165,
        "poor": 9,
        "terrible": 5,
        "very good": 86
    }
}