{
    "aka": "Villa Della Fonte Guest House Hotel",
    "description": null,
    "detail_rating": {
        "cleanliness": null,
        "location": null,
        "rooms": null,
        "service": null,
        "sleep": null,
        "value": null
    },
    "location": {
        "city": "Rome",
        "continent": "Europe",
        "country": "Italy",
        "proposed_city": null,
        "province": null,
        "region": "Lazio"
    },
    "name": "Villa della Fonte Guest House",
    "places": {
        "aka": [],
        "hotel_description": [],
        "hotel_name": []
    },
    "review_count": 116,
    "review_count_current": 4,
    "reviews": [
        {
            "date": "June 14, 2004",
            "detail_rating": {
                "business": null,
                "cleanliness": null,
                "desk": null,
                "location": null,
                "pool": null,
                "restaurant": null,
                "rooms": null,
                "service": null,
                "sleep": null,
                "value": null
            },
            "helpfulness": 5,
            "id": 2187902,
            "likes": {
                "disliked": null,
                "liked": null
            },
            "rating": 4.0,
            "stay_parameters": null,
            "text": "My daughter and I stayed here for 8 nights and it was fantastic. The staff is so helpful and charming. The rooms are very clean, especially since there is no smoking allowed. Breakfast on the terrace is quite nice; if you want fresh fruit, there is an open air market 2 blocks away. Also there is air-conditioning, which is very important since the lively Trastevere area can be extremely noisy into the early morning hours. You can walk everywhere from this central location, and you're surrounded by restaurants and bars. I wouldn't hesitate to stay here again.",
            "title": "Wonderful experience in Trastevere",
            "user": "CharlieMontereyCA"
        },
        {
            "date": "May 31, 2004",
            "detail_rating": {
                "business": null,
                "cleanliness": null,
                "desk": null,
                "location": null,
                "pool": null,
                "restaurant": null,
                "rooms": null,
                "service": null,
                "sleep": null,
                "value": null
            },
            "helpfulness": 4,
            "id": 2132570,
            "likes": {
                "disliked": null,
                "liked": null
            },
            "rating": 4.0,
            "stay_parameters": null,
            "text": "My husband and I just returned from a one week trip to Rome (5/15-5/22). This is a small but terrific hotel. Our room was small, but nicely decorated and had an en-suite bathroom. The hotel was just redone in 2000 so everything is new. They have a lovely terrace where they serve breakfast every morning. Breakfast is included in the pricing. The front desk is open 24hrs a day, so you can have all of your questions answered. The location is terrific!! We walked everywhere from the Vatican to the Piazza Navona. No problem. The Trastevere is the best place to be at night, it is all resturaunts, bars, wine bars, and people watching. I would suggest this hotel to younger singles or couples, the walking might be too much for some, and it is a busy area at night. Also, this is not the most touristy area, so most people speak little English. We don't speak Italian, but we got by ok. One other thing, no cars can drive down the street of the hotel, so you have to get dropped off or picked up by taxi a few short blocks away. We found it helpful to have the phone number for the taxi driver to call the hotel directly to get directions. Have fun in Rome, Ciao!!",
            "title": "Wonderful small hotel...",
            "user": "A TripAdvisor user"
        },
        {
            "date": "May 6, 2004",
            "detail_rating": {
                "business": null,
                "cleanliness": null,
                "desk": null,
                "location": null,
                "pool": null,
                "restaurant": null,
                "rooms": null,
                "service": null,
                "sleep": null,
                "value": null
            },
            "helpfulness": 6,
            "id": 1878795,
            "likes": {
                "disliked": null,
                "liked": null
            },
            "rating": 4.0,
            "stay_parameters": null,
            "text": "fab little guest house that was welcoming and spotlessly clean. rooms are nice, beds are really confortable and the power shower a dream!. walked EVERYWHERE from here and only had to take a bus when we had our luggage on the way home. Trastevere is a great place to stay, with loads of little bars and restaurants down a maze of cobbled streets.",
            "title": "trastevere - the place to stay",
            "user": "WW666"
        },
        {
            "date": "December 1, 2003",
            "detail_rating": {
                "business": null,
                "cleanliness": null,
                "desk": null,
                "location": null,
                "pool": null,
                "restaurant": null,
                "rooms": null,
                "service": null,
                "sleep": null,
                "value": null
            },
            "helpfulness": 9,
            "id": 1503168,
            "likes": {
                "disliked": null,
                "liked": null
            },
            "rating": 4.0,
            "stay_parameters": null,
            "text": "Very nice small (5 rooms) hotel in a great location just off Piazza Santa Maria in Trastevere, a few steps from dozens of restaurants, bars etc. Rooms are fairly well sized and spotlessly clean, as are the bathrooms. We were there in November and as the roof terrace was closed our breakfast was delivered to our room every morning. Do not be put off by the fact that it is located off a side street with graffiti filled walls, that is just the way Trastevere seems to be.",
            "title": "Villa della Fonte Guest House",
            "user": "por_1971"
        }
    ],
    "slim_ranking": 0.0946372239748,
    "stars": null,
    "tripadvisor": {
        "VISITED": false,
        "country_name": null,
        "locality": null,
        "pic_link": null,
        "street_address": null
    },
    "user_rating": 4.5,
    "variance": {
        "average": 3,
        "excellent": 73,
        "poor": 4,
        "terrible": 1,
        "very good": 35
    }
}