{
    "aka": null,
    "description": null,
    "detail_rating": {
        "cleanliness": null,
        "location": null,
        "rooms": null,
        "service": null,
        "sleep": null,
        "value": null
    },
    "location": {
        "city": "Leipzig",
        "continent": "Europe",
        "country": "Germany",
        "proposed_city": null,
        "province": null,
        "region": null
    },
    "name": "Hotel Adler Leipzig",
    "places": {
        "aka": [],
        "hotel_description": [],
        "hotel_name": [
            "Adler",
            "Leipzig"
        ]
    },
    "review_count": 59,
    "review_count_current": 2,
    "reviews": [
        {
            "date": "April 10, 2007",
            "detail_rating": {
                "business": null,
                "cleanliness": null,
                "desk": null,
                "location": null,
                "pool": null,
                "restaurant": null,
                "rooms": null,
                "service": null,
                "sleep": null,
                "value": null
            },
            "helpfulness": 3,
            "id": 7316220,
            "likes": {
                "disliked": null,
                "liked": null
            },
            "rating": 3.0,
            "stay_parameters": null,
            "text": "This hotel is good for budget travelers. We stayed in a double room for one night. The rooms are very clean and a good size. The decoration was a bit dated and the bathroom was very small.",
            "title": "Good value for money",
            "user": "annomonus"
        },
        {
            "date": "January 5, 2007",
            "detail_rating": {
                "business": null,
                "cleanliness": 4.0,
                "desk": null,
                "front_desk": 4.0,
                "location": 3.0,
                "pool": null,
                "restaurant": null,
                "rooms": 3.0,
                "service": 3.0,
                "sleep": null,
                "value": 3.0
            },
            "helpfulness": 8,
            "id": 6556617,
            "likes": {
                "disliked": null,
                "liked": null
            },
            "rating": 3.0,
            "stay_parameters": "Stayed August 2006, traveled solo",
            "text": "The area around the hotel is very quiet. The train station is right next to it so is very convenient for Leipzig city center.",
            "title": "Small but reasonably convenient",
            "user": "cherubino"
        }
    ],
    "slim_ranking": 0.722772277228,
    "stars": 3,
    "tripadvisor": {
        "VISITED": false,
        "country_name": null,
        "locality": null,
        "pic_link": null,
        "street_address": null
    },
    "user_rating": 3.0,
    "variance": {
        "average": 11,
        "excellent": 10,
        "poor": 4,
        "terrible": 15,
        "very good": 19
    }
}