{
    "aka": "Kupeli Hotel Istanbul",
    "description": null,
    "detail_rating": {
        "cleanliness": 4.5,
        "location": 4.5,
        "rooms": 4.0,
        "service": 4.5,
        "sleep": 4.0,
        "value": 4.5
    },
    "location": {
        "city": null,
        "continent": "Europe",
        "country": "Turkey",
        "proposed_city": null,
        "province": null,
        "region": null
    },
    "name": "Kupeli Hotel",
    "places": {
        "aka": [],
        "hotel_description": [],
        "hotel_name": []
    },
    "review_count": 246,
    "review_count_current": 20,
    "reviews": [
        {
            "date": "October 27, 2011",
            "detail_rating": {
                "business": null,
                "cleanliness": 5.0,
                "desk": null,
                "location": 5.0,
                "pool": null,
                "restaurant": null,
                "rooms": 5.0,
                "service": 5.0,
                "sleep": 5.0,
                "value": 5.0
            },
            "helpfulness": null,
            "id": 119781946,
            "likes": {
                "disliked": null,
                "liked": null
            },
            "rating": 5.0,
            "stay_parameters": "Stayed October 2011, traveled with friends",
            "text": "It was our first time to Istanbul and we stayed in Kupeli hotel because of the location and reviews we had read about it. It was nothing short of AMAZING.",
            "title": "AMAZING - RECOMMENDED",
            "user": "MaxineChehab"
        },
        {
            "date": "October 26, 2011",
            "detail_rating": {
                "business": null,
                "cleanliness": 4.0,
                "desk": null,
                "location": 5.0,
                "pool": null,
                "restaurant": null,
                "rooms": 4.0,
                "service": 4.0,
                "sleep": 5.0,
                "value": 5.0
            },
            "helpfulness": null,
            "id": 119764843,
            "likes": {
                "disliked": null,
                "liked": null
            },
            "rating": 4.0,
            "stay_parameters": "Stayed September 2011, traveled with friends",
            "text": "The location in the old city is perfect. It is walking distance from the Grand Bazaar and all of the attractions located in the old city of Istanbul.",
            "title": "A Find in Istanbul",
            "user": "Susan260"
        },
        {
            "date": "October 26, 2011",
            "detail_rating": {
                "business": null,
                "cleanliness": 5.0,
                "desk": null,
                "location": 5.0,
                "pool": null,
                "restaurant": null,
                "rooms": 5.0,
                "service": 5.0,
                "sleep": 5.0,
                "value": 5.0
            },
            "helpfulness": null,
            "id": 119762528,
            "likes": {
                "disliked": null,
                "liked": null
            },
            "rating": 5.0,
            "stay_parameters": "Stayed October 2011, traveled with friends",
            "text": "The staff (Mahir and Ozgur and others) were very friendly and understood English and helped us figuring out where to go in our free time and with the transportation.",
            "title": "Kupeli Hotel is a jewel within the Old City!",
            "user": "Zeina Maria C"
        },
        {
            "date": "October 19, 2011",
            "detail_rating": {
                "business": null,
                "cleanliness": 5.0,
                "desk": null,
                "location": 5.0,
                "pool": null,
                "restaurant": null,
                "rooms": 5.0,
                "service": 5.0,
                "sleep": 5.0,
                "value": 5.0
            },
            "helpfulness": null,
            "id": 119477132,
            "likes": {
                "disliked": null,
                "liked": null
            },
            "rating": 5.0,
            "stay_parameters": "Stayed October 2011, traveled on business",
            "text": "The rooms and bathrooms are very clean and tidy and they have a typical turkish style which is very sweet. The breakfast buffet is very generous, you can find anything you are craving for as a breakfast.",
            "title": "Very friendly Staff",
            "user": "Abbas F"
        },
        {
            "date": "October 8, 2011",
            "detail_rating": {
                "business": null,
                "cleanliness": 5.0,
                "desk": null,
                "location": 5.0,
                "pool": null,
                "restaurant": null,
                "rooms": 5.0,
                "service": 5.0,
                "sleep": 5.0,
                "value": 5.0
            },
            "helpfulness": null,
            "id": 119083144,
            "likes": {
                "disliked": null,
                "liked": null
            },
            "rating": 5.0,
            "stay_parameters": "Stayed September 2011, traveled with family",
            "text": "This hotel is really recommended. It is perfect in all ways.",
            "title": "Amazing trip",
            "user": "Taheer W"
        },
        {
            "date": "August 18, 2011",
            "detail_rating": {
                "business": null,
                "cleanliness": 4.0,
                "desk": null,
                "location": null,
                "pool": null,
                "restaurant": null,
                "rooms": null,
                "service": 4.0,
                "sleep": 3.0,
                "value": 4.0
            },
            "helpfulness": null,
            "id": 116893493,
            "likes": {
                "disliked": null,
                "liked": null
            },
            "rating": 4.0,
            "stay_parameters": "Stayed August 2011, traveled with family",
            "text": "We arrived during renovation, so it got better each day! Everyone was so friendly, the staff could not do enough for you, even when I forgot some important tablets, the reception staff organised for a friend to take me to a chemist nearby and translate what I wanted. The rooms were clean, the breakfast suited everyone's tastes. There will be teething problems but the staff need to know what they are to address them. it's a big change from what we expected on the picutre of the old hotel on the internet. Plus you get to step out into a film set right outside the front door - Coronation Street in Istanbul!",
            "title": "A LOVELY FRIENDLY HOTEL",
            "user": "MRSTOFFS"
        },
        {
            "date": "August 4, 2011",
            "detail_rating": {
                "business": null,
                "cleanliness": 2.0,
                "desk": null,
                "location": null,
                "pool": null,
                "restaurant": null,
                "rooms": null,
                "service": 1.0,
                "sleep": 2.0,
                "value": 1.0
            },
            "helpfulness": 1,
            "id": 116239645,
            "likes": {
                "disliked": null,
                "liked": null
            },
            "rating": 1.0,
            "stay_parameters": "Stayed April 2011, traveled with friends",
            "text": "Don't miss out on Cozy Pub/Restaurant either - they have a spectacular rooftop restaurant.... We will return! Alan, Michele, Josh and Tom Finch",
            "title": "No-go",
            "user": "MariaTarasova"
        },
        {
            "date": "July 6, 2011",
            "detail_rating": {
                "business": null,
                "cleanliness": null,
                "desk": null,
                "location": null,
                "pool": null,
                "restaurant": null,
                "rooms": null,
                "service": null,
                "sleep": null,
                "value": null
            },
            "helpfulness": null,
            "id": 115092741,
            "likes": {
                "disliked": null,
                "liked": null
            },
            "rating": 5.0,
            "stay_parameters": null,
            "text": "The hotel pretends to be 4 star, I would say it's 2! The service was just horrible-horrible!",
            "title": "we loved it and we\"ll be back",
            "user": "A TripAdvisor user"
        },
        {
            "date": "July 1, 2011",
            "detail_rating": {
                "business": null,
                "cleanliness": 4.0,
                "desk": null,
                "location": null,
                "pool": null,
                "restaurant": null,
                "rooms": null,
                "service": 4.0,
                "sleep": 4.0,
                "value": 5.0
            },
            "helpfulness": null,
            "id": 114924963,
            "likes": {
                "disliked": null,
                "liked": null
            },
            "rating": 4.0,
            "stay_parameters": "Stayed July 2011, traveled with friends",
            "text": "First of all the blow dryer was sparking, we asked to have it replaced or fixed and got the promise from the receptionist that it will be done next day. As we returned back to the room next day in the afternoon we found out the broken death-carrying blow dryer was still there. The receptionist told us angrily that it was Sunday and there was not much he could do. So why saying they would take care of it in the first place?! They ended up giving us a very old portable blow dryer.",
            "title": "Nice and cozy hotel",
            "user": "Sonja19"
        },
        {
            "date": "June 28, 2011",
            "detail_rating": {
                "business": null,
                "cleanliness": 5.0,
                "desk": null,
                "location": null,
                "pool": null,
                "restaurant": null,
                "rooms": null,
                "service": 5.0,
                "sleep": 4.0,
                "value": 4.0
            },
            "helpfulness": null,
            "id": 114826270,
            "likes": {
                "disliked": null,
                "liked": null
            },
            "rating": 4.0,
            "stay_parameters": "Stayed June 2011, traveled with friends",
            "text": "Next thing: the towel ring. It was broken as we moved in and never got fixed either so we had to keep hand towel on the sink.",
            "title": "Great hotel and staff",
            "user": "magrat7"
        },
        {
            "date": "October 4, 2011",
            "detail_rating": {
                "business": null,
                "cleanliness": 4.0,
                "desk": null,
                "location": 5.0,
                "pool": null,
                "restaurant": null,
                "rooms": 4.0,
                "service": 4.0,
                "sleep": 4.0,
                "value": 4.0
            },
            "helpfulness": 1,
            "id": 118936254,
            "likes": {
                "disliked": null,
                "liked": null
            },
            "rating": 4.0,
            "stay_parameters": "Stayed July 2011, traveled with friends",
            "text": "Well located, close to the main points to be visited. cozy",
            "title": "Well located and fair price",
            "user": "F\u00e1bio O"
        },
        {
            "date": "October 4, 2011",
            "detail_rating": {
                "business": null,
                "cleanliness": 5.0,
                "desk": null,
                "location": 5.0,
                "pool": null,
                "restaurant": null,
                "rooms": 4.0,
                "service": 5.0,
                "sleep": 5.0,
                "value": 5.0
            },
            "helpfulness": null,
            "id": 118934842,
            "likes": {
                "disliked": null,
                "liked": null
            },
            "rating": 5.0,
            "stay_parameters": "Stayed September 2011, traveled with friends",
            "text": "and helpful staff, especially receptionist Yigit Mahir, who was very attentive not only the hotel but the indications of the city. English fluently and easily approachable.",
            "title": "Best of Istanbul",
            "user": "Catarina M"
        },
        {
            "date": "September 23, 2011",
            "detail_rating": {
                "business": null,
                "cleanliness": 5.0,
                "desk": null,
                "location": 5.0,
                "pool": null,
                "restaurant": null,
                "rooms": 5.0,
                "service": 4.0,
                "sleep": 5.0,
                "value": 5.0
            },
            "helpfulness": null,
            "id": 118481652,
            "likes": {
                "disliked": null,
                "liked": null
            },
            "rating": 4.0,
            "stay_parameters": "Stayed September 2011, traveled as a couple",
            "text": "Great location, excellent infrastructure, good price and good management",
            "title": "A great little hotel",
            "user": "i4ishy"
        },
        {
            "date": "September 22, 2011",
            "detail_rating": {
                "business": null,
                "cleanliness": 1.0,
                "desk": null,
                "location": 1.0,
                "pool": null,
                "restaurant": null,
                "rooms": 1.0,
                "service": 1.0,
                "sleep": 1.0,
                "value": 1.0
            },
            "helpfulness": 1,
            "id": 118436654,
            "likes": {
                "disliked": null,
                "liked": null
            },
            "rating": 1.0,
            "stay_parameters": "Stayed September 2011, traveled with family",
            "text": "We had a great service for the Mr. Mahyr.",
            "title": "An unpleasant experience",
            "user": "Florin_mch"
        },
        {
            "date": "September 18, 2011",
            "detail_rating": {
                "business": null,
                "cleanliness": null,
                "desk": null,
                "location": 5.0,
                "pool": null,
                "restaurant": null,
                "rooms": 5.0,
                "service": 5.0,
                "sleep": null,
                "value": 5.0
            },
            "helpfulness": 1,
            "id": 118275665,
            "likes": {
                "disliked": null,
                "liked": null
            },
            "rating": 5.0,
            "stay_parameters": "Stayed August 2011, traveled solo",
            "text": "Once we arrived in Brazil pointed out to our friends.",
            "title": "I would certainly stay here again!",
            "user": "castrod78702"
        },
        {
            "date": "December 5, 2011",
            "detail_rating": {
                "business": null,
                "cleanliness": 3.0,
                "desk": null,
                "location": 4.0,
                "pool": null,
                "restaurant": null,
                "rooms": 1.0,
                "service": 3.0,
                "sleep": 1.0,
                "value": 2.0
            },
            "helpfulness": 3,
            "id": 121406086,
            "likes": {
                "disliked": null,
                "liked": null
            },
            "rating": 2.0,
            "stay_parameters": "Stayed December 2011, traveled as a couple",
            "text": "Pros:",
            "title": "Big Brother Rooms, Good Location & That's it!",
            "user": "IonutBucharest"
        },
        {
            "date": "December 3, 2011",
            "detail_rating": {
                "business": null,
                "cleanliness": 5.0,
                "desk": null,
                "location": 5.0,
                "pool": null,
                "restaurant": null,
                "rooms": 4.0,
                "service": 5.0,
                "sleep": null,
                "value": 5.0
            },
            "helpfulness": null,
            "id": 121350551,
            "likes": {
                "disliked": null,
                "liked": null
            },
            "rating": 5.0,
            "stay_parameters": "Stayed November 2011",
            "text": "- location: 10 min walk to blue mosque, university and grand bazaar area (Sultanahmed area);",
            "title": "Wonderful staff",
            "user": "wahlstrl"
        },
        {
            "date": "November 20, 2011",
            "detail_rating": {
                "business": null,
                "cleanliness": 4.0,
                "desk": null,
                "location": 5.0,
                "pool": null,
                "restaurant": null,
                "rooms": 4.0,
                "service": 5.0,
                "sleep": 4.0,
                "value": 4.0
            },
            "helpfulness": null,
            "id": 120838944,
            "likes": {
                "disliked": null,
                "liked": null
            },
            "rating": 4.0,
            "stay_parameters": "Stayed October 2011, traveled with friends",
            "text": "- clean bedding and clean location;",
            "title": "TINA. USA",
            "user": "KIM D"
        },
        {
            "date": "November 17, 2011",
            "detail_rating": {
                "business": null,
                "cleanliness": 4.0,
                "desk": null,
                "location": 4.0,
                "pool": null,
                "restaurant": null,
                "rooms": 3.0,
                "service": 3.0,
                "sleep": 3.0,
                "value": 4.0
            },
            "helpfulness": 1,
            "id": 120705417,
            "likes": {
                "disliked": null,
                "liked": null
            },
            "rating": 3.0,
            "stay_parameters": "Stayed November 2011, traveled with family",
            "text": "- elevator;",
            "title": "City Center Hotel",
            "user": "Kamal G"
        },
        {
            "date": "November 10, 2011",
            "detail_rating": {
                "business": null,
                "cleanliness": 5.0,
                "desk": null,
                "location": 5.0,
                "pool": null,
                "restaurant": null,
                "rooms": 4.0,
                "service": 5.0,
                "sleep": 4.0,
                "value": 5.0
            },
            "helpfulness": null,
            "id": 120411077,
            "likes": {
                "disliked": null,
                "liked": null
            },
            "rating": 5.0,
            "stay_parameters": "Stayed October 2011, traveled as a couple",
            "text": "- friendly staff although starting with the reservation and with the welcoming we were told each time to wait until the English speaking guy will come at concierge to help us with our basic demands;",
            "title": "1 week heaven",
            "user": "Atesundjasmin"
        }
    ],
    "slim_ranking": 0.2224797219,
    "stars": 4,
    "tripadvisor": {
        "VISITED": false,
        "country_name": null,
        "locality": null,
        "pic_link": null,
        "street_address": null
    },
    "user_rating": 4.0,
    "variance": {
        "average": 21,
        "excellent": 129,
        "poor": 11,
        "terrible": 13,
        "very good": 72
    }
}