{
    "aka": "Riad Malika Hotel Marrakech",
    "description": "One of the first charmed hotel in Marrakech, located in a historic place of the Medina, a few steps from the famous Dar el Bacha, Riad Malika offers, in a subtle blend of \"Art Deco\" and traditional moroccan art, 10 luxurious rooms, patios, its swimming pool, hammam and its beautiful gardens shaded.",
    "detail_rating": {
        "cleanliness": null,
        "location": null,
        "rooms": null,
        "service": null,
        "sleep": null,
        "value": null
    },
    "location": {
        "city": "Marrakech",
        "continent": "Africa",
        "country": "Morocco",
        "proposed_city": "Medina",
        "province": null,
        "region": "Marrakech-Tensift-El Haouz Region"
    },
    "name": "Riad Malika",
    "places": {
        "aka": [],
        "hotel_description": [
            "Medina"
        ],
        "hotel_name": []
    },
    "review_count": 280,
    "review_count_current": 20,
    "reviews": [
        {
            "date": "October 2, 2013",
            "detail_rating": {
                "business": null,
                "cleanliness": 5.0,
                "desk": null,
                "location": 4.0,
                "pool": null,
                "restaurant": null,
                "rooms": 5.0,
                "service": 5.0,
                "sleep": 4.0,
                "value": 4.0
            },
            "helpfulness": 1,
            "id": 179471744,
            "likes": {
                "disliked": null,
                "liked": null
            },
            "rating": 5.0,
            "stay_parameters": "Stayed July 2013, traveled with friends",
            "text": "My sister and I had a wonderful 3 night stay back in July and our whole experience was perfect from beginning to end. The taxi was ready and waiting at the airport and after a short journey, we had a fantastic meal ready when we were that evening. Riad Malika is a perfect escape from the busy Marrakesh streets with beautiful courtyard gardens and a very refreshing pool to escape to in the heat of the day. Our room was luxurious with fantastic rooftop views and the breakfasts were the best we ever had! We felt incredibly safe and secure and have absolutely no complaints about our stay there, except that we wish we could have stayed for longer! Thank you for a wonderful stay!",
            "title": "Perfection",
            "user": "Sophia S"
        },
        {
            "date": "September 28, 2013",
            "detail_rating": {
                "business": null,
                "cleanliness": 5.0,
                "desk": null,
                "location": 5.0,
                "pool": null,
                "restaurant": null,
                "rooms": 5.0,
                "service": 5.0,
                "sleep": 5.0,
                "value": 5.0
            },
            "helpfulness": null,
            "id": 178911733,
            "likes": {
                "disliked": null,
                "liked": null
            },
            "rating": 5.0,
            "stay_parameters": "Stayed September 2013, traveled as a couple",
            "text": "From the moment we entered the Riad after a gruelling two hour wait through customs we knew it was going to be just what we needed at the end of a long day travelling, so quiet and peaceful. We were welcomed with a smiling face and served a beautiful meal set in the tranquil centre garden of the Riad. Our room didn't dissapoint and was so beautiful with traditional decor throughout and a huge comfortable bed covered in rose petals, what more could you want ?. The staff were always happy to help with anything we required including transport whenever needed. On our day of departure we were required to vacate our room at 12:00 noon to allow for new arrivals but we were kindly allowed to wait at the Riad and use the facilities and waiter service until our flight late in the evening.",
            "title": "Wonderful Malika",
            "user": "Carol Buz"
        },
        {
            "date": "September 24, 2013",
            "detail_rating": {
                "business": null,
                "cleanliness": 5.0,
                "desk": null,
                "location": 5.0,
                "pool": null,
                "restaurant": null,
                "rooms": 5.0,
                "service": 5.0,
                "sleep": 5.0,
                "value": 5.0
            },
            "helpfulness": null,
            "id": 178440389,
            "likes": {
                "disliked": null,
                "liked": null
            },
            "rating": 5.0,
            "stay_parameters": "Stayed September 2013, traveled with friends",
            "text": "Thank you so much Riad Malika.",
            "title": "Magical Malika",
            "user": "Danny R"
        },
        {
            "date": "September 23, 2013",
            "detail_rating": {
                "business": null,
                "cleanliness": 5.0,
                "desk": null,
                "location": 5.0,
                "pool": null,
                "restaurant": null,
                "rooms": 5.0,
                "service": 5.0,
                "sleep": 5.0,
                "value": 5.0
            },
            "helpfulness": null,
            "id": 178230289,
            "likes": {
                "disliked": null,
                "liked": null
            },
            "rating": 5.0,
            "stay_parameters": "Stayed September 2013, traveled with friends",
            "text": "From our arrival at the airport after a chaotic passport control experience, we were greeted by our driver (supplied by Malika) Yaya and treated to an entertaining journey to Riad Malika. As we entered the Riad, we were greeted by the wonderful Rashid and the magic began. The room was fantastic, and once settled we dined at a table in the courtyard strewn with rose petals... fantastic food - from the Moroccan Fish to the breakfasts every morning - there could be no faults found in any aspect of the services provided..... it was like waking up in a film set every day, and the tranquility provided within the walls of the Riad compared to the hectic-ness of the Medina outside provided a welcome respite. Our only disappointment was that we were visiting Marrakech for a friends wedding and were staying until the Sunday and when we booked the Riad was actually full on the Saturday night so we had to spend our final night in Morocco somewhere else.... we have already resolved to return next year with our son and there is nowhere else we would consider staying.... we cannot wait to return.... Many Thanks x",
            "title": "Loved it!",
            "user": "julia c"
        },
        {
            "date": "September 18, 2013",
            "detail_rating": {
                "business": null,
                "cleanliness": 5.0,
                "desk": null,
                "location": 5.0,
                "pool": null,
                "restaurant": null,
                "rooms": 5.0,
                "service": 5.0,
                "sleep": 5.0,
                "value": 5.0
            },
            "helpfulness": null,
            "id": 177672079,
            "likes": {
                "disliked": null,
                "liked": null
            },
            "rating": 5.0,
            "stay_parameters": "Stayed September 2013, traveled with family",
            "text": "The d\u00e9cor is lovely, and the staff are both unobtrusive and there when you need them, (they even kept the kitchen open late for us on our day of arrival when we experienced delays at the airport). The home cooked food was excellent. Relaxing and calm, the riad is located in an ideal place to explore without being too difficult to get back to! They have their own spa facilities and we would recommend the hamman body scrub and massage - fabulous!",
            "title": "The Best of Everything",
            "user": "Jorge C"
        },
        {
            "date": "September 12, 2013",
            "detail_rating": {
                "business": null,
                "cleanliness": 5.0,
                "desk": null,
                "location": 5.0,
                "pool": null,
                "restaurant": null,
                "rooms": 5.0,
                "service": 5.0,
                "sleep": 4.0,
                "value": 5.0
            },
            "helpfulness": null,
            "id": 176833015,
            "likes": {
                "disliked": null,
                "liked": null
            },
            "rating": 5.0,
            "stay_parameters": "Stayed September 2013, traveled as a couple",
            "text": "We stay 3 nights in this Riad, and was a fantastic experience.",
            "title": "Incredible!",
            "user": "David T"
        },
        {
            "date": "September 4, 2013",
            "detail_rating": {
                "business": null,
                "cleanliness": 5.0,
                "desk": null,
                "location": 4.0,
                "pool": null,
                "restaurant": null,
                "rooms": 5.0,
                "service": 5.0,
                "sleep": 5.0,
                "value": 4.0
            },
            "helpfulness": 2,
            "id": 175650746,
            "likes": {
                "disliked": null,
                "liked": null
            },
            "rating": 5.0,
            "stay_parameters": "Stayed June 2013, traveled as a couple",
            "text": "The staff was extremly friendly and help you in all the things that you need.",
            "title": "Oasis in Marrakech",
            "user": "Mary M"
        },
        {
            "date": "August 27, 2013",
            "detail_rating": {
                "business": null,
                "cleanliness": 3.0,
                "desk": null,
                "location": 4.0,
                "pool": null,
                "restaurant": null,
                "rooms": 5.0,
                "service": 4.0,
                "sleep": 3.0,
                "value": 4.0
            },
            "helpfulness": 1,
            "id": 174327941,
            "likes": {
                "disliked": null,
                "liked": null
            },
            "rating": 5.0,
            "stay_parameters": "Stayed August 2013, traveled with family",
            "text": ":):):):):):):):):):):):):):):):):):):):):):):):):):):):):):):):):):):):):):):):):):):):):):):):):):):):):):):):):):):):):):):):):):):):):):):):):):):)",
            "title": "Fabulous experience",
            "user": "Kevin T"
        },
        {
            "date": "August 26, 2013",
            "detail_rating": {
                "business": null,
                "cleanliness": 5.0,
                "desk": null,
                "location": 5.0,
                "pool": null,
                "restaurant": null,
                "rooms": 5.0,
                "service": 5.0,
                "sleep": 5.0,
                "value": 5.0
            },
            "helpfulness": 1,
            "id": 174116629,
            "likes": {
                "disliked": null,
                "liked": null
            },
            "rating": 5.0,
            "stay_parameters": "Stayed August 2013, traveled as a couple",
            "text": "Fantastic small riad in the heart of the Medina area. Behind the front door you find a tranquil garden area, beautifully decorated rooms and a pool which is just what you need after a hot day exploring the souks. The manager was very friendly and helpful. He organised a great day trip to the Atlas Mountains for us. The room was lovely, the beds comfortable, the internet service good, and the breakfast tasty and varied.",
            "title": "A dream stay",
            "user": "LauraR172013"
        },
        {
            "date": "August 25, 2013",
            "detail_rating": {
                "business": null,
                "cleanliness": 3.0,
                "desk": null,
                "location": 4.0,
                "pool": null,
                "restaurant": null,
                "rooms": 5.0,
                "service": 4.0,
                "sleep": 4.0,
                "value": 5.0
            },
            "helpfulness": 2,
            "id": 173909980,
            "likes": {
                "disliked": null,
                "liked": null
            },
            "rating": 4.0,
            "stay_parameters": "Stayed August 2013, traveled as a couple",
            "text": "The riad is in walking distance of the main square, but is a little hard to return to. particularly at night, so its best to explore for the first time in the day light. Also take advantage of the hotels offer to collect you at the airport/station as the riad is not easy to find on your own.",
            "title": "Exceptional place with three-storey room",
            "user": "Dianxue"
        },
        {
            "date": "November 11, 2013",
            "detail_rating": {
                "business": null,
                "cleanliness": 5.0,
                "desk": null,
                "location": 5.0,
                "pool": null,
                "restaurant": null,
                "rooms": 4.0,
                "service": 5.0,
                "sleep": 4.0,
                "value": 3.0
            },
            "helpfulness": null,
            "id": 184354392,
            "likes": {
                "disliked": null,
                "liked": null
            },
            "rating": 4.0,
            "stay_parameters": "Stayed October 2013, traveled as a couple",
            "text": "I have no hesitation in recommending this riad to visitors to Martrakech. It was exactly what we were looking for: central location, peaceful haven, comfortable room with a great terrace for relaxation. Very pleased that we chose the suite with its large bedroom and bathroom and the breakfast was pretty good too. The riad is well maintained and the service is very efficient. Breakfast was varied each morning which was most welcome as I despair of eating the same food each day in a hotel that one is staying in for a week.",
            "title": "A very good stay.",
            "user": "BillParis"
        },
        {
            "date": "November 3, 2013",
            "detail_rating": {
                "business": null,
                "cleanliness": 5.0,
                "desk": null,
                "location": 4.0,
                "pool": null,
                "restaurant": null,
                "rooms": 5.0,
                "service": 4.0,
                "sleep": 4.0,
                "value": 4.0
            },
            "helpfulness": 1,
            "id": 183424806,
            "likes": {
                "disliked": null,
                "liked": null
            },
            "rating": 4.0,
            "stay_parameters": "Stayed October 2013, traveled as a couple",
            "text": "I really can't see why anyone would prefer an international branded hotel over a riad with such colour and character. Of course there are always things that could be improved: a mini bar/fridge in the room, a telephone to order drinks (it is forbidden to bring food and drink into the hotel), more comfortable chairs in the suite rather than the 1970s polyester swivel chair and proper mixer taps rather than separate hot and cold taps in the shower which seems to offer two options - scolding hot or freezing cold.It would also be an idea to make it clearer to guests that cash is preferred over cards (and maybe offer a discount as is done in Turkey), that way guests could be more prepared with a better commission charge.",
            "title": "Good Value Riyadh",
            "user": "UkJaycee"
        },
        {
            "date": "October 23, 2013",
            "detail_rating": {
                "business": null,
                "cleanliness": 5.0,
                "desk": null,
                "location": 5.0,
                "pool": null,
                "restaurant": null,
                "rooms": 5.0,
                "service": 5.0,
                "sleep": 5.0,
                "value": 5.0
            },
            "helpfulness": null,
            "id": 182077465,
            "likes": {
                "disliked": null,
                "liked": null
            },
            "rating": 5.0,
            "stay_parameters": "Stayed September 2013, traveled as a couple",
            "text": "Despite these small gripes, I would warmly recommend the Riad Malika. You won't regret it!",
            "title": "A great place to stay",
            "user": "TomJoad10"
        },
        {
            "date": "October 21, 2013",
            "detail_rating": {
                "business": null,
                "cleanliness": 5.0,
                "desk": null,
                "location": 5.0,
                "pool": null,
                "restaurant": null,
                "rooms": 5.0,
                "service": 5.0,
                "sleep": 5.0,
                "value": 5.0
            },
            "helpfulness": null,
            "id": 181841983,
            "likes": {
                "disliked": null,
                "liked": null
            },
            "rating": 5.0,
            "stay_parameters": "Stayed October 2013, traveled as a couple",
            "text": "This was our second time in Marrakech and we chose Riyadh Malika because of the reviews and a personal recommendation from a friend. We stayed in one of the suites. The room was lovely - large with two bathrooms, a lounge and a covered courtyard. The bedroom was good and sleep quality was excellent. The call to prayer at 5am each morning that woke us up was actually a feature rather than an inconvenience. The location of the Riyadh is very good and only 10 - 15 minutes walk from the main market. Even walking back late at night felt very safe. We ate twice in the evenings at the Riyadh and both nights the food quality was very good. The Riyadh has a homely feel to it and the two main guys who oversaw everything were friendly and accommodating. The quality of the breakfasts was a disappointment having read the reviews. Basically yoghurt, jam and a selection of breads. There was no hot option for the breakfast (although when we did ask for some eggs they did quite happily make us an omelette). We would recommend this Riyadh as good value for money",
            "title": "Perfect Honeymoon",
            "user": "admiralwilde"
        },
        {
            "date": "October 11, 2013",
            "detail_rating": {
                "business": null,
                "cleanliness": 5.0,
                "desk": null,
                "location": 5.0,
                "pool": null,
                "restaurant": null,
                "rooms": 5.0,
                "service": 5.0,
                "sleep": 4.0,
                "value": 5.0
            },
            "helpfulness": null,
            "id": 180562916,
            "likes": {
                "disliked": null,
                "liked": null
            },
            "rating": 5.0,
            "stay_parameters": "Stayed October 2013, traveled as a couple",
            "text": "My wife and I stayed at Riad Malika for 1 week in the second week of September. The riad has a homely feel to it with the comforts of a hotel. We stayed in one of the standard double rooms as it was the only one available at the time, but this was by no means a 'box room'. The staff were very helpful and pleasant. A special thanks to Rashid who was very helpful with everything.",
            "title": "lovely homely place to stay",
            "user": "ALAN H"
        },
        {
            "date": "October 8, 2013",
            "detail_rating": {
                "business": null,
                "cleanliness": 5.0,
                "desk": null,
                "location": 5.0,
                "pool": null,
                "restaurant": null,
                "rooms": 5.0,
                "service": 5.0,
                "sleep": null,
                "value": 5.0
            },
            "helpfulness": null,
            "id": 180248346,
            "likes": {
                "disliked": null,
                "liked": null
            },
            "rating": 5.0,
            "stay_parameters": "Stayed October 2013",
            "text": "As if you are invited to a beautiful typical moroccan house, with numerous details in the interior and a living soul. Amazing place, unforgettable attitude. The nearest parking is in front of Maison de arab (people in the streets know is place, can help to find the riad). You can trust the staffs recommendations regarding the restraunts and night life (both were exactly what we asked for).",
            "title": "Amazing stay",
            "user": "Elena M"
        },
        {
            "date": "October 8, 2013",
            "detail_rating": {
                "business": null,
                "cleanliness": 5.0,
                "desk": null,
                "location": 4.0,
                "pool": null,
                "restaurant": null,
                "rooms": 4.0,
                "service": 4.0,
                "sleep": 5.0,
                "value": 4.0
            },
            "helpfulness": null,
            "id": 180162940,
            "likes": {
                "disliked": null,
                "liked": null
            },
            "rating": 5.0,
            "stay_parameters": "Stayed July 2013, traveled as a couple",
            "text": "A very well located Rian in the middle of the Medina. After the hectics a very welcome oasis. Very friendly people and nice rooms, especially the suits.",
            "title": "Excellent place",
            "user": "mirjan k"
        },
        {
            "date": "October 6, 2013",
            "detail_rating": {
                "business": null,
                "cleanliness": 5.0,
                "desk": null,
                "location": 4.0,
                "pool": null,
                "restaurant": null,
                "rooms": 4.0,
                "service": 5.0,
                "sleep": 4.0,
                "value": 4.0
            },
            "helpfulness": null,
            "id": 179950153,
            "likes": {
                "disliked": null,
                "liked": null
            },
            "rating": 5.0,
            "stay_parameters": "Stayed September 2013, traveled as a couple",
            "text": "We loved our stay very much.",
            "title": "Calm, tranquil and a heavenly oasis",
            "user": "Dee1978"
        },
        {
            "date": "October 6, 2013",
            "detail_rating": {
                "business": null,
                "cleanliness": 5.0,
                "desk": null,
                "location": 5.0,
                "pool": null,
                "restaurant": null,
                "rooms": 5.0,
                "service": 5.0,
                "sleep": 5.0,
                "value": 5.0
            },
            "helpfulness": null,
            "id": 179917867,
            "likes": {
                "disliked": null,
                "liked": null
            },
            "rating": 5.0,
            "stay_parameters": "Stayed September 2013, traveled with friends",
            "text": "Thanks for the warm welcome and we hope to come back sometime.",
            "title": "True paradise",
            "user": "SjokeA"
        },
        {
            "date": "October 5, 2013",
            "detail_rating": {
                "business": null,
                "cleanliness": 5.0,
                "desk": null,
                "location": 5.0,
                "pool": null,
                "restaurant": null,
                "rooms": 5.0,
                "service": 5.0,
                "sleep": 5.0,
                "value": 5.0
            },
            "helpfulness": 1,
            "id": 179780745,
            "likes": {
                "disliked": null,
                "liked": null
            },
            "rating": 5.0,
            "stay_parameters": "Stayed October 2013, traveled with friends",
            "text": "We stayed here for a week for my partner's 40th birthday and it was just beautiful. We stayed in the Royal Suite and were blown away at how gorgeous it was. The pictures online really don't do it justice.",
            "title": "Heavenly haven!",
            "user": "Bella_Bx"
        }
    ],
    "slim_ranking": 0.0769230769231,
    "stars": null,
    "tripadvisor": {
        "VISITED": false,
        "country_name": null,
        "locality": null,
        "pic_link": null,
        "street_address": null
    },
    "user_rating": 5.0,
    "variance": {
        "average": 1,
        "excellent": 247,
        "poor": 2,
        "terrible": 3,
        "very good": 27
    }
}