{
    "aka": "Pestana Sintra Golf Hotel",
    "description": null,
    "detail_rating": {
        "cleanliness": null,
        "location": null,
        "rooms": null,
        "service": null,
        "sleep": null,
        "value": null
    },
    "location": {
        "city": null,
        "continent": "Europe",
        "country": "Portugal",
        "proposed_city": "Sintra",
        "province": null,
        "region": "Central Portugal"
    },
    "name": "Pestana Sintra Golf Resort and Spa Hotel",
    "places": {
        "aka": [
            "Sintra"
        ],
        "hotel_description": [],
        "hotel_name": [
            "Sintra"
        ]
    },
    "review_count": 184,
    "review_count_current": 14,
    "reviews": [
        {
            "date": "June 2, 2010",
            "detail_rating": {
                "business": null,
                "cleanliness": 5.0,
                "desk": null,
                "location": 4.0,
                "pool": null,
                "restaurant": null,
                "rooms": 4.0,
                "service": 4.0,
                "sleep": 4.0,
                "value": 5.0
            },
            "helpfulness": null,
            "id": 66237988,
            "likes": {
                "disliked": null,
                "liked": null
            },
            "rating": 5.0,
            "stay_parameters": "Stayed May 2010, traveled as a couple",
            "text": "If you like American style hotels (ie. Sheraton, Westin, Marriott) that are spacious & have the amenities of four star hotels, you'll definitely like this place. There's no nickeling and diming you for internet service or parking. Wi-fi is available for free and voucher for a free drink per person at the bar (beer, wine or port). We stayed one night on May 30, 2010 since we were flying out the next day from Lisbon. We decided to stay near Sintra to visit the sites. The air is very fresh (a tad bit cooler) since you're in a \"higher\" elevation. The resort is very clean and of an excellent standard. Our room faced the golf-course and there were two? pools (very nice!). The hotel was not super busy so it was not noisy at all. I didn't try the spa but the price list was very reasonable. It is a very short drive to downtown historical area (5-10 minutes) so I definitely recommend staying here if you're planning on visiting Sintra.",
            "title": "Very nice hotel",
            "user": "wlslb"
        },
        {
            "date": "October 25, 2009",
            "detail_rating": {
                "business": null,
                "cleanliness": null,
                "desk": null,
                "location": null,
                "pool": null,
                "restaurant": null,
                "rooms": null,
                "service": null,
                "sleep": null,
                "value": null
            },
            "helpfulness": null,
            "id": 47688512,
            "likes": {
                "disliked": null,
                "liked": null
            },
            "rating": 4.0,
            "stay_parameters": null,
            "text": "rooms comfortable and clean, staff was very helpful, great breakfast",
            "title": "Very clean, modern and functional",
            "user": "Jaque_bpc"
        },
        {
            "date": "August 31, 2009",
            "detail_rating": {
                "business": null,
                "cleanliness": 5.0,
                "desk": null,
                "location": 5.0,
                "pool": null,
                "restaurant": null,
                "rooms": 5.0,
                "service": 4.0,
                "sleep": null,
                "value": 4.0
            },
            "helpfulness": null,
            "id": 39367587,
            "likes": {
                "disliked": null,
                "liked": null
            },
            "rating": 5.0,
            "stay_parameters": "Stayed August 2009, traveled as a couple",
            "text": "I actually own a flat in the close off district of Quinta da Beloura 1 but still decided to spend one night with my wife in the Pestana Hotel next door. The location of the hotel is fabulous with amazing views over the Sintra mountain. The swimming pool is nice, the spa enjoyable, the restaurant good, the staff pleasant and helpful. The rooms are spacious and the bathrooms are nice. We got a nice balcony with view of the mountain, with a nice table a two chairs. There is a 18 h golf course. Good value for money, in particular if you find a last minute deal as we did.",
            "title": "Very comfortable hotel with amazing views. Great for Golf lovers.",
            "user": "Carvalhor1"
        },
        {
            "date": "June 14, 2009",
            "detail_rating": {
                "business": null,
                "cleanliness": 5.0,
                "desk": null,
                "location": 4.0,
                "pool": null,
                "restaurant": null,
                "rooms": 5.0,
                "service": 5.0,
                "sleep": null,
                "value": 5.0
            },
            "helpfulness": null,
            "id": 32313882,
            "likes": {
                "disliked": null,
                "liked": null
            },
            "rating": 5.0,
            "stay_parameters": "Stayed May 2009, traveled as a couple",
            "text": "Me and my wife like new hotels (but nothing against the old ones).",
            "title": "JUST A PERFECT CHOICE...",
            "user": "robertolebrao"
        },
        {
            "date": "September 21, 2008",
            "detail_rating": {
                "business": 3.0,
                "cleanliness": 4.0,
                "desk": null,
                "front_desk": 4.0,
                "location": 1.0,
                "pool": null,
                "restaurant": null,
                "rooms": 4.0,
                "service": 4.0,
                "sleep": null,
                "value": 3.0
            },
            "helpfulness": 1,
            "id": 20255806,
            "likes": {
                "disliked": "\u2014 Location",
                "liked": "\u2014 Price"
            },
            "rating": 4.0,
            "stay_parameters": "Stayed August 2008, traveled on business",
            "text": "After reading some reviews from Sintra, we decided to visit 2 hotels: Tivoli (downtown) and Pestana (5 min downtown by car).",
            "title": "Great if you have a car",
            "user": "junglejim1"
        },
        {
            "date": "November 29, 2007",
            "detail_rating": {
                "business": 4.0,
                "cleanliness": 5.0,
                "desk": null,
                "front_desk": 5.0,
                "location": 3.0,
                "pool": null,
                "restaurant": null,
                "rooms": 5.0,
                "service": 5.0,
                "sleep": null,
                "value": 5.0
            },
            "helpfulness": null,
            "id": 11136814,
            "likes": {
                "disliked": "\u2014 They couldnt fit me in for a massage",
                "liked": "\u2014 The room"
            },
            "rating": 4.0,
            "stay_parameters": "Stayed November 2007",
            "text": "Excellent hotel. Nice big, clean rooms and good facilities. Staff very helpful.",
            "title": "Great hotel, lovely stay",
            "user": "pilotlady"
        },
        {
            "date": "September 3, 2007",
            "detail_rating": {
                "business": null,
                "cleanliness": 5.0,
                "desk": null,
                "front_desk": 5.0,
                "location": 5.0,
                "pool": null,
                "restaurant": null,
                "rooms": 5.0,
                "service": 5.0,
                "sleep": null,
                "value": 5.0
            },
            "helpfulness": null,
            "id": 8612382,
            "likes": {
                "disliked": "\u2014 Restaurant",
                "liked": "\u2014 Amenities"
            },
            "rating": 5.0,
            "stay_parameters": "Stayed August 2007, traveled with family",
            "text": "Prob not worth upgrading to the Mezzanine as the standard rooms were really good anyway and with the Mezzanine the bathroom is downstairs and the bed upstairs.",
            "title": "Excellent choice to relaxing holidays",
            "user": "Eng_Pepi"
        },
        {
            "date": "April 3, 2007",
            "detail_rating": {
                "business": 3.0,
                "cleanliness": 4.0,
                "desk": null,
                "front_desk": 4.0,
                "location": 2.0,
                "pool": null,
                "restaurant": null,
                "rooms": 4.0,
                "service": 2.0,
                "sleep": null,
                "value": 3.0
            },
            "helpfulness": null,
            "id": 7275807,
            "likes": {
                "disliked": "\u2014 The inefficiency",
                "liked": "\u2014 The Spa"
            },
            "rating": 3.0,
            "stay_parameters": "Stayed April 2007, traveled on business",
            "text": "Food in the restaurant not great apart from the Octopus.",
            "title": "Vague but polite",
            "user": "Lemonstar"
        },
        {
            "date": "December 13, 2004",
            "detail_rating": {
                "business": null,
                "cleanliness": 5.0,
                "desk": null,
                "location": null,
                "pool": null,
                "restaurant": null,
                "rooms": 5.0,
                "service": 5.0,
                "sleep": null,
                "value": 5.0
            },
            "helpfulness": 6,
            "id": 2878074,
            "likes": {
                "disliked": null,
                "liked": null
            },
            "rating": 4.0,
            "stay_parameters": "Stayed November 2004",
            "text": "Location a bit out of the way but exactly as advertised and perfect for our requirement.",
            "title": "Huge Rooms! Like an Apartment!",
            "user": "EKCS"
        },
        {
            "date": "August 11, 2008",
            "detail_rating": {
                "business": 3.0,
                "cleanliness": 3.0,
                "desk": null,
                "front_desk": 4.0,
                "location": 2.0,
                "pool": null,
                "restaurant": null,
                "rooms": 3.0,
                "service": 3.0,
                "sleep": null,
                "value": null
            },
            "helpfulness": null,
            "id": 18846819,
            "likes": {
                "disliked": "\u2014 No other restaurants etc within walking distances of hotel",
                "liked": "\u2014 The modern mezzanine rooms"
            },
            "rating": 3.0,
            "stay_parameters": "Stayed July 2008, traveled as a couple",
            "text": "We booked this hotel last minute for our last couple of days in Portugal and we weren\u2019t disappointed, we fortunately had a car so the out of town location was fine.",
            "title": "Good place to recharge",
            "user": "Panna"
        },
        {
            "date": "June 11, 2008",
            "detail_rating": {
                "business": 5.0,
                "cleanliness": 5.0,
                "desk": null,
                "front_desk": 3.0,
                "location": 3.0,
                "pool": null,
                "restaurant": null,
                "rooms": 5.0,
                "service": 3.0,
                "sleep": null,
                "value": 4.0
            },
            "helpfulness": null,
            "id": 16839151,
            "likes": {
                "disliked": "\u2014 Distance from sites",
                "liked": "\u2014 Architecture, bar lounge, Free internet access"
            },
            "rating": 4.0,
            "stay_parameters": "Stayed May 2008, traveled as a couple",
            "text": "Staff were very friendly and helpful, our apartment room was really nice, clean modern, breakfast at the hotel was good, the indoor pool was just the right temperature and empty, I had a full body massage which was great.",
            "title": "Beautifully designed",
            "user": "ushma"
        },
        {
            "date": "June 4, 2008",
            "detail_rating": {
                "business": 3.0,
                "cleanliness": 4.0,
                "desk": null,
                "front_desk": 3.0,
                "location": 4.0,
                "pool": null,
                "restaurant": null,
                "rooms": 4.0,
                "service": 4.0,
                "sleep": null,
                "value": 4.0
            },
            "helpfulness": 1,
            "id": 16675601,
            "likes": {
                "disliked": "\u2014 Whilst the views of the golf club are nice, there isn't much else in the area - you need a car",
                "liked": "\u2014 The rooms and the spa area"
            },
            "rating": 4.0,
            "stay_parameters": "Stayed May 2008, traveled with family",
            "text": "This hotel is ideal if you have a car, or just want to stay on site playing golf and relaxing.",
            "title": "Nice hotel in a Good location",
            "user": "Lord_Gin"
        },
        {
            "date": "March 9, 2008",
            "detail_rating": {
                "business": 4.0,
                "cleanliness": 5.0,
                "desk": null,
                "front_desk": 2.0,
                "location": 5.0,
                "pool": null,
                "restaurant": null,
                "rooms": 5.0,
                "service": 3.0,
                "sleep": null,
                "value": 4.0
            },
            "helpfulness": null,
            "id": 14168571,
            "likes": {
                "disliked": "\u2014 Reception service",
                "liked": "\u2014 Location"
            },
            "rating": 4.0,
            "stay_parameters": "Stayed March 2008, traveled as a couple",
            "text": "This hotel has beautiful Moorish architecture. It is new, clean and modern and has great facilities. I highly recommend it. All rooms have 2 levels. Downstairs is the bathroom, small kitchen, and living area with desk. Upstairs is the bedroom which can be a bit inconvenient if you have to use the facilities at night. Most rooms have balconies. The bar is beautifully decorated and it\u2019s a nice place to get a drink. The indoor pool is heated. Only complaint is that it is a bit understaffed. At the front desk there is usually only one person and that usually means waiting a while to get assistance. It is far out of the city so you will probably need a car to see the sites of Sintra. Free parking was nice.",
            "title": "Nice place to rest",
            "user": "Ricardo_Almeida"
        },
        {
            "date": "December 23, 2007",
            "detail_rating": {
                "business": 5.0,
                "cleanliness": 4.0,
                "desk": null,
                "front_desk": 4.0,
                "location": 4.0,
                "pool": null,
                "restaurant": null,
                "rooms": 5.0,
                "service": 5.0,
                "sleep": null,
                "value": 5.0
            },
            "helpfulness": null,
            "id": 11914393,
            "likes": {
                "disliked": "\u2014 nothing",
                "liked": "\u2014 every thing"
            },
            "rating": 5.0,
            "stay_parameters": "Stayed December 2007, traveled as a couple",
            "text": "We stayed at the Pestana Sintra with our two kids (5&16). The hotel is modern, and was inaugurated in October 2006. It is clean and the rooms (we got two superior rooms) are large and well furnished. The indoor swimming pool is great, but the temperature was not favourable for us to check the outdoor pool. They have a good Spa with good treatments, but pricey. The breakfast was pretty good, with a selection of hot and cold food, and a good variety of pastries. We only dined at the hotel twice, and on both nights they had a buffet, which in my view was overpriced and uninteresting \u2013 you\u2019re better off checking out some of the very unpretentious traditional restaurants in Sintra and neighbouring areas, as we did on the other nights, but with a small daughter the convenience of the hotel was didn\u2019t go out very night. Having travelled a bit in Portugal, I think the Northerners are more friendly and polite, but the staff at the hotel was mostly fine, with the exception of the lady doing physiotherapy treatments in the pool, which clearly shouldn\u2019t be in the service sector.",
            "title": "great hotel",
            "user": "Icon29"
        }
    ],
    "slim_ranking": 1.0,
    "stars": 4,
    "tripadvisor": {
        "VISITED": false,
        "country_name": null,
        "locality": null,
        "pic_link": null,
        "street_address": null
    },
    "user_rating": 4.0,
    "variance": {
        "average": 30,
        "excellent": 55,
        "poor": 5,
        "terrible": 5,
        "very good": 89
    }
}