{
    "aka": "Courtyard By Marriott Fresno Airport Hotel Fresno",
    "description": "At the Fresno Airport Hotel all of our guest rooms feature complimentary high speed internet service. Our hotel is 100% non-smoking with your choice of either a King room or a room with two double beds. Each room features 42 inch flat screen televisions for viewing enjoyment. We offer complimentary airport shuttle service to and from the airport 24 hours a day. We are located on McKinley and Peach next to the main enterance of Fresno Yosemite International Airport. We are pleased to have Starbucks sharing our main enterance of the Fresno Airport Hotel. We are very excited to now feature a complimentary breakfast to all of our guests. We are currently making plans to add suites to our hotel.",
    "detail_rating": {
        "cleanliness": null,
        "location": null,
        "rooms": null,
        "service": null,
        "sleep": null,
        "value": null
    },
    "location": {
        "city": "Fresno",
        "continent": null,
        "country": "United States",
        "proposed_city": "Fresno",
        "province": null,
        "region": null
    },
    "name": "BEST WESTERN PLUS Fresno Airport Hotel",
    "places": {
        "aka": [
            "Fresno"
        ],
        "hotel_description": [
            "Fresno"
        ],
        "hotel_name": [
            "BEST",
            "Fresno"
        ]
    },
    "review_count": 99,
    "review_count_current": 20,
    "reviews": [
        {
            "date": "May 5, 2012",
            "detail_rating": {
                "business": null,
                "cleanliness": 5.0,
                "desk": null,
                "location": 5.0,
                "pool": null,
                "restaurant": null,
                "rooms": 5.0,
                "service": 5.0,
                "sleep": 5.0,
                "value": 4.0
            },
            "helpfulness": null,
            "id": 129386500,
            "likes": {
                "disliked": null,
                "liked": null
            },
            "rating": 5.0,
            "stay_parameters": "Stayed May 2012, traveled on business",
            "text": "Clean, friendly desk staff always a pleasure to stay at this Courtyard Marriott.",
            "title": "Repeat visitor",
            "user": "Connie S"
        },
        {
            "date": "April 19, 2012",
            "detail_rating": {
                "business": null,
                "cleanliness": 5.0,
                "desk": null,
                "location": 5.0,
                "pool": null,
                "restaurant": null,
                "rooms": 5.0,
                "service": 5.0,
                "sleep": null,
                "value": 5.0
            },
            "helpfulness": null,
            "id": 128195539,
            "likes": {
                "disliked": null,
                "liked": null
            },
            "rating": 5.0,
            "stay_parameters": "Stayed April 2012",
            "text": "Fine all services tried were excellent including front desk",
            "title": "Great",
            "user": "jwax5791"
        },
        {
            "date": "March 24, 2012",
            "detail_rating": {
                "business": null,
                "cleanliness": 5.0,
                "desk": null,
                "location": 5.0,
                "pool": null,
                "restaurant": null,
                "rooms": 5.0,
                "service": 5.0,
                "sleep": 5.0,
                "value": 5.0
            },
            "helpfulness": null,
            "id": 126595546,
            "likes": {
                "disliked": null,
                "liked": null
            },
            "rating": 5.0,
            "stay_parameters": "Stayed February 2012, traveled on business",
            "text": "very friendly staff and extremely convenient! Their shuttle to the airport took less than 15 minutes.",
            "title": "Great Fresno airport hotel",
            "user": "trey p"
        },
        {
            "date": "March 23, 2012",
            "detail_rating": {
                "business": null,
                "cleanliness": 4.0,
                "desk": null,
                "location": 5.0,
                "pool": null,
                "restaurant": null,
                "rooms": 3.0,
                "service": 4.0,
                "sleep": 3.0,
                "value": 4.0
            },
            "helpfulness": null,
            "id": 126537904,
            "likes": {
                "disliked": null,
                "liked": null
            },
            "rating": 4.0,
            "stay_parameters": "Stayed March 2012, traveled on business",
            "text": "The Marriott as always was very clean and the rooms provided sufficient space. I loved the location, being very close to the airport and surrounded by a variety of eating establishments. Staff was great and the Shuttle service was a plus. Would definitely recommend to others.",
            "title": "Nice place that is conveniently located",
            "user": "MsRadiant"
        },
        {
            "date": "March 11, 2012",
            "detail_rating": {
                "business": null,
                "cleanliness": 4.0,
                "desk": null,
                "location": 5.0,
                "pool": null,
                "restaurant": null,
                "rooms": 5.0,
                "service": 4.0,
                "sleep": 4.0,
                "value": 4.0
            },
            "helpfulness": null,
            "id": 125957110,
            "likes": {
                "disliked": null,
                "liked": null
            },
            "rating": 5.0,
            "stay_parameters": "Stayed March 2012, traveled with family",
            "text": "Marriott Airport in Fresno, nice, clean, facility, friendly staff. We enjoyed the hot tea service in the evening. The breakfast is delicious too! Thank you for the shuttle to the Fresno Air Terminal.",
            "title": "Nice place, good value",
            "user": "Nevermind2G"
        },
        {
            "date": "February 28, 2012",
            "detail_rating": {
                "business": null,
                "cleanliness": 4.0,
                "desk": null,
                "location": 4.0,
                "pool": null,
                "restaurant": null,
                "rooms": 4.0,
                "service": 4.0,
                "sleep": 4.0,
                "value": 4.0
            },
            "helpfulness": null,
            "id": 125366427,
            "likes": {
                "disliked": null,
                "liked": null
            },
            "rating": 4.0,
            "stay_parameters": "Stayed February 2012, traveled on business",
            "text": "I have stayed here a couple times now and it is a very comfortable stay and is close to a lot of busniess and restaurants, plus the airport. Always a friendly staff very clean has everything you need, fitness center, business center, free wifi, evening refreshments,,, I would recommend this for anyone travling for business, its perfect for all reasons.",
            "title": "Gregg S",
            "user": "Greggs3126"
        },
        {
            "date": "February 28, 2012",
            "detail_rating": {
                "business": null,
                "cleanliness": 4.0,
                "desk": null,
                "location": 4.0,
                "pool": null,
                "restaurant": null,
                "rooms": 4.0,
                "service": 5.0,
                "sleep": null,
                "value": 5.0
            },
            "helpfulness": null,
            "id": 125345797,
            "likes": {
                "disliked": null,
                "liked": null
            },
            "rating": 4.0,
            "stay_parameters": "Stayed February 2012",
            "text": "It is an older building so the exterior and structural design are on par with hotels in the same timeframe. The interior, however, has kept up with the times. Good tv, good refrigerator and microwave. They still have an old window air conditioner and it runs pretty loud. The makeshift lobby bar was frequented by many guests which made it an enjoyable experience. Overall I recommend staying at this location, especially if you can take advantage of the low government rate.",
            "title": "Recommended stay",
            "user": "Viperpilot69"
        },
        {
            "date": "February 13, 2012",
            "detail_rating": {
                "business": null,
                "cleanliness": 4.0,
                "desk": null,
                "location": 5.0,
                "pool": null,
                "restaurant": null,
                "rooms": 5.0,
                "service": 5.0,
                "sleep": 5.0,
                "value": 5.0
            },
            "helpfulness": null,
            "id": 124548969,
            "likes": {
                "disliked": null,
                "liked": null
            },
            "rating": 5.0,
            "stay_parameters": "Stayed February 2012, traveled on business",
            "text": "I 've always enjoyed the times that I've stayed at this hotel. The personnel are tremendous and very thoughtful. Any problems are handled promptly and with full attention to my needs. Thank you guys for the wonderful time.",
            "title": "Courtyard at FAT Airport",
            "user": "terryg42"
        },
        {
            "date": "February 9, 2012",
            "detail_rating": {
                "business": null,
                "cleanliness": 5.0,
                "desk": null,
                "location": 5.0,
                "pool": null,
                "restaurant": null,
                "rooms": 5.0,
                "service": 5.0,
                "sleep": 5.0,
                "value": 5.0
            },
            "helpfulness": null,
            "id": 124371247,
            "likes": {
                "disliked": null,
                "liked": null
            },
            "rating": 5.0,
            "stay_parameters": "Stayed February 2012, traveled on business",
            "text": "I use this hotel several times a year, some single nights and other times several nights. I have not been disappointed with any of the staff or the facility.",
            "title": "Courtyard at Fresno Airport",
            "user": "Kerry C"
        },
        {
            "date": "January 15, 2012",
            "detail_rating": {
                "business": null,
                "cleanliness": 5.0,
                "desk": null,
                "location": 5.0,
                "pool": null,
                "restaurant": null,
                "rooms": 5.0,
                "service": 5.0,
                "sleep": 5.0,
                "value": 5.0
            },
            "helpfulness": null,
            "id": 123120062,
            "likes": {
                "disliked": null,
                "liked": null
            },
            "rating": 5.0,
            "stay_parameters": "Stayed February 2012, traveled on business",
            "text": "Have ask for recommendations for restaurants and they always have a good list to select from.",
            "title": "Courtyard at Fresno Airport",
            "user": "Kerry C"
        },
        {
            "date": "March 6, 2012",
            "detail_rating": {
                "business": null,
                "cleanliness": 5.0,
                "desk": null,
                "location": 5.0,
                "pool": null,
                "restaurant": null,
                "rooms": null,
                "service": 4.0,
                "sleep": 5.0,
                "value": 5.0
            },
            "helpfulness": null,
            "id": 125725470,
            "likes": {
                "disliked": null,
                "liked": null
            },
            "rating": 5.0,
            "stay_parameters": "Stayed March 2012, traveled on business",
            "text": "This hotel is well positioned for travel in and out of Fresno by air and for business in Fresno. The hotel is well designed and the staff is very efficient and friendly.",
            "title": "Good place to stay",
            "user": "BillyJimTwo"
        },
        {
            "date": "March 6, 2012",
            "detail_rating": {
                "business": null,
                "cleanliness": 5.0,
                "desk": null,
                "location": 5.0,
                "pool": null,
                "restaurant": null,
                "rooms": 4.0,
                "service": 5.0,
                "sleep": 5.0,
                "value": 4.0
            },
            "helpfulness": null,
            "id": 125692808,
            "likes": {
                "disliked": null,
                "liked": null
            },
            "rating": 5.0,
            "stay_parameters": "Stayed March 2012, traveled on business",
            "text": "As typical, Courtyard is pretty constant nationwide. I travel for work a lot and like the Marriott brands becauase they are all over and I always know what to expect. The Fresno Courtyard is no different. Staff was very friendly, room was spotless, and coffee was hot. Thanks!",
            "title": "Great Business Stay!",
            "user": "David D"
        },
        {
            "date": "March 2, 2012",
            "detail_rating": {
                "business": null,
                "cleanliness": 5.0,
                "desk": null,
                "location": 5.0,
                "pool": null,
                "restaurant": null,
                "rooms": 4.0,
                "service": 5.0,
                "sleep": 4.0,
                "value": 4.0
            },
            "helpfulness": null,
            "id": 125499908,
            "likes": {
                "disliked": null,
                "liked": null
            },
            "rating": 5.0,
            "stay_parameters": "Stayed February 2012, traveled on business",
            "text": "I recently had the pleasure of staying at the Courtyard near the Fresno Airport. I didn't expect the greetig that I received when I checked in. There were 3 staff members working the desk when I arrived. Each of them took the time to welcome me and offer their asssistance. During my stay each time I passed the desk or had reason to contact them they were engaging in conversation and extremely helpful. Their actions and cheerful behavior made me feel like they really were interested in their customers and in making the stay with them as pleasant as possible. It is this kind of customer service that will keep me returning to this hotel.",
            "title": "Excellent Customer Service",
            "user": "Cory L"
        },
        {
            "date": "March 2, 2012",
            "detail_rating": {
                "business": null,
                "cleanliness": 5.0,
                "desk": null,
                "location": 5.0,
                "pool": null,
                "restaurant": null,
                "rooms": 5.0,
                "service": 5.0,
                "sleep": 5.0,
                "value": 5.0
            },
            "helpfulness": null,
            "id": 125498822,
            "likes": {
                "disliked": null,
                "liked": null
            },
            "rating": 5.0,
            "stay_parameters": "Stayed February 2012, traveled on business",
            "text": "I recently had the pleasure of staying at this facility. Very friendly and professional staff. Very clean, great (and reasonably priced) breakfast buffet, and a great location. I would recommend.",
            "title": "Quick Trip",
            "user": "Mary V"
        },
        {
            "date": "February 28, 2012",
            "detail_rating": {
                "business": null,
                "cleanliness": 4.0,
                "desk": null,
                "location": 4.0,
                "pool": null,
                "restaurant": null,
                "rooms": 4.0,
                "service": 5.0,
                "sleep": 5.0,
                "value": 4.0
            },
            "helpfulness": null,
            "id": 125372811,
            "likes": {
                "disliked": null,
                "liked": null
            },
            "rating": 5.0,
            "stay_parameters": "Stayed February 2012, traveled on business",
            "text": "Always enjoy my stay here. Staff all friendly. I travel here frequently for business. The breakfast buffet is always top notch. Accommodations are comfortable.",
            "title": "FAT Courtyard",
            "user": "Rick T"
        },
        {
            "date": "May 17, 2012",
            "detail_rating": {
                "business": null,
                "cleanliness": 5.0,
                "desk": null,
                "location": 5.0,
                "pool": null,
                "restaurant": null,
                "rooms": 5.0,
                "service": 5.0,
                "sleep": 5.0,
                "value": 5.0
            },
            "helpfulness": 1,
            "id": 130078249,
            "likes": {
                "disliked": null,
                "liked": null
            },
            "rating": 5.0,
            "stay_parameters": "Stayed May 2012, traveled on business",
            "text": "We had to visit family in the area on Saturday and had planned to only stay in a hotel Friday night and depart Saturday afternoon. The Marriott was so comfortable that we decided to extend our stay another night and depart on Sunday afternoon. The front desk staff was very friendly and greeted us with cookies when we checked in. I've never experienced that at a Marriott. The room was newly rennovated and the bed comfortable. The hotel was quiet and I was able to take a swim in the pool and jacuzzi each day all by myself. Being next door to Starbucks, the airport and just a short drive from a major shopping mall with a Cheesecake Factory and many other restaurants makes this hotel the perfect place to stay when in Fresno. I can't wait to go back!",
            "title": "Weekend stay was very relaxing!",
            "user": "usctrojantravelgirl"
        },
        {
            "date": "May 11, 2012",
            "detail_rating": {
                "business": null,
                "cleanliness": 5.0,
                "desk": null,
                "location": 5.0,
                "pool": null,
                "restaurant": null,
                "rooms": 4.0,
                "service": 5.0,
                "sleep": 5.0,
                "value": 5.0
            },
            "helpfulness": null,
            "id": 129731186,
            "likes": {
                "disliked": null,
                "liked": null
            },
            "rating": 4.0,
            "stay_parameters": "Stayed May 2012, traveled on business",
            "text": "A couple of minor inconveniences with the room. Closet door didn't open smoothly and the shampoo bottle was half empty. Weird. But apart from those two minor issues, the stay was awesome. The staff was extremely friendly, room still very comfortable, and well above average an extremely well kept hotel.",
            "title": "2 Night Stay while attending a Seminar",
            "user": "Jerry R"
        },
        {
            "date": "May 9, 2012",
            "detail_rating": {
                "business": null,
                "cleanliness": 5.0,
                "desk": null,
                "location": 5.0,
                "pool": null,
                "restaurant": null,
                "rooms": 5.0,
                "service": 5.0,
                "sleep": 5.0,
                "value": 5.0
            },
            "helpfulness": null,
            "id": 129660973,
            "likes": {
                "disliked": null,
                "liked": null
            },
            "rating": 5.0,
            "stay_parameters": "Stayed May 2012, traveled with family",
            "text": "Stayed here for a Sac State Baseball Series with Fresno State and the front desk personnel was awesome! Very polite and helpful. Quiet rooms, even with the airport across the street. Clean and good size rooms. Will stay again next year when we visit the area. Great choice if you want comfort, cleanliness, and style.",
            "title": "Great Place to Stay",
            "user": "Barbara M"
        },
        {
            "date": "May 8, 2012",
            "detail_rating": {
                "business": null,
                "cleanliness": 4.0,
                "desk": null,
                "location": 4.0,
                "pool": null,
                "restaurant": null,
                "rooms": 3.0,
                "service": 4.0,
                "sleep": 4.0,
                "value": 5.0
            },
            "helpfulness": null,
            "id": 129613650,
            "likes": {
                "disliked": null,
                "liked": null
            },
            "rating": 4.0,
            "stay_parameters": "Stayed May 2012, traveled on business",
            "text": "hotel is very convient to airport, within walking distance. Staff is very friendly and accomodating. Very quiet and clean. I woukd stay here again.",
            "title": "nice hotel",
            "user": "eric n"
        },
        {
            "date": "May 8, 2012",
            "detail_rating": {
                "business": null,
                "cleanliness": 2.0,
                "desk": null,
                "location": 2.0,
                "pool": null,
                "restaurant": null,
                "rooms": 2.0,
                "service": 4.0,
                "sleep": 3.0,
                "value": 1.0
            },
            "helpfulness": null,
            "id": 129561946,
            "likes": {
                "disliked": null,
                "liked": null
            },
            "rating": 1.0,
            "stay_parameters": "Stayed May 2012, traveled on business",
            "text": "The ONLY reason I stay here is for the Marriott reward points and there are no better hotels in this \"devils armpit\" they call Fresno. I have to come here to work every 6 weeks and every time I come here I DREAD it.",
            "title": "UGH!!!!",
            "user": "M B"
        }
    ],
    "slim_ranking": 0.257575757576,
    "stars": 3,
    "tripadvisor": {
        "VISITED": false,
        "country_name": null,
        "locality": null,
        "pic_link": null,
        "street_address": null
    },
    "user_rating": 4.0,
    "variance": {
        "average": 18,
        "excellent": 38,
        "poor": 5,
        "terrible": 5,
        "very good": 33
    }
}