{
    "aka": "Grand Plaza Milan",
    "description": null,
    "detail_rating": {
        "cleanliness": null,
        "location": null,
        "rooms": null,
        "service": null,
        "sleep": null,
        "value": null
    },
    "location": {
        "city": "Milan",
        "continent": "Europe",
        "country": "Italy",
        "proposed_city": null,
        "province": null,
        "region": "Lombardy"
    },
    "name": "Grand Plaza Hotel",
    "places": {
        "aka": [],
        "hotel_description": [],
        "hotel_name": []
    },
    "review_count": 179,
    "review_count_current": 8,
    "reviews": [
        {
            "date": "June 21, 2007",
            "detail_rating": {
                "business": null,
                "cleanliness": 5.0,
                "desk": null,
                "front_desk": 5.0,
                "location": 5.0,
                "pool": null,
                "restaurant": null,
                "rooms": 3.0,
                "service": 5.0,
                "sleep": null,
                "value": 5.0
            },
            "helpfulness": null,
            "id": 7955070,
            "likes": {
                "disliked": null,
                "liked": null
            },
            "rating": 3.0,
            "stay_parameters": "Stayed August 2006, traveled as a couple",
            "text": "Average room. Friendly staff. Excellent location.",
            "title": "Good Value- Great Location",
            "user": "shawana80"
        },
        {
            "date": "May 17, 2007",
            "detail_rating": {
                "business": null,
                "cleanliness": null,
                "desk": null,
                "location": null,
                "pool": null,
                "restaurant": null,
                "rooms": null,
                "service": null,
                "sleep": null,
                "value": null
            },
            "helpfulness": 1,
            "id": 7634883,
            "likes": {
                "disliked": null,
                "liked": null
            },
            "rating": 4.0,
            "stay_parameters": null,
            "text": "No probelms what so ever.",
            "title": "excellent location",
            "user": "andrew1976"
        },
        {
            "date": "September 6, 2006",
            "detail_rating": {
                "business": null,
                "cleanliness": 5.0,
                "desk": null,
                "front_desk": 5.0,
                "location": 5.0,
                "pool": null,
                "restaurant": null,
                "rooms": 5.0,
                "service": 5.0,
                "sleep": null,
                "value": 4.0
            },
            "helpfulness": null,
            "id": 5773175,
            "likes": {
                "disliked": "\u2014 Noise from the other rooms and from outside",
                "liked": "\u2014 central location, safe area, friendly, helpful and efficient staff, cleanliness and comfort of rooms"
            },
            "rating": 4.0,
            "stay_parameters": "Stayed September 2006",
            "text": "Just got back from Milan. Had a lovely time and the hotel was perfectly situated for our trip. Easy walking distance to one of the main parks. Perfect for the Dumo. It's just off the square so you don't have to worry about being hassled by a million people trying to sell you dodgy roses and horrible little braclets.",
            "title": "Great location, very clean, good comfort, great value",
            "user": "ave-maria"
        },
        {
            "date": "July 7, 2006",
            "detail_rating": {
                "business": null,
                "cleanliness": null,
                "desk": null,
                "location": null,
                "pool": null,
                "restaurant": null,
                "rooms": null,
                "service": null,
                "sleep": null,
                "value": null
            },
            "helpfulness": 1,
            "id": 5437980,
            "likes": {
                "disliked": null,
                "liked": null
            },
            "rating": 4.0,
            "stay_parameters": null,
            "text": "The hotel felt like a ghost town so if your looking for a lively hotel bar for a drink and food then forget it. If like us your looking for somewhere that's quiet, safe, clean in a good loaction and not to expensive then this is your hotel.",
            "title": "Good location",
            "user": "A TripAdvisor user"
        },
        {
            "date": "May 30, 2006",
            "detail_rating": {
                "business": null,
                "cleanliness": 4.0,
                "desk": null,
                "location": null,
                "pool": null,
                "restaurant": null,
                "rooms": 4.0,
                "service": 5.0,
                "sleep": null,
                "value": 2.0
            },
            "helpfulness": 3,
            "id": 5235963,
            "likes": {
                "disliked": null,
                "liked": null
            },
            "rating": 2.0,
            "stay_parameters": "Stayed May 2006",
            "text": "We turned the air con off as it wasn't that hot in the room but i can imagine that peak summer is different and the air con is fairly noisey.",
            "title": "Sleepless in Milan",
            "user": "travelenthusiast070"
        },
        {
            "date": "December 16, 2005",
            "detail_rating": {
                "business": null,
                "cleanliness": null,
                "desk": null,
                "location": null,
                "pool": null,
                "restaurant": null,
                "rooms": null,
                "service": null,
                "sleep": null,
                "value": null
            },
            "helpfulness": 3,
            "id": 4245320,
            "likes": {
                "disliked": null,
                "liked": null
            },
            "rating": 5.0,
            "stay_parameters": null,
            "text": "We have just returned from a weekend away at the Grand Hotel Plaza. The staff could not be more helpful and friendly. They all spoke English. The hotel was very clean and was to 4 star standard. Our room did not have much of a view, but the location of the hotel is right in the city centre. The location of the hotel is only a few hundred yards away from the Cathedral, shopping areas, restaurants and underground trains which are easy to use and cost only one euro for a trip to another area of town. Next door is a bar which laid on snacks (hot and cold) throughout the evening. Don't be put off by the fact that the bar is called \"Scottish Bar\" as it was actually a decent place and was frequented by Milanese people rather than tourists. We had heard that Milan was expensive to eat out, however we found this to be untrue. A litre of house wine would cost 10 Euro and a pizza, approx 6-10 Euro depending upon toppings. We will definitely be returning and staying in this hotel. We stayed Friday - Sunday and so the rates were cheap. The hotel was quiet - but apparenty mid-week the prices are higher and the hotel busier due to buisness bookings.",
            "title": "On Duomo's Doorstep",
            "user": "A TripAdvisor user"
        },
        {
            "date": "July 4, 2005",
            "detail_rating": {
                "business": null,
                "cleanliness": null,
                "desk": null,
                "location": null,
                "pool": null,
                "restaurant": null,
                "rooms": null,
                "service": null,
                "sleep": null,
                "value": null
            },
            "helpfulness": 7,
            "id": 3633758,
            "likes": {
                "disliked": null,
                "liked": null
            },
            "rating": 5.0,
            "stay_parameters": null,
            "text": "This hotel is really located only 150m from the Duomo on a quiet piazza. Don't be fooled by the facade of the hotel which looks a bit shabby. The inside is quite the opposite!!!. Spotless room which looked recently refurbished and friendly staff. We paid 99euro per night which was very good value for money.",
            "title": "Superb Location, Great hotel.",
            "user": "A TripAdvisor user"
        },
        {
            "date": "May 21, 2003",
            "detail_rating": {
                "business": null,
                "cleanliness": null,
                "desk": null,
                "location": null,
                "pool": null,
                "restaurant": null,
                "rooms": null,
                "service": null,
                "sleep": null,
                "value": null
            },
            "helpfulness": 3,
            "id": 1024777,
            "likes": {
                "disliked": null,
                "liked": null
            },
            "rating": 5.0,
            "stay_parameters": null,
            "text": "Only the buffet breakfast didn't look very special. But you're in Italy, so why would you want to have breakfast in your hotel anyway!",
            "title": "excellent hotel",
            "user": "A TripAdvisor user"
        }
    ],
    "slim_ranking": 0.716589861751,
    "stars": null,
    "tripadvisor": {
        "VISITED": false,
        "country_name": null,
        "locality": null,
        "pic_link": null,
        "street_address": null
    },
    "user_rating": 3.0,
    "variance": {
        "average": 59,
        "excellent": 20,
        "poor": 32,
        "terrible": 22,
        "very good": 46
    }
}