{
    "aka": "Santos Hotel Taipei",
    "description": "Located in the heart of Taipei City on Chengde Road, Santos Hotel has been dedicated to providing not only exceptional quality services to travelers with warm hospitality, but also personalized touches in making every guests' stay a memorable experience since 1979. This 4-star rated 287-room hotel is the perfect accommodation choice for the first time as well as returning visitors to this cosmopolitan city. Within 3-minute walking distance to the nearest Minquan West Road MRT station, Santos Hotel is also close to popular and must-see points-of-interest including Shilin Night Market, National Palace Museum, Beitou hot spring, Confucius Temple, and Taipei Expo Park. Our service staffs, proficient in English and Japanese, will ensure your needs are met to your satisfaction. Free high speed wireless Internet access is available both in room and throughout the hotel. For added luxury, flat panel LCD TV with satellite channels including HBO and CNN, and in-room safe are standard in every room.",
    "detail_rating": {
        "cleanliness": null,
        "location": null,
        "rooms": null,
        "service": null,
        "sleep": null,
        "value": null
    },
    "location": {
        "city": null,
        "continent": "Asia",
        "country": "Taiwan",
        "proposed_city": "Santos",
        "province": null,
        "region": null
    },
    "name": "Santos Hotel",
    "places": {
        "aka": [
            "Santos",
            "Taipei"
        ],
        "hotel_description": [
            "Taipei",
            "Chengde",
            "Santos",
            "Shilin",
            "Temple"
        ],
        "hotel_name": [
            "Santos"
        ]
    },
    "review_count": 165,
    "review_count_current": 5,
    "reviews": [
        {
            "date": "May 8, 2013",
            "detail_rating": {
                "business": null,
                "cleanliness": 3.0,
                "desk": null,
                "location": 2.0,
                "pool": null,
                "restaurant": null,
                "rooms": 2.0,
                "service": 5.0,
                "sleep": 1.0,
                "value": 1.0
            },
            "helpfulness": null,
            "id": 160045420,
            "likes": {
                "disliked": null,
                "liked": null
            },
            "rating": 2.0,
            "stay_parameters": "Stayed May 2013, traveled as a couple",
            "text": "Great wewlcome from the staff really friendly and helpful but whilst showing us to our room the veil began to drop. No gym (OK maybe we should have checked more) but worse still no bar and not one even within walking distance around the hotel.",
            "title": "5-star staff, 3-star hotel",
            "user": "HKPlum_Bum"
        },
        {
            "date": "April 4, 2013",
            "detail_rating": {
                "business": null,
                "cleanliness": 4.0,
                "desk": null,
                "location": 3.0,
                "pool": null,
                "restaurant": null,
                "rooms": 4.0,
                "service": 4.0,
                "sleep": 4.0,
                "value": 3.0
            },
            "helpfulness": 1,
            "id": 156558390,
            "likes": {
                "disliked": null,
                "liked": null
            },
            "rating": 4.0,
            "stay_parameters": "Stayed March 2013, traveled with family",
            "text": "OK moving on to when we got in after dinner, as there was no bar, went to the mini bar (fridge) in the room and had a Mother Hubbard experience in finding that the cupboard was bare. Phoning the front desk at first I was told to go to the nearest convenience store but eventually they brought me up a couple of cans for solace.",
            "title": "Clean rooms. Good service, attentive staff. Walking distance to MRT Minquan rd. station and NET store beside it.",
            "user": "travelholicena"
        },
        {
            "date": "April 1, 2013",
            "detail_rating": {
                "business": null,
                "cleanliness": 4.0,
                "desk": null,
                "location": 5.0,
                "pool": null,
                "restaurant": null,
                "rooms": 5.0,
                "service": 4.0,
                "sleep": 4.0,
                "value": 5.0
            },
            "helpfulness": null,
            "id": 156319743,
            "likes": {
                "disliked": null,
                "liked": null
            },
            "rating": 4.0,
            "stay_parameters": "Stayed March 2013, traveled on business",
            "text": "Now the issue with the fridge doesn't end there as even though it was empty it was still turned on and it is obviously not very efficient as it keeps turning itself on and off all night disrupting sleep which would otherwise be OK in a fairly quiet part of town and on a highish floor. Anyway the fridge wasn't the only criminal in sleep prevention as the paper thin walls meant you could listen to everyone elses conversations and movements in the adjacent rooms. And don't get me on to the state of the mattress......",
            "title": "Another room with a magnificent view",
            "user": "porntipb"
        },
        {
            "date": "February 23, 2013",
            "detail_rating": {
                "business": null,
                "cleanliness": 4.0,
                "desk": null,
                "location": 4.0,
                "pool": null,
                "restaurant": null,
                "rooms": 3.0,
                "service": 3.0,
                "sleep": null,
                "value": 4.0
            },
            "helpfulness": null,
            "id": 152851250,
            "likes": {
                "disliked": null,
                "liked": null
            },
            "rating": 3.0,
            "stay_parameters": "Stayed February 2013",
            "text": "Morning calls and going for a shower.....if one is greater than 1.85m tall then you cannot stand in the bath for a shower without your head hitting the ceiling - not the best way to wash your hair and body crouching down. If I get a bad back I'll sue.",
            "title": "Worked for me",
            "user": "Asiadream"
        },
        {
            "date": "January 28, 2013",
            "detail_rating": {
                "business": null,
                "cleanliness": 5.0,
                "desk": null,
                "location": 4.0,
                "pool": null,
                "restaurant": null,
                "rooms": 5.0,
                "service": 4.0,
                "sleep": null,
                "value": 5.0
            },
            "helpfulness": null,
            "id": 150823724,
            "likes": {
                "disliked": null,
                "liked": null
            },
            "rating": 5.0,
            "stay_parameters": "Stayed January 2013",
            "text": "Frankly the rooms are tired and are in dire need of an overhaul, whilst at all stages the staff were perfectly accomodating this place wasn't worth the money. I've stayed in better B & B,s (but without the staff attention).",
            "title": "Very happy with this Taipei hotel, will stay again",
            "user": "jhuang"
        }
    ],
    "slim_ranking": 0.280952380952,
    "stars": 3.5,
    "tripadvisor": {
        "VISITED": false,
        "country_name": null,
        "locality": null,
        "pic_link": null,
        "street_address": null
    },
    "user_rating": 4.0,
    "variance": {
        "average": 45,
        "excellent": 22,
        "poor": 7,
        "terrible": 0,
        "very good": 91
    }
}