{
    "aka": "Mercure Farnham Bush Hotel Farnham",
    "description": "Mercure Farnham Bush hotel is located in the centre of Farnham, a very short walking distance from the railway station. The Hotel is only 15 minutes drive to Farnborough Airport, around 30 minutes from Heathrow Airport and 35 minutes from Gatwick. Thackery's Restaurant serves modern European cuisine, and the Coachman's Bar is a cosy spot for a nightcap. The 6 fully equipped function rooms can host varying events from small meetings in a boardroom style right up to 140 people for conferences, parties and weddings.",
    "detail_rating": {
        "cleanliness": 4.0,
        "location": 4.5,
        "rooms": 3.5,
        "service": 3.5,
        "sleep": 4.0,
        "value": 3.5
    },
    "location": {
        "city": null,
        "continent": "Europe",
        "country": "United Kingdom (UK)",
        "proposed_city": "Farnham",
        "province": null,
        "region": null
    },
    "name": "Mercure Farnham Bush Hotel",
    "places": {
        "aka": [
            "Farnham"
        ],
        "hotel_description": [
            "Farnham",
            "Farnborough",
            "Bar"
        ],
        "hotel_name": [
            "Farnham"
        ]
    },
    "review_count": 237,
    "review_count_current": 12,
    "reviews": [
        {
            "date": "July 11, 2005",
            "detail_rating": {
                "business": null,
                "cleanliness": 2.0,
                "desk": null,
                "location": null,
                "pool": null,
                "restaurant": null,
                "rooms": 4.0,
                "service": 2.0,
                "sleep": null,
                "value": 2.0
            },
            "helpfulness": 4,
            "id": 3655800,
            "likes": {
                "disliked": null,
                "liked": null
            },
            "rating": 3.0,
            "stay_parameters": "Stayed July 2005",
            "text": "Stayed last Saturday for a friend's wedding. The hotel was pretty and the room was nice - though there was evidence that it hadn't been cleaned as well as it could have; there was an open, unlidded shower gel bottle still in the shower.",
            "title": "One Egg!",
            "user": "Chickadee7"
        },
        {
            "date": "September 26, 2004",
            "detail_rating": {
                "business": null,
                "cleanliness": null,
                "desk": null,
                "location": null,
                "pool": null,
                "restaurant": null,
                "rooms": null,
                "service": null,
                "sleep": null,
                "value": null
            },
            "helpfulness": 4,
            "id": 2601535,
            "likes": {
                "disliked": null,
                "liked": null
            },
            "rating": 5.0,
            "stay_parameters": null,
            "text": "Breakfast on the busy Sunday morning was a bit of a shambles - the staff huffed and puffed and we waited an inordinate time for our cooked \"country\" breakfast before a waiter came over to ask (again) if we had ordered. When it did arrive, my \"country\" breakfast (listed on the menu as a full english) came with one poached egg, one sausage, two slim rashers of bacon, one mushroom and one half grilled tomato. We paid the full B&B rate of \u00a3118, but if I had paid the separate \u00a315 breakfast charge I would have been disgusted (I was anyway). We all know breakfasts don't cost that much to cater, and fair enough there was a buffet - but that had run dry when we arrived at 9.50 (breakfast ran till 10.30 - there was little in the way of replenishment). They clearly cannot cope with large amounts of guests - but for a successful and reasonably pricey hotel in a major wedding catchment area I was not impressed at all.",
            "title": "Perfect setting",
            "user": "A TripAdvisor user"
        },
        {
            "date": "November 26, 2005",
            "detail_rating": {
                "business": null,
                "cleanliness": 5.0,
                "desk": null,
                "location": null,
                "pool": null,
                "restaurant": null,
                "rooms": 5.0,
                "service": 5.0,
                "sleep": null,
                "value": 5.0
            },
            "helpfulness": 4,
            "id": 4144278,
            "likes": {
                "disliked": null,
                "liked": null
            },
            "rating": 5.0,
            "stay_parameters": "Stayed November 2005",
            "text": "I booked this through Lastminute for a bargain \u00a353 for the two of us, including breakfast. What a lovely hotel, bang in the centre of Farnham, within easy walking distance of the many pubs and restaurants. Our room was very traditional, and very comfy with all the amenities you would expect of a 4* hotel. It had a trouser press, free bottled sparkling and still water, herbal teas/normal tea/coffee, and hot chocolate. The breakfast was a treat, in a beautiful room with chandaliers. It's coming up to Christmas and it was tastefully decorated, not tacky. The buffet was plentiful, with yummy treats like fresh figs, fresh honey, and the usual pastries, cheeses, meats etc. Toast came out automatically, and there was waiter service for the hot food. Yes, you got 'one egg' if you ordered the poached, but I'm sure you can order more if need be. My beans on toast came out with 4 tiny triangles of toast with the crusts cut off, arranged around a small pot of beans. I guess the restaurants theme is the appearance of the food rather than the quantity, but the overall quality was fantastic. All in all, we had a very pleasant stay in a good standard 4* hotel for a bargain price. We'll certainly consider going there again next time we want a quick get-away.",
            "title": "A Pleasant Surprise",
            "user": "southmouth"
        },
        {
            "date": "November 6, 2005",
            "detail_rating": {
                "business": null,
                "cleanliness": null,
                "desk": null,
                "location": null,
                "pool": null,
                "restaurant": null,
                "rooms": null,
                "service": null,
                "sleep": null,
                "value": null
            },
            "helpfulness": 5,
            "id": 4089933,
            "likes": {
                "disliked": null,
                "liked": null
            },
            "rating": 5.0,
            "stay_parameters": null,
            "text": "My daughter and her new husband had their wedding reception here at the end of October. We had a wonderful day. The organisation was excellent, the food delicious and the service brilliant. All the staff were polite, helpful and competent. The rooms were comfortable and everyone who stayed (and there were a large number of us) said they would stay at the Bush again.",
            "title": "Wonderful wedding venue",
            "user": "A TripAdvisor user"
        },
        {
            "date": "September 29, 2005",
            "detail_rating": {
                "business": null,
                "cleanliness": null,
                "desk": null,
                "location": null,
                "pool": null,
                "restaurant": null,
                "rooms": null,
                "service": null,
                "sleep": null,
                "value": null
            },
            "helpfulness": 5,
            "id": 3970146,
            "likes": {
                "disliked": null,
                "liked": null
            },
            "rating": 5.0,
            "stay_parameters": null,
            "text": "We have just had our wedding reception at The Bush and wanted to write a review to defend the hotel from the couple of other complanits about it on this site so that readers don't get the wrong impression!",
            "title": "Wow!",
            "user": "A TripAdvisor user"
        },
        {
            "date": "September 1, 2005",
            "detail_rating": {
                "business": null,
                "cleanliness": 4.0,
                "desk": null,
                "location": null,
                "pool": null,
                "restaurant": null,
                "rooms": 3.0,
                "service": null,
                "sleep": null,
                "value": 2.0
            },
            "helpfulness": 6,
            "id": 3837071,
            "likes": {
                "disliked": null,
                "liked": null
            },
            "rating": 3.0,
            "stay_parameters": "Stayed August 2005, traveled on business",
            "text": "The hotel itself is lovely with lots of interesting historical features (see the indoor ceiling sundial in the oak lounge) and is also in the centre of farnham which is a lovely town.",
            "title": "A little better than the Salvation Army!!",
            "user": "JSFULHAM"
        },
        {
            "date": "August 1, 2005",
            "detail_rating": {
                "business": null,
                "cleanliness": null,
                "desk": null,
                "location": null,
                "pool": null,
                "restaurant": null,
                "rooms": null,
                "service": null,
                "sleep": null,
                "value": null
            },
            "helpfulness": 5,
            "id": 3726920,
            "likes": {
                "disliked": null,
                "liked": null
            },
            "rating": 1.0,
            "stay_parameters": null,
            "text": "The service could not have been any better either on our wedding day (thankyou hiney and team!) or on the numerous occasions that we visited the hotel for lunch, afternoon tea and to check wedding details with Diane the coordinator.",
            "title": "Disappointing",
            "user": "A TripAdvisor user"
        },
        {
            "date": "September 17, 2006",
            "detail_rating": {
                "business": null,
                "cleanliness": 2.0,
                "desk": null,
                "front_desk": 2.0,
                "location": 3.0,
                "pool": null,
                "restaurant": null,
                "rooms": 3.0,
                "service": null,
                "sleep": null,
                "value": 1.0
            },
            "helpfulness": 2,
            "id": 5810157,
            "likes": {
                "disliked": "\u2014 didn't feel clean",
                "liked": "\u2014 handy location"
            },
            "rating": 2.0,
            "stay_parameters": "Stayed September 2006, traveled as a couple",
            "text": "We stayed here after attending a wedding in the area and were very disappointed. On the website the hotel looked really lovely however we found it to be pretty shabby and felt that the \u00a3160 B&B rate was certainly not deserved. We waited about 15 minutes to check in which was not great as we were in a rush. Some people's rooms were not even ready and it was mid afternoon. The room was OK but the bathroom was really old and tatty and not particularly clean, we were only given two small hand towels. Breakfas was included in the price, the buffet bit was fine but the cooked food was a real let down with tiny portions, I ordered poached eggs with beans, mushrooms and tomato and literlly got 1 mushroom and half a tomato ( we also had a 40 minute wait for this). Feel a bit ripped off but we should have checked Tripadvisor prior to booking.",
            "title": "Really disappointing",
            "user": "JosieH"
        },
        {
            "date": "August 1, 2006",
            "detail_rating": {
                "business": null,
                "cleanliness": 4.0,
                "desk": null,
                "front_desk": 3.0,
                "location": 4.0,
                "pool": null,
                "restaurant": null,
                "rooms": 3.0,
                "service": 2.0,
                "sleep": null,
                "value": 2.0
            },
            "helpfulness": 2,
            "id": 5537085,
            "likes": {
                "disliked": "\u2014 Food",
                "liked": "\u2014 Convieninet location"
            },
            "rating": 1.0,
            "stay_parameters": "Stayed July 2006, traveled as a couple",
            "text": "Evidently a busy hotel in a town setting. The food was such a let down. We ordered a plowman's lunch from the bar menu at nearly \u00a310 a go and it was just a joke. Tiny amount of dried up cheese and celery. Three mingy (tiny) slices of white dry bread. A teeny tiny pot of pickle. The barman serving us said it was not his problem! Pathetic in such a hotel. We got disturbed by the disco from the wedding in the hotel. We went to bed after midnight but the noise from the rowdy wedding guests and disco up kept us awake. A drunk guest called us in the middle of the night (4am). As requested my medium boiled egg at breakfast arrived watery inside. Sort it out Macdonald hotel company or we (and others) just will never be back. You have to watch the type of people you attract at low room rates and in wedding groups as they will put of regular clientelle who pay nearly full price.",
            "title": "smallest plowman's lunch in the world",
            "user": "Honest-but-fair"
        },
        {
            "date": "May 24, 2006",
            "detail_rating": {
                "business": null,
                "cleanliness": 3.0,
                "desk": null,
                "location": null,
                "pool": null,
                "restaurant": null,
                "rooms": 4.0,
                "service": 4.0,
                "sleep": null,
                "value": 3.0
            },
            "helpfulness": 4,
            "id": 5208449,
            "likes": {
                "disliked": null,
                "liked": null
            },
            "rating": 4.0,
            "stay_parameters": "Stayed May 2006, traveled on business",
            "text": "On a slight positive note we found the room to be clean and tidy.",
            "title": "Classical lodgings",
            "user": "Jon P"
        },
        {
            "date": "February 2, 2006",
            "detail_rating": {
                "business": null,
                "cleanliness": 1.0,
                "desk": null,
                "location": null,
                "pool": null,
                "restaurant": null,
                "rooms": 2.0,
                "service": 4.0,
                "sleep": null,
                "value": 2.0
            },
            "helpfulness": 4,
            "id": 4408860,
            "likes": {
                "disliked": null,
                "liked": null
            },
            "rating": 2.0,
            "stay_parameters": "Stayed July 2005",
            "text": "Booked into the Bush on the recommendation of a seasoned traveller. It's much more interesting than your average concrete block of hotel rooms.",
            "title": "Will Not be staying here again",
            "user": "achapman"
        },
        {
            "date": "January 7, 2006",
            "detail_rating": {
                "business": null,
                "cleanliness": null,
                "desk": null,
                "location": null,
                "pool": null,
                "restaurant": null,
                "rooms": null,
                "service": null,
                "sleep": null,
                "value": null
            },
            "helpfulness": 4,
            "id": 4331204,
            "likes": {
                "disliked": null,
                "liked": null
            },
            "rating": 5.0,
            "stay_parameters": null,
            "text": "I was give a small suite in a corner of the hotel, with a really comfy bed and excellent blackout curtains.",
            "title": "Polite and helpful staff",
            "user": "A TripAdvisor user"
        }
    ],
    "slim_ranking": 0.333333333333,
    "stars": 3,
    "tripadvisor": {
        "VISITED": false,
        "country_name": null,
        "locality": null,
        "pic_link": null,
        "street_address": null
    },
    "user_rating": 3.5,
    "variance": {
        "average": 61,
        "excellent": 43,
        "poor": 34,
        "terrible": 18,
        "very good": 81
    }
}