{
    "aka": "Sail Inn B&B Lunenburg, Nova Scotia",
    "description": null,
    "detail_rating": {
        "cleanliness": null,
        "location": null,
        "rooms": null,
        "service": null,
        "sleep": null,
        "value": null
    },
    "location": {
        "city": null,
        "continent": null,
        "country": "Canada",
        "proposed_city": null,
        "province": null,
        "region": null
    },
    "name": "Sail Inn B&B",
    "places": {
        "aka": [],
        "hotel_description": [],
        "hotel_name": []
    },
    "review_count": 41,
    "review_count_current": 8,
    "reviews": [
        {
            "date": "February 24, 2008",
            "detail_rating": {
                "business": null,
                "cleanliness": 4.0,
                "desk": null,
                "front_desk": 3.0,
                "location": 4.0,
                "pool": null,
                "restaurant": null,
                "rooms": 4.0,
                "service": 4.0,
                "sleep": null,
                "value": 5.0
            },
            "helpfulness": 1,
            "id": 13812337,
            "likes": {
                "disliked": null,
                "liked": null
            },
            "rating": 4.0,
            "stay_parameters": "Stayed August 2007, traveled as a couple",
            "text": "Although it was a while ago when we stayed there (August 2007) I just wanted to write a quick review to let people know how wonderful it was.",
            "title": "Wonderful B&B",
            "user": "NovaScotiaTravellers"
        },
        {
            "date": "October 8, 2007",
            "detail_rating": {
                "business": null,
                "cleanliness": 5.0,
                "desk": null,
                "front_desk": 4.0,
                "location": 5.0,
                "pool": null,
                "restaurant": null,
                "rooms": 4.0,
                "service": 4.0,
                "sleep": null,
                "value": 5.0
            },
            "helpfulness": 3,
            "id": 10056660,
            "likes": {
                "disliked": "\u2014 Noise from upstairs plumbing.",
                "liked": "\u2014 Going with Keith on his boats."
            },
            "rating": 5.0,
            "stay_parameters": "Stayed August 2007, traveled as a couple",
            "text": "We stayed in Room 1 which was very large and had nice antique furnishings and a huge bathroom with jacuzzi. There was also a little kitchenette.",
            "title": "Four Star Accomodations, Five Star Experience",
            "user": "zracoon"
        },
        {
            "date": "June 27, 2007",
            "detail_rating": {
                "business": null,
                "cleanliness": null,
                "desk": null,
                "location": null,
                "pool": null,
                "restaurant": null,
                "rooms": null,
                "service": null,
                "sleep": null,
                "value": null
            },
            "helpfulness": 2,
            "id": 8005373,
            "likes": {
                "disliked": null,
                "liked": null
            },
            "rating": 4.0,
            "stay_parameters": null,
            "text": "Since the owner's boat (The Eastern Star) wasn't filled we went out with them for an afternoon cruise and then an evening/sunset cruise (it was free since they weren't full). We brought a bottle of wine and a little picnic to enjoy. My husband even helped to raise the sails. There were binoculars on board and we saw seals.",
            "title": "Good B&B and Complementary Sail Too!",
            "user": "chevybb"
        },
        {
            "date": "October 3, 2009",
            "detail_rating": {
                "business": null,
                "cleanliness": 5.0,
                "desk": null,
                "location": 5.0,
                "pool": null,
                "restaurant": null,
                "rooms": 5.0,
                "service": 5.0,
                "sleep": null,
                "value": 5.0
            },
            "helpfulness": null,
            "id": 45761094,
            "likes": {
                "disliked": null,
                "liked": null
            },
            "rating": 5.0,
            "stay_parameters": "Stayed September 2009, traveled as a couple",
            "text": "We loved the Sail Inn B& B. We stayed in room #2 & loved it. Very spacious & clean with good amenities. The location was great...just one street up from where the Bluenose II is berthed. We truly enjoyed the sail although there was no wind. We had the option of sitting out in the harbour or using the motor to go out by the Ovens. We went to the Ovens. Breakfast was very good with lots of options....eggs, sausage, bacon, breads, fruit, cheeses, jams, etc. Would def stay here again.",
            "title": "Great Stay & Sail",
            "user": "kftw"
        },
        {
            "date": "July 12, 2009",
            "detail_rating": {
                "business": null,
                "cleanliness": 5.0,
                "desk": null,
                "location": 5.0,
                "pool": null,
                "restaurant": null,
                "rooms": 5.0,
                "service": 5.0,
                "sleep": null,
                "value": 5.0
            },
            "helpfulness": null,
            "id": 34583430,
            "likes": {
                "disliked": null,
                "liked": null
            },
            "rating": 5.0,
            "stay_parameters": "Stayed July 2009, traveled as a couple",
            "text": "We stayed at the Sail Inn on our second night in Lunenburg and we were soooo happy we had to switch Inns. Lovely room, beautifully restored building, wonderful complimentary sail on the owner's boat and the hugest, most delicious breakfast we had on our trip! Please stay here. You will love it! (ask for room #4).",
            "title": "THE BEST",
            "user": "ChappyChapman"
        },
        {
            "date": "August 7, 2008",
            "detail_rating": {
                "business": 5.0,
                "cleanliness": 5.0,
                "desk": null,
                "front_desk": 5.0,
                "location": 5.0,
                "pool": null,
                "restaurant": null,
                "rooms": 5.0,
                "service": 5.0,
                "sleep": null,
                "value": 5.0
            },
            "helpfulness": 1,
            "id": 18728310,
            "likes": {
                "disliked": "\u2014 nothing",
                "liked": "\u2014 the free sail included, breakfast, wonderful staff"
            },
            "rating": 5.0,
            "stay_parameters": "Stayed August 2008, traveled as a couple",
            "text": "we loved the sail inn. really friendly people, yummy, cooked to order breakfast, spacious, homey room, great view, amazing \"free sail\" included in the cost of the room. we LOVED it and would return in a heartbeat!",
            "title": "the best b & b ever!!!",
            "user": "donnadbb"
        },
        {
            "date": "June 26, 2008",
            "detail_rating": {
                "business": 5.0,
                "cleanliness": 5.0,
                "desk": null,
                "front_desk": 5.0,
                "location": 5.0,
                "pool": null,
                "restaurant": null,
                "rooms": 5.0,
                "service": 5.0,
                "sleep": null,
                "value": 5.0
            },
            "helpfulness": null,
            "id": 17264563,
            "likes": {
                "disliked": "\u2014 Having to leave the next day!",
                "liked": "\u2014 The whole experience"
            },
            "rating": 5.0,
            "stay_parameters": "Stayed June 2008, traveled as a couple",
            "text": "We just called in on spec and found a real bargain! The owner also has a 48 foot classic wooden ketch (Eastern Star) that conducts interpreted sails around the harbour and bay. If you stay at this lovingly restored turn of the century skipper's house you will be invited aboard the ketch for an evening sail. The four rooms are all spacious and thoughtfully restored to enhance many of the building's original features. The decor is contemporary whilst complementing the old building. The breakfast was excellent, with healthy options.",
            "title": "Free Sail!",
            "user": "FloJoCornwall"
        },
        {
            "date": "June 16, 2008",
            "detail_rating": {
                "business": null,
                "cleanliness": 4.0,
                "desk": null,
                "front_desk": 5.0,
                "location": 5.0,
                "pool": null,
                "restaurant": null,
                "rooms": 4.0,
                "service": 5.0,
                "sleep": null,
                "value": 5.0
            },
            "helpfulness": null,
            "id": 16962247,
            "likes": {
                "disliked": "\u2014 nothing",
                "liked": "\u2014 its character"
            },
            "rating": 5.0,
            "stay_parameters": "Stayed June 2008, traveled as a couple",
            "text": "We stayed at the Sail Inn B&B in Lunenburg after staying at the Guest Lovitt B&B in Yarmouth. The Sail Inn is a very different yet complementary experience and one you should not miss. Again, the location is excellent as it is right down town and has a view of the harbour. We stayed in room # 3 on the third floor with a small kitchenette but the highlight of the room is the very large bathroom with jaquzzi. The breakfast by the owner Keith, was made to order with a variety of items that would satisfy all tastes. (I especially enjoyed the salted salmon.)",
            "title": "Stay at the Sail Inn B&B!",
            "user": "Morjohn"
        }
    ],
    "slim_ranking": 0.241379310345,
    "stars": null,
    "tripadvisor": {
        "VISITED": false,
        "country_name": null,
        "locality": null,
        "pic_link": null,
        "street_address": null
    },
    "user_rating": 5.0,
    "variance": {
        "average": 1,
        "excellent": 34,
        "poor": 0,
        "terrible": 0,
        "very good": 6
    }
}