{
    "aka": "Toyoko Inn Yamanotesen Otsuka-Eki Kita-Guchi No.2 Tokyo, Japan",
    "description": null,
    "detail_rating": {
        "cleanliness": null,
        "location": null,
        "rooms": null,
        "service": null,
        "sleep": null,
        "value": null
    },
    "location": {
        "city": null,
        "continent": "Asia",
        "country": "Japan",
        "proposed_city": "Tokyo",
        "province": null,
        "region": "Kanto"
    },
    "name": "Toyoko Inn Yamanotesen Otsuka-eki Kita-guchi No.2",
    "places": {
        "aka": [
            "Tokyo"
        ],
        "hotel_description": [],
        "hotel_name": []
    },
    "review_count": 18,
    "review_count_current": 3,
    "reviews": [
        {
            "date": "April 27, 2013",
            "detail_rating": {
                "business": null,
                "cleanliness": 4.0,
                "desk": null,
                "location": 4.0,
                "pool": null,
                "restaurant": null,
                "rooms": 3.0,
                "service": 4.0,
                "sleep": 3.0,
                "value": 4.0
            },
            "helpfulness": null,
            "id": 158948845,
            "likes": {
                "disliked": null,
                "liked": null
            },
            "rating": 4.0,
            "stay_parameters": "Stayed April 2013, traveled with friends",
            "text": "We stayed here for 2 nights. Location was great. Less than 5 minutes walk from the JR Station with loads of cheap restaurants along the way. It was a pleasant walk even at night. The hotel is located slightly off the main thoroughfare. Thus, it was nice to sit outside by their outdoor tables since it was very peaceful.",
            "title": "Excellent Location",
            "user": "MelKualaLumpur"
        },
        {
            "date": "December 12, 2012",
            "detail_rating": {
                "business": null,
                "cleanliness": 5.0,
                "desk": null,
                "location": 5.0,
                "pool": null,
                "restaurant": null,
                "rooms": 3.0,
                "service": 4.0,
                "sleep": 4.0,
                "value": 5.0
            },
            "helpfulness": null,
            "id": 147337448,
            "likes": {
                "disliked": null,
                "liked": null
            },
            "rating": 4.0,
            "stay_parameters": "Stayed August 2012, traveled as a couple",
            "text": "We booked a Double Room and not the Economy Double. Thus, slightly bigger room and the bed was slightly bigger than a queen sized bed. Therefore, a good size for friends sharing. As mentioned, the bed was higher than usual to accommodate luggages being stored underneath.",
            "title": "Good value",
            "user": "Dvd_Naz"
        },
        {
            "date": "August 11, 2009",
            "detail_rating": {
                "business": null,
                "cleanliness": null,
                "desk": null,
                "location": null,
                "pool": null,
                "restaurant": null,
                "rooms": null,
                "service": null,
                "sleep": null,
                "value": null
            },
            "helpfulness": 2,
            "id": 37417596,
            "likes": {
                "disliked": null,
                "liked": null
            },
            "rating": 5.0,
            "stay_parameters": null,
            "text": "After staying in both twin and double rooms I prefer the double since there is more space. What I love about Toyoko Inn is the abundance of places to hang wet clothing to dry in the bathroom.",
            "title": "Great Budget Hotel",
            "user": "cstrnuts"
        }
    ],
    "slim_ranking": 0.372549019608,
    "stars": null,
    "tripadvisor": {
        "VISITED": false,
        "country_name": null,
        "locality": null,
        "pic_link": null,
        "street_address": null
    },
    "user_rating": 4.0,
    "variance": {
        "average": 5,
        "excellent": 3,
        "poor": 0,
        "terrible": 0,
        "very good": 10
    }
}