{
    "aka": "Hotel Dolder Waldhaus",
    "description": null,
    "detail_rating": {
        "cleanliness": null,
        "location": null,
        "rooms": null,
        "service": null,
        "sleep": null,
        "value": null
    },
    "location": {
        "city": null,
        "continent": "Europe",
        "country": "Switzerland",
        "proposed_city": null,
        "province": null,
        "region": null
    },
    "name": "Dolder Waldhaus Hotel",
    "places": {
        "aka": [],
        "hotel_description": [],
        "hotel_name": []
    },
    "review_count": 84,
    "review_count_current": 10,
    "reviews": [
        {
            "date": "September 18, 2007",
            "detail_rating": {
                "business": 3.0,
                "cleanliness": 4.0,
                "desk": null,
                "front_desk": 4.0,
                "location": 4.0,
                "pool": null,
                "restaurant": null,
                "rooms": 3.0,
                "service": 4.0,
                "sleep": null,
                "value": 3.0
            },
            "helpfulness": null,
            "id": 8749982,
            "likes": {
                "disliked": null,
                "liked": null
            },
            "rating": 4.0,
            "stay_parameters": "Stayed September 2007, traveled on business",
            "text": "I had a very quick trip to this hotel - concur on the great location, amazing views etc. My room was an average size, but felt quite sparse, almost like a uni dorm. The staff were very helpful and quick to respond eg to requests for an iron. The breakfast was great - I would be the size of a house if I had croissants and cheese for breakfast every morning! Very good coffee too.",
            "title": "Great location, average room",
            "user": "jojoMelbourne"
        },
        {
            "date": "September 17, 2007",
            "detail_rating": {
                "business": null,
                "cleanliness": null,
                "desk": null,
                "location": null,
                "pool": null,
                "restaurant": null,
                "rooms": null,
                "service": null,
                "sleep": null,
                "value": null
            },
            "helpfulness": 1,
            "id": 8740408,
            "likes": {
                "disliked": null,
                "liked": null
            },
            "rating": 5.0,
            "stay_parameters": null,
            "text": "I also found the room very stuffy and could not find any temperature control (could have been me!) So I slept with the balcony door open, which was a bit of an issue as there was a huge storm all night.",
            "title": "3rd stay, not disappointed",
            "user": "WhiteTara"
        },
        {
            "date": "September 4, 2007",
            "detail_rating": {
                "business": 3.0,
                "cleanliness": 5.0,
                "desk": null,
                "front_desk": 5.0,
                "location": 5.0,
                "pool": null,
                "restaurant": null,
                "rooms": 5.0,
                "service": 5.0,
                "sleep": null,
                "value": 5.0
            },
            "helpfulness": 1,
            "id": 8617516,
            "likes": {
                "disliked": "\u2014 Nowhere to eat in the area",
                "liked": "\u2014 Views, the quiet, friendly front desk"
            },
            "rating": 4.0,
            "stay_parameters": "Stayed September 2006, traveled as a couple",
            "text": "Also no shampoo or conditioner in the bathroom which I had expected, just an all-in-one shower gel / shampoo.",
            "title": "Lovely!",
            "user": "kauailover11"
        },
        {
            "date": "October 12, 2006",
            "detail_rating": {
                "business": null,
                "cleanliness": 5.0,
                "desk": null,
                "front_desk": 5.0,
                "location": 5.0,
                "pool": null,
                "restaurant": null,
                "rooms": 4.0,
                "service": null,
                "sleep": null,
                "value": 5.0
            },
            "helpfulness": 5,
            "id": 5947318,
            "likes": {
                "disliked": "\u2014 price",
                "liked": "\u2014 value"
            },
            "rating": 5.0,
            "stay_parameters": "Stayed September 2006, traveled with friends",
            "text": "I also had a swim in the pool, which was tiny to do laps in, but very nice.",
            "title": "Must stay",
            "user": "JonnyRotten90"
        },
        {
            "date": "June 20, 2006",
            "detail_rating": {
                "business": null,
                "cleanliness": 5.0,
                "desk": null,
                "location": null,
                "pool": null,
                "restaurant": null,
                "rooms": 5.0,
                "service": 5.0,
                "sleep": null,
                "value": 5.0
            },
            "helpfulness": 10,
            "id": 5363699,
            "likes": {
                "disliked": null,
                "liked": null
            },
            "rating": 5.0,
            "stay_parameters": "Stayed June 2006",
            "text": "How can I convince people to stay at this hotel? Yes. It is a little out of the way. You have to take tram #3 from Central Station just past the art museum and then a little mountain railroad up the hill, which is great fun, and yes, it is not impressive from the outside, sort of Soviet Bloc architecture ... but inside, mmmmm! Super service, lovely rooms, beautiful views over the lake and downtown Zurich from high above which makes it magical at night. I go back each year just to sit on the balcony (each room has a private one) and watch the sunset. It is the end of my yearly sojourn in Europe and calms me down for the flight home. I usually go down to the Museum if I want to do anything at all, which takes all of ten minutes from the hotel, and avoid downtown ... I just rest, enjoy the pool, the view, the food and being taken care of ... then it is back to reality ... Manhattan.",
            "title": "Fantastic Placee to Stay",
            "user": "CorkeSydney"
        },
        {
            "date": "August 30, 2008",
            "detail_rating": {
                "business": 3.0,
                "cleanliness": 5.0,
                "desk": null,
                "front_desk": 5.0,
                "location": 5.0,
                "pool": null,
                "restaurant": null,
                "rooms": 4.0,
                "service": 5.0,
                "sleep": null,
                "value": 4.0
            },
            "helpfulness": null,
            "id": 19536064,
            "likes": {
                "disliked": "\u2014 furniture in the rooms",
                "liked": "\u2014 View from the balcony, breakfast"
            },
            "rating": 4.0,
            "stay_parameters": "Stayed August 2008, traveled on business",
            "text": "Whenever business takes me to Zurich, this is - and has been for over 20 years - my favourite place to spend the night. True, it is not right in the centre of town but rather pleasant to get to (tram plus funicular) and quiet (except for rooms where the last number is a 1). Very friendly staff, beautiful view over lake and mountains, the whole town lies at your feet. There is a free shuttle bus to the main railway station, but it does not run very frequently. I just love the breakfast. Large underground car park absolutely free. One minus point: The room furniture is hideous! But bed very comfortable and good lighting. TV set should be replaced by a flat screen one. Some rooms have airconditioning individually adjustable (not easy).",
            "title": "My favourite hotel in Zurich",
            "user": "blacklab"
        },
        {
            "date": "July 29, 2008",
            "detail_rating": {
                "business": 4.0,
                "cleanliness": 5.0,
                "desk": null,
                "front_desk": 4.0,
                "location": 5.0,
                "pool": null,
                "restaurant": null,
                "rooms": 4.0,
                "service": 4.0,
                "sleep": null,
                "value": 4.0
            },
            "helpfulness": null,
            "id": 18398231,
            "likes": {
                "disliked": "\u2014 Hideous exterior!",
                "liked": "\u2014 Peace and quiet, efficiency"
            },
            "rating": 4.0,
            "stay_parameters": "Stayed October 2007, traveled on business",
            "text": "The Waldhaus Dolder is not to be confused with its recently-refurbished Grand neighbour up the hill!",
            "title": "A well-kept secret",
            "user": "chilternwelshman"
        },
        {
            "date": "July 8, 2008",
            "detail_rating": {
                "business": null,
                "cleanliness": 4.0,
                "desk": null,
                "front_desk": 4.0,
                "location": 5.0,
                "pool": null,
                "restaurant": null,
                "rooms": 4.0,
                "service": 3.0,
                "sleep": null,
                "value": 4.0
            },
            "helpfulness": null,
            "id": 17640405,
            "likes": {
                "disliked": null,
                "liked": null
            },
            "rating": 4.0,
            "stay_parameters": "Stayed June 2008, traveled on business",
            "text": "When you reach it via the funicular from Roemerhof, you'll be greeted by something that looks hideous - 60s concrete. Fortunately, the interior, though relatively unflamboyant, is much, much more pleasant. Some of the rooms are small, but many are rather like suites, and the majority, though not all, have balconies and superb views down over Zurich.",
            "title": "Great views, average building",
            "user": "Mel 'Evans' Y"
        },
        {
            "date": "April 6, 2008",
            "detail_rating": {
                "business": null,
                "cleanliness": null,
                "desk": null,
                "location": null,
                "pool": null,
                "restaurant": null,
                "rooms": null,
                "service": null,
                "sleep": null,
                "value": null
            },
            "helpfulness": 1,
            "id": 14834119,
            "likes": {
                "disliked": null,
                "liked": null
            },
            "rating": 3.0,
            "stay_parameters": null,
            "text": "The food is good-quality Swiss, both at breakfast and dinner. Staff are also typical Swiss: efficient and with passable, though not always perfect, English (which is anyway far better than my Swiss-German!).",
            "title": "Step back to the 70s at the Dolder Waldhaus!",
            "user": "CK78"
        },
        {
            "date": "September 22, 2007",
            "detail_rating": {
                "business": 5.0,
                "cleanliness": 5.0,
                "desk": null,
                "front_desk": 4.0,
                "location": 3.0,
                "pool": null,
                "restaurant": null,
                "rooms": 5.0,
                "service": 5.0,
                "sleep": null,
                "value": 4.0
            },
            "helpfulness": null,
            "id": 8852054,
            "likes": {
                "disliked": "\u2014 some staff speak very poor english",
                "liked": "\u2014 view"
            },
            "rating": 4.0,
            "stay_parameters": "Stayed September 2007, traveled as a couple",
            "text": "It is altogether a quiet haven from the city, and a few degrees cooler in a hot summer. I tend to stay there once every couple of years as an occasional change from my much more frequent venue. I can imagine it would be ideal for visitors to Zurich who appreciate peace and quiet (not that Zurich is a bustling metropolis!) and, perhaps, would like some walking in the woods.",
            "title": "Excellent hotel for the price",
            "user": "LobsterDaddy"
        }
    ],
    "slim_ranking": 0.290322580645,
    "stars": 4,
    "tripadvisor": {
        "VISITED": false,
        "country_name": null,
        "locality": null,
        "pic_link": null,
        "street_address": null
    },
    "user_rating": 4.0,
    "variance": {
        "average": 7,
        "excellent": 30,
        "poor": 7,
        "terrible": 2,
        "very good": 38
    }
}