{
    "aka": "Thunderbird Hotel West Yarmouth",
    "description": "Newly renovated rooms.",
    "detail_rating": {
        "cleanliness": null,
        "location": null,
        "rooms": null,
        "service": null,
        "sleep": null,
        "value": null
    },
    "location": {
        "city": null,
        "continent": null,
        "country": "United States",
        "proposed_city": "Yarmouth",
        "province": null,
        "region": null
    },
    "name": "Thunderbird Motel",
    "places": {
        "aka": [
            "Yarmouth"
        ],
        "hotel_description": [],
        "hotel_name": []
    },
    "review_count": 46,
    "review_count_current": 5,
    "reviews": [
        {
            "date": "August 26, 2009",
            "detail_rating": {
                "business": null,
                "cleanliness": 5.0,
                "desk": null,
                "location": 4.0,
                "pool": null,
                "restaurant": null,
                "rooms": 5.0,
                "service": 5.0,
                "sleep": null,
                "value": 4.0
            },
            "helpfulness": null,
            "id": 38824507,
            "likes": {
                "disliked": null,
                "liked": null
            },
            "rating": 5.0,
            "stay_parameters": "Stayed August 2009, traveled on business",
            "text": "I recently stayed at the Travelodge for 1 night. I recall staying at the same establishment when it was a Roadway Inn two years ago and that was surely depressing..... dated and musty! The new owners have done a complete 360' with renovations. The room was new and furnishings were new, comfortable bed and the AC was FRIGID! Just the way I like it on a hot summer\u2019s night.",
            "title": "Surprised!",
            "user": "scott s"
        },
        {
            "date": "August 17, 2009",
            "detail_rating": {
                "business": null,
                "cleanliness": 5.0,
                "desk": null,
                "location": 4.0,
                "pool": null,
                "restaurant": null,
                "rooms": 5.0,
                "service": 4.0,
                "sleep": null,
                "value": 5.0
            },
            "helpfulness": null,
            "id": 37883793,
            "likes": {
                "disliked": null,
                "liked": null
            },
            "rating": 4.0,
            "stay_parameters": "Stayed August 2009, traveled with family",
            "text": "I stayed for one night with two of my children. The bedrooms were recently redone. They are beautiful and comfortable. On check in we were told that all though the bedrooms were redone they still had to get to the bathrooms (they just recently bought the hotel) so I was prepared for a subpar bathroom but found it was fine. Nothing wrong with the bathroom. The staff was very helpful in suggesting a great restaurant for dinner. The pool was a nice break from the rain we had while we were there. There is a nice playground out back and couple of charcoal grills for cooking. We really enjoyed the stay. My daughter was even able to work on a project for her summer classes as there is free WiFi and it worked well from our room. Like a previous guest mentioned, the one thing I would change was breakfast. There were two types of cold cereal with only whole milk. Very small, bite size muffins, donuts that had been frozen (still cold in the middle) and the make your own waffles. The waffles were great but one waffle maker for many people so it took a long time to get everyone through. I think they should add a second waffle maker and then have a better variety of bagels and bread with a toaster and maybe some fruit.",
            "title": "Great place, great price, nice people, breakfast not so good",
            "user": "MAtrigal"
        },
        {
            "date": "August 7, 2009",
            "detail_rating": {
                "business": null,
                "cleanliness": 4.0,
                "desk": null,
                "location": 5.0,
                "pool": null,
                "restaurant": null,
                "rooms": 4.0,
                "service": 4.0,
                "sleep": null,
                "value": 4.0
            },
            "helpfulness": null,
            "id": 37002132,
            "likes": {
                "disliked": null,
                "liked": null
            },
            "rating": 4.0,
            "stay_parameters": "Stayed August 2009, traveled with family",
            "text": "The room was alot larger than I expected! The carpet was new and the beds were comfortable (and so was the recliner that I fell asleep in!). I did wish that it had a fridge in it, but no big deal.",
            "title": "Really nice...with one minor flaw...",
            "user": "ARMYtango"
        },
        {
            "date": "August 5, 2009",
            "detail_rating": {
                "business": null,
                "cleanliness": null,
                "desk": null,
                "location": null,
                "pool": null,
                "restaurant": null,
                "rooms": null,
                "service": null,
                "sleep": null,
                "value": null
            },
            "helpfulness": null,
            "id": 36852733,
            "likes": {
                "disliked": null,
                "liked": null
            },
            "rating": 5.0,
            "stay_parameters": null,
            "text": "The kids enjoyed the small playground, and the indoor pool. The pool was not heated, and the spa/ hottub was empty, but again, no big deal.",
            "title": "Inquire within before driving by.",
            "user": "Vfoote2"
        },
        {
            "date": "March 2, 2009",
            "detail_rating": {
                "business": null,
                "cleanliness": 2.0,
                "desk": null,
                "location": 4.0,
                "pool": null,
                "restaurant": null,
                "rooms": 1.0,
                "service": 1.0,
                "sleep": null,
                "value": 2.0
            },
            "helpfulness": 1,
            "id": 25467667,
            "likes": {
                "disliked": null,
                "liked": null
            },
            "rating": 1.0,
            "stay_parameters": "Stayed February 2009, traveled with friends",
            "text": "The only flaw I saw was where the breakfast was served. The room was uncomfortably hot because of the lack of any fans or windows that can open.",
            "title": "the worse hotel I ever stayed in after being relocated from the other hotel they own because of a gas leak",
            "user": "goofy1thomas"
        }
    ],
    "slim_ranking": 0.684210526316,
    "stars": 2,
    "tripadvisor": {
        "VISITED": false,
        "country_name": null,
        "locality": null,
        "pic_link": null,
        "street_address": null
    },
    "user_rating": 3.0,
    "variance": {
        "average": 12,
        "excellent": 7,
        "poor": 3,
        "terrible": 10,
        "very good": 14
    }
}