{
    "aka": "Ramada Fredericton Hotel Fredericton",
    "description": "Complimentary wireless, Flat Screen TV's, pillowtop mattresses, full service restaurant and terrace bar. Minutes to downtown. Fitness room, pool tables and games area. Executive rooms with King Bed Suite with King Sleigh Bed and stand-alone bathtub, heated bathroom floor and TV in the bathroom in this suite.Adjacent to a 9 Hole Golf Course with mini-putt, our Meditteranean ambiance in the beautiful 10,000 square foot indoor courtyard allows for summer all year long.",
    "detail_rating": {
        "cleanliness": null,
        "location": null,
        "rooms": null,
        "service": null,
        "sleep": null,
        "value": null
    },
    "location": {
        "city": "Fredericton",
        "continent": null,
        "country": "Canada",
        "proposed_city": null,
        "province": null,
        "region": null
    },
    "name": "Ramada Fredericton",
    "places": {
        "aka": [
            "Ramada",
            "Fredericton"
        ],
        "hotel_description": [],
        "hotel_name": [
            "Ramada",
            "Fredericton"
        ]
    },
    "review_count": 170,
    "review_count_current": 11,
    "reviews": [
        {
            "date": "April 18, 2013",
            "detail_rating": {
                "business": null,
                "cleanliness": 3.0,
                "desk": null,
                "location": 3.0,
                "pool": null,
                "restaurant": null,
                "rooms": 2.0,
                "service": 4.0,
                "sleep": 3.0,
                "value": 1.0
            },
            "helpfulness": null,
            "id": 158095420,
            "likes": {
                "disliked": null,
                "liked": null
            },
            "rating": 2.0,
            "stay_parameters": "Stayed March 2013, traveled with family",
            "text": "Old Hotel, small rooms. Family suite is a joke. One big room with 2 beds and a pullout couch. Very small fridge and microwave. Bathroom with huge square tub (more for couples then a family) and a tiny tiny tiny shower hidden behind the bathroom door. Not worth the money they gouge you for. The people are very friendly and willing to help. It's just too bad these rooms need so much help. Stay somewhere else.",
            "title": "Hotel does not live up to it's Name!!",
            "user": "Traveller T"
        },
        {
            "date": "April 17, 2013",
            "detail_rating": {
                "business": null,
                "cleanliness": 5.0,
                "desk": null,
                "location": 4.0,
                "pool": null,
                "restaurant": null,
                "rooms": 4.0,
                "service": 5.0,
                "sleep": 4.0,
                "value": 4.0
            },
            "helpfulness": null,
            "id": 158074198,
            "likes": {
                "disliked": null,
                "liked": null
            },
            "rating": 4.0,
            "stay_parameters": "Stayed April 2013, traveled on business",
            "text": "I enjoy Ramada Inn. The staff always treat me with respect.. I always stay there when in that area of Fredericton.",
            "title": "I enjoy Ramada Inn. The staff always treat me with...",
            "user": "Jerry H"
        },
        {
            "date": "April 1, 2013",
            "detail_rating": {
                "business": null,
                "cleanliness": 1.0,
                "desk": null,
                "location": 1.0,
                "pool": null,
                "restaurant": null,
                "rooms": 1.0,
                "service": 1.0,
                "sleep": 2.0,
                "value": 1.0
            },
            "helpfulness": null,
            "id": 156304180,
            "likes": {
                "disliked": null,
                "liked": null
            },
            "rating": 1.0,
            "stay_parameters": "Stayed April 2013, traveled with friends",
            "text": "Only here 2 days ...",
            "title": "its tired",
            "user": "greentearocks"
        },
        {
            "date": "April 29, 2013",
            "detail_rating": {
                "business": null,
                "cleanliness": 5.0,
                "desk": null,
                "location": 4.0,
                "pool": null,
                "restaurant": null,
                "rooms": 4.0,
                "service": 4.0,
                "sleep": null,
                "value": 4.0
            },
            "helpfulness": null,
            "id": 159108474,
            "likes": {
                "disliked": null,
                "liked": null
            },
            "rating": 4.0,
            "stay_parameters": "Stayed April 2013",
            "text": "I immediately found the mini fridge tucked away in the dresser but the microwave was nowhere to be seen.",
            "title": "Where's the microwave?",
            "user": "Tombassinger"
        },
        {
            "date": "April 26, 2013",
            "detail_rating": {
                "business": null,
                "cleanliness": 5.0,
                "desk": null,
                "location": 4.0,
                "pool": null,
                "restaurant": null,
                "rooms": 4.0,
                "service": 5.0,
                "sleep": 5.0,
                "value": 5.0
            },
            "helpfulness": null,
            "id": 158901065,
            "likes": {
                "disliked": null,
                "liked": null
            },
            "rating": 4.0,
            "stay_parameters": "Stayed April 2013, traveled on business",
            "text": "Other amenities such as iron and board, coffee maker, hair blower were readily available.",
            "title": "2ND STAY AT THE RAMADA FREDERICTON",
            "user": "Mike C"
        },
        {
            "date": "April 22, 2013",
            "detail_rating": {
                "business": null,
                "cleanliness": 4.0,
                "desk": null,
                "location": 3.0,
                "pool": null,
                "restaurant": null,
                "rooms": 4.0,
                "service": 5.0,
                "sleep": 4.0,
                "value": 4.0
            },
            "helpfulness": null,
            "id": 158474150,
            "likes": {
                "disliked": null,
                "liked": null
            },
            "rating": 4.0,
            "stay_parameters": "Stayed April 2013, traveled with friends",
            "text": "Missing also, was a breakfast but the hotel's own restaurant was available ($).",
            "title": "Awesome satff !!",
            "user": "David P"
        },
        {
            "date": "July 13, 2013",
            "detail_rating": {
                "business": null,
                "cleanliness": 3.0,
                "desk": null,
                "location": 3.0,
                "pool": null,
                "restaurant": null,
                "rooms": 3.0,
                "service": 5.0,
                "sleep": 3.0,
                "value": 3.0
            },
            "helpfulness": 2,
            "id": 167398063,
            "likes": {
                "disliked": null,
                "liked": null
            },
            "rating": 3.0,
            "stay_parameters": "Stayed July 2013, traveled on business",
            "text": "I stayed at the Ramada Fredericton in July 2013. For starters, the hotel is located on the northside of the St. John River, a fair distance from downtown. The hotel is somewhat older but in fairly good condition, likely kept this way by a noticeably attentive staff and dedicated maintenance team. At the hotel's center is a pool/courtyard area. In my own opinion, much of this space appears to be wasted on what appears to be past expectations. The hotel might be better to tear up much of the courtyard (including the pond?) in favor of expanding the pool/water amenities (water slide?). While the hotel makes mention of \"renovations\", it is apparent that they have made some updates to the bathroom vanities, bedding and some room amenities (TVs) but the decor of the hotel still remains to be that of a hotel of the late 1980s/1990s. While the rooms are clean and the bedding was spotless, there are subtle reminders of the hotels age such as the lighting, bath/shower and room climate control (or lack there of). The onsite conference rooms were clean, adequate and in a central location. The onsite restaurant \u201cThe Courtyard\u201d offers good food from a decent menu. If there was one thing that stood out, it was the exceptional staff: the front desk was very friendly (Jillian) and the staff supporting the conference area was quick and prompt. There were many positives but it is worth mentioning that I found the exterior noises to easily find their way into my room, such as kids in the courtyard/pool or a dog in the adjoining room. Aagain, perhaps better room climate control might help drowned out the noise. While I can recommend the hotel, it would be nice to see so additional renovations.",
            "title": "Fair Stay in Fredericton",
            "user": "StandingRoom"
        },
        {
            "date": "July 7, 2013",
            "detail_rating": {
                "business": null,
                "cleanliness": 4.0,
                "desk": null,
                "location": 2.0,
                "pool": null,
                "restaurant": null,
                "rooms": 3.0,
                "service": 4.0,
                "sleep": 4.0,
                "value": 3.0
            },
            "helpfulness": null,
            "id": 166570436,
            "likes": {
                "disliked": null,
                "liked": null
            },
            "rating": 3.0,
            "stay_parameters": "Stayed June 2013, traveled as a couple",
            "text": "We were in an upgraded room and even had a plaque showing 'business class'.",
            "title": "Staff nice - location bad - hotel needs a lot of work!",
            "user": "Sarabara999"
        },
        {
            "date": "July 6, 2013",
            "detail_rating": {
                "business": null,
                "cleanliness": 4.0,
                "desk": null,
                "location": 3.0,
                "pool": null,
                "restaurant": null,
                "rooms": 4.0,
                "service": 3.0,
                "sleep": 4.0,
                "value": 1.0
            },
            "helpfulness": 1,
            "id": 166497762,
            "likes": {
                "disliked": null,
                "liked": null
            },
            "rating": 3.0,
            "stay_parameters": "Stayed July 2013, traveled with family",
            "text": "The hotel itself is outdated and needs a lot of renovations - seems to be more of a place that hockey teams/families will stay but not a place for couples looking for R&R.",
            "title": "Not that great",
            "user": "SaintSparky"
        },
        {
            "date": "June 25, 2013",
            "detail_rating": {
                "business": null,
                "cleanliness": 1.0,
                "desk": null,
                "location": 3.0,
                "pool": null,
                "restaurant": null,
                "rooms": 1.0,
                "service": 4.0,
                "sleep": 1.0,
                "value": 2.0
            },
            "helpfulness": null,
            "id": 165245994,
            "likes": {
                "disliked": null,
                "liked": null
            },
            "rating": 2.0,
            "stay_parameters": "Stayed June 2013, traveled as a couple",
            "text": "The location is terrible - it is not hear anything but a gas station - you cannot walk anywhere.",
            "title": "Poor Experience",
            "user": "Jordyn T"
        },
        {
            "date": "June 5, 2013",
            "detail_rating": {
                "business": null,
                "cleanliness": 4.0,
                "desk": null,
                "location": 2.0,
                "pool": null,
                "restaurant": null,
                "rooms": 4.0,
                "service": 4.0,
                "sleep": 4.0,
                "value": 4.0
            },
            "helpfulness": null,
            "id": 163130658,
            "likes": {
                "disliked": null,
                "liked": null
            },
            "rating": 4.0,
            "stay_parameters": "Stayed June 2013, traveled on business",
            "text": "The staff were very nice and accomodating. The bartender let us stay a little later to have a few drinks since it was the only bar/restaurant close by.",
            "title": "Bucking the trend",
            "user": "caveatemptor69"
        }
    ],
    "slim_ranking": 0.578947368421,
    "stars": 3,
    "tripadvisor": {
        "VISITED": false,
        "country_name": null,
        "locality": null,
        "pic_link": null,
        "street_address": null
    },
    "user_rating": 3.5,
    "variance": {
        "average": 45,
        "excellent": 49,
        "poor": 14,
        "terrible": 9,
        "very good": 53
    }
}