{
    "aka": "Killashee House Hotel And Villa Spa",
    "description": "Killashee House Hotel, Naas, Co. Kildare is set amongst 280 acres of manicured gardens & parklands with magnificent views over the Wicklow Mountains and Kildare countryside. From the hotel's beautifully appointed guestrooms to the indulgent services available, Killashee offers you the highest standards of comfort, service & cuisine. Offering four star luxury, Killashee House Hotel is ideally located just 30 kms from Dublin City Centre, 2 kms outside Naas Town, and only 40 mins from Dublin Airport.",
    "detail_rating": {
        "cleanliness": null,
        "location": null,
        "rooms": null,
        "service": null,
        "sleep": null,
        "value": null
    },
    "location": {
        "city": null,
        "continent": "Europe",
        "country": "Ireland",
        "proposed_city": null,
        "province": null,
        "region": null
    },
    "name": "Killashee House Hotel",
    "places": {
        "aka": [],
        "hotel_description": [
            "Naas",
            "Dublin"
        ],
        "hotel_name": []
    },
    "review_count": 441,
    "review_count_current": 20,
    "reviews": [
        {
            "date": "October 28, 2012",
            "detail_rating": {
                "business": null,
                "cleanliness": 4.0,
                "desk": null,
                "location": 4.0,
                "pool": null,
                "restaurant": null,
                "rooms": 4.0,
                "service": 4.0,
                "sleep": 4.0,
                "value": 5.0
            },
            "helpfulness": null,
            "id": 143943023,
            "likes": {
                "disliked": null,
                "liked": null
            },
            "rating": 4.0,
            "stay_parameters": "Stayed October 2012, traveled with friends",
            "text": "I'm just back from this hotel, we stayed two nights which included two BnB, one dinner and two spa treatments. I dealt with Laura mostly on reception who was very helpful from booking to queries. I booked three twin bedrooms which had two double beds in each and were very clean and airy.",
            "title": "Six Ladies On A Two Day Spa Break",
            "user": "Giovanna M"
        },
        {
            "date": "October 24, 2012",
            "detail_rating": {
                "business": null,
                "cleanliness": null,
                "desk": null,
                "location": null,
                "pool": null,
                "restaurant": null,
                "rooms": null,
                "service": null,
                "sleep": null,
                "value": null
            },
            "helpfulness": 1,
            "id": 143625337,
            "likes": {
                "disliked": null,
                "liked": null
            },
            "rating": 4.0,
            "stay_parameters": null,
            "text": "Both breakfasts and our dinner were very enjoyable, all waiting, bar staff and porters we met were excellent. The only bad point was the walk to the spa which is not connected to the hotel.",
            "title": "Fantastic, beautiful hotel. Amazing weekend.",
            "user": "cheekybabymonkey"
        },
        {
            "date": "October 24, 2012",
            "detail_rating": {
                "business": null,
                "cleanliness": 4.0,
                "desk": null,
                "location": 5.0,
                "pool": null,
                "restaurant": null,
                "rooms": 3.0,
                "service": 5.0,
                "sleep": null,
                "value": 5.0
            },
            "helpfulness": null,
            "id": 143588632,
            "likes": {
                "disliked": null,
                "liked": null
            },
            "rating": 4.0,
            "stay_parameters": "Stayed October 2012",
            "text": "There was entertainment in the bar both nights much to our enjoyment and a great buzz in general throughout.",
            "title": "Great",
            "user": "elainew1"
        },
        {
            "date": "October 23, 2012",
            "detail_rating": {
                "business": null,
                "cleanliness": 3.0,
                "desk": null,
                "location": 5.0,
                "pool": null,
                "restaurant": null,
                "rooms": 3.0,
                "service": 3.0,
                "sleep": 3.0,
                "value": 2.0
            },
            "helpfulness": 1,
            "id": 143500377,
            "likes": {
                "disliked": null,
                "liked": null
            },
            "rating": 3.0,
            "stay_parameters": "Stayed September 2012, traveled with friends",
            "text": "Myself and friends will definitely go back.",
            "title": "Oh Dear... In need of some maintenance",
            "user": "Paul S"
        },
        {
            "date": "October 22, 2012",
            "detail_rating": {
                "business": null,
                "cleanliness": 5.0,
                "desk": null,
                "location": 5.0,
                "pool": null,
                "restaurant": null,
                "rooms": 3.0,
                "service": 5.0,
                "sleep": 5.0,
                "value": 5.0
            },
            "helpfulness": null,
            "id": 143430338,
            "likes": {
                "disliked": null,
                "liked": null
            },
            "rating": 5.0,
            "stay_parameters": "Stayed October 2012, traveled with friends",
            "text": "Just returned from a 2 night stay at Killashee for a friend's wedding. The hotel is absolutely beautiful with fantastic chandeliers and sweeping staircases. Excellent customer service from start to finish.",
            "title": "exceptional service",
            "user": "familyCheshire"
        },
        {
            "date": "October 22, 2012",
            "detail_rating": {
                "business": null,
                "cleanliness": 5.0,
                "desk": null,
                "location": 4.0,
                "pool": null,
                "restaurant": null,
                "rooms": 5.0,
                "service": 5.0,
                "sleep": 5.0,
                "value": 5.0
            },
            "helpfulness": null,
            "id": 143419631,
            "likes": {
                "disliked": null,
                "liked": null
            },
            "rating": 5.0,
            "stay_parameters": "Stayed October 2012, traveled with friends",
            "text": "Just back from a fab weekend in Killashee House Hotel. we booked dinner, bed and breakfast in what had been described to us as one of Ireland's best hotels. we were not disappointed! The welcome from the check in staff was friendly, courteous and professional. We got lots of discount vouchers! 10% off in Kildare Village - made good use of that - and discounts at local tourist attractions. Our room was so comfortable with all the amenities you could ask for. The food! well, what can i say, a 4 course dinner to write about! all washed down with an excellent wine chosen for us by the restaurant manager. Ate too much so had to go to the bar for a shot of Sambuca to settle the tummy, worked a treat.",
            "title": "Fab weekend",
            "user": "maggieCavanIreland"
        },
        {
            "date": "October 18, 2012",
            "detail_rating": {
                "business": null,
                "cleanliness": 4.0,
                "desk": null,
                "location": 4.0,
                "pool": null,
                "restaurant": null,
                "rooms": 3.0,
                "service": 3.0,
                "sleep": 3.0,
                "value": 3.0
            },
            "helpfulness": null,
            "id": 143139449,
            "likes": {
                "disliked": null,
                "liked": null
            },
            "rating": 3.0,
            "stay_parameters": "Stayed October 2012, traveled with family",
            "text": "Breakfast was no disappointment the next morning - i love getting my breakfast served to the table and it was fresh, not sitting in a bane-marie for hours.",
            "title": "Nice hotel but disappointing for 4*",
            "user": "IrelandKaa"
        },
        {
            "date": "October 17, 2012",
            "detail_rating": {
                "business": null,
                "cleanliness": 5.0,
                "desk": null,
                "location": 5.0,
                "pool": null,
                "restaurant": null,
                "rooms": 5.0,
                "service": 5.0,
                "sleep": 5.0,
                "value": 5.0
            },
            "helpfulness": null,
            "id": 143039287,
            "likes": {
                "disliked": null,
                "liked": null
            },
            "rating": 5.0,
            "stay_parameters": "Stayed September 2012, traveled with family",
            "text": "Killashee is on our list for next year when we need a luxury weekend away.",
            "title": "Fantastic Value And Service.",
            "user": "Tazelmo"
        },
        {
            "date": "October 8, 2012",
            "detail_rating": {
                "business": null,
                "cleanliness": null,
                "desk": null,
                "location": null,
                "pool": null,
                "restaurant": null,
                "rooms": null,
                "service": null,
                "sleep": null,
                "value": null
            },
            "helpfulness": null,
            "id": 142264994,
            "likes": {
                "disliked": null,
                "liked": null
            },
            "rating": 5.0,
            "stay_parameters": null,
            "text": "Thanks to all the staff who made our stay so enjoyable.",
            "title": "Exquisite!",
            "user": "yvonne71"
        },
        {
            "date": "October 4, 2012",
            "detail_rating": {
                "business": null,
                "cleanliness": 5.0,
                "desk": null,
                "location": 5.0,
                "pool": null,
                "restaurant": null,
                "rooms": 5.0,
                "service": 5.0,
                "sleep": 5.0,
                "value": 5.0
            },
            "helpfulness": null,
            "id": 142005937,
            "likes": {
                "disliked": null,
                "liked": null
            },
            "rating": 5.0,
            "stay_parameters": "Stayed September 2012, traveled with friends",
            "text": "This was my second visit to this hotel. The renovations downstairs in lobby and bar area are lovely and it is a beautiful hotel when you drive up the beautiful driveway and enter the hotel. However, our room was not up to the same standard. The rooms were comfortable but the decor and furniture is very tired and badly need of updating - definitely not 4* hotel room. Had dinner in the bar which was very good-restaurant manager was very accommodating and helpful for our group and the food was lovely. Service was a bit slow but it was very busy so can understand that. Waiting staff at breakfast was a different story- they did not seem to interested in us and was very hard to get their attention even though the restaurant was very quiet at the time - they spent most the their time gossiping in the corner until a manager came in. The food at breakfast however was very good-nice selection of hot and cold food. I found some of the reception staff were very rude and not interested in serving guests. The fire alarm went off at 5am in the morning - when I mentioned it when checking out, the girl just said someone drunk set it off and that was the end of the conversation. Even though this was not their fault, an apology on behalf of the hotel would have been nice. I was waiting for a friend in the lobby and noticed their attitude with a number of guests-not just me. Overall, food is excellent but customer service definitely needs improving in this hotel.",
            "title": "Brilliant weekend break",
            "user": "Michele B"
        },
        {
            "date": "November 8, 2012",
            "detail_rating": {
                "business": null,
                "cleanliness": 3.0,
                "desk": null,
                "location": 5.0,
                "pool": null,
                "restaurant": null,
                "rooms": 4.0,
                "service": 4.0,
                "sleep": 3.0,
                "value": 3.0
            },
            "helpfulness": 1,
            "id": 144908347,
            "likes": {
                "disliked": null,
                "liked": null
            },
            "rating": 3.0,
            "stay_parameters": "Stayed November 2012, traveled as a couple",
            "text": "At first glance this looks like a stunning hotel, but on closer inspection, i felt it was a little tired, and could do with a little attention. No sky tv in the rooms or in the tv lounge and loo roll is clearly the cheapest they could buy..! Spa is very good value though, and if you're an equestrian person this is a fabulous location",
            "title": "Fairly Good...",
            "user": "TheScorer"
        },
        {
            "date": "November 5, 2012",
            "detail_rating": {
                "business": null,
                "cleanliness": 5.0,
                "desk": null,
                "location": 5.0,
                "pool": null,
                "restaurant": null,
                "rooms": 5.0,
                "service": 5.0,
                "sleep": 5.0,
                "value": 5.0
            },
            "helpfulness": 1,
            "id": 144538025,
            "likes": {
                "disliked": null,
                "liked": null
            },
            "rating": 5.0,
            "stay_parameters": "Stayed October 2012, traveled with family",
            "text": "We had our wedding reception in the Killashee House 1 month ago. We could not fault one thing, the place is amazing, the staff are fantastic, everything was perfect. We couldn't wish for a more perfect, dream day! The food was to die for, the waiters even came around with 2nd's for everyone. It was the best day of our lives..",
            "title": "Our wedding day",
            "user": "Tinley_12"
        },
        {
            "date": "November 2, 2012",
            "detail_rating": {
                "business": null,
                "cleanliness": 5.0,
                "desk": null,
                "location": 5.0,
                "pool": null,
                "restaurant": null,
                "rooms": null,
                "service": 5.0,
                "sleep": 5.0,
                "value": 5.0
            },
            "helpfulness": null,
            "id": 144331707,
            "likes": {
                "disliked": null,
                "liked": null
            },
            "rating": 5.0,
            "stay_parameters": "Stayed October 2012, traveled solo",
            "text": "A big thanks to the wedding department who couldn't have done anymore for us, especially Caroline Thank you to everyone at the Killashee for making our day so special and memorable.",
            "title": "Autumn villa spa pamper treatment: not to be missed!",
            "user": "Bayflo"
        },
        {
            "date": "October 30, 2012",
            "detail_rating": {
                "business": null,
                "cleanliness": 5.0,
                "desk": null,
                "location": 5.0,
                "pool": null,
                "restaurant": null,
                "rooms": null,
                "service": 5.0,
                "sleep": null,
                "value": 5.0
            },
            "helpfulness": null,
            "id": 144062522,
            "likes": {
                "disliked": null,
                "liked": null
            },
            "rating": 5.0,
            "stay_parameters": "Stayed October 2012, traveled with friends",
            "text": "Tinley & Glenn.",
            "title": "Very nice hotel & spa",
            "user": "Tapa_11"
        },
        {
            "date": "October 30, 2012",
            "detail_rating": {
                "business": null,
                "cleanliness": 3.0,
                "desk": null,
                "location": 3.0,
                "pool": null,
                "restaurant": null,
                "rooms": 3.0,
                "service": 3.0,
                "sleep": 3.0,
                "value": 4.0
            },
            "helpfulness": null,
            "id": 144056601,
            "likes": {
                "disliked": null,
                "liked": null
            },
            "rating": 3.0,
            "stay_parameters": "Stayed October 2012, traveled with friends",
            "text": "I had the chance and the opportunity to try the Autumn pamper treatment, Swedish back massage, facial treatment,foot massage,head massage,...etc for 99 Euros...in the Villas Spa of the Killashee house hotel, it lasted roughly 2 hours,it was simply amazing.Amy who took care of me, was fantastic, the massage with her was really relaxing, she removed all the tensions I had in my body, especially in my back.The products for the facial and the body wrap were really good products,my skin was as smooth as the skin of a baby and totally re-energised,and so was I! So good value for money,and worth while doing it, if you're down or not!",
            "title": "Could do with an oomph",
            "user": "Doyle123"
        },
        {
            "date": "November 18, 2012",
            "detail_rating": {
                "business": null,
                "cleanliness": 5.0,
                "desk": null,
                "location": 5.0,
                "pool": null,
                "restaurant": null,
                "rooms": 5.0,
                "service": 5.0,
                "sleep": 5.0,
                "value": 4.0
            },
            "helpfulness": 1,
            "id": 145665109,
            "likes": {
                "disliked": null,
                "liked": null
            },
            "rating": 5.0,
            "stay_parameters": "Stayed November 2012, traveled as a couple",
            "text": "For my wife's birthday, I brought her to Newbridge silverware for a look around. I was looking for somewhere in Kildare in which to stay the night, and a friend recommended this place. I had no idea or expectation. Accommodation and a meal was pricey, but not exceptionally so for a four star hotel. When we arrived, I have to say that my expectations were very much exceeded. This hotel is absolutely enormous. Our bedroom was in the Belling section, and was huge. The furnishings were antique and cosy. We had a four poster bed. We both slept like logs. The bathroom was nice too, with twin sinks, jacuzzi bath and nice shower.We found it spectacular. One thing I liked too was that it was not stiflingly warm in the hotel or bedrooms. I find that a problem staying in hotels normally. Can be very hard to sleep indeed.The restaurant was exceptional. We both had potato and coconut soup for starters. Delicious. Then both had hereford beef. Absolutely beautiful. The dessert was out of this world. It was a chocolate fudge cake with black cherries, cherry sauce and ice cream. There was a chocolate swirl with honeycomb sticking out of the ice cream. The chef really knows his stuff. Lovely artistic flair and delicious taste. The service in the restaurant was exceptional. They have a lot of staff on. There seems to be a person for everything. That's good. We thought the breakfast service was excellent too. The full Irish breakfast was lovely, especially the sausages. My wife had waffles with syrup, which was lovely too. We found the reception staff to be very friendly on our departure. They were a bit under pressure on our arrival ! We will definitely stay here again.",
            "title": "Very impressed with everything",
            "user": "BurstYourBubble"
        },
        {
            "date": "November 18, 2012",
            "detail_rating": {
                "business": null,
                "cleanliness": 5.0,
                "desk": null,
                "location": 5.0,
                "pool": null,
                "restaurant": null,
                "rooms": 5.0,
                "service": 5.0,
                "sleep": 3.0,
                "value": 3.0
            },
            "helpfulness": null,
            "id": 145663412,
            "likes": {
                "disliked": null,
                "liked": null
            },
            "rating": 5.0,
            "stay_parameters": "Stayed November 2012, traveled with family",
            "text": "I was at a wedding in this hotel recently and it was a really was an amazing venue. The food was really excellent considering there was another wedding on at the same time. I was in a single room and I must say I was very spoilt with the huge sized room and shower-en-suite. Everything was spotlessly clean but the only thing I was disappointed with was there was no water in the room. The Spa looked great and I will be back again to enjoy the great looking spa treatments.",
            "title": "Wonderful venue",
            "user": "Catherine W"
        },
        {
            "date": "November 16, 2012",
            "detail_rating": {
                "business": null,
                "cleanliness": 5.0,
                "desk": null,
                "location": 5.0,
                "pool": null,
                "restaurant": null,
                "rooms": 4.0,
                "service": 5.0,
                "sleep": 5.0,
                "value": 3.0
            },
            "helpfulness": null,
            "id": 145502846,
            "likes": {
                "disliked": null,
                "liked": null
            },
            "rating": 4.0,
            "stay_parameters": "Stayed November 2012, traveled on business",
            "text": "I stayed here on a business trip - arrived late and left early, so I didn't get to see or experience the hotel in its entirety. However, my room was really lovely - spacious and nicely decorated, great bathroom. However the best part of the stay was Michelle on reception who was exceptionally friendly and helpful in getting me to the hotel on the night of my arrival and to my business meeting the following morning! It would make me want to go back when I can have more time in the hotel and would recommend it to others.",
            "title": "Michelle is excellent!",
            "user": "DetteGalway"
        },
        {
            "date": "November 14, 2012",
            "detail_rating": {
                "business": null,
                "cleanliness": 3.0,
                "desk": null,
                "location": 4.0,
                "pool": null,
                "restaurant": null,
                "rooms": 3.0,
                "service": 4.0,
                "sleep": 4.0,
                "value": 3.0
            },
            "helpfulness": null,
            "id": 145372297,
            "likes": {
                "disliked": null,
                "liked": null
            },
            "rating": 3.0,
            "stay_parameters": "Stayed October 2012, traveled as a couple",
            "text": "I attended a wedding in Killashee House hotel recently with my wife and I was looking forward to the night primarily and to staying in the hotel as a number of friends had said it was nice.",
            "title": "You might just get lost ...",
            "user": "cappakeelontour"
        },
        {
            "date": "November 11, 2012",
            "detail_rating": {
                "business": null,
                "cleanliness": 5.0,
                "desk": null,
                "location": 5.0,
                "pool": null,
                "restaurant": null,
                "rooms": 5.0,
                "service": 5.0,
                "sleep": 5.0,
                "value": 5.0
            },
            "helpfulness": null,
            "id": 145151111,
            "likes": {
                "disliked": null,
                "liked": null
            },
            "rating": 4.0,
            "stay_parameters": "Stayed October 2012, traveled as a couple",
            "text": "Check in was smooth and efficient and a porter was sent with us .. not to carry our bags but to find our way to our room. In one lift and then a walk through a large reception room and down one of the corridors into another lift and then to our room, I was considering breadcrumbs to mark the way back ! The rooms were large and comfortable, our room had two large double beds. The decor and furniture was good but it was all very dark and dull which gave a less than welcoming feel to the place .. which to be honest the overall experience didn't deserve.",
            "title": "Well needed break",
            "user": "triptotip"
        }
    ],
    "slim_ranking": 0.6,
    "stars": 4,
    "tripadvisor": {
        "VISITED": false,
        "country_name": null,
        "locality": null,
        "pic_link": null,
        "street_address": null
    },
    "user_rating": 4.0,
    "variance": {
        "average": 56,
        "excellent": 225,
        "poor": 33,
        "terrible": 25,
        "very good": 102
    }
}