{
    "aka": "Quality Inn Hotel",
    "description": null,
    "detail_rating": {
        "cleanliness": null,
        "location": null,
        "rooms": null,
        "service": null,
        "sleep": null,
        "value": null
    },
    "location": {
        "city": null,
        "continent": null,
        "country": "United States",
        "proposed_city": null,
        "province": null,
        "region": null
    },
    "name": "Quality Inn",
    "places": {
        "aka": [],
        "hotel_description": [],
        "hotel_name": []
    },
    "review_count": 168,
    "review_count_current": 38,
    "reviews": [
        {
            "date": "July 11, 2011",
            "detail_rating": {
                "business": null,
                "cleanliness": 3.0,
                "desk": null,
                "location": 3.0,
                "pool": null,
                "restaurant": null,
                "rooms": 3.0,
                "service": 2.0,
                "sleep": null,
                "value": 1.0
            },
            "helpfulness": null,
            "id": 115256889,
            "likes": {
                "disliked": null,
                "liked": null
            },
            "rating": 3.0,
            "stay_parameters": "Stayed July 2011",
            "text": "We stayed at this room for 3 nights as my step daughter was in an all star games on the last day of the stay after winning the championship game we returned to the hotel to swim but where chases out because we had check out not to long before that we thought that since the whole team had stayed there for 23 nights that this was poor customer service I will never stay at any quality inn ever again I may just not stay at any choice hotel ever again",
            "title": "Good room crappy service",
            "user": "puppet87112"
        },
        {
            "date": "March 15, 2011",
            "detail_rating": {
                "business": null,
                "cleanliness": 3.0,
                "desk": null,
                "location": 4.0,
                "pool": null,
                "restaurant": null,
                "rooms": 4.0,
                "service": 3.0,
                "sleep": 4.0,
                "value": 5.0
            },
            "helpfulness": null,
            "id": 100218796,
            "likes": {
                "disliked": null,
                "liked": null
            },
            "rating": 4.0,
            "stay_parameters": "Stayed March 2011, traveled with family",
            "text": "got a good rate with AAA discount for 2 rooms for our family of 5. The rooms are large with microwave & refrigerator - nice to be able to keep snacks when staying a few days. The breakfast is very good, but this holiday week the hotel is full and service is slow. This morning from when I got in line for a table til I got food was 50 min - so if in a hurry, skip and hit McDonalds a few buildings down the street. The wifi has worked well.",
            "title": "good for family trip",
            "user": "bethtex"
        },
        {
            "date": "February 22, 2011",
            "detail_rating": {
                "business": null,
                "cleanliness": 3.0,
                "desk": null,
                "location": 3.0,
                "pool": null,
                "restaurant": null,
                "rooms": 3.0,
                "service": 1.0,
                "sleep": 2.0,
                "value": 3.0
            },
            "helpfulness": null,
            "id": 97527902,
            "likes": {
                "disliked": null,
                "liked": null
            },
            "rating": 1.0,
            "stay_parameters": "Stayed February 2011, traveled with family",
            "text": "The indoor hot tub is nice but can get full",
            "title": "They can'd figure out their finances, don't stay there.",
            "user": "spottedpear"
        },
        {
            "date": "January 17, 2011",
            "detail_rating": {
                "business": null,
                "cleanliness": 3.0,
                "desk": null,
                "location": 4.0,
                "pool": null,
                "restaurant": null,
                "rooms": 3.0,
                "service": 4.0,
                "sleep": 3.0,
                "value": 4.0
            },
            "helpfulness": null,
            "id": 93392883,
            "likes": {
                "disliked": null,
                "liked": null
            },
            "rating": 4.0,
            "stay_parameters": "Stayed January 2011, traveled with family",
            "text": "Location is great - Walmart, restaurants, movie theater nearby and easy to get to ski resorts.",
            "title": "I enjoyed my stay",
            "user": "James60933"
        },
        {
            "date": "January 11, 2011",
            "detail_rating": {
                "business": null,
                "cleanliness": 4.0,
                "desk": null,
                "location": 4.0,
                "pool": null,
                "restaurant": null,
                "rooms": 4.0,
                "service": 5.0,
                "sleep": 4.0,
                "value": 5.0
            },
            "helpfulness": 1,
            "id": 92611866,
            "likes": {
                "disliked": null,
                "liked": null
            },
            "rating": 4.0,
            "stay_parameters": "Stayed January 2011, traveled with family",
            "text": "Beds are comfortable. Staff has been friendly and helpful.",
            "title": "Great family hotel in Taos- 2 story suites with breakfast!",
            "user": "kinzab"
        },
        {
            "date": "August 1, 2011",
            "detail_rating": {
                "business": null,
                "cleanliness": 1.0,
                "desk": null,
                "location": null,
                "pool": null,
                "restaurant": null,
                "rooms": null,
                "service": 2.0,
                "sleep": 2.0,
                "value": 1.0
            },
            "helpfulness": 1,
            "id": 116112030,
            "likes": {
                "disliked": null,
                "liked": null
            },
            "rating": 1.0,
            "stay_parameters": "Stayed July 2011, traveled with friends",
            "text": "Honest to goodness, the hotel smelled awful...especially the side entrance which reeked of cat urine. The room was in disrepair, peeling wallpaper, dirty carpet and broken closet door's. I can handle outdated, but not filth. Breakfast was nice and dining room was well managed. However it didn't make up for the rest. I wouldn't stay there again for free",
            "title": "Smelly and Dirty- Yuck",
            "user": "mosocwbrian"
        },
        {
            "date": "July 31, 2011",
            "detail_rating": {
                "business": null,
                "cleanliness": 5.0,
                "desk": null,
                "location": null,
                "pool": null,
                "restaurant": null,
                "rooms": null,
                "service": 5.0,
                "sleep": 5.0,
                "value": 5.0
            },
            "helpfulness": null,
            "id": 116089276,
            "likes": {
                "disliked": null,
                "liked": null
            },
            "rating": 5.0,
            "stay_parameters": "Stayed July 2011, traveled with family",
            "text": "We stayed two nights at this hotel. We traveled with our two small dogs. The hotel staff was friendly and tremendously helpful. Upon arrival, they assisted us with selecting the appropriate room for our stay (close to the courtyard). The room was very clean, the bed ultra comfortable. We enjoyed the free cooked-to-order breakfast; it is an outstanding restaurant. We did not use the pool area, but spent quite a bit of time around it with our two dogs and it looked very enjoyable and many people were using it. The property is very close to the plaza and also various stores to purchase additional essentials. We would DEFINITELY return to this hotel for it's reasonable cost for what you receive - and will recommend it to others.",
            "title": "Fabulous Stay!",
            "user": "leonalab"
        },
        {
            "date": "July 25, 2011",
            "detail_rating": {
                "business": null,
                "cleanliness": 5.0,
                "desk": null,
                "location": null,
                "pool": null,
                "restaurant": null,
                "rooms": null,
                "service": 5.0,
                "sleep": 5.0,
                "value": 5.0
            },
            "helpfulness": 3,
            "id": 115773427,
            "likes": {
                "disliked": null,
                "liked": null
            },
            "rating": 5.0,
            "stay_parameters": "Stayed July 2011, traveled with family",
            "text": "This was a very good motel. Nice room furnishings, very clean. Had everything we needed. The outdoor heated pool was very large and best of all, there was outside seating around the outside of the pool. Nice patio tables and chairs in the grassy area made for a nice place to enjoy the New Mexico weather. And breakfast was a bonus. You could choose from 4 different breakfasts which came with the room. It was cooked to order in their restaurant. We had eggs, bacon, hashbrowns, toast, orange juice and coffee. Not a long wait either. I'm surprised that this motel is not rated in the top 3 or 4 for Taos. It was reasonably priced also and right on the main strip near many restaurants. If you have kids, they will love the pool. The outside of the motel doesn't do it justice but it was well worth the money.",
            "title": "Great place to stay....much better than expected",
            "user": "OkieDokieIII"
        },
        {
            "date": "July 19, 2011",
            "detail_rating": {
                "business": null,
                "cleanliness": 4.0,
                "desk": null,
                "location": null,
                "pool": null,
                "restaurant": null,
                "rooms": null,
                "service": 5.0,
                "sleep": 4.0,
                "value": 4.0
            },
            "helpfulness": 1,
            "id": 115554655,
            "likes": {
                "disliked": null,
                "liked": null
            },
            "rating": 4.0,
            "stay_parameters": "Stayed July 2011, traveled with family",
            "text": "Checked in to the Quality Inn after awful experience at slightly less expensive hotel nearby. We needed a pet freindly room and luckily, they were able to accomodate us late in the evening. The hotel is an older style hotel, but it's been kept up and is probably as nice as it ever was. Staff was very friendly and helpful. Breakfast was very good. Pool was clean and well maintained. We felt fairly safe staying here....unlike the hotel a few blocks away. I would stay here again.",
            "title": "Nice, budget hotel",
            "user": "oktourist"
        },
        {
            "date": "July 17, 2011",
            "detail_rating": {
                "business": null,
                "cleanliness": 5.0,
                "desk": null,
                "location": null,
                "pool": null,
                "restaurant": null,
                "rooms": null,
                "service": 4.0,
                "sleep": 5.0,
                "value": 4.0
            },
            "helpfulness": 1,
            "id": 115434977,
            "likes": {
                "disliked": null,
                "liked": null
            },
            "rating": 4.0,
            "stay_parameters": "Stayed July 2011, traveled with friends",
            "text": "The room was very clean, neat and fairly roomy. The free breakfast provided with a stay at the hotel was better than most. You get one of the four set menu choices. The hotel has an outdoor heated pool and an indoor hot tub. Had an enjoyable stay and would recommend staying here.",
            "title": "Superb place to stay",
            "user": "vacationdeprived35"
        },
        {
            "date": "April 25, 2013",
            "detail_rating": {
                "business": null,
                "cleanliness": 4.0,
                "desk": null,
                "location": 4.0,
                "pool": null,
                "restaurant": null,
                "rooms": 4.0,
                "service": 4.0,
                "sleep": 4.0,
                "value": 4.0
            },
            "helpfulness": 2,
            "id": 158768280,
            "likes": {
                "disliked": null,
                "liked": null
            },
            "rating": 4.0,
            "stay_parameters": "Stayed April 2013, traveled with family",
            "text": "We stayed here in April of 2013 for a night.",
            "title": "Decent place to stop for the night",
            "user": "codelemur"
        },
        {
            "date": "March 12, 2013",
            "detail_rating": {
                "business": null,
                "cleanliness": 5.0,
                "desk": null,
                "location": 5.0,
                "pool": null,
                "restaurant": null,
                "rooms": 5.0,
                "service": 5.0,
                "sleep": 3.0,
                "value": 4.0
            },
            "helpfulness": null,
            "id": 154351412,
            "likes": {
                "disliked": null,
                "liked": null
            },
            "rating": 4.0,
            "stay_parameters": "Stayed March 2013, traveled as a couple",
            "text": "Probably one of the better places to stay in Alexander City. We sprung fo the \"suite\" (an extra $5), which was really just a standard room that was ever so slightly larger - just a bit bigger than a standard room with just enough extra space to hold an additional small loveseat and coffee table. Room had a small mini-fridge and microwave. Bathroom was clean and functional, with plenty of hot water. Location is convenient - right off US-280.",
            "title": "Nice stay, nice employees",
            "user": "Gary B"
        },
        {
            "date": "January 2, 2013",
            "detail_rating": {
                "business": null,
                "cleanliness": 1.0,
                "desk": null,
                "location": 3.0,
                "pool": null,
                "restaurant": null,
                "rooms": 1.0,
                "service": 3.0,
                "sleep": 1.0,
                "value": 4.0
            },
            "helpfulness": null,
            "id": 148658726,
            "likes": {
                "disliked": null,
                "liked": null
            },
            "rating": 2.0,
            "stay_parameters": "Stayed December 2012, traveled as a couple",
            "text": "Probably one of the better hotels I've stayed in in Alexander City.",
            "title": "bad odor and un vacuumed room,",
            "user": "Teresa C"
        },
        {
            "date": "December 24, 2012",
            "detail_rating": {
                "business": null,
                "cleanliness": 3.0,
                "desk": null,
                "location": 4.0,
                "pool": null,
                "restaurant": null,
                "rooms": 4.0,
                "service": 4.0,
                "sleep": 3.0,
                "value": 4.0
            },
            "helpfulness": null,
            "id": 148013785,
            "likes": {
                "disliked": null,
                "liked": null
            },
            "rating": 3.0,
            "stay_parameters": "Stayed December 2012, traveled as a couple",
            "text": "The hotel staff were extremely friendly, especially John at the front desk. Every employee from the maintenance man to the front desk manager would greet you with a hello and smile. The rooms were clean, however not well sound insulated between rooms. The breakfast was very good. The data screens on the cardio equipment needs maintenance.",
            "title": "okay stay for the price",
            "user": "luvleeleo"
        },
        {
            "date": "October 19, 2012",
            "detail_rating": {
                "business": null,
                "cleanliness": 5.0,
                "desk": null,
                "location": 3.0,
                "pool": null,
                "restaurant": null,
                "rooms": 3.0,
                "service": 3.0,
                "sleep": 4.0,
                "value": 3.0
            },
            "helpfulness": 1,
            "id": 143208914,
            "likes": {
                "disliked": null,
                "liked": null
            },
            "rating": 4.0,
            "stay_parameters": "Stayed October 2012, traveled as a couple",
            "text": "Overall a very nice place. If we ever returned to the Keys, we'd certainly stay here again.",
            "title": "Clean rooms, Nice staff",
            "user": "Alex G"
        },
        {
            "date": "August 10, 2006",
            "detail_rating": {
                "business": 4.0,
                "cleanliness": 4.0,
                "desk": null,
                "front_desk": 5.0,
                "location": 4.0,
                "pool": null,
                "restaurant": null,
                "rooms": 3.0,
                "service": 4.0,
                "sleep": null,
                "value": 4.0
            },
            "helpfulness": null,
            "id": 5594459,
            "likes": {
                "disliked": null,
                "liked": null
            },
            "rating": 3.0,
            "stay_parameters": "Stayed June 2006, traveled as a couple",
            "text": "The big plus for this hotel is the helpful and friendly staff.",
            "title": "Good value accommodation",
            "user": "Jennidcap"
        },
        {
            "date": "March 10, 2006",
            "detail_rating": {
                "business": null,
                "cleanliness": null,
                "desk": null,
                "location": null,
                "pool": null,
                "restaurant": null,
                "rooms": null,
                "service": null,
                "sleep": null,
                "value": null
            },
            "helpfulness": 1,
            "id": 4599519,
            "likes": {
                "disliked": null,
                "liked": null
            },
            "rating": 3.0,
            "stay_parameters": null,
            "text": "Although clean, the hotel is looking a bit tired in places but is priced accordingly. Room was comfortable and had free internet access that works first time.",
            "title": "unfortunately i was surprised",
            "user": "A TripAdvisor user"
        },
        {
            "date": "November 5, 2005",
            "detail_rating": {
                "business": null,
                "cleanliness": 5.0,
                "desk": null,
                "location": null,
                "pool": null,
                "restaurant": null,
                "rooms": 5.0,
                "service": 5.0,
                "sleep": null,
                "value": 5.0
            },
            "helpfulness": null,
            "id": 4088881,
            "likes": {
                "disliked": null,
                "liked": null
            },
            "rating": 4.0,
            "stay_parameters": "Stayed October 2005",
            "text": "Breakfast is the usual HI Express fare and perfectly adequate, although on the morning we were there the size of the breakfast area was struggling to cope with the number of guests.",
            "title": "Outstanding hotel",
            "user": "Traveller1Traveller"
        },
        {
            "date": "August 5, 2005",
            "detail_rating": {
                "business": null,
                "cleanliness": 4.0,
                "desk": null,
                "location": null,
                "pool": null,
                "restaurant": null,
                "rooms": 3.0,
                "service": 4.0,
                "sleep": null,
                "value": 4.0
            },
            "helpfulness": 2,
            "id": 3739092,
            "likes": {
                "disliked": null,
                "liked": null
            },
            "rating": 4.0,
            "stay_parameters": "Stayed July 2005",
            "text": "Overall good value for money",
            "title": "Nice and quiet",
            "user": "UkieFinnGirl"
        },
        {
            "date": "July 13, 2005",
            "detail_rating": {
                "business": null,
                "cleanliness": 4.0,
                "desk": null,
                "location": null,
                "pool": null,
                "restaurant": null,
                "rooms": 3.0,
                "service": 3.0,
                "sleep": null,
                "value": 4.0
            },
            "helpfulness": 3,
            "id": 3663884,
            "likes": {
                "disliked": null,
                "liked": null
            },
            "rating": 4.0,
            "stay_parameters": "Stayed July 2005",
            "text": "after staying in other holiday inn express hotels, i have come to expect certain things,but not here. in the bathroom,other than the familiar towels and shower curtain, i could have been at a budget motel, an older sink with cig. stains.the only chair in the bedroom was a wooden dining room chair.the place is clean but a hampton inn alternative it's not.",
            "title": "Great hotel!",
            "user": "GleefulTraveler"
        },
        {
            "date": "March 14, 2004",
            "detail_rating": {
                "business": null,
                "cleanliness": null,
                "desk": null,
                "location": null,
                "pool": null,
                "restaurant": null,
                "rooms": null,
                "service": null,
                "sleep": null,
                "value": null
            },
            "helpfulness": 14,
            "id": 1724191,
            "likes": {
                "disliked": null,
                "liked": null
            },
            "rating": 4.0,
            "stay_parameters": null,
            "text": "Great hotel to spend a night or two. Located on other end of Sturbridge away from busy spots. Great full breakfast with famous cinnamon buns.",
            "title": "great inexpensive hotel",
            "user": "A TripAdvisor user"
        },
        {
            "date": "September 2, 2011",
            "detail_rating": {
                "business": null,
                "cleanliness": 3.0,
                "desk": null,
                "location": null,
                "pool": null,
                "restaurant": null,
                "rooms": null,
                "service": 4.0,
                "sleep": 4.0,
                "value": 5.0
            },
            "helpfulness": null,
            "id": 117597291,
            "likes": {
                "disliked": null,
                "liked": null
            },
            "rating": 4.0,
            "stay_parameters": "Stayed August 2011, traveled as a couple",
            "text": "This is an older motel on the Paseo del Pueblo Sur (main drag) into Taos, New Mexico. I was at first a little apprehensive to try it based on the mixed reviews.",
            "title": "Older Motel But Great Value With Nice Extras",
            "user": "DCSacramento"
        },
        {
            "date": "August 28, 2011",
            "detail_rating": {
                "business": null,
                "cleanliness": 5.0,
                "desk": null,
                "location": null,
                "pool": null,
                "restaurant": null,
                "rooms": null,
                "service": 5.0,
                "sleep": 5.0,
                "value": 5.0
            },
            "helpfulness": null,
            "id": 117375705,
            "likes": {
                "disliked": null,
                "liked": null
            },
            "rating": 4.0,
            "stay_parameters": "Stayed August 2011, traveled with friends",
            "text": "Check In- Check in was smooth. The clerk appeared to have been up for a long time and wasn't particularly friendly. The lobby looks like a motel right out of the 1960's with dark colors but it did bring back a nostalgic feeling. The hotel used a key rather than a card system.",
            "title": "An older property with great ammenities",
            "user": "brezi"
        },
        {
            "date": "August 20, 2011",
            "detail_rating": {
                "business": null,
                "cleanliness": 3.0,
                "desk": null,
                "location": null,
                "pool": null,
                "restaurant": null,
                "rooms": null,
                "service": 1.0,
                "sleep": 2.0,
                "value": 3.0
            },
            "helpfulness": null,
            "id": 117009162,
            "likes": {
                "disliked": null,
                "liked": null
            },
            "rating": 1.0,
            "stay_parameters": "Stayed August 2011, traveled with family",
            "text": "The Room- The room which contained two queen beds was definitely dated and showing signs of wear. The beds were fine but a little lumpy. The window screens had tears in them and there was some paint missing in other parts of the room. However the room was exceptionally clean.",
            "title": "Avoid unless you have pets",
            "user": "DT_Amarillo_TX"
        },
        {
            "date": "August 11, 2011",
            "detail_rating": {
                "business": null,
                "cleanliness": 5.0,
                "desk": null,
                "location": null,
                "pool": null,
                "restaurant": null,
                "rooms": null,
                "service": 5.0,
                "sleep": 5.0,
                "value": 5.0
            },
            "helpfulness": null,
            "id": 116586991,
            "likes": {
                "disliked": null,
                "liked": null
            },
            "rating": 5.0,
            "stay_parameters": "Stayed August 2011, traveled with friends",
            "text": "The Managers Reception- Even on a Saturday night, which is a rare among hotels/motels they have a managers reception. There was a free minestrone soup which was quite tasty. Later in the evening each guest is given a free drink coupon and there is a large assortment of snacks on the table. Guests were friendly and it was a good experience.",
            "title": "Great location and lots of extras",
            "user": "Marcus4"
        },
        {
            "date": "August 8, 2011",
            "detail_rating": {
                "business": null,
                "cleanliness": 4.0,
                "desk": null,
                "location": 5.0,
                "pool": null,
                "restaurant": null,
                "rooms": 4.0,
                "service": 5.0,
                "sleep": null,
                "value": 5.0
            },
            "helpfulness": null,
            "id": 116432545,
            "likes": {
                "disliked": null,
                "liked": null
            },
            "rating": 5.0,
            "stay_parameters": "Stayed August 2011",
            "text": "The Sleep- The sleep was fine. There was no noise that I could here in the adjacent rooms or down the hall. With our outside room we had a great view of a distant thunderstorm. Shower worked great.",
            "title": "One of the best hotels we have stayed in.",
            "user": "orcaswatcher"
        },
        {
            "date": "June 11, 2007",
            "detail_rating": {
                "business": 5.0,
                "cleanliness": null,
                "desk": null,
                "front_desk": 3.0,
                "location": 4.0,
                "pool": null,
                "restaurant": null,
                "rooms": 4.0,
                "service": null,
                "sleep": null,
                "value": 4.0
            },
            "helpfulness": 6,
            "id": 7836381,
            "likes": {
                "disliked": null,
                "liked": "\u2014 It had free Wi-FI"
            },
            "rating": 4.0,
            "stay_parameters": "Stayed June 2007, traveled with family",
            "text": "Last time I stayed in Eastern Shore, VA to visit family, I stayed at this dump (sorry can't remember the name of the hotel). So I wasn't sure what to expect from the Comfort Inn Onley. What a pleasant surprise. Our room and bathroom was very clean and comfortable. The staffs there were very nice and accommodating. The hotel sits in a great location, right across the street from a shopping center and not far from nearby restaurants.",
            "title": "Clean Place to Stay",
            "user": "MsLibrarian"
        },
        {
            "date": "August 22, 2005",
            "detail_rating": {
                "business": null,
                "cleanliness": 4.0,
                "desk": null,
                "location": null,
                "pool": null,
                "restaurant": null,
                "rooms": 4.0,
                "service": 4.0,
                "sleep": null,
                "value": 4.0
            },
            "helpfulness": 1,
            "id": 3797721,
            "likes": {
                "disliked": null,
                "liked": null
            },
            "rating": 4.0,
            "stay_parameters": "Stayed August 2005",
            "text": "Nice, clean room w/ Jacuzzi and fridge. Convenient location to various Restaurants and State Parks Campsite/Beaches.",
            "title": "Nice Place",
            "user": "CRYSTAL J"
        },
        {
            "date": "August 18, 2005",
            "detail_rating": {
                "business": null,
                "cleanliness": null,
                "desk": null,
                "location": null,
                "pool": null,
                "restaurant": null,
                "rooms": null,
                "service": null,
                "sleep": null,
                "value": null
            },
            "helpfulness": 2,
            "id": 3788312,
            "likes": {
                "disliked": null,
                "liked": null
            },
            "rating": 4.0,
            "stay_parameters": null,
            "text": "we stayed here on our journey to the Outer Banks. Clean, comfortable room, nice pool and convenient next door family restaurant. Friendly and helpful staff.",
            "title": "Nice place to stay",
            "user": "A TripAdvisor user"
        },
        {
            "date": "July 30, 2005",
            "detail_rating": {
                "business": null,
                "cleanliness": null,
                "desk": null,
                "location": null,
                "pool": null,
                "restaurant": null,
                "rooms": null,
                "service": null,
                "sleep": null,
                "value": null
            },
            "helpfulness": 3,
            "id": 3723119,
            "likes": {
                "disliked": null,
                "liked": null
            },
            "rating": 5.0,
            "stay_parameters": null,
            "text": "We had to visit the area on business and booked the last room at this hotel for the weekend--the king jacuzzi suite. The Comfort Inn is not the Ritz Carlton (so we weren't expecting the Ritz) but we thought that the room was very nice, large, and clean and had a nifty tub in middle of the living area. The staff was very pleasant and we were able to surf the web with the hotel's wireless access. The location is very close to Onancock, where we had an excellent dinner at Bizzotto's in downtown. We would definitely stay here again.",
            "title": "Very nice hotel!",
            "user": "A TripAdvisor user"
        },
        {
            "date": "July 14, 2005",
            "detail_rating": {
                "business": null,
                "cleanliness": 1.0,
                "desk": null,
                "location": null,
                "pool": null,
                "restaurant": null,
                "rooms": 1.0,
                "service": 1.0,
                "sleep": null,
                "value": 1.0
            },
            "helpfulness": 3,
            "id": 3664339,
            "likes": {
                "disliked": null,
                "liked": null
            },
            "rating": 1.0,
            "stay_parameters": "Stayed May 2004",
            "text": "This hotel had the filthiest room I've ever stayed in in my life -- the bathroom had water stains in the toilet, bugs on the floor and dust everywhere. The carpet in the room looked like it hadn't been vaccumed in weeks, the room reeked of stale cigarettes to the point we left the door open to air it out. Just disgusting -- stay somewhere else!",
            "title": "Worst room I've ever stayed in!",
            "user": "plays88keys"
        },
        {
            "date": "January 1, 2011",
            "detail_rating": {
                "business": null,
                "cleanliness": 2.0,
                "desk": null,
                "location": 3.0,
                "pool": null,
                "restaurant": null,
                "rooms": 2.0,
                "service": 2.0,
                "sleep": 3.0,
                "value": 4.0
            },
            "helpfulness": null,
            "id": 91294744,
            "likes": {
                "disliked": null,
                "liked": null
            },
            "rating": 1.0,
            "stay_parameters": "Stayed December 2010, traveled with friends",
            "text": "From the very beginning, the management was not very friendly to me and my friends who had traveled there to ski, and was giving us a terrible time for wanting to split up the rooms and use different credit cards. Hot breakfast was good, but the staff, cleanliness, professionalism, and consumer oriented behavior was not acceptable. I will look to stay at the Best Western Kachina in Taos if I ever travel there again.",
            "title": "Management needs a makeover",
            "user": "shadediggler"
        },
        {
            "date": "October 6, 2010",
            "detail_rating": {
                "business": null,
                "cleanliness": 2.0,
                "desk": null,
                "location": 3.0,
                "pool": null,
                "restaurant": null,
                "rooms": 2.0,
                "service": 4.0,
                "sleep": 3.0,
                "value": 2.0
            },
            "helpfulness": null,
            "id": 82325839,
            "likes": {
                "disliked": null,
                "liked": null
            },
            "rating": 2.0,
            "stay_parameters": "Stayed October 2010, traveled with family",
            "text": "The staff was very nice, however, there is no quality here",
            "title": "no quality",
            "user": "travelintheusa"
        },
        {
            "date": "August 25, 2010",
            "detail_rating": {
                "business": null,
                "cleanliness": 1.0,
                "desk": null,
                "location": 2.0,
                "pool": null,
                "restaurant": null,
                "rooms": 1.0,
                "service": 3.0,
                "sleep": 1.0,
                "value": 2.0
            },
            "helpfulness": null,
            "id": 76888262,
            "likes": {
                "disliked": null,
                "liked": null
            },
            "rating": 2.0,
            "stay_parameters": "Stayed August 2010, traveled with family",
            "text": "We stayed here based on the fact that it had a full served breakfast and we thought it would be nice to have something different than the standard continental breakfasts that we had for the rest of the trip. It was not worth it. The hallways smelled like old stale smoke and our youngest kid plugged his nose on our way to breakfast in the morning. We had a large 2 story room with a king bed and bathroom upstairs and a queen wallbed and pullout couch in the downstairs sitting room. The downstairs air conditioner had so much mold on it that we couldn't use it without making the air smell worse. There was a small 18\" window upstairs that we opened to try to air out the room. The downstairs room had a door that opened up into the outdoor pool courtyard. We kept that open as much as possible.",
            "title": "Terrible air - smoky and moldy - it made me feel sick.",
            "user": "MaineHazel"
        },
        {
            "date": "August 13, 2010",
            "detail_rating": {
                "business": null,
                "cleanliness": 4.0,
                "desk": null,
                "location": 5.0,
                "pool": null,
                "restaurant": null,
                "rooms": 4.0,
                "service": 5.0,
                "sleep": 4.0,
                "value": 5.0
            },
            "helpfulness": 1,
            "id": 75084001,
            "likes": {
                "disliked": null,
                "liked": null
            },
            "rating": 4.0,
            "stay_parameters": "Stayed August 2010, traveled as a couple",
            "text": "The only good part about this hotel was the pool. It was outdoors, very clean and goes to 9 ft deep! The kids ranked it as the best pool of the whole trip but the worst hotel.",
            "title": "Pretty Nice with one exception",
            "user": "gerryrtodd"
        },
        {
            "date": "August 2, 2010",
            "detail_rating": {
                "business": null,
                "cleanliness": 4.0,
                "desk": null,
                "location": 5.0,
                "pool": null,
                "restaurant": null,
                "rooms": 4.0,
                "service": 5.0,
                "sleep": 5.0,
                "value": 5.0
            },
            "helpfulness": 1,
            "id": 73335156,
            "likes": {
                "disliked": null,
                "liked": null
            },
            "rating": 4.0,
            "stay_parameters": "Stayed July 2010, traveled as a couple",
            "text": "To get to the point, my exception related to the free Wireless service. The reception was terrible, even when I went to the lobby to try to get closer to the server. I called their technical support but the guy wanted to change my settings and I knew my computer was not at fault. It was fine for me to do without internet for a day!!!! Others may not like it.",
            "title": "Good hotel",
            "user": "DrDoppler"
        },
        {
            "date": "May 11, 2005",
            "detail_rating": {
                "business": null,
                "cleanliness": 1.0,
                "desk": null,
                "location": null,
                "pool": null,
                "restaurant": null,
                "rooms": 2.0,
                "service": 3.0,
                "sleep": null,
                "value": 2.0
            },
            "helpfulness": 2,
            "id": 3459612,
            "likes": {
                "disliked": null,
                "liked": null
            },
            "rating": 2.0,
            "stay_parameters": "Stayed March 2004",
            "text": "Husband is from near this area. We stayed here a few times when we are in town visiting. The last time I had issues with the cleanliness of the hotel and do not intend to stay again. Unfortunately, there are very few hotels in this part of the state. I am trying B&Bs instead.",
            "title": "Would not stay again",
            "user": "SMM03"
        },
        {
            "date": "November 1, 2004",
            "detail_rating": {
                "business": null,
                "cleanliness": null,
                "desk": null,
                "location": null,
                "pool": null,
                "restaurant": null,
                "rooms": null,
                "service": null,
                "sleep": null,
                "value": null
            },
            "helpfulness": 5,
            "id": 2800420,
            "likes": {
                "disliked": null,
                "liked": null
            },
            "rating": 3.0,
            "stay_parameters": null,
            "text": "We stayed at this hotel for 5 nights during late October 2004 and found the location great for our needs. It is centrally located for any Eastern Shore activity. We had a king bed, a table with two chairs, and plenty of storage. The breakfast was a basic cont. - fruit, coffee, pastry, cereal, milk and juice.",
            "title": "Good location for Eastern Shore",
            "user": "eariner"
        }
    ],
    "slim_ranking": 0.666666666667,
    "stars": 2.5,
    "tripadvisor": {
        "VISITED": false,
        "country_name": null,
        "locality": null,
        "pic_link": null,
        "street_address": null
    },
    "user_rating": 3.5,
    "variance": {
        "average": 35,
        "excellent": 33,
        "poor": 18,
        "terrible": 19,
        "very good": 63
    }
}