{
    "aka": "Comfort Suites Baytown Hotel Baytown",
    "description": null,
    "detail_rating": {
        "cleanliness": null,
        "location": null,
        "rooms": null,
        "service": null,
        "sleep": null,
        "value": null
    },
    "location": {
        "city": null,
        "continent": null,
        "country": "United States",
        "proposed_city": "Baytown",
        "province": null,
        "region": null
    },
    "name": "Comfort Suites Baytown",
    "places": {
        "aka": [
            "Baytown"
        ],
        "hotel_description": [],
        "hotel_name": [
            "Baytown"
        ]
    },
    "review_count": 28,
    "review_count_current": 6,
    "reviews": [
        {
            "date": "April 4, 2005",
            "detail_rating": {
                "business": null,
                "cleanliness": 4.0,
                "desk": null,
                "location": null,
                "pool": null,
                "restaurant": null,
                "rooms": 4.0,
                "service": 4.0,
                "sleep": null,
                "value": 4.0
            },
            "helpfulness": 1,
            "id": 3329726,
            "likes": {
                "disliked": null,
                "liked": null
            },
            "rating": 4.0,
            "stay_parameters": "Stayed March 2005",
            "text": "The rooms are typical for a newer comfort suites. The front desk person was particularly helpful in finding a room that would work for us as well as dinner recommendations. The cookies at check-in were a nice touch. The pool and hot tub were outside and it was a bit too cool for us to try it.",
            "title": "new hotel in area",
            "user": "1contleft"
        },
        {
            "date": "July 10, 2009",
            "detail_rating": {
                "business": null,
                "cleanliness": 5.0,
                "desk": null,
                "location": 5.0,
                "pool": null,
                "restaurant": null,
                "rooms": 5.0,
                "service": 5.0,
                "sleep": null,
                "value": 5.0
            },
            "helpfulness": null,
            "id": 34365137,
            "likes": {
                "disliked": null,
                "liked": null
            },
            "rating": 5.0,
            "stay_parameters": "Stayed June 2009, traveled on business",
            "text": "Stayed several weeks at this great hotel on business. Super clean, friendly staff and overall well managed hotel. I like the fact that it is not located right on top of the interstate like many hotels I've stayed. Being a couple of hundred yards away created a quieter experience. I preferred the upper north side which had a nice view of green fields.Very quiet. All of the best restaurants and stores are conviently located. My coworkers also use this same hotel and recommended it to me. It's new, reasonably priced and really nice. Has LCD television, sofa area, refridge and microwave. Easy wireless access at no extra charge. Nice excercise room and the pool is really clean and fairly private. I found the breakfast bar better than average and well attended. The waffle maker is great and the brewed coffee is rich (better than starbucks imho). I've stayed at many hotels in this price range over the past year and this is my favorite. Very nice and highly recommend. Oh yeah, 25 minutes from downtown Houston.",
            "title": "Excellent choice",
            "user": "jetzoom99"
        },
        {
            "date": "July 19, 2008",
            "detail_rating": {
                "business": 3.0,
                "cleanliness": 3.0,
                "desk": null,
                "front_desk": 3.0,
                "location": 1.0,
                "pool": null,
                "restaurant": null,
                "rooms": 3.0,
                "service": 3.0,
                "sleep": null,
                "value": null
            },
            "helpfulness": 2,
            "id": 18051650,
            "likes": {
                "disliked": null,
                "liked": null
            },
            "rating": 1.0,
            "stay_parameters": "Stayed July 2008, traveled with family",
            "text": "Security cameras are conviently broken in this high crime area. Car got broken into with severe damage to door and had $2500.00 of merchandise stolen from car. Other cars were broken into as well. With no security around, this hotel is a dream come true for thieves. Do not stay here!!!! My family is still crying in Louisiana!!!!!",
            "title": "High Crime Area",
            "user": "veronicamia"
        },
        {
            "date": "December 27, 2006",
            "detail_rating": {
                "business": 4.0,
                "cleanliness": 4.0,
                "desk": null,
                "front_desk": 3.0,
                "location": 3.0,
                "pool": null,
                "restaurant": null,
                "rooms": 4.0,
                "service": 3.0,
                "sleep": null,
                "value": 4.0
            },
            "helpfulness": null,
            "id": 6504599,
            "likes": {
                "disliked": "\u2014 Breakfast bar.",
                "liked": "\u2014 Clean, quiet, and comfortable."
            },
            "rating": 4.0,
            "stay_parameters": "Stayed December 2006, traveled with family",
            "text": "Cleaner than expected, and the rooms were decorated better than the usual Choice Hotels establishment. Tile bathrooms and tile accents in the room, crown moulding, clean carpets. The exercise room had a \"universal\" style weight training machine, a treadmill, and a stationary bike. The business center provided online access. The breakfast was somewhat disappointing, but I didn't stay there for the food. The bed was comfortable. I didn't notice any noise from either the interstate or Garth Road. The front desk even fulfilled my advance request for extra pillows and placed three extra pillows in my room. There is a Denny's and Starbucks within easy walking distance (across parking lots).",
            "title": "Better Than Expected",
            "user": "TXLumberJack"
        },
        {
            "date": "May 2, 2006",
            "detail_rating": {
                "business": null,
                "cleanliness": 4.0,
                "desk": null,
                "location": null,
                "pool": null,
                "restaurant": null,
                "rooms": 4.0,
                "service": 4.0,
                "sleep": null,
                "value": 4.0
            },
            "helpfulness": 3,
            "id": 5029811,
            "likes": {
                "disliked": null,
                "liked": null
            },
            "rating": 4.0,
            "stay_parameters": "Stayed April 2006",
            "text": "Stayed at the Comfort Suites for 4 nights and found the place very clean. The rooms were spacious with two queen beds and a pull out sofa. The breakfast was better than average, one morning they had scrambled eggs and sausages. The outside pool looked very nice even thou we didn't use it. There are numerous restaurants nearby, some within walking distance. The morning clerk could have been a little more friendly although the night clerk was very friendly and sociable. The price was a little more than other motels within the area but I would definitely stay again because of the cleanliness.",
            "title": "Clean Hotel",
            "user": "DSchmidtNekoosa_Wi"
        },
        {
            "date": "June 7, 2005",
            "detail_rating": {
                "business": null,
                "cleanliness": 5.0,
                "desk": null,
                "location": null,
                "pool": null,
                "restaurant": null,
                "rooms": 4.0,
                "service": 4.0,
                "sleep": null,
                "value": 3.0
            },
            "helpfulness": 2,
            "id": 3536348,
            "likes": {
                "disliked": null,
                "liked": null
            },
            "rating": 5.0,
            "stay_parameters": "Stayed June 2005, traveled on business",
            "text": "Noting much to say, the hotel has what any business traveler is looking for... A clean room, cookies at checkin, continential breakfast, Wired and Wireless High Speed Internet access is free. Since it's a new hotel, the beds are still comfortable, the rooms are clean, and the carpet isn't gross. A short drive to the Houston shipping channel industrial parks.",
            "title": "Nice, clean, new",
            "user": "nospam"
        }
    ],
    "slim_ranking": 0.409090909091,
    "stars": 2.5,
    "tripadvisor": {
        "VISITED": false,
        "country_name": null,
        "locality": null,
        "pic_link": null,
        "street_address": null
    },
    "user_rating": 4.0,
    "variance": {
        "average": 2,
        "excellent": 11,
        "poor": 2,
        "terrible": 3,
        "very good": 10
    }
}