{
    "aka": "Elkton Days Inn",
    "description": null,
    "detail_rating": {
        "cleanliness": null,
        "location": null,
        "rooms": null,
        "service": null,
        "sleep": null,
        "value": null
    },
    "location": {
        "city": "Elkton",
        "continent": null,
        "country": "United States",
        "proposed_city": "Elkton",
        "province": null,
        "region": null
    },
    "name": "Days Inn Elkton",
    "places": {
        "aka": [
            "Elkton"
        ],
        "hotel_description": [],
        "hotel_name": [
            "Elkton"
        ]
    },
    "review_count": 39,
    "review_count_current": 1,
    "reviews": [
        {
            "date": "December 15, 2003",
            "detail_rating": {
                "business": null,
                "cleanliness": null,
                "desk": null,
                "location": null,
                "pool": null,
                "restaurant": null,
                "rooms": null,
                "service": null,
                "sleep": null,
                "value": null
            },
            "helpfulness": 2,
            "id": 1517739,
            "likes": {
                "disliked": null,
                "liked": null
            },
            "rating": 4.0,
            "stay_parameters": null,
            "text": "I stayed here over Thanksgiving and it was very nice. Comfortable bed, large TV with lots of cable channels, temperature controlled heating and cooling, affable staff. We're definitely going to stay here again.",
            "title": "Great budget hotel",
            "user": "pinkypinksand"
        }
    ],
    "slim_ranking": 0.571428571429,
    "stars": 1.5,
    "tripadvisor": {
        "VISITED": false,
        "country_name": null,
        "locality": null,
        "pic_link": null,
        "street_address": null
    },
    "user_rating": 3.5,
    "variance": {
        "average": 12,
        "excellent": 6,
        "poor": 6,
        "terrible": 3,
        "very good": 12
    }
}