{
    "aka": "Empress Hotel Ho Chi Minh",
    "description": null,
    "detail_rating": {
        "cleanliness": null,
        "location": null,
        "rooms": null,
        "service": null,
        "sleep": null,
        "value": null
    },
    "location": {
        "city": null,
        "continent": "Asia",
        "country": "Vietnam",
        "proposed_city": "Ho",
        "province": null,
        "region": null
    },
    "name": "Empress Hotel IMS Ho Chi Minh",
    "places": {
        "aka": [
            "Ho"
        ],
        "hotel_description": [],
        "hotel_name": [
            "Ho"
        ]
    },
    "review_count": 167,
    "review_count_current": 8,
    "reviews": [
        {
            "date": "April 29, 2006",
            "detail_rating": {
                "business": null,
                "cleanliness": 5.0,
                "desk": null,
                "location": null,
                "pool": null,
                "restaurant": null,
                "rooms": 4.0,
                "service": 5.0,
                "sleep": null,
                "value": 5.0
            },
            "helpfulness": 18,
            "id": 5019695,
            "likes": {
                "disliked": null,
                "liked": null
            },
            "rating": 4.0,
            "stay_parameters": "Stayed April 2006",
            "text": "I stayed at the Empress for one night after a long flight! I arrived late at night and was greeted by name as I walked through the doors. I had the Jr Suite - I had doubts about booking this hotel as it was so much cheaper than anything else on Expedia - but I would stay there again in a second.",
            "title": "Great little hotel",
            "user": "Markbb"
        },
        {
            "date": "November 11, 2005",
            "detail_rating": {
                "business": null,
                "cleanliness": null,
                "desk": null,
                "location": null,
                "pool": null,
                "restaurant": null,
                "rooms": null,
                "service": null,
                "sleep": null,
                "value": null
            },
            "helpfulness": 15,
            "id": 4106222,
            "likes": {
                "disliked": null,
                "liked": null
            },
            "rating": 4.0,
            "stay_parameters": null,
            "text": "It was all very clean - the room was well equiped (stereo, cd player, minibar, etc) with a view over the city. The shower in the bathroom was great - two air con units- one in the bedroom and another in the sitting area.",
            "title": "Great Staff",
            "user": "A TripAdvisor user"
        },
        {
            "date": "March 30, 2005",
            "detail_rating": {
                "business": null,
                "cleanliness": null,
                "desk": null,
                "location": null,
                "pool": null,
                "restaurant": null,
                "rooms": null,
                "service": null,
                "sleep": null,
                "value": null
            },
            "helpfulness": 39,
            "id": 3311837,
            "likes": {
                "disliked": null,
                "liked": null
            },
            "rating": 4.0,
            "stay_parameters": null,
            "text": "Breakfast had both european and Vietnamese food. Service was great too - arriving late i had offers to go and get food from nearby restaurants.",
            "title": "GOOD DEAL",
            "user": "A TripAdvisor user"
        },
        {
            "date": "November 29, 2006",
            "detail_rating": {
                "business": 3.0,
                "cleanliness": 3.0,
                "desk": null,
                "front_desk": 5.0,
                "location": 2.0,
                "pool": null,
                "restaurant": null,
                "rooms": 3.0,
                "service": 5.0,
                "sleep": null,
                "value": 3.0
            },
            "helpfulness": 2,
            "id": 6233393,
            "likes": {
                "disliked": null,
                "liked": null
            },
            "rating": 3.0,
            "stay_parameters": "Stayed October 2006",
            "text": "This is a decent 3 star hotel. We stayed there for 3 nights and the bed is comfortable, the room clean with a good air conditioner. TV has satellite. There is an adequate bathroom although a bit grimy in places. A good scrubbing is needed.",
            "title": "Nice room - shame about the breakfast",
            "user": "Miranda_L"
        },
        {
            "date": "November 23, 2006",
            "detail_rating": {
                "business": 4.0,
                "cleanliness": 5.0,
                "desk": null,
                "front_desk": 4.0,
                "location": 3.0,
                "pool": null,
                "restaurant": null,
                "rooms": 2.0,
                "service": 4.0,
                "sleep": null,
                "value": 4.0
            },
            "helpfulness": 2,
            "id": 6169453,
            "likes": {
                "disliked": "\u2014 Breakfast buffet!",
                "liked": "\u2014 Exceptionally clean rooms, secure environment, quiet."
            },
            "rating": 3.0,
            "stay_parameters": "Stayed March 2006, traveled with family",
            "text": "The staff is very helpful. They got us some packing tape to seal up a box we wanted to take on the plane. They put us on a smoking floor even though we requested a non-smoking room, but the room didn't smell of smoke.",
            "title": "Empress Hotel HCMC....",
            "user": "rinni004"
        },
        {
            "date": "September 18, 2006",
            "detail_rating": {
                "business": null,
                "cleanliness": 4.0,
                "desk": null,
                "front_desk": 5.0,
                "location": 3.0,
                "pool": null,
                "restaurant": null,
                "rooms": 4.0,
                "service": 4.0,
                "sleep": null,
                "value": 4.0
            },
            "helpfulness": 8,
            "id": 5811680,
            "likes": {
                "disliked": null,
                "liked": null
            },
            "rating": 4.0,
            "stay_parameters": "Stayed August 2006, traveled with family",
            "text": "The breakfast is really pretty terrible though. They advertise it as a buffet but is actually just some scrambled eggs which were very bland with peas in it, cold toast, butter and jam, two slices of bacon on a plate, a few slices of watermelon and pineapple and that is about it. Forget the breakfast and go out for some Pho. We did after the first morning.",
            "title": "Enjoy",
            "user": "Young61"
        },
        {
            "date": "August 24, 2006",
            "detail_rating": {
                "business": null,
                "cleanliness": 5.0,
                "desk": null,
                "front_desk": 4.0,
                "location": 4.0,
                "pool": null,
                "restaurant": null,
                "rooms": 5.0,
                "service": 4.0,
                "sleep": null,
                "value": 5.0
            },
            "helpfulness": 9,
            "id": 5703168,
            "likes": {
                "disliked": null,
                "liked": null
            },
            "rating": 5.0,
            "stay_parameters": "Stayed August 2006",
            "text": "Very very small rooms, but exceptionally clean.",
            "title": "Pleasant surprise",
            "user": "Jenstar"
        },
        {
            "date": "August 21, 2006",
            "detail_rating": {
                "business": 3.0,
                "cleanliness": 4.0,
                "desk": null,
                "front_desk": 4.0,
                "location": 4.0,
                "pool": null,
                "restaurant": null,
                "rooms": 4.0,
                "service": 4.0,
                "sleep": null,
                "value": 4.0
            },
            "helpfulness": 7,
            "id": 5630768,
            "likes": {
                "disliked": "\u2014 Cigarette smoke smell in the room",
                "liked": "\u2014 Clean with proper facilities"
            },
            "rating": 4.0,
            "stay_parameters": "Stayed August 2006, traveled as a couple",
            "text": "Breakfast buffet is very ordinary / uninspired, but considering the cheap room rates one can't really complain too much!!",
            "title": "Great Experience at Empress",
            "user": "VWong"
        }
    ],
    "slim_ranking": 0.276470588235,
    "stars": 2.5,
    "tripadvisor": {
        "VISITED": false,
        "country_name": null,
        "locality": null,
        "pic_link": null,
        "street_address": null
    },
    "user_rating": 3.5,
    "variance": {
        "average": 45,
        "excellent": 20,
        "poor": 16,
        "terrible": 6,
        "very good": 80
    }
}