{
    "aka": "The Brentwood Hotel Los Angeles",
    "description": "Charm, convenience and extraordinary value: we have it all. Our tastefully decorated rooms are all non-smoking and pet-free, and come equipped with flat-panel LCD TVs and high-speed internet access. Your room rate includes free parking, continental breakfast and freshly-baked cookies every afternoon. Our location in Brentwood is conveniently close to restaurants in Brentwood Village, shopping in Beverly Hills and Santa Monica and only minutes from UCLA and the world-famous Getty Center.",
    "detail_rating": {
        "cleanliness": null,
        "location": null,
        "rooms": null,
        "service": null,
        "sleep": null,
        "value": null
    },
    "location": {
        "city": "Los Angeles",
        "continent": null,
        "country": "United States",
        "proposed_city": "Brentwood",
        "province": null,
        "region": null
    },
    "name": "The Brentwood Inn",
    "places": {
        "aka": [
            "Brentwood"
        ],
        "hotel_description": [
            "Brentwood",
            "Beverly"
        ],
        "hotel_name": [
            "Brentwood"
        ]
    },
    "review_count": 253,
    "review_count_current": 21,
    "reviews": [
        {
            "date": "November 5, 2006",
            "detail_rating": {
                "business": 4.0,
                "cleanliness": 3.0,
                "desk": null,
                "front_desk": 3.0,
                "location": 3.0,
                "pool": null,
                "restaurant": null,
                "rooms": 2.0,
                "service": 4.0,
                "sleep": null,
                "value": 1.0
            },
            "helpfulness": 11,
            "id": 6059738,
            "likes": {
                "disliked": null,
                "liked": null
            },
            "rating": 2.0,
            "stay_parameters": "Stayed October 2006, traveled as a couple",
            "text": "I don't know how this is the 6th best hotel in LA as their website (the Brentwood Inn) is completely misleading as there are no \"cottages.\" It's set up like a motel and their website has some very strategic photos to show internet marketing at it's finest.",
            "title": "Not worth it! (Overrated)",
            "user": "mrs233"
        },
        {
            "date": "November 2, 2006",
            "detail_rating": {
                "business": null,
                "cleanliness": 3.0,
                "desk": null,
                "front_desk": 4.0,
                "location": 2.0,
                "pool": null,
                "restaurant": null,
                "rooms": 3.0,
                "service": 3.0,
                "sleep": null,
                "value": 3.0
            },
            "helpfulness": 11,
            "id": 6044452,
            "likes": {
                "disliked": null,
                "liked": "\u2014 Breakfast, traffic, sky light"
            },
            "rating": 2.0,
            "stay_parameters": "Stayed October 2006, traveled as a couple",
            "text": "I checked in early and was able to get my room within an hour which was nice and the staff was friendly, but the rooms are nothing special. Basically--it's an expensive motel ($200+/night). The rooms are small and the bathroom is pretty blah as well. The skylight is a bit annoying in the morning especially if you wanted to sleep in. And lastly--the breakfast assortment included muffins, fruit and croissants--once again there is nothing to rave about.",
            "title": "Not sure I agree with the other reviews ....",
            "user": "KD1"
        },
        {
            "date": "October 2, 2006",
            "detail_rating": {
                "business": 4.0,
                "cleanliness": 5.0,
                "desk": null,
                "front_desk": 5.0,
                "location": 4.0,
                "pool": null,
                "restaurant": null,
                "rooms": 4.0,
                "service": 5.0,
                "sleep": null,
                "value": 5.0
            },
            "helpfulness": 6,
            "id": 5901331,
            "likes": {
                "disliked": "\u2014 No restaurnant",
                "liked": "\u2014 Cleanliness and room features for the price"
            },
            "rating": 5.0,
            "stay_parameters": "Stayed September 2006, traveled on business",
            "text": "I wouldn't recommend this MOTEL to anyone as it's a rip off .",
            "title": "Best Kept Secret in Brentwood",
            "user": "Joltin_Joe"
        },
        {
            "date": "August 6, 2006",
            "detail_rating": {
                "business": 5.0,
                "cleanliness": 5.0,
                "desk": null,
                "front_desk": 5.0,
                "location": 4.0,
                "pool": null,
                "restaurant": null,
                "rooms": 4.0,
                "service": 5.0,
                "sleep": null,
                "value": 4.0
            },
            "helpfulness": 8,
            "id": 5564380,
            "likes": {
                "disliked": "\u2014 price",
                "liked": "\u2014 individual bungalow-style guestrooms"
            },
            "rating": 4.0,
            "stay_parameters": "Stayed July 2006, traveled solo",
            "text": "Not sure I agree with the last couple of reviews regarding The Brentwood.",
            "title": "Lovely place to stay, great location",
            "user": "happyinca"
        },
        {
            "date": "July 23, 2006",
            "detail_rating": {
                "business": null,
                "cleanliness": null,
                "desk": null,
                "location": null,
                "pool": null,
                "restaurant": null,
                "rooms": null,
                "service": null,
                "sleep": null,
                "value": null
            },
            "helpfulness": 7,
            "id": 5501848,
            "likes": {
                "disliked": null,
                "liked": null
            },
            "rating": 4.0,
            "stay_parameters": null,
            "text": "Sure, the one staff member that spoke to me on check in was very friendly.",
            "title": "Lovely Inn",
            "user": "Rohonda"
        },
        {
            "date": "June 13, 2006",
            "detail_rating": {
                "business": null,
                "cleanliness": 5.0,
                "desk": null,
                "location": null,
                "pool": null,
                "restaurant": null,
                "rooms": 4.0,
                "service": 5.0,
                "sleep": null,
                "value": 3.0
            },
            "helpfulness": 8,
            "id": 5341778,
            "likes": {
                "disliked": null,
                "liked": null
            },
            "rating": 4.0,
            "stay_parameters": "Stayed June 2006",
            "text": "I would stay here again. Place is kept clean and staff is more than friendly and knowledgable about surrounding eateries and things to do. If you are a light sleeper it might be too noisy because it's next to the blvd. The only other negative aspect is the skylight. There's no control over the light coming into the skylight on the ceiling. It's annoying in the morning when you're trying to sleep in.",
            "title": "Nice Place to Stay",
            "user": "larroyo69"
        },
        {
            "date": "May 29, 2006",
            "detail_rating": {
                "business": null,
                "cleanliness": 5.0,
                "desk": null,
                "location": null,
                "pool": null,
                "restaurant": null,
                "rooms": 5.0,
                "service": 5.0,
                "sleep": null,
                "value": 5.0
            },
            "helpfulness": 8,
            "id": 5233569,
            "likes": {
                "disliked": null,
                "liked": null
            },
            "rating": 5.0,
            "stay_parameters": "Stayed May 2006, traveled on business",
            "text": "The Brentwood Inn is an absolute gem. It's nestled in a lovely area along Sunset Boulevard, just a mile west of I-405. The two women working the front office are warm and helpful, as is one of the resident managers who kindly brought an iron to my room at 11:00 one night.",
            "title": "What a gem!",
            "user": "misspipsy"
        },
        {
            "date": "May 18, 2006",
            "detail_rating": {
                "business": null,
                "cleanliness": null,
                "desk": null,
                "location": null,
                "pool": null,
                "restaurant": null,
                "rooms": null,
                "service": null,
                "sleep": null,
                "value": null
            },
            "helpfulness": 6,
            "id": 5180767,
            "likes": {
                "disliked": null,
                "liked": null
            },
            "rating": 5.0,
            "stay_parameters": null,
            "text": "My room was very clean and a winning mix of charm and hi-tech. It was a little on the small side, but laid out to maximize space. Though I think some parts of the room would be too snug for two people. My corner room had a skylight, white shutters as blinds, and furnishings in rich colors. Very home-y. A remote control allows guests to adjust the room's climate.",
            "title": "Hospitality Inn",
            "user": "Wendy L"
        },
        {
            "date": "February 16, 2006",
            "detail_rating": {
                "business": null,
                "cleanliness": null,
                "desk": null,
                "location": null,
                "pool": null,
                "restaurant": null,
                "rooms": null,
                "service": null,
                "sleep": null,
                "value": null
            },
            "helpfulness": 9,
            "id": 4463562,
            "likes": {
                "disliked": null,
                "liked": null
            },
            "rating": 5.0,
            "stay_parameters": null,
            "text": "The hotel has business travelers in mind, offering free wireless internet, free bottled water, a nice-sized refrigerator, and a desk with a good workspace. Women are also catered to. I appreciated the many useful mirrors and Aveda toiletries, for starters. As a woman traveling alone, I felt secure, even though I usually avoid hotels where rooms open directly onto the parking lot.",
            "title": "An enjoyable hotel",
            "user": "A TripAdvisor user"
        },
        {
            "date": "January 17, 2006",
            "detail_rating": {
                "business": null,
                "cleanliness": null,
                "desk": null,
                "location": null,
                "pool": null,
                "restaurant": null,
                "rooms": null,
                "service": null,
                "sleep": null,
                "value": null
            },
            "helpfulness": 8,
            "id": 4357440,
            "likes": {
                "disliked": null,
                "liked": null
            },
            "rating": 3.0,
            "stay_parameters": null,
            "text": "The free breakfast of muffins, fruit, and coffee/tea fit the bill. The best part was eating breakfast in the small courtyard edged with a long fountain. You'd never guess busy Sunset Boulevard was on the other side of the tall privacy fence.",
            "title": "Not Bad, But Not The Bel-Air Hotel",
            "user": "cjennt"
        },
        {
            "date": "July 20, 2006",
            "detail_rating": {
                "business": null,
                "cleanliness": null,
                "desk": null,
                "location": null,
                "pool": null,
                "restaurant": null,
                "rooms": null,
                "service": null,
                "sleep": null,
                "value": null
            },
            "helpfulness": 9,
            "id": 5489428,
            "likes": {
                "disliked": null,
                "liked": null
            },
            "rating": 5.0,
            "stay_parameters": null,
            "text": "We stayed at The Brentwood for 1 week the 1st part of July. It was a wonderful vacation thanks to the friendliness of the staff and cleanliness of the inn. The rooms are small but very updated- track lighting on vaulted wooden ceilings, remote control AC and heat, Aveda products, mini refrigerator with bottled water restocked daily and whenever you need it, and a small but very efficient and relaxing shower! It was like staying in a small trendy cottage in some ways. Parking is free, and it was great to be able to walk outside your room to the car. The landscaping on the grounds is beautiful-take advantage of the patio with cascading wall of water! Muffins, other breakfast pastries, fresh fruit, coffee, and gourmet teas are included- we ate on the patio as often as possible. Our host even packed breakfast bags for us to take on the plane as we were leaving the next day before breakfast!! We also enjoyed walking through the neighborhood each morning- it is about a 15-20 minute walk to the main street, San Vicente, which has lots of shops and restaurants/cafes. Dutton Books is a great place to stop. Our hosts, who are a young couple, and all the staff were very accommodating and gave us lots of good suggestions about things to do and places to go. The J. Paul Getty Center is only about 10 minutes away, too. There is wireless connection and you can also borrow a computer in the office if you didn't bring one. We will certainly return to this great find!",
            "title": "Great Experience at The Brentwood",
            "user": "Longingfortravel"
        },
        {
            "date": "June 18, 2007",
            "detail_rating": {
                "business": 4.0,
                "cleanliness": 5.0,
                "desk": null,
                "front_desk": 5.0,
                "location": 5.0,
                "pool": null,
                "restaurant": null,
                "rooms": 5.0,
                "service": 5.0,
                "sleep": null,
                "value": 5.0
            },
            "helpfulness": 2,
            "id": 7872800,
            "likes": {
                "disliked": null,
                "liked": null
            },
            "rating": 5.0,
            "stay_parameters": "Stayed June 2007, traveled with family",
            "text": "The staff could not have been more accommodating. A small, renovated property in a quiet part of the Brentwood/UCLA area of Los Angeles. The amenities in the room were perfect for my long weekend stay, including a plasma TV! Santa Monica, Venice and Malibu are but a short drive away. I have absolutely no hesitation in recommending The Brentwood Inn to anyone needing lodging in this part of LA county.",
            "title": "Under the radar...but fabulous!",
            "user": "auntkid"
        },
        {
            "date": "June 2, 2007",
            "detail_rating": {
                "business": 3.0,
                "cleanliness": 5.0,
                "desk": null,
                "front_desk": 5.0,
                "location": 4.0,
                "pool": null,
                "restaurant": null,
                "rooms": 4.0,
                "service": 5.0,
                "sleep": null,
                "value": 4.0
            },
            "helpfulness": 1,
            "id": 7740261,
            "likes": {
                "disliked": "\u2014 No pool! :-(",
                "liked": "\u2014 Location, cleanliness, helpfulness of staff"
            },
            "rating": 4.0,
            "stay_parameters": "Stayed June 2007, traveled as a couple",
            "text": "My husband and I stayed at the Brentwood from the 15th May till 20th May. We had a great stay. The Brentwood Inn is situated in a wealthy area of Los Angeles where many stars have their homes. Unfortunately we didn't spot any! We felt safe in the area and were able to walk around at any time of day. The Inn is about a 15 minute walk to the centre of Brentwood where there are shops and restaurants including the Cheesecake Factory. The Brentwood Inn is conviently located to visit the main tourist attractions in LA and is also only a 10 minute drive to Santa Monica.",
            "title": "Great Brentwood",
            "user": "Vic"
        },
        {
            "date": "February 17, 2007",
            "detail_rating": {
                "business": 5.0,
                "cleanliness": 5.0,
                "desk": null,
                "front_desk": 5.0,
                "location": 5.0,
                "pool": null,
                "restaurant": null,
                "rooms": 5.0,
                "service": 5.0,
                "sleep": null,
                "value": 5.0
            },
            "helpfulness": 5,
            "id": 6805728,
            "likes": {
                "disliked": null,
                "liked": "\u2014 friendliness and location"
            },
            "rating": 5.0,
            "stay_parameters": "Stayed February 2007, traveled on business",
            "text": "The Brentwood Inn is geared towards the business traveller. The rooms are small but immaculate and with a very modern feel. The owners of the Inn are incredibly helpful and go out their way to answer questions and offer suggestions of things to do. There is a complimentary breakfast which consists of muffins and pastries, tea and coffee.",
            "title": "GREAT LITTLE GEM WITH HEART AND SOUL",
            "user": "tonitravels"
        },
        {
            "date": "January 31, 2007",
            "detail_rating": {
                "business": 5.0,
                "cleanliness": 5.0,
                "desk": null,
                "front_desk": 5.0,
                "location": 5.0,
                "pool": null,
                "restaurant": null,
                "rooms": 4.0,
                "service": 5.0,
                "sleep": null,
                "value": 5.0
            },
            "helpfulness": 4,
            "id": 6720107,
            "likes": {
                "disliked": null,
                "liked": "\u2014 Location, Value and a great staff."
            },
            "rating": 5.0,
            "stay_parameters": "Stayed January 2007, traveled solo",
            "text": "I recently had the pleasure of staying at the Brentwood for a month while consulting with a medical specialist in LA. The hotel was recommended by the Doctor who is located in Brentwood. This little gem of an inn is run by an intelligent, charming and entertaining young couple who live on site.",
            "title": "Great location. Terrific owners and staff!",
            "user": "GaryDelaware"
        },
        {
            "date": "December 12, 2006",
            "detail_rating": {
                "business": null,
                "cleanliness": null,
                "desk": null,
                "location": null,
                "pool": null,
                "restaurant": null,
                "rooms": null,
                "service": null,
                "sleep": null,
                "value": null
            },
            "helpfulness": 8,
            "id": 6433518,
            "likes": {
                "disliked": null,
                "liked": null
            },
            "rating": 4.0,
            "stay_parameters": null,
            "text": "The Inn is a true reflection of it's loving owners. The owners have instilled their values of unending graciousness to the small staff, and there is not an unfriendly face on the premises.",
            "title": "Overpriced but otherwise ideal",
            "user": "DougP"
        },
        {
            "date": "September 24, 2007",
            "detail_rating": {
                "business": 4.0,
                "cleanliness": 4.0,
                "desk": null,
                "front_desk": 5.0,
                "location": 4.0,
                "pool": null,
                "restaurant": null,
                "rooms": 4.0,
                "service": 5.0,
                "sleep": null,
                "value": 4.0
            },
            "helpfulness": 2,
            "id": 10000245,
            "likes": {
                "disliked": "\u2014 Rooms were on the small side",
                "liked": "\u2014 Kind staff, complimentary breakfast/tea time, location"
            },
            "rating": 5.0,
            "stay_parameters": "Stayed September 2007, traveled as a couple",
            "text": "My husband and I spent three nights at the Brentwood Inn recently while we were in town for a wedding. We were looking for a reasonably priced hotel, and a family member recommended the Brentwood. We were thrilled with the hotel's location (minutes from Santa Monica and a beautiful drive up highway 1 to Malibu), clean (though slighly small) rooms, and a fantastically helpful and welcoming staff. We highly recommend it, and will certainly be back ourselves!",
            "title": "Great hotel, Excellent Staff",
            "user": "blanche_d"
        },
        {
            "date": "August 21, 2007",
            "detail_rating": {
                "business": 4.0,
                "cleanliness": 4.0,
                "desk": null,
                "front_desk": 3.0,
                "location": 4.0,
                "pool": null,
                "restaurant": null,
                "rooms": 2.0,
                "service": 3.0,
                "sleep": null,
                "value": 3.0
            },
            "helpfulness": 7,
            "id": 8462400,
            "likes": {
                "disliked": null,
                "liked": null
            },
            "rating": 2.0,
            "stay_parameters": "Stayed August 2007, traveled with family",
            "text": "Pros:",
            "title": "Decent Stay but Overpriced for a Cute Little Motor Inn",
            "user": "Siempre_Italia"
        },
        {
            "date": "August 11, 2007",
            "detail_rating": {
                "business": null,
                "cleanliness": null,
                "desk": null,
                "location": null,
                "pool": null,
                "restaurant": null,
                "rooms": null,
                "service": null,
                "sleep": null,
                "value": null
            },
            "helpfulness": 1,
            "id": 8395385,
            "likes": {
                "disliked": null,
                "liked": null
            },
            "rating": 5.0,
            "stay_parameters": null,
            "text": "- Good location in West LA/Brentwood",
            "title": "Wonderful Stay!",
            "user": "nanosmom"
        },
        {
            "date": "July 3, 2007",
            "detail_rating": {
                "business": 5.0,
                "cleanliness": 5.0,
                "desk": null,
                "front_desk": 5.0,
                "location": 5.0,
                "pool": null,
                "restaurant": null,
                "rooms": 4.0,
                "service": 5.0,
                "sleep": null,
                "value": 5.0
            },
            "helpfulness": 1,
            "id": 8051492,
            "likes": {
                "disliked": "\u2014 No pool.",
                "liked": "\u2014 The staff!"
            },
            "rating": 5.0,
            "stay_parameters": "Stayed June 2007, traveled as a couple",
            "text": "- Rooms are very clean and the bedroom area is decorated in a soothing minimalist way",
            "title": "The Brentwood Inn: A welcome respite.",
            "user": "sophiejay"
        },
        {
            "date": "September 27, 2007",
            "detail_rating": {
                "business": null,
                "cleanliness": null,
                "desk": null,
                "location": null,
                "pool": null,
                "restaurant": null,
                "rooms": null,
                "service": null,
                "sleep": null,
                "value": null
            },
            "helpfulness": 2,
            "id": 10012722,
            "likes": {
                "disliked": null,
                "liked": null
            },
            "rating": 1.0,
            "stay_parameters": null,
            "text": "We were supposed to stay at the Brentwood Inn on September 23, but my fiance got sick and we had to cancel. The Brentwood Inn would not give us a refund or even let us apply our payment to another night. That cost us more than $200! Be prepared to lose your full payment if you get sick on a Sunday and you don't have a doctor's note to \"prove\" it.",
            "title": "Can't get your money back if you cancel",
            "user": "JEC2"
        }
    ],
    "slim_ranking": 0.025641025641,
    "stars": 2,
    "tripadvisor": {
        "VISITED": false,
        "country_name": null,
        "locality": null,
        "pic_link": null,
        "street_address": null
    },
    "user_rating": 4.5,
    "variance": {
        "average": 7,
        "excellent": 161,
        "poor": 4,
        "terrible": 6,
        "very good": 75
    }
}