{
    "aka": "Hilton Garden Inn Indianapolis Northwest Hotel Indianapolis",
    "description": "Enjoy a refreshing and successful stay at the Hilton Garden Inn Indianapolis Northwest hotel with a selection of comforting and convenient amenities and services. Unwind on a comfortable king or queen size bed and view a movie or select from a choice of premium TV channels on a 32-inch flat screen TV. Catch up with work at the desk and stay connected with family and business with complimentary high-speed internet access, available in every guest room of our hotel in northwest Indianapolis.",
    "detail_rating": {
        "cleanliness": null,
        "location": null,
        "rooms": null,
        "service": null,
        "sleep": null,
        "value": null
    },
    "location": {
        "city": "Indianapolis",
        "continent": null,
        "country": "United States",
        "proposed_city": "Indianapolis",
        "province": null,
        "region": null
    },
    "name": "Hilton Garden Inn Indianapolis Northwest",
    "places": {
        "aka": [
            "Indianapolis"
        ],
        "hotel_description": [
            "Indianapolis"
        ],
        "hotel_name": [
            "Indianapolis"
        ]
    },
    "review_count": 111,
    "review_count_current": 21,
    "reviews": [
        {
            "date": "June 14, 2012",
            "detail_rating": {
                "business": null,
                "cleanliness": 2.0,
                "desk": null,
                "location": 3.0,
                "pool": null,
                "restaurant": null,
                "rooms": 2.0,
                "service": 3.0,
                "sleep": 1.0,
                "value": 3.0
            },
            "helpfulness": null,
            "id": 131981105,
            "likes": {
                "disliked": null,
                "liked": null
            },
            "rating": 2.0,
            "stay_parameters": "Stayed June 2012, traveled on business",
            "text": "For a couple of years this was one of my go-to hotels in the Indianapolis area. My most recent trip involved ants in the room. I know ants are found everywhere. I've even had them in my home but I won't be able to get over it in the hotel room. I woke up at midnight and reached for my phone to check the time and ant were crawling all over it. I noticed that they were all over the nightstand. Immediately, I called down to the front desk. They were able to move me to a different room right away.",
            "title": "Won't be staying here again",
            "user": "LizzChicago"
        },
        {
            "date": "May 5, 2012",
            "detail_rating": {
                "business": null,
                "cleanliness": 5.0,
                "desk": null,
                "location": 5.0,
                "pool": null,
                "restaurant": null,
                "rooms": 5.0,
                "service": 5.0,
                "sleep": 5.0,
                "value": 5.0
            },
            "helpfulness": null,
            "id": 129401556,
            "likes": {
                "disliked": null,
                "liked": null
            },
            "rating": 5.0,
            "stay_parameters": "Stayed May 2012, traveled with family",
            "text": "I've hesitated to write this review because over the years I've had good experiences here however, I know I would want to hear about this if I was considering a stay here. There are worse bugs to have in a room but I'm still checking my suitcase for stow-a-ways from the trip.",
            "title": "Reliable base in Indy",
            "user": "jpzeller"
        },
        {
            "date": "April 19, 2012",
            "detail_rating": {
                "business": null,
                "cleanliness": 5.0,
                "desk": null,
                "location": 4.0,
                "pool": null,
                "restaurant": null,
                "rooms": 4.0,
                "service": 4.0,
                "sleep": 5.0,
                "value": 4.0
            },
            "helpfulness": 1,
            "id": 128170626,
            "likes": {
                "disliked": null,
                "liked": null
            },
            "rating": 5.0,
            "stay_parameters": "Stayed August 2011, traveled solo",
            "text": "Our daughter is a student at Butler University, and this is our mainstay hotel when visiting. Very conveniently located off I-65 and accessible to the north side of Indianapolis, this hotel never fails us. Typical HGI rooms and amenities, and with an exceptionally friendly and accommodating staff. Ample parking, and a Starbucks just across the road. Didn't enjoy the breakfast offerings at the hotel, however, but there is a full-service restaurant and a bar in the lobby.",
            "title": "Newer hotel, very quiet and comfortable",
            "user": "Mmmidwesterner"
        },
        {
            "date": "April 17, 2012",
            "detail_rating": {
                "business": null,
                "cleanliness": 4.0,
                "desk": null,
                "location": 5.0,
                "pool": null,
                "restaurant": null,
                "rooms": 5.0,
                "service": 5.0,
                "sleep": 5.0,
                "value": 5.0
            },
            "helpfulness": null,
            "id": 128076623,
            "likes": {
                "disliked": null,
                "liked": null
            },
            "rating": 5.0,
            "stay_parameters": "Stayed April 2012, traveled on business",
            "text": "Normally I stay at the Embassy Suites but this hotel is closer to my family's home in Indy. It's basically adjacent to an office park, and there isn't much to do nearby, but it is a newer hotel, very quiet, no highway noise, and has a great exercise room.",
            "title": "Great staff, comfortable beds, & ample parking!",
            "user": "365travelNYC"
        },
        {
            "date": "March 30, 2012",
            "detail_rating": {
                "business": null,
                "cleanliness": 4.0,
                "desk": null,
                "location": 4.0,
                "pool": null,
                "restaurant": null,
                "rooms": 4.0,
                "service": 4.0,
                "sleep": 4.0,
                "value": 4.0
            },
            "helpfulness": null,
            "id": 126983069,
            "likes": {
                "disliked": null,
                "liked": null
            },
            "rating": 4.0,
            "stay_parameters": "Stayed March 2012, traveled on business",
            "text": "The staff is also friendly, and if you have time for a drink, you can relax in the very pretty lobby area or even sit on a little terrace.",
            "title": "Shiney and new",
            "user": "Hammy59"
        },
        {
            "date": "October 15, 2010",
            "detail_rating": {
                "business": null,
                "cleanliness": 5.0,
                "desk": null,
                "location": 5.0,
                "pool": null,
                "restaurant": null,
                "rooms": null,
                "service": 5.0,
                "sleep": null,
                "value": 5.0
            },
            "helpfulness": null,
            "id": 83642810,
            "likes": {
                "disliked": null,
                "liked": null
            },
            "rating": 5.0,
            "stay_parameters": "Stayed October 2010, traveled on business",
            "text": "I hosted a dinner at this hotel this week that we so delicious and perfect - I had to write my first ever review. My guests raved about the menu, the food, the decorations, the service and the ambiance of the hotel. The hotel is beautifully decorated. Our banquet room looked out over a nice patio with outdoor couches and a fire pit. I would highly recommend this hotel for a wonderful banquet dinner.",
            "title": "What a great dinner",
            "user": "indyconnie"
        },
        {
            "date": "October 13, 2010",
            "detail_rating": {
                "business": null,
                "cleanliness": null,
                "desk": null,
                "location": null,
                "pool": null,
                "restaurant": null,
                "rooms": null,
                "service": null,
                "sleep": null,
                "value": null
            },
            "helpfulness": 1,
            "id": 83403447,
            "likes": {
                "disliked": null,
                "liked": null
            },
            "rating": 4.0,
            "stay_parameters": null,
            "text": "Hotel seemed very new. Good fitness room and pool. Very clean. Front desk staff were very friendly and helpful. Wi-Fi worked great. The ideal hotel for business.",
            "title": "Great hotel for business traveler.",
            "user": "StLouie987"
        },
        {
            "date": "September 27, 2010",
            "detail_rating": {
                "business": null,
                "cleanliness": 3.0,
                "desk": null,
                "location": 3.0,
                "pool": null,
                "restaurant": null,
                "rooms": 3.0,
                "service": 3.0,
                "sleep": 3.0,
                "value": 5.0
            },
            "helpfulness": null,
            "id": 81271246,
            "likes": {
                "disliked": null,
                "liked": null
            },
            "rating": 4.0,
            "stay_parameters": "Stayed September 2010, traveled with family",
            "text": "There were many hotels to choose from, so I chose this one because of the low price, the proximity to family and to try the Adjust.Sleep System Bed.",
            "title": "Adjust.Sleep System Beds!!!!",
            "user": "BLITZMA"
        },
        {
            "date": "July 25, 2010",
            "detail_rating": {
                "business": null,
                "cleanliness": 5.0,
                "desk": null,
                "location": 4.0,
                "pool": null,
                "restaurant": null,
                "rooms": 5.0,
                "service": 5.0,
                "sleep": 5.0,
                "value": 4.0
            },
            "helpfulness": null,
            "id": 72203182,
            "likes": {
                "disliked": null,
                "liked": null
            },
            "rating": 5.0,
            "stay_parameters": "Stayed July 2010, traveled with family",
            "text": "All in all the hotel was fine.",
            "title": "very nice hotel",
            "user": "bjpremierontheroad"
        },
        {
            "date": "June 5, 2010",
            "detail_rating": {
                "business": null,
                "cleanliness": 5.0,
                "desk": null,
                "location": 4.0,
                "pool": null,
                "restaurant": null,
                "rooms": 5.0,
                "service": 5.0,
                "sleep": 5.0,
                "value": null
            },
            "helpfulness": null,
            "id": 66555650,
            "likes": {
                "disliked": null,
                "liked": null
            },
            "rating": 5.0,
            "stay_parameters": "Stayed June 2010, traveled with friends",
            "text": "PLUSES: free Wi-Fi, easy parking, gym, pool, business center",
            "title": "Very nice hotel",
            "user": "dnrdavies"
        },
        {
            "date": "May 3, 2010",
            "detail_rating": {
                "business": null,
                "cleanliness": 4.0,
                "desk": null,
                "location": 3.0,
                "pool": null,
                "restaurant": null,
                "rooms": 4.0,
                "service": 4.0,
                "sleep": 5.0,
                "value": 5.0
            },
            "helpfulness": 1,
            "id": 63156195,
            "likes": {
                "disliked": null,
                "liked": null
            },
            "rating": 4.0,
            "stay_parameters": "Stayed April 2010, traveled on business",
            "text": "I hadn't stayed at an HGI in a while. I was driving in from Chicago late at night and wanted a place just outside the city limited along 65. I arrived about 10:45pm and the parking lot was well lit which is important to me as a solo female traveler. The staff greeted me right away and offered me some bottled water. My room was very clean and had everything I needed. The bed was the pleasant surprise. It is one of those that has a dial to control the firmness. I slept so well that night. Usually I wake up a few times but I didn't once. The breakfast was excellent and the staff in the restaurant was very friendly. This may be my new go-to hotel for late night drives into Indy.",
            "title": "Love the Beds at this HGI",
            "user": "LizzChicago"
        },
        {
            "date": "July 2, 2011",
            "detail_rating": {
                "business": null,
                "cleanliness": 4.0,
                "desk": null,
                "location": null,
                "pool": null,
                "restaurant": null,
                "rooms": null,
                "service": 5.0,
                "sleep": 5.0,
                "value": 4.0
            },
            "helpfulness": null,
            "id": 114964883,
            "likes": {
                "disliked": null,
                "liked": null
            },
            "rating": 4.0,
            "stay_parameters": "Stayed June 2011, traveled on business",
            "text": "The hotel seemed very new. The rooms were spacious and had very nice furnishings. The beds were very comfortable and the bathroom was good sized. The bartender was very personable and fun to chat with. The food is very good. My only complaint is the housekeeping. My floor was not vacuumed at least one of the days. The night stands were not wiped down. The sheets were not changed even though I left the card on the bed. If the housekeeping had been up to par, I would have given a 5 star rating.",
            "title": "Very Comfortable and Nice Hotel",
            "user": "Lesley L"
        },
        {
            "date": "June 17, 2011",
            "detail_rating": {
                "business": null,
                "cleanliness": 4.0,
                "desk": null,
                "location": null,
                "pool": null,
                "restaurant": null,
                "rooms": null,
                "service": 1.0,
                "sleep": 3.0,
                "value": 3.0
            },
            "helpfulness": 1,
            "id": 114112940,
            "likes": {
                "disliked": null,
                "liked": null
            },
            "rating": 1.0,
            "stay_parameters": "Stayed June 2011, traveled on business",
            "text": "The HGI is a pretty nice hotel - decent breakfast, clean and comfortable. I was all set to give them 3 or 4 stars right up until I came back from work last night to find that the maid had left my door propped open with the security bar! There was nothing of value in the room and nothing was missing but it easily could have been. Fortunately the room was at the end of the hall so not much foot traffic would have seen it open.",
            "title": "Room left unlocked by housekeeping!",
            "user": "NapaWineLover"
        },
        {
            "date": "March 15, 2011",
            "detail_rating": {
                "business": null,
                "cleanliness": 5.0,
                "desk": null,
                "location": 5.0,
                "pool": null,
                "restaurant": null,
                "rooms": 5.0,
                "service": 5.0,
                "sleep": null,
                "value": 5.0
            },
            "helpfulness": 1,
            "id": 100327656,
            "likes": {
                "disliked": null,
                "liked": null
            },
            "rating": 5.0,
            "stay_parameters": "Stayed March 2011",
            "text": "I called the desk to complain and they told me they would \"get back to me\" - nobody did so I complained again this morning and was given a free breakfast coupon for my trouble.",
            "title": "A great stay close to Indy downtown without the price!",
            "user": "MSUmindy"
        },
        {
            "date": "January 7, 2011",
            "detail_rating": {
                "business": null,
                "cleanliness": 5.0,
                "desk": null,
                "location": 3.0,
                "pool": null,
                "restaurant": null,
                "rooms": 3.0,
                "service": 5.0,
                "sleep": 2.0,
                "value": 3.0
            },
            "helpfulness": null,
            "id": 92078664,
            "likes": {
                "disliked": null,
                "liked": null
            },
            "rating": 3.0,
            "stay_parameters": "Stayed December 2010, traveled solo",
            "text": "I'm not very picky when it comes to hotels but I definitely expect my door to be kept locked!",
            "title": "Nice, new hotel but walls are paper thin",
            "user": "Neilbond007"
        },
        {
            "date": "October 25, 2010",
            "detail_rating": {
                "business": null,
                "cleanliness": 5.0,
                "desk": null,
                "location": 3.0,
                "pool": null,
                "restaurant": null,
                "rooms": 5.0,
                "service": 4.0,
                "sleep": 3.0,
                "value": 3.0
            },
            "helpfulness": null,
            "id": 84829999,
            "likes": {
                "disliked": null,
                "liked": null
            },
            "rating": 4.0,
            "stay_parameters": "Stayed October 2010, traveled on business",
            "text": "This is an almost new property. Very quiet, yet close to highways. Spacious, immaculate rooms, full amenities, great staff. Drive 15 minutes and you are downtown.",
            "title": "Great Hotel, Excellent Staff",
            "user": "Keeblerelf928"
        },
        {
            "date": "February 9, 2012",
            "detail_rating": {
                "business": null,
                "cleanliness": 4.0,
                "desk": null,
                "location": 3.0,
                "pool": null,
                "restaurant": null,
                "rooms": 3.0,
                "service": 5.0,
                "sleep": 4.0,
                "value": 3.0
            },
            "helpfulness": 1,
            "id": 124351917,
            "likes": {
                "disliked": null,
                "liked": null
            },
            "rating": 4.0,
            "stay_parameters": "Stayed February 2012, traveled with family",
            "text": "We stayed at this hotel for 3 nights during Super Bowl weekend. Although the rate was more than three times what it would normally be, the hotel was not out of line with what other places were charging. The staff was extremely friendly and accommodating. The sales manager Dennis was very helpful and welcoming as well. Although a taxi was 40$ into downtown, the hotel staff always helped with calling a car and securing it. The rooms were average in size but very clean. Beds were super comfortable and the entire hotel was spotless. Complimentary full breakfast in the morning was very well done.",
            "title": "Super Bowl Trip",
            "user": "pickymomboston"
        },
        {
            "date": "October 3, 2011",
            "detail_rating": {
                "business": null,
                "cleanliness": 4.0,
                "desk": null,
                "location": 4.0,
                "pool": null,
                "restaurant": null,
                "rooms": 4.0,
                "service": 4.0,
                "sleep": 4.0,
                "value": 4.0
            },
            "helpfulness": 1,
            "id": 118911294,
            "likes": {
                "disliked": null,
                "liked": null
            },
            "rating": 4.0,
            "stay_parameters": "Stayed October 2011, traveled as a couple",
            "text": "my wife and I stayed here after taking in the IU football game in Bloomington--we're from Chicago and didn't feel like driving back up that night. Property is definitely newer, right off 465, nice lobby, tons of parking, Fountain at the main entrance was a nice touch too. Staff was very friendly. Room was good sized, flat screen TV, had a king and mattress and comforter/pillows were excellent. Fridge in room too along with microwave. Got to the pool and it was heated. Hot tub was great. Suburban hotel so pool was nice sized as was the adjacent gym--all super clean. Precor equipment in the gym so definitely nice. Didn't try the bar but did do room service. Fast, person was friendly and food was reasonably priced.",
            "title": "Great hotel!",
            "user": "Sailguy"
        },
        {
            "date": "August 20, 2011",
            "detail_rating": {
                "business": null,
                "cleanliness": 5.0,
                "desk": null,
                "location": null,
                "pool": null,
                "restaurant": null,
                "rooms": null,
                "service": 5.0,
                "sleep": 4.0,
                "value": 4.0
            },
            "helpfulness": 1,
            "id": 117010503,
            "likes": {
                "disliked": null,
                "liked": null
            },
            "rating": 4.0,
            "stay_parameters": "Stayed August 2011, traveled on business",
            "text": "Location looks like it has recently been updated. Has a slightly contemporary ambiance both in the lobby and the rooms. Plenty of parking, easy access to the highway and the staff was very friendly. I would certainly stay at this location again.",
            "title": "Nicely Updated",
            "user": "MocNJen"
        },
        {
            "date": "August 8, 2011",
            "detail_rating": {
                "business": null,
                "cleanliness": 5.0,
                "desk": null,
                "location": null,
                "pool": null,
                "restaurant": null,
                "rooms": null,
                "service": 4.0,
                "sleep": 5.0,
                "value": 4.0
            },
            "helpfulness": 1,
            "id": 116447524,
            "likes": {
                "disliked": null,
                "liked": null
            },
            "rating": 4.0,
            "stay_parameters": "Stayed August 2011, traveled as a couple",
            "text": "I booked this hotel because I was unable to book a Hilton in downtown (or any other hotel, for that matter). We only planned our trip a couple of months in advance as this was a mini weekend getaway (there was also a gaming convention downtown, which probably contributed to limited availability).",
            "title": "Nice Hotel in New Development",
            "user": "aneudec"
        },
        {
            "date": "July 15, 2011",
            "detail_rating": {
                "business": null,
                "cleanliness": 4.0,
                "desk": null,
                "location": null,
                "pool": null,
                "restaurant": null,
                "rooms": null,
                "service": 4.0,
                "sleep": 4.0,
                "value": 4.0
            },
            "helpfulness": 1,
            "id": 115396326,
            "likes": {
                "disliked": null,
                "liked": null
            },
            "rating": 4.0,
            "stay_parameters": "Stayed June 2011, traveled on business",
            "text": "The hotel overall was very nice. We booked during the \"great getaway\" promotion, which was a good deal. The room was clean, the staff was friendly, and we had an overall good experience. The only drawback was the location. The good news is it only takes about 15 minutes to get to downtown. The bad news is....it takes fifteen minutes to get downtown. Because most of the activities we had planned were mostly downtown, this was slightly inconvenient. However, it's in a nice area (I'm assuming a new development) near the interstate and there is also a small strip mall nearby.",
            "title": "Very Nice Hotel - Would stay here again",
            "user": "CORedTraveler"
        }
    ],
    "slim_ranking": 0.126373626374,
    "stars": 3,
    "tripadvisor": {
        "VISITED": false,
        "country_name": null,
        "locality": null,
        "pic_link": null,
        "street_address": null
    },
    "user_rating": 4.5,
    "variance": {
        "average": 10,
        "excellent": 59,
        "poor": 5,
        "terrible": 3,
        "very good": 34
    }
}