{
    "aka": "q Signature Samui Beach Hotel",
    "description": null,
    "detail_rating": {
        "cleanliness": 4.0,
        "location": 4.0,
        "rooms": 3.5,
        "service": 4.0,
        "sleep": 4.0,
        "value": 4.0
    },
    "location": {
        "city": null,
        "continent": "Asia",
        "country": "Thailand",
        "proposed_city": null,
        "province": null,
        "region": null
    },
    "name": "Q Signature Samui Beach Resort",
    "places": {
        "aka": [],
        "hotel_description": [],
        "hotel_name": []
    },
    "review_count": 457,
    "review_count_current": 2,
    "reviews": [
        {
            "date": "May 20, 2009",
            "detail_rating": {
                "business": null,
                "cleanliness": 5.0,
                "desk": null,
                "location": 4.0,
                "pool": null,
                "restaurant": null,
                "rooms": 5.0,
                "service": 4.0,
                "sleep": null,
                "value": 4.0
            },
            "helpfulness": 1,
            "id": 30388770,
            "likes": {
                "disliked": null,
                "liked": null
            },
            "rating": 4.0,
            "stay_parameters": "Stayed April 2009, traveled as a couple",
            "text": "Lovely grounds, nice clean room and very comfy bed. Breakfast was included and was very good, lots of choice !",
            "title": "Beautiful boutique hotel",
            "user": "goldma"
        },
        {
            "date": "May 13, 2009",
            "detail_rating": {
                "business": null,
                "cleanliness": 5.0,
                "desk": null,
                "location": 4.0,
                "pool": null,
                "restaurant": null,
                "rooms": 4.0,
                "service": 5.0,
                "sleep": null,
                "value": 5.0
            },
            "helpfulness": 7,
            "id": 29914958,
            "likes": {
                "disliked": null,
                "liked": null
            },
            "rating": 5.0,
            "stay_parameters": "Stayed April 2009",
            "text": "Enjoyed my stay at the top of resort, with the beautiful views and the more private swimming pools.",
            "title": "A great place to stay",
            "user": "Christl77"
        }
    ],
    "slim_ranking": 0.6,
    "stars": null,
    "tripadvisor": {
        "VISITED": false,
        "country_name": null,
        "locality": null,
        "pic_link": null,
        "street_address": null
    },
    "user_rating": 4.0,
    "variance": {
        "average": 71,
        "excellent": 149,
        "poor": 37,
        "terrible": 37,
        "very good": 163
    }
}