{
    "aka": "Westin Chicago Northwest Hotel",
    "description": "An O'Hare perimeter hotel, The Westin Chicago Northwest is located just 12 miles from O'Hare International Airport and 27 miles from downtown Chicago. 50,000 square feet of meeting and event space.",
    "detail_rating": {
        "cleanliness": 4.0,
        "location": 3.5,
        "rooms": 4.0,
        "service": 4.0,
        "sleep": 4.0,
        "value": 4.0
    },
    "location": {
        "city": null,
        "continent": null,
        "country": null,
        "proposed_city": "Chicago",
        "province": null,
        "region": null
    },
    "name": "Westin Chicago Northwest",
    "places": {
        "aka": [
            "Chicago"
        ],
        "hotel_description": [
            "Chicago"
        ],
        "hotel_name": [
            "Chicago"
        ]
    },
    "review_count": 221,
    "review_count_current": 20,
    "reviews": [
        {
            "date": "October 18, 2006",
            "detail_rating": {
                "business": null,
                "cleanliness": null,
                "desk": null,
                "location": null,
                "pool": null,
                "restaurant": null,
                "rooms": null,
                "service": null,
                "sleep": null,
                "value": null
            },
            "helpfulness": null,
            "id": 5967769,
            "likes": {
                "disliked": null,
                "liked": null
            },
            "rating": 2.0,
            "stay_parameters": null,
            "text": "I booked this hotel for 6 nights for a vacation. If I hadn't prepaid, I would have left after the first night. There was major construction going on in the hotel, which they didn't tell us about when booking. The construction started at between 6-7:00 a.m. each day and lasted all day with pounding, sawing, etc. going constantly. Not a pleasant way to wake up or spend your day.",
            "title": "Very poor service at this hotel, beautiful lobby, tired & worn out rooms",
            "user": "Dcruiser"
        },
        {
            "date": "March 27, 2006",
            "detail_rating": {
                "business": null,
                "cleanliness": null,
                "desk": null,
                "location": null,
                "pool": null,
                "restaurant": null,
                "rooms": null,
                "service": null,
                "sleep": null,
                "value": null
            },
            "helpfulness": null,
            "id": 4737750,
            "likes": {
                "disliked": null,
                "liked": null
            },
            "rating": 3.0,
            "stay_parameters": null,
            "text": "The last night we received a letter stating our water would be turned off due to construction at 8:30 the next morning & may need access to our room for construction. Check out time is 12:00, so this did not make me happy at all. Upon checking with the front desk I was told they couldn't do anything about it, couldn't move us to another room, and would not credit our bill, even though we would basically have to get up and shower & check out early. That's fine for business, but not what I wanted to do on my vacation. The best they could do was give us free breakfast in the morning, which was nice, but not adequate compensation in my opinion for the noise and inconvenience for 6 nights.",
            "title": "Not Bad Overall",
            "user": "Riversider Raymond"
        },
        {
            "date": "December 6, 2005",
            "detail_rating": {
                "business": null,
                "cleanliness": null,
                "desk": null,
                "location": null,
                "pool": null,
                "restaurant": null,
                "rooms": null,
                "service": null,
                "sleep": null,
                "value": null
            },
            "helpfulness": null,
            "id": 4210348,
            "likes": {
                "disliked": null,
                "liked": null
            },
            "rating": 5.0,
            "stay_parameters": null,
            "text": "On one hand it is good they are remodeling the hotel. The rooms I've seen needed it badly. There was grout falling off the tub, the carpet was stained, the decor very dated, and the mattresses and bedding were horrible. The mattress was bad enough that we went to a local store after the first night and bought a mattress pad to put on top of it, even though that meant we had to cart the pad home after our vacation.",
            "title": "Love the bartenders",
            "user": "A TripAdvisor user"
        },
        {
            "date": "November 14, 2005",
            "detail_rating": {
                "business": null,
                "cleanliness": null,
                "desk": null,
                "location": null,
                "pool": null,
                "restaurant": null,
                "rooms": null,
                "service": null,
                "sleep": null,
                "value": null
            },
            "helpfulness": null,
            "id": 4110966,
            "likes": {
                "disliked": null,
                "liked": null
            },
            "rating": 4.0,
            "stay_parameters": null,
            "text": "This hotel will probably be very nice once the remodeling was done, but my advice is to avoid this place like the plague for the near future, unless you like sleeping in a work zone.",
            "title": "Good hotel",
            "user": "1pickymommy"
        },
        {
            "date": "March 19, 2005",
            "detail_rating": {
                "business": null,
                "cleanliness": null,
                "desk": null,
                "location": null,
                "pool": null,
                "restaurant": null,
                "rooms": null,
                "service": null,
                "sleep": null,
                "value": null
            },
            "helpfulness": null,
            "id": 3287518,
            "likes": {
                "disliked": null,
                "liked": null
            },
            "rating": 2.0,
            "stay_parameters": null,
            "text": "I reserved a King room, but was assigned two small double beds (why is this SO common?). Upon calling the desk, I was told, unapologetically, that they were overbooked by 11 rooms (my problem?). Bedding is of the old \"bedspread\" variety, not the up-to-date duvet style. The carpet in my room had what appeared to be bleach spots all over it - very unappealing. The atrium design may look impressive, but when there's a boisterous group at the bar until 1:00am (as there was while I was there), the noise reverberates throughout, making it difficult to fall asleep. Bring earplugs. The immediate area is primarily office buildings. No services or restaurants within walking distance. Short drive to many restaurants, though. The gym in the building charges $8 to work out, and it closes far too early (9:00pm). The hotel does not have its own exercise room. Room service food was impressive - best I've had in a long time.",
            "title": "Elegant, But Don't Depend on Staff or Shuttle",
            "user": "A TripAdvisor user"
        },
        {
            "date": "June 5, 2007",
            "detail_rating": {
                "business": null,
                "cleanliness": null,
                "desk": null,
                "location": null,
                "pool": null,
                "restaurant": null,
                "rooms": null,
                "service": null,
                "sleep": null,
                "value": null
            },
            "helpfulness": null,
            "id": 7780602,
            "likes": {
                "disliked": null,
                "liked": null
            },
            "rating": 5.0,
            "stay_parameters": null,
            "text": "Great hotel, and staff. This is a must see in the burbs. Hotel very modern, and the best staff in Chicago. Great deal, and outstanding value. Priced right!!!!!!!",
            "title": "Amazzzzzzzzing",
            "user": "squared237"
        },
        {
            "date": "May 3, 2007",
            "detail_rating": {
                "business": null,
                "cleanliness": null,
                "desk": null,
                "location": null,
                "pool": null,
                "restaurant": null,
                "rooms": null,
                "service": null,
                "sleep": null,
                "value": null
            },
            "helpfulness": null,
            "id": 7544115,
            "likes": {
                "disliked": null,
                "liked": null
            },
            "rating": 5.0,
            "stay_parameters": null,
            "text": "The lobby bar was an exciting place to meet with a extensive wine list, available by the glass.",
            "title": "\"Heavenly\"",
            "user": "squared237"
        },
        {
            "date": "April 28, 2007",
            "detail_rating": {
                "business": null,
                "cleanliness": null,
                "desk": null,
                "location": null,
                "pool": null,
                "restaurant": null,
                "rooms": null,
                "service": null,
                "sleep": null,
                "value": null
            },
            "helpfulness": null,
            "id": 7479501,
            "likes": {
                "disliked": null,
                "liked": null
            },
            "rating": 5.0,
            "stay_parameters": null,
            "text": "Associates are all very excited about what they do. Close to O'hare and Wood field. Heavenly bed and shower a must for every home. I can not wait to return.",
            "title": "great for business",
            "user": "hk442"
        },
        {
            "date": "March 2, 2007",
            "detail_rating": {
                "business": null,
                "cleanliness": null,
                "desk": null,
                "location": null,
                "pool": null,
                "restaurant": null,
                "rooms": null,
                "service": null,
                "sleep": null,
                "value": null
            },
            "helpfulness": null,
            "id": 6900896,
            "likes": {
                "disliked": null,
                "liked": null
            },
            "rating": 5.0,
            "stay_parameters": null,
            "text": "I had the pleasure of staying at this property for the Illinois Assoc. for College Admission Counseling May 2-4, 2007. I had read earlier reviews that were unfavorable, but after hearing that the hotel was taken over by Westin and refurbished, I was excited.",
            "title": "Now this is LUXURY!",
            "user": "Drox"
        },
        {
            "date": "October 18, 2006",
            "detail_rating": {
                "business": null,
                "cleanliness": null,
                "desk": null,
                "location": null,
                "pool": null,
                "restaurant": null,
                "rooms": null,
                "service": null,
                "sleep": null,
                "value": null
            },
            "helpfulness": null,
            "id": 5968056,
            "likes": {
                "disliked": null,
                "liked": null
            },
            "rating": 1.0,
            "stay_parameters": null,
            "text": "I was not disappointed and the hotel exceeded my expectations... exceeded them so much that I will most likely choose this hotel when I am on business again in this area and leaving the hotel I usually have stayed at over the last 9 years!",
            "title": "Avoid this one like the plague!!!",
            "user": "D-fine"
        },
        {
            "date": "March 2, 2005",
            "detail_rating": {
                "business": null,
                "cleanliness": null,
                "desk": null,
                "location": null,
                "pool": null,
                "restaurant": null,
                "rooms": null,
                "service": null,
                "sleep": null,
                "value": null
            },
            "helpfulness": null,
            "id": 3240965,
            "likes": {
                "disliked": null,
                "liked": null
            },
            "rating": 4.0,
            "stay_parameters": null,
            "text": "This is a nice Wyndham in a suburb of Chicago (not to be confused with the Wyndham Chicago in downtown, which is a beautiful hotel). Check-in was nice. I paid only $37 through Priceline, so it was a great deal. By Request perks are not available with Priceline though.",
            "title": "Nice hotel, watch out for extras!",
            "user": "Christine C"
        },
        {
            "date": "November 9, 2004",
            "detail_rating": {
                "business": null,
                "cleanliness": null,
                "desk": null,
                "location": null,
                "pool": null,
                "restaurant": null,
                "rooms": null,
                "service": null,
                "sleep": null,
                "value": null
            },
            "helpfulness": null,
            "id": 2815515,
            "likes": {
                "disliked": null,
                "liked": null
            },
            "rating": 4.0,
            "stay_parameters": null,
            "text": "The room is large, nicely appointed, but not luxurious. Beds were nice, they pay a lot of attention to the linens they use, so the beds look nice as well. There's a good-sized work desk with a fancy Aeron chair and a sitting area with a couch. The bathroom was standard.",
            "title": "good value with web rate",
            "user": "Phil6184"
        },
        {
            "date": "March 1, 2004",
            "detail_rating": {
                "business": null,
                "cleanliness": null,
                "desk": null,
                "location": null,
                "pool": null,
                "restaurant": null,
                "rooms": null,
                "service": null,
                "sleep": null,
                "value": null
            },
            "helpfulness": null,
            "id": 1686709,
            "likes": {
                "disliked": null,
                "liked": null
            },
            "rating": 5.0,
            "stay_parameters": null,
            "text": "High-speed internet (wireless or wired) is $10 per calendar day, NOT per 24 hour period. This is annoying because if you check in at 6pm and pay $10 to use high speed internet, your connection will expire at midnight, and then you'll have to pay another $10 to continue using it. However, if you wait until 8pm, they'll give you that 4 hour period as a courtesy, and your $10 will give you until midnight the following night. Internet is free with By Request.",
            "title": "Wonderful Wyndham Weekend",
            "user": "A TripAdvisor user"
        },
        {
            "date": "November 9, 2003",
            "detail_rating": {
                "business": null,
                "cleanliness": null,
                "desk": null,
                "location": null,
                "pool": null,
                "restaurant": null,
                "rooms": null,
                "service": null,
                "sleep": null,
                "value": null
            },
            "helpfulness": null,
            "id": 1443258,
            "likes": {
                "disliked": null,
                "liked": null
            },
            "rating": 4.0,
            "stay_parameters": null,
            "text": "Also, there is a $8 fee to use the exercise facility because it's a privately owned gym. It's a decent gym with racquetball courts, weight machines, cardio machines.",
            "title": "Most Comfortable Bed Ever",
            "user": "RickyC"
        },
        {
            "date": "May 9, 2003",
            "detail_rating": {
                "business": null,
                "cleanliness": null,
                "desk": null,
                "location": null,
                "pool": null,
                "restaurant": null,
                "rooms": null,
                "service": null,
                "sleep": null,
                "value": null
            },
            "helpfulness": null,
            "id": 993296,
            "likes": {
                "disliked": null,
                "liked": null
            },
            "rating": 5.0,
            "stay_parameters": null,
            "text": "It is about 10 miles from the airport and probably 30 minutes from downtown, but if you have business in the area, it's a nice pick, especially if you get a good rate on Priceline.",
            "title": "Babquet dinner",
            "user": "A TripAdvisor user"
        },
        {
            "date": "October 30, 2007",
            "detail_rating": {
                "business": null,
                "cleanliness": null,
                "desk": null,
                "location": null,
                "pool": null,
                "restaurant": null,
                "rooms": null,
                "service": null,
                "sleep": null,
                "value": null
            },
            "helpfulness": null,
            "id": 10443465,
            "likes": {
                "disliked": null,
                "liked": null
            },
            "rating": 5.0,
            "stay_parameters": null,
            "text": "We had our wedding at the Westin on October 14 and have nothing but positive comments about this hotel.",
            "title": "Great hotel ... huge rooms",
            "user": "Karch72"
        },
        {
            "date": "August 22, 2007",
            "detail_rating": {
                "business": null,
                "cleanliness": null,
                "desk": null,
                "location": null,
                "pool": null,
                "restaurant": null,
                "rooms": null,
                "service": null,
                "sleep": null,
                "value": null
            },
            "helpfulness": null,
            "id": 8471678,
            "likes": {
                "disliked": null,
                "liked": null
            },
            "rating": 5.0,
            "stay_parameters": null,
            "text": "Everything went smoothly and the staff (from the banquet people to the front desk) were courteous, polite and accommodating every step of the way.",
            "title": "So Comfortable! Ahhhhhhh!!",
            "user": "lucylee123"
        },
        {
            "date": "August 14, 2007",
            "detail_rating": {
                "business": null,
                "cleanliness": null,
                "desk": null,
                "location": null,
                "pool": null,
                "restaurant": null,
                "rooms": null,
                "service": null,
                "sleep": null,
                "value": null
            },
            "helpfulness": null,
            "id": 8422079,
            "likes": {
                "disliked": null,
                "liked": null
            },
            "rating": 5.0,
            "stay_parameters": null,
            "text": "The rooms are modern and spacious, the beds are comfortable, and the property is very clean. The hotel changed hands from a Wyndham about six months ago and it's evident that it's a huge improvement.",
            "title": "Very nice hotel",
            "user": "BusterCT1K"
        },
        {
            "date": "July 20, 2007",
            "detail_rating": {
                "business": null,
                "cleanliness": null,
                "desk": null,
                "location": null,
                "pool": null,
                "restaurant": null,
                "rooms": null,
                "service": null,
                "sleep": null,
                "value": null
            },
            "helpfulness": null,
            "id": 8206566,
            "likes": {
                "disliked": null,
                "liked": null
            },
            "rating": 4.0,
            "stay_parameters": null,
            "text": "I highly recommend this hotel for a wedding, business trip or weekend getaway.",
            "title": "Awfully nice",
            "user": "New_Yooper"
        },
        {
            "date": "June 29, 2007",
            "detail_rating": {
                "business": null,
                "cleanliness": null,
                "desk": null,
                "location": null,
                "pool": null,
                "restaurant": null,
                "rooms": null,
                "service": null,
                "sleep": null,
                "value": null
            },
            "helpfulness": null,
            "id": 8025614,
            "likes": {
                "disliked": null,
                "liked": null
            },
            "rating": 3.0,
            "stay_parameters": null,
            "text": "I walked into the lobby and was instantly impressed. The check in on a Fri. evening took 2 min. Then right up the glassed elevators to my room on the 12th floor. The room is so relaxing! Nice big cushy bed, lots of pillows. Pretty asian art on the walls. Streamlined flat screen TV. Very modern decor. Also had internet and MP3 connections. View was of the interstate, but what was cool was right down the road is :O'Hare. So I stood at the window and ironed my clothes watching planes landing one after the other. Really entertaining...........I thought anyway.",
            "title": "Good hotel with large rooms, but can it really be called a Westin?",
            "user": "Sammyfloyd"
        }
    ],
    "slim_ranking": 0.666666666667,
    "stars": 4,
    "tripadvisor": {
        "VISITED": false,
        "country_name": null,
        "locality": null,
        "pic_link": null,
        "street_address": null
    },
    "user_rating": 3.5,
    "variance": {
        "average": 47,
        "excellent": 60,
        "poor": 22,
        "terrible": 20,
        "very good": 72
    }
}