{
    "aka": "Lindos Bay Hotel",
    "description": null,
    "detail_rating": {
        "cleanliness": null,
        "location": null,
        "rooms": null,
        "service": null,
        "sleep": null,
        "value": null
    },
    "location": {
        "city": null,
        "continent": "Europe",
        "country": "Greece",
        "proposed_city": "Bay",
        "province": null,
        "region": null
    },
    "name": "Sentido Lindos Bay Resort & Spa",
    "places": {
        "aka": [
            "Bay"
        ],
        "hotel_description": [],
        "hotel_name": [
            "Bay"
        ]
    },
    "review_count": 379,
    "review_count_current": 20,
    "reviews": [
        {
            "date": "July 30, 2009",
            "detail_rating": {
                "business": null,
                "cleanliness": 5.0,
                "desk": null,
                "location": 1.0,
                "pool": null,
                "restaurant": null,
                "rooms": 4.0,
                "service": 4.0,
                "sleep": null,
                "value": 3.0
            },
            "helpfulness": null,
            "id": 36246331,
            "likes": {
                "disliked": null,
                "liked": null
            },
            "rating": 4.0,
            "stay_parameters": "Stayed July 2009, traveled as a couple",
            "text": "just back from 7 nights on late deal, with wife.",
            "title": "A balanced view - decent quiet 4 star, not a great location & poor entertainment",
            "user": "paulriddiford"
        },
        {
            "date": "July 16, 2009",
            "detail_rating": {
                "business": null,
                "cleanliness": 5.0,
                "desk": null,
                "location": 5.0,
                "pool": null,
                "restaurant": null,
                "rooms": 5.0,
                "service": 5.0,
                "sleep": null,
                "value": 5.0
            },
            "helpfulness": 1,
            "id": 34933704,
            "likes": {
                "disliked": null,
                "liked": null
            },
            "rating": 5.0,
            "stay_parameters": "Stayed July 2009, traveled as a couple",
            "text": "This is a decent 4 star and no more.",
            "title": "What a view",
            "user": "simbaScotland"
        },
        {
            "date": "July 13, 2009",
            "detail_rating": {
                "business": null,
                "cleanliness": 5.0,
                "desk": null,
                "location": 4.0,
                "pool": null,
                "restaurant": null,
                "rooms": 5.0,
                "service": 5.0,
                "sleep": null,
                "value": 5.0
            },
            "helpfulness": 2,
            "id": 34631170,
            "likes": {
                "disliked": null,
                "liked": null
            },
            "rating": 5.0,
            "stay_parameters": "Stayed July 2009, traveled as a couple",
            "text": "There are no major issues but quite a few niggly ones:",
            "title": "Excellent Hotel Lindos Bay Hotel (Mareblue)",
            "user": "geordie92"
        },
        {
            "date": "July 12, 2009",
            "detail_rating": {
                "business": null,
                "cleanliness": 5.0,
                "desk": null,
                "location": 4.0,
                "pool": null,
                "restaurant": null,
                "rooms": 5.0,
                "service": 5.0,
                "sleep": null,
                "value": 5.0
            },
            "helpfulness": null,
            "id": 34543519,
            "likes": {
                "disliked": null,
                "liked": null
            },
            "rating": 5.0,
            "stay_parameters": "Stayed July 2009, traveled as a couple",
            "text": "The food is good if somewhat samey each night. They only seem to label some of the food on offer which is very confusing when looking for non meat dishes. Staff can appear too keen to clear your plates between courses. Not sure if this is attention to service or to chivy you along! Only 2 very small lifts. They charge for the gym which is part of spa. Up to 10 euro for gym is out of order. Drinks at bars are expensive.",
            "title": "Excellent hotel",
            "user": "BelindaHertfordshire"
        },
        {
            "date": "June 28, 2009",
            "detail_rating": {
                "business": null,
                "cleanliness": 5.0,
                "desk": null,
                "location": 4.0,
                "pool": null,
                "restaurant": null,
                "rooms": 5.0,
                "service": 4.0,
                "sleep": null,
                "value": 4.0
            },
            "helpfulness": null,
            "id": 33398753,
            "likes": {
                "disliked": null,
                "liked": null
            },
            "rating": 4.0,
            "stay_parameters": "Stayed June 2009, traveled as a couple",
            "text": "Rooms are large and cleaned daily. Free safes and fridge in room. Air con worked fine. Hotel right on pebbly beach but has decent fresh water pool. The real downside is the lack on any real entertainment, especially for kids or teenagers. There is a very enthusiastic guy that organises a few daily pool games but at night you have poor singing synth combos types. Lindos is a 7-10 euro taxi away and that mounts up every night. Buses are not reliable as far as I can see and most only stop at top of very steep climb to road. Staff are generally friendly.",
            "title": "Great Hotel",
            "user": "SuziGlasgow"
        },
        {
            "date": "September 29, 2009",
            "detail_rating": {
                "business": null,
                "cleanliness": 5.0,
                "desk": null,
                "location": 4.0,
                "pool": null,
                "restaurant": null,
                "rooms": 5.0,
                "service": 4.0,
                "sleep": null,
                "value": 4.0
            },
            "helpfulness": null,
            "id": 45367361,
            "likes": {
                "disliked": null,
                "liked": null
            },
            "rating": 5.0,
            "stay_parameters": "Stayed September 2009, traveled as a couple",
            "text": "I was very impressed with the hotel, we had a sea view room which was spotlessly clean and came with complimentary drinks and fruit. I also thought the dressing gowns in the hotel were a nice touch especially to wear if you fancied an early morning swim.",
            "title": "Beautiful Hotel",
            "user": "MonkeyGeorge"
        },
        {
            "date": "September 13, 2009",
            "detail_rating": {
                "business": null,
                "cleanliness": 5.0,
                "desk": null,
                "location": 5.0,
                "pool": null,
                "restaurant": null,
                "rooms": 5.0,
                "service": 5.0,
                "sleep": null,
                "value": 5.0
            },
            "helpfulness": null,
            "id": 41339427,
            "likes": {
                "disliked": null,
                "liked": null
            },
            "rating": 5.0,
            "stay_parameters": "Stayed August 2009, traveled as a couple",
            "text": "I personally found the location was a bit too far out of Lindos and the taxi's did add up albeit there was a bus service through the day but if you were content to spend your time at the hotel the facilities were fantastic, decent sized pool and a small indoor pool with decking area outside. The hotel is right on the beach which was kept immaculate.",
            "title": "Relax in an Idyllic location with good food and the best service.",
            "user": "OxfordJohns"
        },
        {
            "date": "September 1, 2009",
            "detail_rating": {
                "business": null,
                "cleanliness": 5.0,
                "desk": null,
                "location": 5.0,
                "pool": null,
                "restaurant": null,
                "rooms": 5.0,
                "service": 5.0,
                "sleep": null,
                "value": 5.0
            },
            "helpfulness": 1,
            "id": 39482906,
            "likes": {
                "disliked": null,
                "liked": null
            },
            "rating": 5.0,
            "stay_parameters": "Stayed August 2009, traveled with family",
            "text": "On the food front I thought they had a decent choice but my partner did struggle as he is vegetarian and it was a bit uninspired on the vegetarian front, so we did swap the evening meal for a lunchtime meal a few times and ate out in Lindos.",
            "title": "Lovely hotel & excellent location and staff",
            "user": "janetravelsKent"
        },
        {
            "date": "August 30, 2009",
            "detail_rating": {
                "business": null,
                "cleanliness": 5.0,
                "desk": null,
                "location": 4.0,
                "pool": null,
                "restaurant": null,
                "rooms": 4.0,
                "service": 3.0,
                "sleep": null,
                "value": 3.0
            },
            "helpfulness": null,
            "id": 39258821,
            "likes": {
                "disliked": null,
                "liked": null
            },
            "rating": 4.0,
            "stay_parameters": "Stayed August 2009, traveled with family",
            "text": "The Spa was a pleasure to visit and all in all this was a very relaxing holiday.",
            "title": "A good holiday, with reservations",
            "user": "DocWales"
        },
        {
            "date": "August 11, 2009",
            "detail_rating": {
                "business": null,
                "cleanliness": 5.0,
                "desk": null,
                "location": 5.0,
                "pool": null,
                "restaurant": null,
                "rooms": 4.0,
                "service": 5.0,
                "sleep": null,
                "value": 5.0
            },
            "helpfulness": null,
            "id": 37412164,
            "likes": {
                "disliked": null,
                "liked": null
            },
            "rating": 5.0,
            "stay_parameters": "Stayed August 2008, traveled with family",
            "text": "My wife and I have just returned from the Lindos Bay Hotel after two weeks stay, and thought the hotel was fantastic and excellent value for money. The hotel was spotless and the staff all very friendly.",
            "title": "Fantastic Holiday",
            "user": "vodkandtonic"
        },
        {
            "date": "November 6, 2009",
            "detail_rating": {
                "business": null,
                "cleanliness": null,
                "desk": null,
                "location": null,
                "pool": null,
                "restaurant": null,
                "rooms": null,
                "service": null,
                "sleep": null,
                "value": null
            },
            "helpfulness": 1,
            "id": 48618032,
            "likes": {
                "disliked": null,
                "liked": null
            },
            "rating": 4.0,
            "stay_parameters": null,
            "text": "We spent a fabulous week at the Lindos Bay Hotel at the beginning of October. We were staying there to attend our daughter's wedding and have a nice break ourselves.",
            "title": "Our wedding holiday.",
            "user": "SylviaH1"
        },
        {
            "date": "October 22, 2009",
            "detail_rating": {
                "business": null,
                "cleanliness": 5.0,
                "desk": null,
                "location": 2.0,
                "pool": null,
                "restaurant": null,
                "rooms": 5.0,
                "service": 3.0,
                "sleep": null,
                "value": 3.0
            },
            "helpfulness": null,
            "id": 47492424,
            "likes": {
                "disliked": null,
                "liked": null
            },
            "rating": 4.0,
            "stay_parameters": "Stayed October 2009, traveled as a couple",
            "text": "It was obvious that it was the end of season, there were no queues for food etc. There were no young children and the whole place had an air of calm. We found the rooms and the service very good, the food excellent, being able to choose quantity and type easily. The staff were very pleasant, efficient and friendly too. Our experience was a complete pleasure.",
            "title": "Lovely Hotel & Staff. Really Beautiful Location but not for eating out",
            "user": "dpdpkpcom"
        },
        {
            "date": "October 18, 2009",
            "detail_rating": {
                "business": null,
                "cleanliness": 5.0,
                "desk": null,
                "location": 1.0,
                "pool": null,
                "restaurant": null,
                "rooms": 3.0,
                "service": 2.0,
                "sleep": null,
                "value": 1.0
            },
            "helpfulness": null,
            "id": 47173489,
            "likes": {
                "disliked": null,
                "liked": null
            },
            "rating": 3.0,
            "stay_parameters": "Stayed October 2009",
            "text": "We booked with Thomas Cook to visit this hotel in October 2009. We used TripAdvisor to find a hotel suitable for our needs and this hotel was the best that Thomas Cook did in the area (review-wise).",
            "title": "Dissapointing start to our holiday!!!!",
            "user": "yorkshirelassA1"
        },
        {
            "date": "October 16, 2009",
            "detail_rating": {
                "business": null,
                "cleanliness": 5.0,
                "desk": null,
                "location": 4.0,
                "pool": null,
                "restaurant": null,
                "rooms": 5.0,
                "service": 4.0,
                "sleep": null,
                "value": 5.0
            },
            "helpfulness": 1,
            "id": 47026461,
            "likes": {
                "disliked": null,
                "liked": null
            },
            "rating": 4.0,
            "stay_parameters": "Stayed October 2009, traveled as a couple",
            "text": "Tripadvisor came up trumps. We got exactly what we thought we were going to get.",
            "title": "Superb Hotel",
            "user": "Jimhough"
        },
        {
            "date": "October 6, 2009",
            "detail_rating": {
                "business": null,
                "cleanliness": 5.0,
                "desk": null,
                "location": 3.0,
                "pool": null,
                "restaurant": null,
                "rooms": 5.0,
                "service": 4.0,
                "sleep": null,
                "value": 4.0
            },
            "helpfulness": 2,
            "id": 45981475,
            "likes": {
                "disliked": null,
                "liked": null
            },
            "rating": 4.0,
            "stay_parameters": "Stayed September 2009, traveled as a couple",
            "text": "__Good Points__",
            "title": "Lovely, quiet, clean hotel, perfect for relaxation",
            "user": "WeeZane"
        },
        {
            "date": "June 7, 2010",
            "detail_rating": {
                "business": null,
                "cleanliness": 5.0,
                "desk": null,
                "location": 4.0,
                "pool": null,
                "restaurant": null,
                "rooms": 5.0,
                "service": 4.0,
                "sleep": 4.0,
                "value": 3.0
            },
            "helpfulness": null,
            "id": 66713411,
            "likes": {
                "disliked": null,
                "liked": null
            },
            "rating": 4.0,
            "stay_parameters": "Stayed May 2010, traveled as a couple",
            "text": "Nice room, lovely loaction on beach although a bit of a walk to the nearest town. However, bus timetables are available from reception.",
            "title": "Lovely hotel, if a bit overpriced",
            "user": "Ashley321"
        },
        {
            "date": "May 28, 2010",
            "detail_rating": {
                "business": null,
                "cleanliness": 5.0,
                "desk": null,
                "location": 4.0,
                "pool": null,
                "restaurant": null,
                "rooms": 5.0,
                "service": 5.0,
                "sleep": 5.0,
                "value": 5.0
            },
            "helpfulness": 2,
            "id": 65639183,
            "likes": {
                "disliked": null,
                "liked": null
            },
            "rating": 5.0,
            "stay_parameters": "Stayed May 2010, traveled as a couple",
            "text": "Restaurant and bar staff great, as was the housekeeping, but reception staff rude and seemed to see guests as a burden.",
            "title": "what a fantastic hotel,facilities,location,staff,food.",
            "user": "chappo22"
        },
        {
            "date": "May 25, 2010",
            "detail_rating": {
                "business": null,
                "cleanliness": 5.0,
                "desk": null,
                "location": 5.0,
                "pool": null,
                "restaurant": null,
                "rooms": 5.0,
                "service": 5.0,
                "sleep": 5.0,
                "value": 5.0
            },
            "helpfulness": 2,
            "id": 65302700,
            "likes": {
                "disliked": null,
                "liked": null
            },
            "rating": 5.0,
            "stay_parameters": "Stayed May 2010, traveled with friends",
            "text": "We were on half board, and found that the drinks were over priced. Eg a beer from Azzurro down the road was alsmost half the price of one in the hotel. We were surprised that we had to pay for drinking water at dinner and were fobidden to take our own in.",
            "title": "Can't wait to return!",
            "user": "midnitedancer"
        },
        {
            "date": "May 13, 2010",
            "detail_rating": {
                "business": null,
                "cleanliness": 5.0,
                "desk": null,
                "location": 4.0,
                "pool": null,
                "restaurant": null,
                "rooms": 5.0,
                "service": 5.0,
                "sleep": 5.0,
                "value": 4.0
            },
            "helpfulness": null,
            "id": 64027654,
            "likes": {
                "disliked": null,
                "liked": null
            },
            "rating": 5.0,
            "stay_parameters": "Stayed May 2010, traveled with friends",
            "text": "In the end we simply bought lunch from the supermarket down the road as everything so expensive in hotel. Also, late checkout was 40 euros, so we stayed in the spa until checkout.",
            "title": "Did not want to come home. Fantastic!",
            "user": "mistyflowers"
        },
        {
            "date": "November 7, 2009",
            "detail_rating": {
                "business": null,
                "cleanliness": 5.0,
                "desk": null,
                "location": 2.0,
                "pool": null,
                "restaurant": null,
                "rooms": 5.0,
                "service": 3.0,
                "sleep": null,
                "value": 3.0
            },
            "helpfulness": 1,
            "id": 48690164,
            "likes": {
                "disliked": null,
                "liked": null
            },
            "rating": 4.0,
            "stay_parameters": "Stayed October 2009, traveled with family",
            "text": "The evening meals were nice,, but there was too much salt in some of it, so much so that it was impalatable. The grilled fish and meats were the best options to go for.",
            "title": "Mareblue Bay Lindos - perfect if you like chilling out in a romantic place",
            "user": "holidayqueenBristol"
        }
    ],
    "slim_ranking": 0.433333333333,
    "stars": 4,
    "tripadvisor": {
        "VISITED": false,
        "country_name": null,
        "locality": null,
        "pic_link": null,
        "street_address": null
    },
    "user_rating": 4.0,
    "variance": {
        "average": 58,
        "excellent": 137,
        "poor": 12,
        "terrible": 3,
        "very good": 169
    }
}