{
    "aka": "Krakow Qubus Hotel",
    "description": null,
    "detail_rating": {
        "cleanliness": 4.5,
        "location": 4.0,
        "rooms": 4.5,
        "service": 4.5,
        "sleep": 4.5,
        "value": 4.5
    },
    "location": {
        "city": null,
        "continent": "Europe",
        "country": "Poland",
        "proposed_city": null,
        "province": null,
        "region": "Southern Poland"
    },
    "name": "Qubus Hotel Krakow",
    "places": {
        "aka": [],
        "hotel_description": [],
        "hotel_name": []
    },
    "review_count": 665,
    "review_count_current": 40,
    "reviews": [
        {
            "date": "July 13, 2008",
            "detail_rating": {
                "business": null,
                "cleanliness": 4.0,
                "desk": null,
                "front_desk": 3.0,
                "location": 3.0,
                "pool": null,
                "restaurant": null,
                "rooms": 3.0,
                "service": 4.0,
                "sleep": null,
                "value": 3.0
            },
            "helpfulness": 2,
            "id": 17839346,
            "likes": {
                "disliked": "\u2014 Noise problems if in a room overlooking bar areas",
                "liked": "\u2014 Modern and clean."
            },
            "rating": 3.0,
            "stay_parameters": "Stayed July 2008, traveled as a couple",
            "text": "This is a modern hotel, situated on the banks of the river Vistula, about 20 minutes walk from the main square in Krakov. A pleasant design with light airy and modern rooms. Well fitted bathrooms with hair dryer and also an iron and ironing board in each room. Flat scren TV also. Draw back is the very small 2'6\" single beds!!! Fairly comfortable but oh so small - have no idea how larger/taller people get on, but we found them uncomfortable. On our first night we were allocated a room on the first floor overlooking the reception/bar area and for some reason there was jazz music playing all night long!! We complained at 1am, 2am and again at 3 am and were simply told they couldn't turn it off!! Neddless to say we complained again the following day and were moved to a quieter room overlooking the side road. Noise from the bar/reception is a real issue though because of the design of the area, everything echoes. I would advise anyone staying to request a room on the other side or third floor and above.",
            "title": "Good hotel for the price",
            "user": "MosesGloucestershire"
        },
        {
            "date": "June 1, 2008",
            "detail_rating": {
                "business": 4.0,
                "cleanliness": 5.0,
                "desk": null,
                "front_desk": 4.0,
                "location": 3.0,
                "pool": null,
                "restaurant": null,
                "rooms": 4.0,
                "service": 5.0,
                "sleep": null,
                "value": 5.0
            },
            "helpfulness": 4,
            "id": 16558500,
            "likes": {
                "disliked": "\u2014 Room facing inward---needed lights on during day.",
                "liked": "\u2014 Helpfulness of staff"
            },
            "rating": 4.0,
            "stay_parameters": "Stayed May 2008, traveled with family",
            "text": "Breakfast was excellent with a huge choice and unusually good coffee. We ate once in the restaurant and it was very acceptable and well priced.",
            "title": "Ticks a lot of boxes",
            "user": "Maxb"
        },
        {
            "date": "May 29, 2008",
            "detail_rating": {
                "business": null,
                "cleanliness": 4.0,
                "desk": null,
                "front_desk": 4.0,
                "location": 3.0,
                "pool": null,
                "restaurant": null,
                "rooms": 4.0,
                "service": 4.0,
                "sleep": null,
                "value": 5.0
            },
            "helpfulness": 4,
            "id": 16494778,
            "likes": {
                "disliked": "\u2014 Distance from centre",
                "liked": "\u2014 Overall standard and facilities"
            },
            "rating": 4.0,
            "stay_parameters": "Stayed May 2008, traveled as a couple",
            "text": "The area around the hotel is interesting and in the small Jewish Quarter square about 10 mins walk away there is a selection of restaurants. We though SZARA excellent. Although dearer than the rest the quality of the food made it well worth the extra cost.",
            "title": "Good hotel just a little far out",
            "user": "highfly"
        },
        {
            "date": "May 28, 2008",
            "detail_rating": {
                "business": null,
                "cleanliness": null,
                "desk": null,
                "location": null,
                "pool": null,
                "restaurant": null,
                "rooms": null,
                "service": null,
                "sleep": null,
                "value": null
            },
            "helpfulness": 1,
            "id": 16457731,
            "likes": {
                "disliked": null,
                "liked": null
            },
            "rating": 4.0,
            "stay_parameters": null,
            "text": "No 24 and 34 tram take visitors from hotel into the city centre in about 8 minutes.",
            "title": "good",
            "user": "willmkent"
        },
        {
            "date": "May 12, 2008",
            "detail_rating": {
                "business": null,
                "cleanliness": 5.0,
                "desk": null,
                "front_desk": 5.0,
                "location": 3.0,
                "pool": null,
                "restaurant": null,
                "rooms": 5.0,
                "service": 4.0,
                "sleep": null,
                "value": 5.0
            },
            "helpfulness": 2,
            "id": 15953042,
            "likes": {
                "disliked": "\u2014 the location",
                "liked": "\u2014 cmort and a hearty breakfast"
            },
            "rating": 5.0,
            "stay_parameters": "Stayed December 2007, traveled as a couple",
            "text": "There is also a hotel boat which takes you (on the hour and with prior reservation) along the river to the Castle area - takes about 10 minutes and is quite pleasant. it is also free - apart from a small tip.",
            "title": "superduper",
            "user": "andyjansy"
        },
        {
            "date": "September 24, 2008",
            "detail_rating": {
                "business": 4.0,
                "cleanliness": 4.0,
                "desk": null,
                "front_desk": 3.0,
                "location": 3.0,
                "pool": null,
                "restaurant": null,
                "rooms": 4.0,
                "service": 3.0,
                "sleep": null,
                "value": 5.0
            },
            "helpfulness": 2,
            "id": 20332940,
            "likes": {
                "disliked": "\u2014 Firm pillows",
                "liked": "\u2014 Rooftop pool, efficient free internet"
            },
            "rating": 4.0,
            "stay_parameters": "Stayed September 2008, traveled as a couple",
            "text": "The Qubus is a modern(ish) convenient(ish) clean and comfortable 4* hotel which met our needs in Krakow almost exactly.",
            "title": "Qubus: Fair, and Square",
            "user": "JohnnyFox"
        },
        {
            "date": "September 20, 2008",
            "detail_rating": {
                "business": 4.0,
                "cleanliness": 4.0,
                "desk": null,
                "front_desk": 1.0,
                "location": 4.0,
                "pool": null,
                "restaurant": null,
                "rooms": 1.0,
                "service": 1.0,
                "sleep": null,
                "value": 2.0
            },
            "helpfulness": 2,
            "id": 20214587,
            "likes": {
                "disliked": "\u2014 The Polic",
                "liked": "\u2014 Decent views"
            },
            "rating": 1.0,
            "stay_parameters": "Stayed September 2008, traveled with friends",
            "text": "Our requests for double bed, non-smoking and river view were met, despite the fact the hotel was almost full and we had booked on a very low internet room rate - and we appreciated three facilities in particular:",
            "title": "Horrible",
            "user": "Gingerpie"
        },
        {
            "date": "September 10, 2008",
            "detail_rating": {
                "business": null,
                "cleanliness": null,
                "desk": null,
                "location": null,
                "pool": null,
                "restaurant": null,
                "rooms": null,
                "service": null,
                "sleep": null,
                "value": null
            },
            "helpfulness": 2,
            "id": 19959582,
            "likes": {
                "disliked": null,
                "liked": null
            },
            "rating": 5.0,
            "stay_parameters": null,
            "text": "- the superb rooftop pool, jacuzzi, sauna, steam and rain showers which we used daily, and were pleased to see open till 10pm",
            "title": "A Krakow'ing good Hotel",
            "user": "igram"
        },
        {
            "date": "August 25, 2008",
            "detail_rating": {
                "business": 5.0,
                "cleanliness": 4.0,
                "desk": null,
                "front_desk": 4.0,
                "location": 4.0,
                "pool": null,
                "restaurant": null,
                "rooms": 4.0,
                "service": 4.0,
                "sleep": null,
                "value": 4.0
            },
            "helpfulness": 4,
            "id": 19344235,
            "likes": {
                "disliked": null,
                "liked": null
            },
            "rating": 4.0,
            "stay_parameters": "Stayed July 2008",
            "text": "- the generous buffet breakfast available till 11am at weekends",
            "title": "Loved this Hotel!",
            "user": "CAbonbon"
        },
        {
            "date": "August 9, 2008",
            "detail_rating": {
                "business": 5.0,
                "cleanliness": 5.0,
                "desk": null,
                "front_desk": 5.0,
                "location": 5.0,
                "pool": null,
                "restaurant": null,
                "rooms": 4.0,
                "service": 5.0,
                "sleep": null,
                "value": 5.0
            },
            "helpfulness": 13,
            "id": 18766049,
            "likes": {
                "disliked": "\u2014 Nothing",
                "liked": "\u2014 Everything"
            },
            "rating": 5.0,
            "stay_parameters": "Stayed August 2008, traveled as a couple",
            "text": "- the free through-the-tv internet which meant I didn't have to lug a laptop to Krakow and which worked better than any other hotel I've stayed in since the internet was invented",
            "title": "Absolutely first class",
            "user": "Bob1949"
        },
        {
            "date": "January 12, 2010",
            "detail_rating": {
                "business": null,
                "cleanliness": 4.0,
                "desk": null,
                "location": 3.0,
                "pool": null,
                "restaurant": null,
                "rooms": 4.0,
                "service": 3.0,
                "sleep": null,
                "value": 3.0
            },
            "helpfulness": null,
            "id": 53256808,
            "likes": {
                "disliked": null,
                "liked": null
            },
            "rating": 3.0,
            "stay_parameters": "Stayed December 2009, traveled as a couple",
            "text": "The Qubus is a nice hotel located across the bridge on the outskirts of the Jewish area. It is easy to get to from the airport, jump onto a free shuttle bus that takes you to the platform to get the train into the centre. You buy your ticket on the bus, if using the dispenser then choose Krakow Balice \u2013 Krakow Glowny (GL) which is only 7 zolty per person",
            "title": "Comfortable Hotel",
            "user": "littlemissneve"
        },
        {
            "date": "January 7, 2010",
            "detail_rating": {
                "business": null,
                "cleanliness": 5.0,
                "desk": null,
                "location": 4.0,
                "pool": null,
                "restaurant": null,
                "rooms": 5.0,
                "service": 5.0,
                "sleep": null,
                "value": 5.0
            },
            "helpfulness": 1,
            "id": 52845200,
            "likes": {
                "disliked": null,
                "liked": null
            },
            "rating": 5.0,
            "stay_parameters": "Stayed December 2009, traveled as a couple",
            "text": "Exit the train station and you can get a tram (No 7 or 13) which takes you down to the Qubus. I couldn\u2019t tell you were the stops are for the trams as we walked to the hotel, took about 20-30 mins through main streets, I wouldn\u2019t advise this if you have a lot of luggage",
            "title": "Perfect. Faultless. Clean. Highly Recommend.",
            "user": "Discodiva82"
        },
        {
            "date": "January 3, 2010",
            "detail_rating": {
                "business": null,
                "cleanliness": 5.0,
                "desk": null,
                "location": 5.0,
                "pool": null,
                "restaurant": null,
                "rooms": 5.0,
                "service": 5.0,
                "sleep": null,
                "value": 5.0
            },
            "helpfulness": null,
            "id": 52469185,
            "likes": {
                "disliked": null,
                "liked": null
            },
            "rating": 5.0,
            "stay_parameters": "Stayed December 2009, traveled as a couple",
            "text": "The hotel has a large restaurant on the ground floor, we only had breakfast in it and an open bar area in the lobby which also does snacks like sandwiches & salads. When taking the elevator to your room you have to try the glass elevator which gives you a nice view across part of the city",
            "title": "fabulous",
            "user": "SuzeEastAnglia"
        },
        {
            "date": "December 15, 2009",
            "detail_rating": {
                "business": null,
                "cleanliness": 4.0,
                "desk": null,
                "location": 3.0,
                "pool": null,
                "restaurant": null,
                "rooms": 4.0,
                "service": 3.0,
                "sleep": null,
                "value": 4.0
            },
            "helpfulness": 1,
            "id": 51261147,
            "likes": {
                "disliked": null,
                "liked": null
            },
            "rating": 4.0,
            "stay_parameters": "Stayed December 2009, traveled as a couple",
            "text": "The hotel also has a beauty shop, jewellery shop and tour shop. We booked our Auschwitz tour through this for 90 zolty each, it picks up from the hotel but doesn\u2019t drop you back off at the hotel",
            "title": "Good Value Hotel",
            "user": "bigpetemon2"
        },
        {
            "date": "December 11, 2009",
            "detail_rating": {
                "business": null,
                "cleanliness": 5.0,
                "desk": null,
                "location": 5.0,
                "pool": null,
                "restaurant": null,
                "rooms": 4.0,
                "service": 4.0,
                "sleep": null,
                "value": 5.0
            },
            "helpfulness": null,
            "id": 51036342,
            "likes": {
                "disliked": null,
                "liked": null
            },
            "rating": 5.0,
            "stay_parameters": "Stayed December 2009, traveled with friends",
            "text": "The room was very comfortable, the bed although a double had 2 single duvets on it which I\u2019ve found to be quite common in Eastern Europe. The only pillows are what looks to be the large decorative pillows that you would put on a bed which I found to be fine but my other half ended up with neck pain sleeping on them. As we were there in Dec/Jan We really appreciated the air conditioning which also heated the room and the room stayed warm all night",
            "title": "Can Highly Recommend This Hotel",
            "user": "Jeannie-BPerthshire"
        },
        {
            "date": "August 5, 2008",
            "detail_rating": {
                "business": 4.0,
                "cleanliness": 5.0,
                "desk": null,
                "front_desk": 5.0,
                "location": 4.0,
                "pool": null,
                "restaurant": null,
                "rooms": 5.0,
                "service": 5.0,
                "sleep": null,
                "value": 5.0
            },
            "helpfulness": 1,
            "id": 18648988,
            "likes": {
                "disliked": "\u2014 nil",
                "liked": "\u2014 everything from food and servise to clean and comfy accomidation"
            },
            "rating": 5.0,
            "stay_parameters": "Stayed January 2008, traveled on business",
            "text": "This hotel is one of the best hotels i have stayed in. The staff were friendly and helpfull beyond requirements with all staff speaking english. The food is fantastic with an extensive breakfast buffet with anything you could possibly ask for. Krakow town centre is a short walk from the hotel which allows you to take in the beautiful sights. The hotel also has organised trips to some of the most popular tourist attractions.",
            "title": "amazing",
            "user": "honestreviews-f-"
        },
        {
            "date": "August 1, 2008",
            "detail_rating": {
                "business": null,
                "cleanliness": null,
                "desk": null,
                "location": null,
                "pool": null,
                "restaurant": null,
                "rooms": null,
                "service": null,
                "sleep": null,
                "value": null
            },
            "helpfulness": null,
            "id": 18489113,
            "likes": {
                "disliked": null,
                "liked": null
            },
            "rating": 4.0,
            "stay_parameters": null,
            "text": "Brilliant all round hotel.",
            "title": "excellent facilities",
            "user": "maggie44560"
        },
        {
            "date": "July 29, 2008",
            "detail_rating": {
                "business": 4.0,
                "cleanliness": 4.0,
                "desk": null,
                "front_desk": 4.0,
                "location": 4.0,
                "pool": null,
                "restaurant": null,
                "rooms": 4.0,
                "service": 4.0,
                "sleep": null,
                "value": 4.0
            },
            "helpfulness": 3,
            "id": 18373816,
            "likes": {
                "disliked": "\u2014 Nothing",
                "liked": "\u2014 Air conditioning and very clean"
            },
            "rating": 5.0,
            "stay_parameters": "Stayed July 2008, traveled as a couple",
            "text": "we stayed at the qubus for three nights and were pleased with the facilities at the hotel. Our room was big enough and was spotless with immaculate decor. Items such as the big flat screen tv, spotless bathroom and comfortable beds made time spent in the room worthwhile. Free facilities such as weight room, sauna, jacuzzi and free boat trips were also an added bonus. Breakfast was good whilst the one evening meal that we had in the hotel was very enjoyable. The two small drawbacks was the lack of money changing facilities in the hotel and the absence of tea making facilities in the room.",
            "title": "Wonderful trip",
            "user": "TravellerCambridge"
        },
        {
            "date": "July 24, 2008",
            "detail_rating": {
                "business": 4.0,
                "cleanliness": 4.0,
                "desk": null,
                "front_desk": 3.0,
                "location": 4.0,
                "pool": null,
                "restaurant": null,
                "rooms": 4.0,
                "service": 3.0,
                "sleep": null,
                "value": 4.0
            },
            "helpfulness": 4,
            "id": 18197508,
            "likes": {
                "disliked": "\u2014 Lack of basic hotel equipment, lack of information, lack of smiles",
                "liked": "\u2014 Location, rooms, shuttle boat"
            },
            "rating": 4.0,
            "stay_parameters": "Stayed July 2008, traveled on business",
            "text": "Dont let these small items put you off as we really enjoyed our",
            "title": "A very nice stay",
            "user": "oceanbird"
        },
        {
            "date": "July 23, 2008",
            "detail_rating": {
                "business": 4.0,
                "cleanliness": 4.0,
                "desk": null,
                "front_desk": 4.0,
                "location": 4.0,
                "pool": null,
                "restaurant": null,
                "rooms": 4.0,
                "service": 4.0,
                "sleep": null,
                "value": 3.0
            },
            "helpfulness": 1,
            "id": 18160374,
            "likes": {
                "disliked": null,
                "liked": "\u2014 Comfort"
            },
            "rating": 4.0,
            "stay_parameters": "Stayed July 2008, traveled as a couple",
            "text": "stay at the Qubus.",
            "title": "Pleasant",
            "user": "gm10"
        },
        {
            "date": "November 1, 2009",
            "detail_rating": {
                "business": null,
                "cleanliness": 4.0,
                "desk": null,
                "location": 4.0,
                "pool": null,
                "restaurant": null,
                "rooms": 4.0,
                "service": 4.0,
                "sleep": null,
                "value": 4.0
            },
            "helpfulness": 2,
            "id": 48257410,
            "likes": {
                "disliked": null,
                "liked": null
            },
            "rating": 4.0,
            "stay_parameters": "Stayed October 2009, traveled with family",
            "text": "We stayed here for 3 nights on a city break to the beautiful city of Krakow.",
            "title": "Great place to stay In Krakow",
            "user": "tommy17"
        },
        {
            "date": "October 25, 2009",
            "detail_rating": {
                "business": null,
                "cleanliness": 4.0,
                "desk": null,
                "location": 4.0,
                "pool": null,
                "restaurant": null,
                "rooms": 5.0,
                "service": 4.0,
                "sleep": null,
                "value": 5.0
            },
            "helpfulness": 1,
            "id": 47687798,
            "likes": {
                "disliked": null,
                "liked": null
            },
            "rating": 5.0,
            "stay_parameters": "Stayed October 2009, traveled with friends",
            "text": "Having read the reviews before I went I was confident this would be a good hotel, I was not wrong.",
            "title": "Good hotel",
            "user": "JohnMc777"
        },
        {
            "date": "October 18, 2009",
            "detail_rating": {
                "business": null,
                "cleanliness": 5.0,
                "desk": null,
                "location": 5.0,
                "pool": null,
                "restaurant": null,
                "rooms": 5.0,
                "service": 5.0,
                "sleep": null,
                "value": 5.0
            },
            "helpfulness": 1,
            "id": 47146801,
            "likes": {
                "disliked": null,
                "liked": null
            },
            "rating": 5.0,
            "stay_parameters": "Stayed September 2009, traveled with friends",
            "text": "The hotel is set overlooking the river wawel although its about a 20 minute walk into the centre is a nice steady walk, the hotel rooms are well appointed and the breakfast lives up to the other reviews about the best I have stayed at for a long time.",
            "title": "Excellent hotel - great value",
            "user": "marxbros"
        },
        {
            "date": "October 7, 2009",
            "detail_rating": {
                "business": null,
                "cleanliness": 5.0,
                "desk": null,
                "location": 4.0,
                "pool": null,
                "restaurant": null,
                "rooms": 4.0,
                "service": 4.0,
                "sleep": null,
                "value": 5.0
            },
            "helpfulness": 1,
            "id": 46072491,
            "likes": {
                "disliked": null,
                "liked": null
            },
            "rating": 5.0,
            "stay_parameters": "Stayed March 2009, traveled as a couple",
            "text": "The only thing they could do to improve would be tea and coffee making facilities in the bedrooms.",
            "title": "GREAT HOTEL - GREAT CITY BREAK",
            "user": "ALMAR09"
        },
        {
            "date": "October 3, 2009",
            "detail_rating": {
                "business": null,
                "cleanliness": 4.0,
                "desk": null,
                "location": 4.0,
                "pool": null,
                "restaurant": null,
                "rooms": 4.0,
                "service": 4.0,
                "sleep": null,
                "value": 4.0
            },
            "helpfulness": 3,
            "id": 45723292,
            "likes": {
                "disliked": null,
                "liked": null
            },
            "rating": 4.0,
            "stay_parameters": "Stayed September 2009, traveled as a couple",
            "text": "overall excellent",
            "title": "Second time, again a good stay",
            "user": "imlittlewop"
        },
        {
            "date": "October 29, 2008",
            "detail_rating": {
                "business": 5.0,
                "cleanliness": 4.0,
                "desk": null,
                "front_desk": 5.0,
                "location": 4.0,
                "pool": null,
                "restaurant": null,
                "rooms": 3.0,
                "service": 4.0,
                "sleep": null,
                "value": 4.0
            },
            "helpfulness": null,
            "id": 21381394,
            "likes": {
                "disliked": "\u2014 no tea making facilities",
                "liked": "\u2014 Pool and free internet/skype access in all rooms"
            },
            "rating": 4.0,
            "stay_parameters": "Stayed October 2008, traveled as a couple",
            "text": "Loved this hotel. It's on the outskirts of the Old Town but it only takes about 15-20 min to walk into the centre. The Jewish Quarter called Kazimierz is close by, about 10 mins walk away and just at the back of the hotel is Podgorze where Ghetto Heroes Square is. There are many nice places to eat in the Jewish Quarter.",
            "title": "Comfortable hotel, good location",
            "user": "tulip"
        },
        {
            "date": "October 25, 2008",
            "detail_rating": {
                "business": 4.0,
                "cleanliness": 5.0,
                "desk": null,
                "front_desk": 4.0,
                "location": 3.0,
                "pool": null,
                "restaurant": null,
                "rooms": 4.0,
                "service": 4.0,
                "sleep": null,
                "value": 4.0
            },
            "helpfulness": null,
            "id": 21200311,
            "likes": {
                "disliked": null,
                "liked": null
            },
            "rating": 4.0,
            "stay_parameters": "Stayed October 2008, traveled as a couple",
            "text": "The rooms are clean and comfortable. I was disappointed that there was no tea making facilities in the room but there was a minibar and two free bottles of water left daily. There is an iron & ironing board in the room.",
            "title": "Qubus Hotel Fantastic",
            "user": "kakushki"
        },
        {
            "date": "October 24, 2008",
            "detail_rating": {
                "business": null,
                "cleanliness": 5.0,
                "desk": null,
                "front_desk": 2.0,
                "location": 5.0,
                "pool": null,
                "restaurant": null,
                "rooms": 4.0,
                "service": 3.0,
                "sleep": null,
                "value": null
            },
            "helpfulness": null,
            "id": 21162625,
            "likes": {
                "disliked": "\u2014 reception staff",
                "liked": "\u2014 modern, clean good location"
            },
            "rating": 4.0,
            "stay_parameters": "Stayed October 2008, traveled with friends",
            "text": "On the 6th floor there is a heated rooftop pool and jacuzzi plus a sauna & steamroom, lovely.",
            "title": "ok",
            "user": "smifmadcow"
        },
        {
            "date": "October 18, 2008",
            "detail_rating": {
                "business": null,
                "cleanliness": 5.0,
                "desk": null,
                "front_desk": 4.0,
                "location": 4.0,
                "pool": null,
                "restaurant": null,
                "rooms": 5.0,
                "service": 4.0,
                "sleep": null,
                "value": 4.0
            },
            "helpfulness": null,
            "id": 20987795,
            "likes": {
                "disliked": null,
                "liked": null
            },
            "rating": 5.0,
            "stay_parameters": "Stayed May 2008, traveled as a couple",
            "text": "Breakfast was very nice but Im not a big breakfast eater to be honest, but they had all the usual suspects on the buffet as well as some more unusual things like vegetables, smoked salmon etc!",
            "title": "Very Good choice",
            "user": "Paula083"
        },
        {
            "date": "October 10, 2008",
            "detail_rating": {
                "business": null,
                "cleanliness": 5.0,
                "desk": null,
                "front_desk": 4.0,
                "location": 4.0,
                "pool": null,
                "restaurant": null,
                "rooms": 5.0,
                "service": 5.0,
                "sleep": null,
                "value": null
            },
            "helpfulness": null,
            "id": 20777629,
            "likes": {
                "disliked": "\u2014 We had to leave.....",
                "liked": "\u2014 Comfort and cleanliness"
            },
            "rating": 5.0,
            "stay_parameters": "Stayed October 2008, traveled with family",
            "text": "There are trips to be booked from the hotel. We booked the Auschwitz/Birkenau trip and the salt mines. Excellent trips. Glad we didnt do them individually, we may have saves a few quid but at least we were picked up and dropped off at the hotel and well looked after. Our taxi from the airport was 90 zlotys but he seemed to drag the journey out a bit! We shared a minibus back with another family organised through the hotel for only 100 zlotys.",
            "title": "Excellent choice!",
            "user": "LexnPete"
        },
        {
            "date": "February 9, 2010",
            "detail_rating": {
                "business": null,
                "cleanliness": null,
                "desk": null,
                "location": null,
                "pool": null,
                "restaurant": null,
                "rooms": null,
                "service": null,
                "sleep": null,
                "value": null
            },
            "helpfulness": 1,
            "id": 55532064,
            "likes": {
                "disliked": null,
                "liked": null
            },
            "rating": 5.0,
            "stay_parameters": null,
            "text": "We stayed here after two weeks in Zakopane. The pool, sauna and fitness centre are excellent. The hotel is well appointed, the service fantastic. The staff are incredibly helpful and the rooms are comfortable and modern. The location is fantastic, with great river views and sweeping views of Krakow. Highly recommended.",
            "title": "Excellent facilities, location and service",
            "user": "Dazzler-TA"
        },
        {
            "date": "February 4, 2010",
            "detail_rating": {
                "business": null,
                "cleanliness": 5.0,
                "desk": null,
                "location": 5.0,
                "pool": null,
                "restaurant": null,
                "rooms": 5.0,
                "service": 5.0,
                "sleep": 5.0,
                "value": 5.0
            },
            "helpfulness": 1,
            "id": 55186055,
            "likes": {
                "disliked": null,
                "liked": null
            },
            "rating": 5.0,
            "stay_parameters": "Stayed January 2010, traveled as a couple",
            "text": "Stayed at the Qubus for 4 nights, with my wife and two friends.Very clean and comfortable bedrooms, and we found all staff friendly and efficient. Breakfast was excellent with plenty of choice for all tastes, and dinner was superb and not expensive as hotels can be in Europe. We ate in restaurants in the city most nights, but this dinner was voted best by our group. Dining staff were pleasant and helpful. When in Krakow again, we will certainly stay here, and there are usually special offers at certain times which are unmissable.\u00a336 pppn for B&B, you couldn't get a B&B inEngland for that!",
            "title": "Excellent hotel-No complaints at all!",
            "user": "fly1now"
        },
        {
            "date": "January 30, 2010",
            "detail_rating": {
                "business": null,
                "cleanliness": 5.0,
                "desk": null,
                "location": 4.0,
                "pool": null,
                "restaurant": null,
                "rooms": 4.0,
                "service": 5.0,
                "sleep": null,
                "value": 5.0
            },
            "helpfulness": 1,
            "id": 54743567,
            "likes": {
                "disliked": null,
                "liked": null
            },
            "rating": 5.0,
            "stay_parameters": "Stayed January 2010, traveled as a couple",
            "text": "Excellent pool and spa facilities.",
            "title": "Loved the luxury",
            "user": "Judith57"
        },
        {
            "date": "January 21, 2010",
            "detail_rating": {
                "business": null,
                "cleanliness": 5.0,
                "desk": null,
                "location": 4.0,
                "pool": null,
                "restaurant": null,
                "rooms": 5.0,
                "service": 5.0,
                "sleep": null,
                "value": 4.0
            },
            "helpfulness": null,
            "id": 54017630,
            "likes": {
                "disliked": null,
                "liked": null
            },
            "rating": 5.0,
            "stay_parameters": "Stayed January 2010, traveled with friends",
            "text": "PS: Use BOBS TAXIS for airport transfer,trips to austwitch including tickets etc.. He's cheaper than tour companies and very good company.He speaks English, and is a good laugh(thinks he's James Bond).",
            "title": "Great hotel, near to old town.",
            "user": "FrenchTony"
        },
        {
            "date": "January 18, 2010",
            "detail_rating": {
                "business": null,
                "cleanliness": 5.0,
                "desk": null,
                "location": 4.0,
                "pool": null,
                "restaurant": null,
                "rooms": 5.0,
                "service": 5.0,
                "sleep": null,
                "value": 5.0
            },
            "helpfulness": null,
            "id": 53767771,
            "likes": {
                "disliked": null,
                "liked": null
            },
            "rating": 5.0,
            "stay_parameters": "Stayed January 2010, traveled with friends",
            "text": "than tour companies",
            "title": "Fabulous modern hotel with great views and very good value for money",
            "user": "tomcatandpebbles"
        },
        {
            "date": "December 8, 2009",
            "detail_rating": {
                "business": null,
                "cleanliness": 5.0,
                "desk": null,
                "location": 4.0,
                "pool": null,
                "restaurant": null,
                "rooms": 5.0,
                "service": 5.0,
                "sleep": null,
                "value": 5.0
            },
            "helpfulness": null,
            "id": 50855295,
            "likes": {
                "disliked": null,
                "liked": null
            },
            "rating": 5.0,
            "stay_parameters": "Stayed December 2009, traveled as a couple",
            "text": "The Qubus lived up to the other positive reviews. After a day visiting Krakow the sauna, pool, jacuzzi and steam room were perfect. Our room was spacious enough with new facilities including a lovely bathroom, a large TV and free internet connection. The bed was very comfortable although we would have preferred one large duvet rather than two single ones. Transport was great and trams to the centre left from nearby square every 10 mins.",
            "title": "An excellent base to visit this interesting city.",
            "user": "SussexCrystal"
        },
        {
            "date": "December 6, 2009",
            "detail_rating": {
                "business": null,
                "cleanliness": 4.0,
                "desk": null,
                "location": 2.0,
                "pool": null,
                "restaurant": null,
                "rooms": 4.0,
                "service": 4.0,
                "sleep": null,
                "value": 4.0
            },
            "helpfulness": 1,
            "id": 50761042,
            "likes": {
                "disliked": null,
                "liked": null
            },
            "rating": 4.0,
            "stay_parameters": "Stayed November 2009, traveled as a couple",
            "text": "Staff were friendly and helpful. We did not eat in the restaurant in the evening, partly because the breakfasts are so varied and plentiful that we weren't hungry for the rest of the day!! In 4 days we had plenty to do including a one day visit to Auschwitz.",
            "title": "Great hotel, friendly and helpful staff.",
            "user": "ByeByePaula"
        },
        {
            "date": "December 6, 2009",
            "detail_rating": {
                "business": null,
                "cleanliness": 5.0,
                "desk": null,
                "location": 4.0,
                "pool": null,
                "restaurant": null,
                "rooms": 4.0,
                "service": 4.0,
                "sleep": null,
                "value": 4.0
            },
            "helpfulness": 1,
            "id": 50757937,
            "likes": {
                "disliked": null,
                "liked": null
            },
            "rating": 4.0,
            "stay_parameters": "Stayed December 2009, traveled as a couple",
            "text": "The hotel was a bit out of the way, but we like walking so it wasn't a problem. There were tram stops close by and taxis were not expensive. We felt quite safe walking day and night. A good buffet breakfast was included with our room rate. We ate dinner one night in the restaurant and it was good. It's a real pity that Poland still allows smoking indoors, but the hotel must have had excellent air conditioning as I didn't notice it at all. The rooms were clean and comfortable, with a good sized bathroom. We had the option of a non-smoking room. All the staff spoke English and were helpful.",
            "title": "Just the job",
            "user": "LushWirral"
        },
        {
            "date": "November 14, 2009",
            "detail_rating": {
                "business": null,
                "cleanliness": 5.0,
                "desk": null,
                "location": 4.0,
                "pool": null,
                "restaurant": null,
                "rooms": 5.0,
                "service": 5.0,
                "sleep": null,
                "value": 5.0
            },
            "helpfulness": 2,
            "id": 49195294,
            "likes": {
                "disliked": null,
                "liked": null
            },
            "rating": 5.0,
            "stay_parameters": "Stayed November 2009, traveled as a couple",
            "text": "A real bonus was that the main tours pick up from the hotel. We booked the Camps and the Salt Mine, and I would recommend both. You can book the tours at the hotel and the prices were good. All very easy.",
            "title": "Fabulous",
            "user": "claychalk"
        },
        {
            "date": "November 3, 2009",
            "detail_rating": {
                "business": null,
                "cleanliness": null,
                "desk": null,
                "location": null,
                "pool": null,
                "restaurant": null,
                "rooms": null,
                "service": null,
                "sleep": null,
                "value": null
            },
            "helpfulness": null,
            "id": 48422036,
            "likes": {
                "disliked": null,
                "liked": null
            },
            "rating": 4.0,
            "stay_parameters": null,
            "text": "There is a large mall a short walk away.",
            "title": "Excellent",
            "user": "TheDavey56"
        }
    ],
    "slim_ranking": 0.14406779661,
    "stars": 4,
    "tripadvisor": {
        "VISITED": false,
        "country_name": null,
        "locality": null,
        "pic_link": null,
        "street_address": null
    },
    "user_rating": 4.5,
    "variance": {
        "average": 39,
        "excellent": 380,
        "poor": 15,
        "terrible": 6,
        "very good": 225
    }
}