{
    "aka": "Beach Club Hotel",
    "description": "With its absolute beachfront location, the Beach Club offers the ultimate romantic island holiday experience. Set in landscaped gardens, all 57 rooms face directly onto Catseye Beach, each with theirown private courtyard or balcony. Exclusive room inclusions/ A la carte breakfast daily at the Beach Club restaurant / VIP return Hamilton Island airport/marina to Beach Club transfers / VIP chauffeur service / Use of catamarans, paddle skis, windsurfers and snorkellingequipment / Use of the gym, spa and sauna / Tennis and squash court hire / Use of the Beach Club lounge, pool and restaurant. Note: Beach Club does not cater for persons under the age of 18 years",
    "detail_rating": {
        "cleanliness": 4.5,
        "location": 5.0,
        "rooms": 4.0,
        "service": 4.5,
        "sleep": 4.5,
        "value": 4.5
    },
    "location": {
        "city": null,
        "continent": null,
        "country": null,
        "proposed_city": "Hamilton",
        "province": null,
        "region": null
    },
    "name": "Beach Club",
    "places": {
        "aka": [],
        "hotel_description": [
            "Hamilton"
        ],
        "hotel_name": []
    },
    "review_count": 422,
    "review_count_current": 25,
    "reviews": [
        {
            "date": "December 19, 2006",
            "detail_rating": {
                "business": null,
                "cleanliness": null,
                "desk": null,
                "location": null,
                "pool": null,
                "restaurant": null,
                "rooms": null,
                "service": null,
                "sleep": null,
                "value": null
            },
            "helpfulness": null,
            "id": 6472252,
            "likes": {
                "disliked": null,
                "liked": null
            },
            "rating": 5.0,
            "stay_parameters": null,
            "text": "I visited Hamilton from the UK via Sydney and on arriving spent 3 days on a boat sailing around some of the islands. After 3 days of 'boat living' - i.e. not being able to have a decent shower, the luxury of the Beach Club was a welcome 4 days stay.",
            "title": "Get away from it all",
            "user": "Meg_99_Mcr"
        },
        {
            "date": "November 21, 2006",
            "detail_rating": {
                "business": null,
                "cleanliness": null,
                "desk": null,
                "location": null,
                "pool": null,
                "restaurant": null,
                "rooms": null,
                "service": null,
                "sleep": null,
                "value": null
            },
            "helpfulness": null,
            "id": 6160294,
            "likes": {
                "disliked": null,
                "liked": null
            },
            "rating": 5.0,
            "stay_parameters": null,
            "text": "Its setting is perfect, and the VIP valet buggy service means you don't have to worry about hiring your own - they just take you where you want to go and pick you up at any time of the day or night.",
            "title": "Heaven for the Rich",
            "user": "Leasha"
        },
        {
            "date": "November 15, 2006",
            "detail_rating": {
                "business": null,
                "cleanliness": null,
                "desk": null,
                "location": null,
                "pool": null,
                "restaurant": null,
                "rooms": null,
                "service": null,
                "sleep": null,
                "value": null
            },
            "helpfulness": null,
            "id": 6134806,
            "likes": {
                "disliked": null,
                "liked": null
            },
            "rating": 5.0,
            "stay_parameters": null,
            "text": "Hamilton has a harbour and restaurants and shops around it - rather than just being one hotel with its own facilities (like Haymen island). You can go out of your hotel onto the harbour and watch the world go by.",
            "title": "Loved the Beach Club!",
            "user": "CJ25"
        },
        {
            "date": "November 1, 2006",
            "detail_rating": {
                "business": null,
                "cleanliness": null,
                "desk": null,
                "location": null,
                "pool": null,
                "restaurant": null,
                "rooms": null,
                "service": null,
                "sleep": null,
                "value": null
            },
            "helpfulness": null,
            "id": 6042596,
            "likes": {
                "disliked": null,
                "liked": null
            },
            "rating": 5.0,
            "stay_parameters": null,
            "text": "Perfect for a few days of relaxation on the beach or by the infinity pool.",
            "title": "Steven and Michelle's Romantic Honeymoon week @ the Beach club",
            "user": "mybelle"
        },
        {
            "date": "August 12, 2006",
            "detail_rating": {
                "business": null,
                "cleanliness": null,
                "desk": null,
                "location": null,
                "pool": null,
                "restaurant": null,
                "rooms": null,
                "service": null,
                "sleep": null,
                "value": null
            },
            "helpfulness": null,
            "id": 5602394,
            "likes": {
                "disliked": null,
                "liked": null
            },
            "rating": 3.0,
            "stay_parameters": null,
            "text": "Highlight of the islands - taking the sea plane over the Barrier Reef and landing on Whitehaven Beach for a glass of Champagne. A must do....",
            "title": "Bit of a bizarre place",
            "user": "Sharen"
        },
        {
            "date": "May 7, 2008",
            "detail_rating": {
                "business": 3.0,
                "cleanliness": 5.0,
                "desk": null,
                "front_desk": 5.0,
                "location": 4.0,
                "pool": null,
                "restaurant": null,
                "rooms": 5.0,
                "service": 5.0,
                "sleep": null,
                "value": 5.0
            },
            "helpfulness": 2,
            "id": 15743630,
            "likes": {
                "disliked": null,
                "liked": null
            },
            "rating": 5.0,
            "stay_parameters": "Stayed April 2008, traveled as a couple",
            "text": "I stayed at Beach Club for 3 nights towards the end of April and was very impressed with everthing about the resort - the rooms were immaculate; the gardens and beach clean; and the restaurant food delicious (and good value). The owner, Mike, was extermely friendly and full of advice about the island, as were all the guests staying there. I'd highly recommend this hotel.",
            "title": "One of the best in Vietnam",
            "user": "catherine_simpson10"
        },
        {
            "date": "May 5, 2008",
            "detail_rating": {
                "business": null,
                "cleanliness": null,
                "desk": null,
                "location": null,
                "pool": null,
                "restaurant": null,
                "rooms": null,
                "service": null,
                "sleep": null,
                "value": null
            },
            "helpfulness": 3,
            "id": 15650915,
            "likes": {
                "disliked": null,
                "liked": null
            },
            "rating": 5.0,
            "stay_parameters": null,
            "text": "Compared with the other resorts, the Beach Club is the closest one to the beach. Meanwhile, it is the best location for appreciating the sunset. They have an excellent chef to cook for the yummy food not only the western style but also the vientname style.",
            "title": "Trangile place to stay, yummy food to taste...",
            "user": "Bonbonsh"
        },
        {
            "date": "March 23, 2008",
            "detail_rating": {
                "business": null,
                "cleanliness": 4.0,
                "desk": null,
                "front_desk": 5.0,
                "location": 5.0,
                "pool": null,
                "restaurant": null,
                "rooms": 4.0,
                "service": 5.0,
                "sleep": null,
                "value": 5.0
            },
            "helpfulness": 4,
            "id": 14476201,
            "likes": {
                "disliked": "\u2014 Nothing!",
                "liked": "\u2014 the location and the amazing staff"
            },
            "rating": 5.0,
            "stay_parameters": "Stayed December 2007, traveled as a couple",
            "text": "Staffs are very sweet to look after every guest. They also recommend a spectacular beach to us - Bai Sao Beach, which is really a fatanstic place to enjoy sunshine, the white and soft beach.",
            "title": "Dreaming We were still there....",
            "user": "ladytravelbugLA"
        },
        {
            "date": "December 30, 2007",
            "detail_rating": {
                "business": null,
                "cleanliness": null,
                "desk": null,
                "location": null,
                "pool": null,
                "restaurant": null,
                "rooms": null,
                "service": null,
                "sleep": null,
                "value": null
            },
            "helpfulness": 4,
            "id": 12093110,
            "likes": {
                "disliked": null,
                "liked": null
            },
            "rating": 5.0,
            "stay_parameters": null,
            "text": "Last but not the least, the cost is really modest on both accommodation and meal.",
            "title": "Our little paradise",
            "user": "Troeim"
        },
        {
            "date": "November 7, 2007",
            "detail_rating": {
                "business": null,
                "cleanliness": 5.0,
                "desk": null,
                "location": 5.0,
                "pool": null,
                "restaurant": null,
                "rooms": 4.0,
                "service": 5.0,
                "sleep": null,
                "value": 5.0
            },
            "helpfulness": 1,
            "id": 10674858,
            "likes": {
                "disliked": "\u2014 nothing. Got exactly what we expected.",
                "liked": "\u2014 Location, value, staff"
            },
            "rating": 5.0,
            "stay_parameters": "Stayed November 2006, traveled as a couple",
            "text": "If you are planning trips to Phu Quoc, four gals highly recommeded that places as your holiday resort.",
            "title": "Excellent, relaxing place. Amazing Value",
            "user": "powderdaysinjax"
        },
        {
            "date": "April 30, 2007",
            "detail_rating": {
                "business": null,
                "cleanliness": null,
                "desk": null,
                "location": null,
                "pool": null,
                "restaurant": null,
                "rooms": null,
                "service": null,
                "sleep": null,
                "value": null
            },
            "helpfulness": null,
            "id": 7483837,
            "likes": {
                "disliked": null,
                "liked": null
            },
            "rating": 4.0,
            "stay_parameters": null,
            "text": "We chose this hotel mainly because it seemed to be the best on the island and I must admit I still belive this to be true.",
            "title": "Quite a suprise",
            "user": "MissTravelAlot"
        },
        {
            "date": "April 17, 2007",
            "detail_rating": {
                "business": null,
                "cleanliness": null,
                "desk": null,
                "location": null,
                "pool": null,
                "restaurant": null,
                "rooms": null,
                "service": null,
                "sleep": null,
                "value": null
            },
            "helpfulness": null,
            "id": 7380123,
            "likes": {
                "disliked": null,
                "liked": null
            },
            "rating": 5.0,
            "stay_parameters": null,
            "text": "The rooms where typical queensland style. Nothing overly flash. The bathrooms where quite large. But realistically your not going to spend alot of time in your rooms.",
            "title": "Near perfect",
            "user": "MikeMoss"
        },
        {
            "date": "April 6, 2007",
            "detail_rating": {
                "business": null,
                "cleanliness": null,
                "desk": null,
                "location": null,
                "pool": null,
                "restaurant": null,
                "rooms": null,
                "service": null,
                "sleep": null,
                "value": null
            },
            "helpfulness": null,
            "id": 7287700,
            "likes": {
                "disliked": null,
                "liked": null
            },
            "rating": 5.0,
            "stay_parameters": null,
            "text": "The hotel breakfast is the best weve encountered anywhere ( in this country or overseas )",
            "title": "Perfect",
            "user": "neda2000"
        },
        {
            "date": "February 17, 2007",
            "detail_rating": {
                "business": null,
                "cleanliness": null,
                "desk": null,
                "location": null,
                "pool": null,
                "restaurant": null,
                "rooms": null,
                "service": null,
                "sleep": null,
                "value": null
            },
            "helpfulness": null,
            "id": 6804230,
            "likes": {
                "disliked": null,
                "liked": null
            },
            "rating": 3.0,
            "stay_parameters": null,
            "text": "But by far the best thing we did was the degustation dinner. We had wine matched courses served to us right on the beach. The hotel sets up tables on the shore with your own personal waiter. If you consider yourself to be a 'foodie' you wont want to miss out on this one. Once again weve eaten degustations all around Australia and this one is high on our list. The setting cant be beaten by anything else.",
            "title": "Beach Club - hotel 4* service 3*",
            "user": "jclewis80"
        },
        {
            "date": "February 11, 2007",
            "detail_rating": {
                "business": null,
                "cleanliness": null,
                "desk": null,
                "location": null,
                "pool": null,
                "restaurant": null,
                "rooms": null,
                "service": null,
                "sleep": null,
                "value": null
            },
            "helpfulness": null,
            "id": 6779732,
            "likes": {
                "disliked": null,
                "liked": null
            },
            "rating": 4.0,
            "stay_parameters": null,
            "text": "We had previously stayed on Daydream Island which failed dismally compared to Hamilton Island. If your trying to decide Hamilton trumps Daydream any day. The only thing it is lacking, which Daydream is not, is a day spa. You would think Hamilton Island or particularly the Beach Club would provide a Day spa. But maybe with the new resort set to open at the end of 2007?",
            "title": "As good as we expected",
            "user": "Rugbytraveller"
        },
        {
            "date": "August 9, 2006",
            "detail_rating": {
                "business": null,
                "cleanliness": null,
                "desk": null,
                "location": null,
                "pool": null,
                "restaurant": null,
                "rooms": null,
                "service": null,
                "sleep": null,
                "value": null
            },
            "helpfulness": null,
            "id": 5593112,
            "likes": {
                "disliked": null,
                "liked": null
            },
            "rating": 5.0,
            "stay_parameters": null,
            "text": "We are curently enjoying our second last day at the Beach Club, and it has exceeded our expectations.",
            "title": "Loved the Beach Club",
            "user": "Blobby"
        },
        {
            "date": "July 16, 2006",
            "detail_rating": {
                "business": null,
                "cleanliness": null,
                "desk": null,
                "location": null,
                "pool": null,
                "restaurant": null,
                "rooms": null,
                "service": null,
                "sleep": null,
                "value": null
            },
            "helpfulness": null,
            "id": 5471684,
            "likes": {
                "disliked": null,
                "liked": null
            },
            "rating": 5.0,
            "stay_parameters": null,
            "text": "We are here for a combined 50th birthday and 22nd wedding anniversary and are delighted with our choice.",
            "title": "Wonderful Resort, best on Hamilton",
            "user": "N_Cane"
        },
        {
            "date": "May 24, 2006",
            "detail_rating": {
                "business": null,
                "cleanliness": null,
                "desk": null,
                "location": null,
                "pool": null,
                "restaurant": null,
                "rooms": null,
                "service": null,
                "sleep": null,
                "value": null
            },
            "helpfulness": null,
            "id": 5207951,
            "likes": {
                "disliked": null,
                "liked": null
            },
            "rating": 5.0,
            "stay_parameters": null,
            "text": "I was originally going to book at Hayman Island, but was hesitant after reading some of the latest reviews.",
            "title": "Excellent, Romantic & Tranquil",
            "user": "Happyfolk"
        },
        {
            "date": "May 16, 2006",
            "detail_rating": {
                "business": null,
                "cleanliness": null,
                "desk": null,
                "location": null,
                "pool": null,
                "restaurant": null,
                "rooms": null,
                "service": null,
                "sleep": null,
                "value": null
            },
            "helpfulness": null,
            "id": 5145108,
            "likes": {
                "disliked": null,
                "liked": null
            },
            "rating": 5.0,
            "stay_parameters": null,
            "text": "The location is magnificent (get a ground floor room if at all possible as you can walk straight onto the beach) and the staff are as friendly and helpful as other reviewers have remarked.",
            "title": "Wonderful place",
            "user": "vineyard1"
        },
        {
            "date": "November 13, 2008",
            "detail_rating": {
                "business": null,
                "cleanliness": 3.0,
                "desk": null,
                "front_desk": 3.0,
                "location": 1.0,
                "pool": null,
                "restaurant": null,
                "rooms": 2.0,
                "service": 3.0,
                "sleep": null,
                "value": 2.0
            },
            "helpfulness": 8,
            "id": 21833947,
            "likes": {
                "disliked": null,
                "liked": null
            },
            "rating": 2.0,
            "stay_parameters": "Stayed October 2008, traveled with family",
            "text": "We had four days here in October. The food is reasonable although prices are 4 times higher than anywhere else in Vietnam as they have you captive here. Also laundry is $4.00 US a kilo, also 4 times higher than anywhere else in Vietnam. The rooms are clean and very basic (fans and cold water only unless you are in the huts that have hot water) and for $20.00 US a night it is what it is.",
            "title": "A teeny piece of clean beach in the middle of a garbage dump!",
            "user": "helenm2331"
        },
        {
            "date": "November 2, 2008",
            "detail_rating": {
                "business": null,
                "cleanliness": 5.0,
                "desk": null,
                "front_desk": 5.0,
                "location": 5.0,
                "pool": null,
                "restaurant": null,
                "rooms": 5.0,
                "service": 5.0,
                "sleep": null,
                "value": 5.0
            },
            "helpfulness": 1,
            "id": 21476186,
            "likes": {
                "disliked": "\u2014 nothing!",
                "liked": "\u2014 the beach, the hammocks, the sunsets, the food"
            },
            "rating": 5.0,
            "stay_parameters": "Stayed October 2008, traveled as a couple",
            "text": "It was not peaceful while we were here, the large mansion next door is being renovated and there was constant construction noise, diesel motors blowing smoke all over us right next to our deck chairs on the beach.",
            "title": "Absolutely fantastic!",
            "user": "TravelgirlHamburg"
        },
        {
            "date": "October 31, 2008",
            "detail_rating": {
                "business": 5.0,
                "cleanliness": 5.0,
                "desk": null,
                "front_desk": 5.0,
                "location": 5.0,
                "pool": null,
                "restaurant": null,
                "rooms": 5.0,
                "service": 5.0,
                "sleep": null,
                "value": 5.0
            },
            "helpfulness": 1,
            "id": 21417678,
            "likes": {
                "disliked": "\u2014 Having to leave!",
                "liked": "\u2014 Sang! It is s super friendly, very clean and so cosy!"
            },
            "rating": 5.0,
            "stay_parameters": "Stayed September 2008, traveled as a couple",
            "text": "As you are driving from the aiport you realise how remote you are from anywhere. If you are off on excursions all day diving etc. it is peaceful at night to come back to, a bit too peaceful for us though. Also the beach is kept very clean directly in front of the property however 2 feet either side the rubbish is horrendous and goes for the length of the beach, we would not go back in the water after running into fluorescent light tubes, glass bottles and light globes that littered the water. It may be nice to see the livestock appear on the beach, however they use the sand as their bathroom...not pleasant.",
            "title": "A Great Getaway!",
            "user": "AndreaMuir"
        },
        {
            "date": "October 18, 2008",
            "detail_rating": {
                "business": null,
                "cleanliness": 4.0,
                "desk": null,
                "front_desk": 5.0,
                "location": 4.0,
                "pool": null,
                "restaurant": null,
                "rooms": 3.0,
                "service": 5.0,
                "sleep": null,
                "value": 5.0
            },
            "helpfulness": 1,
            "id": 20974594,
            "likes": {
                "disliked": "\u2014 A bit far out of town.",
                "liked": "\u2014 Great location, comfortable, incredible service"
            },
            "rating": 5.0,
            "stay_parameters": "Stayed October 2008, traveled as a couple",
            "text": "The young lady managing it is great (as is the young man), however when she is out the staff lay around in the hammocks and the local ladies peddling their massages take over the beach lounges, not a good look. Maybe Mike should pop in unannounced once in a while.",
            "title": "Beach Club was great!",
            "user": "dsh82"
        },
        {
            "date": "August 22, 2008",
            "detail_rating": {
                "business": 2.0,
                "cleanliness": 3.0,
                "desk": null,
                "front_desk": 4.0,
                "location": 4.0,
                "pool": null,
                "restaurant": null,
                "rooms": 3.0,
                "service": 4.0,
                "sleep": null,
                "value": 4.0
            },
            "helpfulness": 1,
            "id": 19225512,
            "likes": {
                "disliked": "\u2014 No internet access and the nearest internet cafe is 4 kms away!",
                "liked": "\u2014 The ambience"
            },
            "rating": 4.0,
            "stay_parameters": "Stayed August 2008, traveled solo",
            "text": "There are better choices that Beach Club, do your homework.",
            "title": "A peaceful getaway with beautiful sunsets",
            "user": "GoannaSydney"
        },
        {
            "date": "August 24, 2007",
            "detail_rating": {
                "business": null,
                "cleanliness": null,
                "desk": null,
                "location": null,
                "pool": null,
                "restaurant": null,
                "rooms": null,
                "service": null,
                "sleep": null,
                "value": null
            },
            "helpfulness": 5,
            "id": 8497250,
            "likes": {
                "disliked": null,
                "liked": null
            },
            "rating": 5.0,
            "stay_parameters": null,
            "text": "8 off us, 4 in out 40's, 3 late teens and a 12 year old, stayed at the Beach Club for 7 nights in July.",
            "title": "Fantastic Hospitality Wondrful Location",
            "user": "ZUNIGA"
        }
    ],
    "slim_ranking": 0.4,
    "stars": 4.5,
    "tripadvisor": {
        "VISITED": false,
        "country_name": null,
        "locality": null,
        "pic_link": null,
        "street_address": null
    },
    "user_rating": 4.5,
    "variance": {
        "average": 54,
        "excellent": 257,
        "poor": 11,
        "terrible": 5,
        "very good": 95
    }
}