{
    "aka": "Duckmaloi Farm Oberon, Blue Mountains, Australia",
    "description": null,
    "detail_rating": {
        "cleanliness": null,
        "location": null,
        "rooms": null,
        "service": null,
        "sleep": null,
        "value": null
    },
    "location": {
        "city": null,
        "continent": "South Pacific",
        "country": "Australia",
        "proposed_city": null,
        "province": null,
        "region": null
    },
    "name": "Duckmaloi Farm",
    "places": {
        "aka": [],
        "hotel_description": [],
        "hotel_name": []
    },
    "review_count": 22,
    "review_count_current": 1,
    "reviews": [
        {
            "date": "March 31, 2008",
            "detail_rating": {
                "business": null,
                "cleanliness": 5.0,
                "desk": null,
                "front_desk": 5.0,
                "location": 5.0,
                "pool": null,
                "restaurant": null,
                "rooms": 5.0,
                "service": 5.0,
                "sleep": null,
                "value": 5.0
            },
            "helpfulness": 2,
            "id": 14673425,
            "likes": {
                "disliked": "\u2014 I cannot complain about anything",
                "liked": "\u2014 Quiet and peaceful, spectacular views and wildlife."
            },
            "rating": 5.0,
            "stay_parameters": "Stayed March 2008, traveled with family",
            "text": "Oh, what a find! This place is a drive past all the usual tourist traps. It is situated in the country about 15-20 mins drive from Oberon. We stayed in one of the cabins. It is set overlooking the mountains, the views are terrific. The cabins have everything you might need and if it isnt there the Patersons will try to provide it. Mr & Mrs Paterson were very friendly and helpful. We bought our food from the supermarket in Oberon (they do great hot cooked chickens!) and the Patersons are happy to lend a cooler box to take out a picnic.",
            "title": "Fantastic experience, beautiful, peaceful surroundings",
            "user": "tulip"
        }
    ],
    "slim_ranking": 0.4,
    "stars": null,
    "tripadvisor": {
        "VISITED": false,
        "country_name": null,
        "locality": null,
        "pic_link": null,
        "street_address": null
    },
    "user_rating": 4.5,
    "variance": {
        "average": 1,
        "excellent": 16,
        "poor": 0,
        "terrible": 1,
        "very good": 4
    }
}