{
    "aka": "Sukantara Cascade Resort And Spa",
    "description": "Natural Luxury boutique resort which is the perfect for private romantic honeymoon. The Resort lies on the sloping bank of a mountain stream in the verdant Chiangmai highland. Mountain water cascades over boulders in the stream, creating tiered waterfalls right below the Lanna-Balinese-style guest cottages and offers the blissful experiences of close-to-nature living, that will remain a cherished memory for a lifetime.",
    "detail_rating": {
        "cleanliness": null,
        "location": null,
        "rooms": null,
        "service": null,
        "sleep": null,
        "value": null
    },
    "location": {
        "city": "Mae Rim",
        "continent": "Asia",
        "country": "Thailand",
        "proposed_city": null,
        "province": null,
        "region": null
    },
    "name": "Sukantara Cascade Resort & Spa",
    "places": {
        "aka": [],
        "hotel_description": [],
        "hotel_name": []
    },
    "review_count": 84,
    "review_count_current": 20,
    "reviews": [
        {
            "date": "May 30, 2008",
            "detail_rating": {
                "business": 5.0,
                "cleanliness": 5.0,
                "desk": null,
                "front_desk": 5.0,
                "location": 5.0,
                "pool": null,
                "restaurant": null,
                "rooms": 5.0,
                "service": 5.0,
                "sleep": null,
                "value": 5.0
            },
            "helpfulness": null,
            "id": 16508495,
            "likes": {
                "disliked": "\u2014 the steps to get there!",
                "liked": "\u2014 Luxury Camp - modern appliances in nature"
            },
            "rating": 5.0,
            "stay_parameters": "Stayed January 2008, traveled solo",
            "text": "The Luxury Camp was an amazing experience which exceeded our expectations.",
            "title": "Luxury Camp",
            "user": "EliseAustralia"
        },
        {
            "date": "May 20, 2008",
            "detail_rating": {
                "business": null,
                "cleanliness": null,
                "desk": null,
                "front_desk": 5.0,
                "location": 5.0,
                "pool": null,
                "restaurant": null,
                "rooms": 5.0,
                "service": 5.0,
                "sleep": null,
                "value": 5.0
            },
            "helpfulness": null,
            "id": 16259625,
            "likes": {
                "disliked": null,
                "liked": "\u2014 Everything"
            },
            "rating": 5.0,
            "stay_parameters": "Stayed February 2008, traveled with family",
            "text": "The relaxed atmosphere was really comfortable, fitted with modern appliances, hot water an in ground spa bath and bamboo shower - pure luxury in Northern Thailand! If you are looking for modern comfort in a relaxed atmosphere with stunning waterfall views, visit Sukantara and stay in the luxury camp - it is an experience to remember!",
            "title": "A Perfect Selection",
            "user": "westnewyorknj"
        },
        {
            "date": "May 16, 2008",
            "detail_rating": {
                "business": 4.0,
                "cleanliness": 5.0,
                "desk": null,
                "front_desk": 5.0,
                "location": 4.0,
                "pool": null,
                "restaurant": null,
                "rooms": 5.0,
                "service": 5.0,
                "sleep": null,
                "value": 5.0
            },
            "helpfulness": null,
            "id": 16078897,
            "likes": {
                "disliked": "\u2014 Nothing..It was fantastic",
                "liked": "\u2014 The location and relaxation and staff"
            },
            "rating": 5.0,
            "stay_parameters": "Stayed April 2008, traveled with friends",
            "text": "Australia",
            "title": "The most beautiful place in Thailand",
            "user": "missfe"
        },
        {
            "date": "January 10, 2008",
            "detail_rating": {
                "business": 4.0,
                "cleanliness": 4.0,
                "desk": null,
                "front_desk": 5.0,
                "location": 5.0,
                "pool": null,
                "restaurant": null,
                "rooms": 5.0,
                "service": 5.0,
                "sleep": null,
                "value": 4.0
            },
            "helpfulness": null,
            "id": 12484521,
            "likes": {
                "disliked": null,
                "liked": "\u2014 The amazing setting"
            },
            "rating": 5.0,
            "stay_parameters": "Stayed April 2007, traveled solo",
            "text": "We chose Sukantara after speaking directly with the hotel owner, reviewing the web site and reading reviews. I was traveling with my wife and parents for two weeks around Thailand and the 4 days we stayed at Sukantara were the best days by far of the wonderful vacation.",
            "title": "Spectacular, private setting!",
            "user": "Sarah2015"
        },
        {
            "date": "November 22, 2007",
            "detail_rating": {
                "business": 5.0,
                "cleanliness": 5.0,
                "desk": null,
                "front_desk": 5.0,
                "location": 2.0,
                "pool": null,
                "restaurant": null,
                "rooms": 5.0,
                "service": 5.0,
                "sleep": null,
                "value": 4.0
            },
            "helpfulness": 1,
            "id": 10975746,
            "likes": {
                "disliked": "\u2014 See review",
                "liked": "\u2014 The lush exotic plants/greenery @ ur fingertips"
            },
            "rating": 4.0,
            "stay_parameters": "Stayed June 2006, traveled as a couple",
            "text": "The setting is out of a movie and the staff makes sure your stay is undisturbed, as you get acquainted with the beauty of your surroundings. The food was so fresh and tasteful; better yet, it was so reasonably priced for the quality. Each one of us experienced a spa treatment and it was so incredibly tranquil and restorative.",
            "title": "Loved it!",
            "user": "EileenKM"
        },
        {
            "date": "September 26, 2010",
            "detail_rating": {
                "business": null,
                "cleanliness": 5.0,
                "desk": null,
                "location": 5.0,
                "pool": null,
                "restaurant": null,
                "rooms": 5.0,
                "service": 5.0,
                "sleep": 5.0,
                "value": 5.0
            },
            "helpfulness": null,
            "id": 81058355,
            "likes": {
                "disliked": null,
                "liked": null
            },
            "rating": 5.0,
            "stay_parameters": "Stayed September 2010, traveled as a couple",
            "text": "Sukantara is a Must that is have to try once in your life...Landscape,people and food are fantastic and you feel like in another dimesion so faraway from our western way of life.",
            "title": "AMAZING...",
            "user": "BAFFO76"
        },
        {
            "date": "July 12, 2010",
            "detail_rating": {
                "business": null,
                "cleanliness": 5.0,
                "desk": null,
                "location": 3.0,
                "pool": null,
                "restaurant": null,
                "rooms": 5.0,
                "service": 3.0,
                "sleep": 4.0,
                "value": 3.0
            },
            "helpfulness": null,
            "id": 70570381,
            "likes": {
                "disliked": null,
                "liked": null
            },
            "rating": 4.0,
            "stay_parameters": "Stayed December 2009, traveled with friends",
            "text": "I would like to thanks all the staff and especially Sam you give us a dream.",
            "title": "Gem in the forest",
            "user": "L1b3rty"
        },
        {
            "date": "March 1, 2010",
            "detail_rating": {
                "business": null,
                "cleanliness": 3.0,
                "desk": null,
                "location": 3.0,
                "pool": null,
                "restaurant": null,
                "rooms": 3.0,
                "service": 3.0,
                "sleep": 4.0,
                "value": 3.0
            },
            "helpfulness": 1,
            "id": 57392065,
            "likes": {
                "disliked": null,
                "liked": null
            },
            "rating": 3.0,
            "stay_parameters": "Stayed February 2010, traveled solo",
            "text": "Thank you...",
            "title": "A tropical paradise with mixed feelings",
            "user": "la_speranza"
        },
        {
            "date": "June 20, 2009",
            "detail_rating": {
                "business": null,
                "cleanliness": 5.0,
                "desk": null,
                "location": 5.0,
                "pool": null,
                "restaurant": null,
                "rooms": 5.0,
                "service": 5.0,
                "sleep": null,
                "value": 5.0
            },
            "helpfulness": null,
            "id": 32718271,
            "likes": {
                "disliked": null,
                "liked": null
            },
            "rating": 5.0,
            "stay_parameters": "Stayed June 2009, traveled with family",
            "text": "With love,",
            "title": "The second we walked in, we didn't want to leave.",
            "user": "SpaManMiami"
        },
        {
            "date": "August 15, 2008",
            "detail_rating": {
                "business": null,
                "cleanliness": 5.0,
                "desk": null,
                "front_desk": 5.0,
                "location": 5.0,
                "pool": null,
                "restaurant": null,
                "rooms": 5.0,
                "service": 5.0,
                "sleep": null,
                "value": 3.0
            },
            "helpfulness": null,
            "id": 18981728,
            "likes": {
                "disliked": null,
                "liked": "\u2014 the setting"
            },
            "rating": 5.0,
            "stay_parameters": "Stayed July 2008, traveled with friends",
            "text": "Andrea & Rossella",
            "title": "Stunning Setting",
            "user": "smartie_7"
        },
        {
            "date": "February 25, 2011",
            "detail_rating": {
                "business": null,
                "cleanliness": 5.0,
                "desk": null,
                "location": 1.0,
                "pool": null,
                "restaurant": null,
                "rooms": 3.0,
                "service": 1.0,
                "sleep": 3.0,
                "value": 1.0
            },
            "helpfulness": 1,
            "id": 97980587,
            "likes": {
                "disliked": null,
                "liked": null
            },
            "rating": 2.0,
            "stay_parameters": "Stayed February 2011, traveled as a couple",
            "text": "Sounds as though I've contradicted myself re location! It's in the middle of the most beautiful waterfall and woodland but you and are 9km from the nearest form of civilisation. The location relative to everything else is miles away yet we were led to believe it was just outside Chiang Mai. It will costs you at least a 900Baht round trip, if there's anyone there to take you and we were told it would be an hour's wait. if you want to go out to eat in Chiang Mai, it's 30km away - we rented a scooter but is still cost us 1,600 Baht to get to the rental shop. The food in the resort restaurant was awful and they are obviously abusing their monopoly. Our tent was stunning once inside but all the wood it's been built on is rotting away so we had to be very careful not to fall through it - it's only been built for 5 years so you'd have thought they'd have treated the wood properly. It was the most expensive place we have ever booked in Thailand and we'd have had better service and food in a guest house, as we did in other parts of Thailand. Frustratingly, every time we spoke to someone, their stock answer was \"ok, yes\" Admittedly, we're not fluent in Thai but, if they are boasting a 5 star resort, some form of communication would have been good.",
            "title": "5 star location but appalling quality service",
            "user": "vicvine1"
        },
        {
            "date": "January 15, 2011",
            "detail_rating": {
                "business": null,
                "cleanliness": 5.0,
                "desk": null,
                "location": 4.0,
                "pool": null,
                "restaurant": null,
                "rooms": 5.0,
                "service": 5.0,
                "sleep": 5.0,
                "value": 5.0
            },
            "helpfulness": null,
            "id": 92989998,
            "likes": {
                "disliked": null,
                "liked": null
            },
            "rating": 5.0,
            "stay_parameters": "Stayed September 2010, traveled with family",
            "text": "A marvelous place to visit. Beutiful scenery. I spent 4days and will surely visit this place again. If u need a peaceful and relaxation place to stay this is the best place to visit. In addition, the 3 peacocks at the resort are beautiful.",
            "title": "A hidden Gem and a paradise on earth.",
            "user": "Hudaolan"
        },
        {
            "date": "January 9, 2011",
            "detail_rating": {
                "business": null,
                "cleanliness": 1.0,
                "desk": null,
                "location": 3.0,
                "pool": null,
                "restaurant": null,
                "rooms": 1.0,
                "service": 1.0,
                "sleep": 1.0,
                "value": 1.0
            },
            "helpfulness": null,
            "id": 92325046,
            "likes": {
                "disliked": null,
                "liked": null
            },
            "rating": 1.0,
            "stay_parameters": "Stayed January 2011, traveled with friends",
            "text": "Property:",
            "title": "Very disappointing",
            "user": "liano212"
        },
        {
            "date": "January 8, 2011",
            "detail_rating": {
                "business": null,
                "cleanliness": 4.0,
                "desk": null,
                "location": 5.0,
                "pool": null,
                "restaurant": null,
                "rooms": 4.0,
                "service": 5.0,
                "sleep": 5.0,
                "value": 4.0
            },
            "helpfulness": null,
            "id": 92236393,
            "likes": {
                "disliked": null,
                "liked": null
            },
            "rating": 4.0,
            "stay_parameters": "Stayed December 2010, traveled with family",
            "text": "Breathtaking, out-door scenery that one would only see on a post card.",
            "title": "Lovely place that I could say which I can touch the real of natural, water fall, forest near by the town, about 30 KMs",
            "user": "great098"
        },
        {
            "date": "October 31, 2010",
            "detail_rating": {
                "business": null,
                "cleanliness": null,
                "desk": null,
                "location": null,
                "pool": null,
                "restaurant": null,
                "rooms": null,
                "service": null,
                "sleep": null,
                "value": null
            },
            "helpfulness": null,
            "id": 85434736,
            "likes": {
                "disliked": null,
                "liked": null
            },
            "rating": 5.0,
            "stay_parameters": null,
            "text": "Location:",
            "title": "Relaxing in Nature in comfort with GREAT food",
            "user": "jack181"
        },
        {
            "date": "November 1, 2011",
            "detail_rating": {
                "business": null,
                "cleanliness": 4.0,
                "desk": null,
                "location": 5.0,
                "pool": null,
                "restaurant": null,
                "rooms": 5.0,
                "service": 3.0,
                "sleep": 4.0,
                "value": 4.0
            },
            "helpfulness": null,
            "id": 120005720,
            "likes": {
                "disliked": null,
                "liked": null
            },
            "rating": 4.0,
            "stay_parameters": "Stayed October 2011, traveled with friends",
            "text": "We didn't stay there but went for dinner as I saw from the website how beautiful it is. The review also didn't confer confidence. Also, it was pretty expensive. But I am a sucker for cascades and waterfalls. We were the only diner. Perhaps even the the only guests in the resort! Therefore, they were very kind to give us the very best table - right on the rock platform next to the cascase. The rushing water was a mere 4 feet away! The cascade was beautifully lighted up. The sound of the rushing water hypnotizing... We just sat quietly enjoying the atmosphere.",
            "title": "Heavenly Location!",
            "user": "MelKualaLumpur"
        },
        {
            "date": "September 15, 2011",
            "detail_rating": {
                "business": null,
                "cleanliness": null,
                "desk": null,
                "location": 5.0,
                "pool": null,
                "restaurant": null,
                "rooms": 4.0,
                "service": 4.0,
                "sleep": null,
                "value": 3.0
            },
            "helpfulness": null,
            "id": 118140800,
            "likes": {
                "disliked": null,
                "liked": null
            },
            "rating": 4.0,
            "stay_parameters": "Stayed July 2011, traveled with family",
            "text": "Food was surprisingly pretty tasty. Our party of 3 included 2 Thais and a foreigner. Even my Thai friend commented that it was OK. After reading the reviews I expected pretty bad food, which we were prepared for since we were there more for the scenery. We had Thai Lard Nha, crispy and good prawn spring rolls and a couple of Thai salads. Portion was small though and the cost on a high side.",
            "title": "Beautiful place",
            "user": "Svegaard"
        },
        {
            "date": "July 23, 2011",
            "detail_rating": {
                "business": null,
                "cleanliness": 2.0,
                "desk": null,
                "location": 5.0,
                "pool": null,
                "restaurant": null,
                "rooms": 3.0,
                "service": 4.0,
                "sleep": null,
                "value": 2.0
            },
            "helpfulness": null,
            "id": 115670995,
            "likes": {
                "disliked": null,
                "liked": null
            },
            "rating": 3.0,
            "stay_parameters": "Stayed July 2011",
            "text": "After dinner we checked out the Deluxe Cottage closest to the restaurant. It was very nice - Luxurious, cosy and spacious. We didn't see any maintenance issue. Everything looked well maintained. Only thing was the room smelled of mildew. Perhaps due to irregular usage.",
            "title": "Past it's prime",
            "user": "Simon8999"
        },
        {
            "date": "July 9, 2011",
            "detail_rating": {
                "business": null,
                "cleanliness": 2.0,
                "desk": null,
                "location": null,
                "pool": null,
                "restaurant": null,
                "rooms": null,
                "service": 3.0,
                "sleep": 2.0,
                "value": 1.0
            },
            "helpfulness": 1,
            "id": 115183329,
            "likes": {
                "disliked": null,
                "liked": null
            },
            "rating": 3.0,
            "stay_parameters": "Stayed July 2011, traveled as a couple",
            "text": "My only regret is we arrived too late and it was already dark. I knew that they light up the cascade. Thus, chose this resort for our dinner. But once we arrived we wished that we got there while it was still bright since it would have been even more beautiful. Or at least beautiful in a different way.",
            "title": "Lovely garden setting but this hotel is no where near a 5 star. Overpriced!",
            "user": "PrincessR"
        },
        {
            "date": "May 16, 2011",
            "detail_rating": {
                "business": null,
                "cleanliness": 4.0,
                "desk": null,
                "location": 2.0,
                "pool": null,
                "restaurant": null,
                "rooms": 3.0,
                "service": 4.0,
                "sleep": 2.0,
                "value": 1.0
            },
            "helpfulness": 1,
            "id": 108485166,
            "likes": {
                "disliked": null,
                "liked": null
            },
            "rating": 3.0,
            "stay_parameters": "Stayed March 2011, traveled as a couple",
            "text": "Sukantara is a place to recommend - given you want something out of town and on the hillside. It's a beautiful area with opportunities to exploit. Make sure that you book a driver to your trips.",
            "title": "Trapped in paradise",
            "user": "Bhavi_BK"
        }
    ],
    "slim_ranking": 0.538461538462,
    "stars": 4.5,
    "tripadvisor": {
        "VISITED": false,
        "country_name": null,
        "locality": null,
        "pic_link": null,
        "street_address": null
    },
    "user_rating": 3.5,
    "variance": {
        "average": 14,
        "excellent": 28,
        "poor": 8,
        "terrible": 7,
        "very good": 27
    }
}