{
    "aka": null,
    "description": null,
    "detail_rating": {
        "cleanliness": null,
        "location": null,
        "rooms": null,
        "service": null,
        "sleep": null,
        "value": null
    },
    "location": {
        "city": null,
        "continent": "Europe",
        "country": "France",
        "proposed_city": null,
        "province": null,
        "region": "Rhone-Alpes"
    },
    "name": "Hotel Restaurant Les Mesanges",
    "places": {
        "aka": [],
        "hotel_description": [],
        "hotel_name": []
    },
    "review_count": 17,
    "review_count_current": 1,
    "reviews": [
        {
            "date": "October 14, 2006",
            "detail_rating": {
                "business": 2.0,
                "cleanliness": 3.0,
                "desk": null,
                "front_desk": 3.0,
                "location": 4.0,
                "pool": null,
                "restaurant": null,
                "rooms": 3.0,
                "service": 3.0,
                "sleep": null,
                "value": 4.0
            },
            "helpfulness": 1,
            "id": 5951469,
            "likes": {
                "disliked": "\u2014 No internet in rooms",
                "liked": "\u2014 Location"
            },
            "rating": 4.0,
            "stay_parameters": "Stayed September 2006, traveled on business",
            "text": "Stayed here for 2 nights on a work event. The hotel is a short drive above the village of Uriage-Les-Bains (you could walk down but beware of the climb back up again!).",
            "title": "Nice stay in a great location",
            "user": "Trav-london"
        }
    ],
    "slim_ranking": 1.0,
    "stars": null,
    "tripadvisor": {
        "VISITED": false,
        "country_name": null,
        "locality": null,
        "pic_link": null,
        "street_address": null
    },
    "user_rating": 4.0,
    "variance": {
        "average": 1,
        "excellent": 3,
        "poor": 1,
        "terrible": 1,
        "very good": 11
    }
}