{
    "aka": "Martinique On Macrossan Hotel Port Douglas",
    "description": "Martinique - perfect for a romantic getaway in the heart of Port Douglas; yet quiet, relaxing and charismatic. Martinique on Macrossan boasts 19 one bedroom apartments, each with their own kitchenette, bathroom and private balcony. Offering accommodation from one night to ninety one nights, this French Caribbean style complex is perfect for those wanting to escape the masses, stroll the beach just metres away, enjoy a BBQ in the lovingly maintained courtyard, or simply want to relax by the delightful pool area. This resort is one of a kind in Port Douglas, quiet, centrally located, charming, accepts one night stays and is child free. If you want to enjoy the tranquility and relaxing nature of this village, you must stay at Martinique.",
    "detail_rating": {
        "cleanliness": null,
        "location": null,
        "rooms": null,
        "service": null,
        "sleep": null,
        "value": null
    },
    "location": {
        "city": null,
        "continent": "South Pacific",
        "country": "Australia",
        "proposed_city": "Douglas",
        "province": null,
        "region": null
    },
    "name": "Martinique on Macrossan",
    "places": {
        "aka": [
            "Douglas"
        ],
        "hotel_description": [
            "Douglas"
        ],
        "hotel_name": []
    },
    "review_count": 321,
    "review_count_current": 10,
    "reviews": [
        {
            "date": "July 4, 2006",
            "detail_rating": {
                "business": null,
                "cleanliness": 3.0,
                "desk": null,
                "location": null,
                "pool": null,
                "restaurant": null,
                "rooms": 3.0,
                "service": 2.0,
                "sleep": null,
                "value": 3.0
            },
            "helpfulness": 10,
            "id": 5422702,
            "likes": {
                "disliked": null,
                "liked": null
            },
            "rating": 2.0,
            "stay_parameters": "Stayed June 2006",
            "text": "This place is OK off season for the Web rate. I wouldn\u2019t want to pay the rack rate. Or be there if it were full. Insulation is non existent and noises from the other apartments were a problem. On our 2nd night we decided to have a quiet night in with take-out and a movie (2 movie channels) However the people in next apartment were entertaining friends and we were forced to put the volume on full to hear. They were sitting on their balcony,but they may as well have been in the room with us.",
            "title": "4 Star in Queensland may not be what you expect",
            "user": "Globetrottin_Grannie"
        },
        {
            "date": "May 9, 2006",
            "detail_rating": {
                "business": null,
                "cleanliness": 4.0,
                "desk": null,
                "location": null,
                "pool": null,
                "restaurant": null,
                "rooms": 4.0,
                "service": 5.0,
                "sleep": null,
                "value": 5.0
            },
            "helpfulness": 4,
            "id": 5046228,
            "likes": {
                "disliked": null,
                "liked": null
            },
            "rating": 4.0,
            "stay_parameters": "Stayed April 2006",
            "text": "Kitchenette has microwave, toaster, cooking utensils & a lot of instructions taped to the wall. The fridge is too small; put in breakfast stuff; couple of beers &wine and it was full. Ants are a BIG problem in FNQ; they will attack any foodstuff not in fridge.",
            "title": "Wonderful stay at Martinique!",
            "user": "Diamond6_inPA"
        },
        {
            "date": "April 3, 2006",
            "detail_rating": {
                "business": null,
                "cleanliness": 5.0,
                "desk": null,
                "location": null,
                "pool": null,
                "restaurant": null,
                "rooms": 5.0,
                "service": 5.0,
                "sleep": null,
                "value": 5.0
            },
            "helpfulness": 4,
            "id": 4895088,
            "likes": {
                "disliked": null,
                "liked": null
            },
            "rating": 5.0,
            "stay_parameters": "Stayed March 2006",
            "text": "The lounge area was a decent size except we had most of our stuff draped on the chairs. There is one small wardrobe in the bedroom and nowhere to put bags except the floor. It is not serviced, but you can change your bath towels every 2nd day at the office if you can get there before closing time(6.00pm). There is an iron and board which I would gladly have swapped for a vacuum cleaner. They charge $5.00 pw for a hairdryer too.",
            "title": "Home away from Home",
            "user": "LizCalifornia"
        },
        {
            "date": "January 30, 2006",
            "detail_rating": {
                "business": null,
                "cleanliness": 3.0,
                "desk": null,
                "location": null,
                "pool": null,
                "restaurant": null,
                "rooms": 4.0,
                "service": 5.0,
                "sleep": null,
                "value": 4.0
            },
            "helpfulness": 5,
            "id": 4398294,
            "likes": {
                "disliked": null,
                "liked": null
            },
            "rating": 4.0,
            "stay_parameters": "Stayed January 2006",
            "text": "The public areas were extremely well kept, clean and appealing. The pool is household size and the pic.of the 4 lounges are it-there are 4.The one time we decided to hang out there, the racket from an overlooking apartment drove us away.",
            "title": "Great place, friendly hosts!",
            "user": "NYCTravelGal"
        },
        {
            "date": "January 23, 2006",
            "detail_rating": {
                "business": null,
                "cleanliness": null,
                "desk": null,
                "location": null,
                "pool": null,
                "restaurant": null,
                "rooms": null,
                "service": null,
                "sleep": null,
                "value": null
            },
            "helpfulness": 3,
            "id": 4372154,
            "likes": {
                "disliked": null,
                "liked": null
            },
            "rating": 4.0,
            "stay_parameters": null,
            "text": "It\u2019s close to Four mile beach which is fine for walking or running at low tide, too windy to spend much time on.",
            "title": "wow its hot",
            "user": "A TripAdvisor user"
        },
        {
            "date": "January 18, 2006",
            "detail_rating": {
                "business": null,
                "cleanliness": 4.0,
                "desk": null,
                "location": null,
                "pool": null,
                "restaurant": null,
                "rooms": 4.0,
                "service": 3.0,
                "sleep": null,
                "value": 4.0
            },
            "helpfulness": 8,
            "id": 4359493,
            "likes": {
                "disliked": null,
                "liked": null
            },
            "rating": 4.0,
            "stay_parameters": "Stayed January 2006",
            "text": "My wife and I switched to this apartment complex after we were disappointed with another apartment complex nearby and were pleasantly surprised.",
            "title": "Great apartment complex!",
            "user": "montgod"
        },
        {
            "date": "December 1, 2005",
            "detail_rating": {
                "business": null,
                "cleanliness": 5.0,
                "desk": null,
                "location": null,
                "pool": null,
                "restaurant": null,
                "rooms": 5.0,
                "service": 5.0,
                "sleep": null,
                "value": 5.0
            },
            "helpfulness": 4,
            "id": 4157676,
            "likes": {
                "disliked": null,
                "liked": null
            },
            "rating": 5.0,
            "stay_parameters": "Stayed April 2004",
            "text": "For the price and location, this is an excellent option! We were in walking distance to the 4 mile beach and all the shops/resturaunts in PD. The rooms were very nice, clean, spacious and up to date. Compared to the previous place we were staying, this place is a hidden treasure!",
            "title": "Perfect Honeymoon",
            "user": "roddersNewZealand"
        },
        {
            "date": "June 27, 2005",
            "detail_rating": {
                "business": null,
                "cleanliness": 1.0,
                "desk": null,
                "location": null,
                "pool": null,
                "restaurant": null,
                "rooms": 1.0,
                "service": 1.0,
                "sleep": null,
                "value": 1.0
            },
            "helpfulness": 3,
            "id": 3613906,
            "likes": {
                "disliked": null,
                "liked": null
            },
            "rating": 1.0,
            "stay_parameters": "Stayed March 2005",
            "text": "I would definitely stay there again if we visit PD. Just an fyi, we were also debating between The Radisson Treetops hotel, but decided on the Martinque instead. Why pay $200 a night when you can get the same thing for only $95?",
            "title": "Very dark apartments",
            "user": "Bella33"
        },
        {
            "date": "June 26, 2005",
            "detail_rating": {
                "business": null,
                "cleanliness": 5.0,
                "desk": null,
                "location": null,
                "pool": null,
                "restaurant": null,
                "rooms": 5.0,
                "service": 5.0,
                "sleep": null,
                "value": 5.0
            },
            "helpfulness": 2,
            "id": 3611871,
            "likes": {
                "disliked": null,
                "liked": null
            },
            "rating": 5.0,
            "stay_parameters": "Stayed June 2005, traveled on business",
            "text": "Found Martinique on Macrossan a very good place to stay and have given other people the phone number.",
            "title": "A great secret in Port Douglas",
            "user": "Tangible-Solutions"
        },
        {
            "date": "January 25, 2005",
            "detail_rating": {
                "business": null,
                "cleanliness": null,
                "desk": null,
                "location": null,
                "pool": null,
                "restaurant": null,
                "rooms": null,
                "service": null,
                "sleep": null,
                "value": null
            },
            "helpfulness": 13,
            "id": 3084260,
            "likes": {
                "disliked": null,
                "liked": null
            },
            "rating": 3.0,
            "stay_parameters": null,
            "text": "My wife and mydelf stayed there on our honey moon and very much recommend it.",
            "title": "rooms good but noisy",
            "user": "Natasha98"
        }
    ],
    "slim_ranking": 0.0851063829787,
    "stars": 4,
    "tripadvisor": {
        "VISITED": false,
        "country_name": null,
        "locality": null,
        "pic_link": null,
        "street_address": null
    },
    "user_rating": 4.5,
    "variance": {
        "average": 8,
        "excellent": 254,
        "poor": 3,
        "terrible": 5,
        "very good": 51
    }
}