{
    "aka": "Fairfield Inn And Suites By Marriott Newark Liberty International Airport",
    "description": null,
    "detail_rating": {
        "cleanliness": null,
        "location": null,
        "rooms": null,
        "service": null,
        "sleep": null,
        "value": null
    },
    "location": {
        "city": "Newark",
        "continent": null,
        "country": "United States",
        "proposed_city": null,
        "province": null,
        "region": null
    },
    "name": "Fairfield Inn & Suites by Marriott Newark Liberty International Airport",
    "places": {
        "aka": [
            "Fairfield",
            "Newark",
            "Liberty"
        ],
        "hotel_description": [],
        "hotel_name": [
            "Fairfield",
            "Newark",
            "Liberty"
        ]
    },
    "review_count": 286,
    "review_count_current": 17,
    "reviews": [
        {
            "date": "June 26, 2007",
            "detail_rating": {
                "business": 4.0,
                "cleanliness": 5.0,
                "desk": null,
                "front_desk": 5.0,
                "location": 4.0,
                "pool": null,
                "restaurant": null,
                "rooms": 5.0,
                "service": 5.0,
                "sleep": null,
                "value": 5.0
            },
            "helpfulness": 1,
            "id": 7999324,
            "likes": {
                "disliked": "\u2014 hard to find",
                "liked": "\u2014 Customer service, clean rooms"
            },
            "rating": 5.0,
            "stay_parameters": "Stayed June 2007",
            "text": "We all look forward to our vacations since most of us are stuck in the rat race and only get 2 weeks out of the year to actually relax. Needless to say that when we're suppossed to be enjoying our time off we're to busy worrying about what can go wrong, how we're getting to the airport or if we forgot anything. I was a little skeptical about staying at the Fairfield because i'm a loyal Starwood customer, but a friend recommended it so i gave it a shot. It was great from the start. We decided to do the Park & Fly package, so we drove to the hotel. Well, we were lost for about 20 minutes and decided to call the hotel for directions. The front desk personnel stayed on the phone with us until we were in front of the hotel. After that it was smooth sailing. The Staff was excellent, from the front desk to the breakfast attendants. The rooms were clean, they provided coffee service all hours of the night and they had an indoor pool which tired out our kids which got them to bed nice and early. This is my hotel of choice when flying out of Newark Airport, at least i know i have one less thing to worry about.",
            "title": "Great Experience",
            "user": "banga07086"
        },
        {
            "date": "May 2, 2007",
            "detail_rating": {
                "business": 3.0,
                "cleanliness": 4.0,
                "desk": null,
                "front_desk": 4.0,
                "location": 3.0,
                "pool": null,
                "restaurant": null,
                "rooms": 4.0,
                "service": 4.0,
                "sleep": null,
                "value": 3.0
            },
            "helpfulness": null,
            "id": 7540363,
            "likes": {
                "disliked": null,
                "liked": "\u2014 clean rooms"
            },
            "rating": 4.0,
            "stay_parameters": "Stayed April 2007",
            "text": "Stayed at this hotel while chaperoning a class trip. The hotel was clean and the employees friendly. They had a nice breakfast, with many choices. Quiet and safe.",
            "title": "Nice Stay",
            "user": "djad"
        },
        {
            "date": "January 22, 2008",
            "detail_rating": {
                "business": 4.0,
                "cleanliness": 5.0,
                "desk": null,
                "front_desk": 4.0,
                "location": 3.0,
                "pool": null,
                "restaurant": null,
                "rooms": 4.0,
                "service": 4.0,
                "sleep": null,
                "value": 4.0
            },
            "helpfulness": 2,
            "id": 12890233,
            "likes": {
                "disliked": null,
                "liked": null
            },
            "rating": 4.0,
            "stay_parameters": "Stayed December 2007, traveled as a couple",
            "text": "My boyfriend and felt very comfortable at the Fairfield Inn. We stayed there over New Years weekend as we went into the city for the ball drop. We were pleased with the service they provided us. We were happy with the room- although not very glamorous or extravigant but practical. I read many reviews before we left and I was a bit nervous. Most of them said it was hard to get to the hotal and believe me- it was! It comes up quick and the signs aren't huge on the side of the road so you easily pass it. I heard that the mattress was hard and not comfortable but I found it very nice. It is all a matter of opinion.",
            "title": "Great Stay",
            "user": "LKC25"
        },
        {
            "date": "December 2, 2007",
            "detail_rating": {
                "business": null,
                "cleanliness": 5.0,
                "desk": null,
                "front_desk": 5.0,
                "location": 4.0,
                "pool": null,
                "restaurant": null,
                "rooms": 5.0,
                "service": 5.0,
                "sleep": null,
                "value": 4.0
            },
            "helpfulness": 2,
            "id": 11211075,
            "likes": {
                "disliked": "\u2014 difficult road acess",
                "liked": "\u2014 Cleanliness, proximity to airport"
            },
            "rating": 4.0,
            "stay_parameters": "Stayed November 2007, traveled solo",
            "text": "The only problem we did have was the whirlpool did not work 2 out of the 4 nights we were there. The hotel staff tried but something was seriously wrong with it.",
            "title": "Excellent experience - recommended",
            "user": "Moura"
        },
        {
            "date": "November 9, 2007",
            "detail_rating": {
                "business": null,
                "cleanliness": 3.0,
                "desk": null,
                "front_desk": 4.0,
                "location": 3.0,
                "pool": null,
                "restaurant": null,
                "rooms": 4.0,
                "service": 4.0,
                "sleep": null,
                "value": 4.0
            },
            "helpfulness": 2,
            "id": 10719637,
            "likes": {
                "disliked": null,
                "liked": null
            },
            "rating": 4.0,
            "stay_parameters": "Stayed November 2007, traveled with friends",
            "text": "Fairfield Inn has a wonderful continential breakfast. It was not your ordinary bagels and muffins. They had make your own waffles, pastries, cereal, english muffins, fresh fruit...and the list goes on.",
            "title": "Liked it here",
            "user": "Jabei"
        },
        {
            "date": "October 23, 2007",
            "detail_rating": {
                "business": null,
                "cleanliness": null,
                "desk": null,
                "location": null,
                "pool": null,
                "restaurant": null,
                "rooms": null,
                "service": null,
                "sleep": null,
                "value": null
            },
            "helpfulness": 2,
            "id": 10269300,
            "likes": {
                "disliked": null,
                "liked": null
            },
            "rating": 3.0,
            "stay_parameters": null,
            "text": "The shuttle system really works out great especially if you are going to the city. It is a long trip into the city but flawless. You hop on the shuttle which brings you to the AirTran (get off at Continential Air). The Air Tran is free and brings you to the New Jersey train station where you catch a train to Penn Station in New York. You could also get the PATH which is $1.50 per person each trip and go to PENN Station or the World Trade Center. If you are a tourist I would recommend TWC because you ride in to (under as well)where the Twin Towers were.",
            "title": "You better have a car if you want to eat!",
            "user": "buddles"
        },
        {
            "date": "October 9, 2007",
            "detail_rating": {
                "business": null,
                "cleanliness": 3.0,
                "desk": null,
                "front_desk": 2.0,
                "location": 2.0,
                "pool": null,
                "restaurant": null,
                "rooms": 2.0,
                "service": 2.0,
                "sleep": null,
                "value": 3.0
            },
            "helpfulness": 1,
            "id": 10059202,
            "likes": {
                "disliked": "\u2014 Terrible beds",
                "liked": "\u2014 Proximity to airport"
            },
            "rating": 2.0,
            "stay_parameters": "Stayed October 2007, traveled with family",
            "text": "Overall I was very happy with our room and the level of service they provided and I would recommend this along with other Fairfield Inn's to anyone.",
            "title": "It's Newark, what do you expect?",
            "user": "gregz69"
        },
        {
            "date": "September 10, 2007",
            "detail_rating": {
                "business": null,
                "cleanliness": 3.0,
                "desk": null,
                "front_desk": 5.0,
                "location": 5.0,
                "pool": null,
                "restaurant": null,
                "rooms": 4.0,
                "service": 5.0,
                "sleep": null,
                "value": 4.0
            },
            "helpfulness": 1,
            "id": 8688083,
            "likes": {
                "disliked": null,
                "liked": null
            },
            "rating": 4.0,
            "stay_parameters": "Stayed August 2007, traveled as a couple",
            "text": "Staff was very friendly (how did New Jerseyites get such a bad reputation?!?) and check in was efficient. I had a great night's rest, adequate breakfast, and have nothing negative to say about this property - I would stay here again.",
            "title": "Great Night before Flight",
            "user": "BC_Corkie"
        },
        {
            "date": "August 22, 2007",
            "detail_rating": {
                "business": 5.0,
                "cleanliness": 5.0,
                "desk": null,
                "front_desk": 5.0,
                "location": 5.0,
                "pool": null,
                "restaurant": null,
                "rooms": 5.0,
                "service": 5.0,
                "sleep": null,
                "value": 5.0
            },
            "helpfulness": 3,
            "id": 8470512,
            "likes": {
                "disliked": "\u2014 difficult to get to",
                "liked": "\u2014 Clean rooms and friendly service"
            },
            "rating": 4.0,
            "stay_parameters": "Stayed August 2007, traveled as a couple",
            "text": "Rarely even at high end hotels are the staff as nice and attentive as these people. The young man from Columbia who checked us in made sure we had a quiet room, and even changed room types to ensure this. Also, the beds were quite comfortable for a Fairfield. This is an above average Fairfield, very convenient to the airport. Make sure you have PRINTED directions from the website to get to the hotel. Gettting to the airport however, was super easy.",
            "title": "Great staff, beds and quiet!",
            "user": "kipptraveler"
        },
        {
            "date": "August 13, 2007",
            "detail_rating": {
                "business": null,
                "cleanliness": 3.0,
                "desk": null,
                "front_desk": 2.0,
                "location": 3.0,
                "pool": null,
                "restaurant": null,
                "rooms": 1.0,
                "service": 2.0,
                "sleep": null,
                "value": 1.0
            },
            "helpfulness": 1,
            "id": 8402578,
            "likes": {
                "disliked": null,
                "liked": null
            },
            "rating": 1.0,
            "stay_parameters": "Stayed August 2007, traveled with family",
            "text": "I've stayed at a lot of Fairfield Inns and usually have a good experience however this is absolutely the worst one! Our room was musty and the air conditioner would not turn off. Our (older) children's room the HEATER was on and it was AUGUST! We exchanged rooms since they love the cold but it took forever to get it cool. The sheets were ratty and the blankets had holes in it. Our TV did not work well. The room was clean but very musty. The delievery food recommended in their book was closed (it was Sunday). THey did advertise sandwiches in the lobby & other things but I went down their and they said they didn't have any. (We were too tired to go out) The desk clerk was in a hurry to get rid of me (He was talking to an angry guest!) so he handed me another brochure for pizza. When it arrived, it was SO bad (and we aren't picky) that no one wanted to eat it. Ok shouldn't be the hotel's fault but they recommended it!",
            "title": "The Worst Fairfield Inn!",
            "user": "Annie055"
        },
        {
            "date": "July 24, 2007",
            "detail_rating": {
                "business": null,
                "cleanliness": 5.0,
                "desk": null,
                "front_desk": 5.0,
                "location": 3.0,
                "pool": null,
                "restaurant": null,
                "rooms": 5.0,
                "service": 5.0,
                "sleep": null,
                "value": 4.0
            },
            "helpfulness": 2,
            "id": 8229571,
            "likes": {
                "disliked": "\u2014 Location",
                "liked": "\u2014 Clean"
            },
            "rating": 4.0,
            "stay_parameters": "Stayed July 2007, traveled with family",
            "text": "One last thing...the wakeup service didn't wake us up. I didn't sleep much anyway because of the AWFUL - and I mean AWFUL mattress...so its a good thing I was awake or we could have missed the plane!!",
            "title": "Great Hotel",
            "user": "btate00"
        },
        {
            "date": "July 13, 2007",
            "detail_rating": {
                "business": 3.0,
                "cleanliness": 5.0,
                "desk": null,
                "front_desk": 5.0,
                "location": 4.0,
                "pool": null,
                "restaurant": null,
                "rooms": 5.0,
                "service": 4.0,
                "sleep": null,
                "value": 5.0
            },
            "helpfulness": 2,
            "id": 8114296,
            "likes": {
                "disliked": "\u2014 Pool too small",
                "liked": "\u2014 Confort of the bed"
            },
            "rating": 5.0,
            "stay_parameters": "Stayed June 2007, traveled on business",
            "text": "Will never stay here again!",
            "title": "I love the Fairfield Inn",
            "user": "Kamucaca"
        },
        {
            "date": "September 5, 2008",
            "detail_rating": {
                "business": null,
                "cleanliness": null,
                "desk": null,
                "location": null,
                "pool": null,
                "restaurant": null,
                "rooms": null,
                "service": null,
                "sleep": null,
                "value": null
            },
            "helpfulness": 1,
            "id": 19796487,
            "likes": {
                "disliked": null,
                "liked": null
            },
            "rating": 5.0,
            "stay_parameters": null,
            "text": "This a good choice for a quick overnight stay before or after a flight into/out of Newark. To get to the hotel you need to catch the airtrain monorail to P4 (parking station) from your terminal, The courtesy hotel shuttle was there in less than 10 mins. It was a bouncy ride to the hotel but otherwise fine.",
            "title": "A good choice for Newark EWR",
            "user": "dogsareforlife"
        },
        {
            "date": "July 24, 2008",
            "detail_rating": {
                "business": null,
                "cleanliness": 4.0,
                "desk": null,
                "front_desk": 5.0,
                "location": 5.0,
                "pool": null,
                "restaurant": null,
                "rooms": 4.0,
                "service": 5.0,
                "sleep": null,
                "value": 5.0
            },
            "helpfulness": 2,
            "id": 18201838,
            "likes": {
                "disliked": "\u2014 Lack of restaurants or other businesses in walking distance of hotel",
                "liked": "\u2014 Proximity to the airport and New York City, free shuttle to and from airport, friendly and accomdating staff"
            },
            "rating": 5.0,
            "stay_parameters": "Stayed July 2008, traveled as a couple",
            "text": "Check in was swift (not over friendly but courteous and efficient which is all I need) The room had a king bed and a very clean bright bathroom. Both bed and linens were comfortable.",
            "title": "Perfect choice",
            "user": "sheckman"
        },
        {
            "date": "July 6, 2008",
            "detail_rating": {
                "business": 3.0,
                "cleanliness": 3.0,
                "desk": null,
                "front_desk": 3.0,
                "location": 3.0,
                "pool": null,
                "restaurant": null,
                "rooms": 3.0,
                "service": 3.0,
                "sleep": null,
                "value": 3.0
            },
            "helpfulness": null,
            "id": 17594771,
            "likes": {
                "disliked": null,
                "liked": null
            },
            "rating": 3.0,
            "stay_parameters": "Stayed July 2008, traveled solo",
            "text": "Breakfast is served near the lobby - I had a fresh bagel and coffee which was fine and good enough to wake me up! Typical menu available in all these hotel types.",
            "title": "Adequate.",
            "user": "Bellarina126"
        },
        {
            "date": "July 4, 2008",
            "detail_rating": {
                "business": 4.0,
                "cleanliness": 4.0,
                "desk": null,
                "front_desk": 4.0,
                "location": 4.0,
                "pool": null,
                "restaurant": null,
                "rooms": 4.0,
                "service": 4.0,
                "sleep": null,
                "value": 4.0
            },
            "helpfulness": null,
            "id": 17506834,
            "likes": {
                "disliked": "\u2014 n/a",
                "liked": "\u2014 location"
            },
            "rating": 4.0,
            "stay_parameters": "Stayed June 2008, traveled on business",
            "text": "Coffee and tea was available from the lobby along with cookies - a nice touch.",
            "title": "Great stay",
            "user": "gregnkw"
        },
        {
            "date": "March 30, 2008",
            "detail_rating": {
                "business": 5.0,
                "cleanliness": 5.0,
                "desk": null,
                "front_desk": 5.0,
                "location": 3.0,
                "pool": null,
                "restaurant": null,
                "rooms": 5.0,
                "service": 5.0,
                "sleep": null,
                "value": 5.0
            },
            "helpfulness": 2,
            "id": 14648691,
            "likes": {
                "disliked": "\u2014 nothing",
                "liked": "\u2014 staff and cleanliness of rooms, free internet"
            },
            "rating": 5.0,
            "stay_parameters": "Stayed February 2008, traveled solo",
            "text": "Paid $135 for the one night (compared with the Marriott which wanted $300 for the night it wasn't a difficult choice although I do like the Marriott too) Given that everything was clean and worked well, I consider this a great choice for the money. Will use again if visiting EWR.",
            "title": "Great property and staff",
            "user": "aerobik1"
        }
    ],
    "slim_ranking": 0.285714285714,
    "stars": 2.5,
    "tripadvisor": {
        "VISITED": false,
        "country_name": null,
        "locality": null,
        "pic_link": null,
        "street_address": null
    },
    "user_rating": 4.0,
    "variance": {
        "average": 49,
        "excellent": 67,
        "poor": 15,
        "terrible": 14,
        "very good": 141
    }
}