{
    "aka": "English Country Garden B&B Cape Breton Island, Nova Scotia - Indian Brook",
    "description": "Relax with us and experience the art of living. Overlooking a tranquil lake, our inspired rooms are the beginning of a Bed & Breakfast experience like few other. 5 Luxury Suites with 4 piece bathroom en-suites. Full English Breakfast. Open Year-Round. No Stairs for most of our suites. Fine Dining by advance reservation only. Canoe and hiking trails. Professional Innkeepers.",
    "detail_rating": {
        "cleanliness": null,
        "location": null,
        "rooms": null,
        "service": null,
        "sleep": null,
        "value": null
    },
    "location": {
        "city": null,
        "continent": null,
        "country": "Canada",
        "proposed_city": null,
        "province": null,
        "region": null
    },
    "name": "English Country Garden B&B",
    "places": {
        "aka": [],
        "hotel_description": [],
        "hotel_name": []
    },
    "review_count": 87,
    "review_count_current": 18,
    "reviews": [
        {
            "date": "October 11, 2009",
            "detail_rating": {
                "business": null,
                "cleanliness": 5.0,
                "desk": null,
                "location": 4.0,
                "pool": null,
                "restaurant": null,
                "rooms": 5.0,
                "service": 5.0,
                "sleep": null,
                "value": 5.0
            },
            "helpfulness": null,
            "id": 46536548,
            "likes": {
                "disliked": null,
                "liked": null
            },
            "rating": 5.0,
            "stay_parameters": "Stayed September 2009, traveled as a couple",
            "text": "We stayed in the Rose Cottage & it exceeded out expectations. Wonderful experience & beautiful setting. Dinner & breakfast were delicious. We wished we allowed ourselves time to stay a few more days. A great place to unwind & feel pampered.",
            "title": "Wish we had more nites here.",
            "user": "kftw"
        },
        {
            "date": "October 9, 2009",
            "detail_rating": {
                "business": null,
                "cleanliness": 5.0,
                "desk": null,
                "location": 5.0,
                "pool": null,
                "restaurant": null,
                "rooms": 5.0,
                "service": 5.0,
                "sleep": null,
                "value": 4.0
            },
            "helpfulness": null,
            "id": 46385233,
            "likes": {
                "disliked": null,
                "liked": null
            },
            "rating": 5.0,
            "stay_parameters": "Stayed July 2009, traveled as a couple",
            "text": "k",
            "title": "Beautiful",
            "user": "lingbot"
        },
        {
            "date": "September 8, 2009",
            "detail_rating": {
                "business": null,
                "cleanliness": 4.0,
                "desk": null,
                "location": 3.0,
                "pool": null,
                "restaurant": null,
                "rooms": 4.0,
                "service": 3.0,
                "sleep": null,
                "value": 3.0
            },
            "helpfulness": 2,
            "id": 40230019,
            "likes": {
                "disliked": null,
                "liked": null
            },
            "rating": 4.0,
            "stay_parameters": "Stayed August 2009, traveled as a couple",
            "text": "We stayed in the russian room for our honeymoon and it was incredibly spacious and beautiful. We also had dinner there one night and it was amazing. From the appetizer to dessert, we wanted to eat more but were completely stuffed. For a B&B, they had small tables for meals, so couples got to eat by themselves and not have to socialize with others. The wireless worked well only in the living room/common area so trying to use it in the russian room (at the end of the hallway) was spotty at best. Just a note in case you care about this.",
            "title": "A peaceful and secluded retreat",
            "user": "egon61"
        },
        {
            "date": "September 8, 2009",
            "detail_rating": {
                "business": null,
                "cleanliness": 5.0,
                "desk": null,
                "location": 4.0,
                "pool": null,
                "restaurant": null,
                "rooms": 5.0,
                "service": 5.0,
                "sleep": null,
                "value": 5.0
            },
            "helpfulness": null,
            "id": 40173494,
            "likes": {
                "disliked": null,
                "liked": null
            },
            "rating": 5.0,
            "stay_parameters": "Stayed July 2008, traveled as a couple",
            "text": "The grounds are beautiful and feature flower gardens, lawns, forest, and a lake which is home to beavers and apparently also a moose. A canoe is available for guests to take out on the lake.",
            "title": "Great place to stay",
            "user": "jhbrown24"
        },
        {
            "date": "August 30, 2009",
            "detail_rating": {
                "business": null,
                "cleanliness": 5.0,
                "desk": null,
                "location": 3.0,
                "pool": null,
                "restaurant": null,
                "rooms": 5.0,
                "service": 5.0,
                "sleep": null,
                "value": 4.0
            },
            "helpfulness": null,
            "id": 39279893,
            "likes": {
                "disliked": null,
                "liked": null
            },
            "rating": 5.0,
            "stay_parameters": "Stayed August 2009, traveled as a couple",
            "text": "The Russian Room was spotless and spacious and the themed decor was interesting. The bathroom was very luxurious with a jetted tub. The room includes a sitting area with large glass patio doors with a view out to the lake and satellite tv.",
            "title": "Top notch personal service in a relaxing private setting",
            "user": "erk42"
        },
        {
            "date": "May 8, 2008",
            "detail_rating": {
                "business": 3.0,
                "cleanliness": 5.0,
                "desk": null,
                "front_desk": 5.0,
                "location": 5.0,
                "pool": null,
                "restaurant": null,
                "rooms": 5.0,
                "service": 5.0,
                "sleep": null,
                "value": 4.0
            },
            "helpfulness": 1,
            "id": 15788237,
            "likes": {
                "disliked": "\u2014 No counter space in the bathroom.",
                "liked": "\u2014 The room and the dinner."
            },
            "rating": 5.0,
            "stay_parameters": "Stayed April 2008, traveled as a couple",
            "text": "My boyfriend and I did a roadtrip around Nova Scotia in late April and needed a place to stay after our day exploring the Highlands National Park. The English Country Garden was the perfect choice. It's set on a peaceful property right on the lake. We stayed in the African room, which was beautifully decorated, spacious and had a nice soaker tub in the bathroom. However, if you're willing to spend the money, I'd recommend the Russian Room, which looks amazing! We also booked dinner for that evening as the B&B runs a little restaurant there as well. Wow, what a fabulous dinner! I highly recommend making dinner",
            "title": "Perfect Spot",
            "user": "NYC1stTime"
        },
        {
            "date": "April 29, 2008",
            "detail_rating": {
                "business": null,
                "cleanliness": 5.0,
                "desk": null,
                "front_desk": 5.0,
                "location": 3.0,
                "pool": null,
                "restaurant": null,
                "rooms": 5.0,
                "service": 5.0,
                "sleep": null,
                "value": 4.0
            },
            "helpfulness": 2,
            "id": 15482629,
            "likes": {
                "disliked": "\u2014 can't think of a thing",
                "liked": "\u2014 Hospitality and the room - it was amazing"
            },
            "rating": 5.0,
            "stay_parameters": "Stayed August 2007, traveled as a couple",
            "text": "arrangements if you stay there. The hosts were friendly, but not",
            "title": "What a gem!",
            "user": "gbwt"
        },
        {
            "date": "August 11, 2007",
            "detail_rating": {
                "business": null,
                "cleanliness": 5.0,
                "desk": null,
                "front_desk": 5.0,
                "location": 5.0,
                "pool": null,
                "restaurant": null,
                "rooms": 4.0,
                "service": 5.0,
                "sleep": null,
                "value": 5.0
            },
            "helpfulness": 3,
            "id": 8396714,
            "likes": {
                "disliked": "\u2014 The room was a little dark.",
                "liked": "\u2014 The food and the hosts."
            },
            "rating": 5.0,
            "stay_parameters": "Stayed July 2007, traveled as a couple",
            "text": "intrusive. All in all, we had a great stay at this B&B and would definitely recommend it!",
            "title": "Fantastic B&B with Great Food and Super Hosts",
            "user": "GoneTravelin"
        },
        {
            "date": "August 24, 2009",
            "detail_rating": {
                "business": null,
                "cleanliness": 5.0,
                "desk": null,
                "location": 3.0,
                "pool": null,
                "restaurant": null,
                "rooms": 5.0,
                "service": 5.0,
                "sleep": null,
                "value": 5.0
            },
            "helpfulness": null,
            "id": 38681468,
            "likes": {
                "disliked": null,
                "liked": null
            },
            "rating": 5.0,
            "stay_parameters": "Stayed August 2009, traveled as a couple",
            "text": "We made reservations at ECG for but one night, mainly to break up a long day's drive, and that turned out to be a mistake. Had we known then what we do now, we would have booked all of our stay in Cape Breton with Penny & Co. and made day trips to Pleasant Bay, Baddeck, Louisburg, etc. from there.",
            "title": "Their website and road signs promised QUALITY. THEY DID NOT LIE.",
            "user": "EdOtt"
        },
        {
            "date": "August 18, 2009",
            "detail_rating": {
                "business": null,
                "cleanliness": 5.0,
                "desk": null,
                "location": 5.0,
                "pool": null,
                "restaurant": null,
                "rooms": 5.0,
                "service": 5.0,
                "sleep": null,
                "value": 5.0
            },
            "helpfulness": null,
            "id": 38103731,
            "likes": {
                "disliked": null,
                "liked": null
            },
            "rating": 5.0,
            "stay_parameters": "Stayed August 2009, traveled as a couple",
            "text": "Our one-night stand was indeed an experience to be treasured. We were in the African Room, a large room with ample space and facilities. The room was exquisitely decorated and with extensive bathroom supplies.",
            "title": "A Very Unique Experience",
            "user": "Happy_TravelersNY"
        },
        {
            "date": "August 4, 2009",
            "detail_rating": {
                "business": null,
                "cleanliness": 5.0,
                "desk": null,
                "location": 4.0,
                "pool": null,
                "restaurant": null,
                "rooms": 5.0,
                "service": 5.0,
                "sleep": null,
                "value": 5.0
            },
            "helpfulness": null,
            "id": 36733401,
            "likes": {
                "disliked": null,
                "liked": null
            },
            "rating": 5.0,
            "stay_parameters": "Stayed July 2009, traveled as a couple",
            "text": "Penny and Ian were gracious, friendly hosts. And Millie chipped in, too.",
            "title": "Wonderful Getaway",
            "user": "ssdive"
        },
        {
            "date": "August 3, 2009",
            "detail_rating": {
                "business": null,
                "cleanliness": 5.0,
                "desk": null,
                "location": 4.0,
                "pool": null,
                "restaurant": null,
                "rooms": 5.0,
                "service": 5.0,
                "sleep": null,
                "value": 5.0
            },
            "helpfulness": null,
            "id": 36635741,
            "likes": {
                "disliked": null,
                "liked": null
            },
            "rating": 5.0,
            "stay_parameters": "Stayed July 2009, traveled as a couple",
            "text": "Breakfast was wonderful, providing a fitting final touch to a short but most enjoyable stay..",
            "title": "Great accommodations, excellenf food, fabulous hosts",
            "user": "phototunesfan"
        },
        {
            "date": "July 18, 2009",
            "detail_rating": {
                "business": null,
                "cleanliness": 5.0,
                "desk": null,
                "location": 3.0,
                "pool": null,
                "restaurant": null,
                "rooms": 3.0,
                "service": 4.0,
                "sleep": null,
                "value": 3.0
            },
            "helpfulness": null,
            "id": 35103200,
            "likes": {
                "disliked": null,
                "liked": null
            },
            "rating": 3.0,
            "stay_parameters": "Stayed July 2009, traveled as a couple",
            "text": "E & S",
            "title": "Didn't live up to expectations",
            "user": "Raylene56"
        },
        {
            "date": "July 14, 2009",
            "detail_rating": {
                "business": null,
                "cleanliness": 5.0,
                "desk": null,
                "location": 2.0,
                "pool": null,
                "restaurant": null,
                "rooms": 3.0,
                "service": 5.0,
                "sleep": null,
                "value": 3.0
            },
            "helpfulness": null,
            "id": 34729896,
            "likes": {
                "disliked": null,
                "liked": null
            },
            "rating": 4.0,
            "stay_parameters": "Stayed July 2009, traveled as a couple",
            "text": "If this is your first visit to Cape Breton, you are going to love it. We were there only three days and we saw hummingbirds, bear, moose, whales, bald eagles, fox and countless wildflowers.",
            "title": "Cape Breton is Amazing !",
            "user": "GopalG"
        },
        {
            "date": "June 26, 2009",
            "detail_rating": {
                "business": null,
                "cleanliness": 5.0,
                "desk": null,
                "location": 5.0,
                "pool": null,
                "restaurant": null,
                "rooms": 5.0,
                "service": 5.0,
                "sleep": null,
                "value": 5.0
            },
            "helpfulness": null,
            "id": 33226030,
            "likes": {
                "disliked": null,
                "liked": null
            },
            "rating": 5.0,
            "stay_parameters": "Stayed June 2009, traveled as a couple",
            "text": "The highlight of our honeymoon was meeting Katy who serves breakfast, cleans rooms and serves dinner if you stay there. She will highlight a map for you and tell you where to go. We did everything she said to do and had an unforgettable honeymoon.",
            "title": "Number #1 B & B in Cape Bretoon",
            "user": "gourmetMinneapolis"
        },
        {
            "date": "November 13, 2008",
            "detail_rating": {
                "business": 2.0,
                "cleanliness": 5.0,
                "desk": null,
                "front_desk": 5.0,
                "location": 5.0,
                "pool": null,
                "restaurant": null,
                "rooms": 5.0,
                "service": 5.0,
                "sleep": null,
                "value": 4.0
            },
            "helpfulness": 1,
            "id": 21819445,
            "likes": {
                "disliked": "\u2014 Towels - clean but were thin and lower quality",
                "liked": "\u2014 Location & Hosts"
            },
            "rating": 5.0,
            "stay_parameters": "Stayed September 2008, traveled as a couple",
            "text": "The place : The inn is charming, spotless and well kept. There are three rooms in the main house and one separate cabin. We stayed in the russian room which was quite spacious, nice bathroom. Immaculate ! The bed was not comfortable, it was a king, and you both will roll into the center because it sags.",
            "title": "Great Place to Stay",
            "user": "cincygirl101"
        },
        {
            "date": "October 24, 2008",
            "detail_rating": {
                "business": 4.0,
                "cleanliness": 5.0,
                "desk": null,
                "front_desk": 4.0,
                "location": 3.0,
                "pool": null,
                "restaurant": null,
                "rooms": 4.0,
                "service": 5.0,
                "sleep": null,
                "value": 4.0
            },
            "helpfulness": 1,
            "id": 21175725,
            "likes": {
                "disliked": null,
                "liked": null
            },
            "rating": 4.0,
            "stay_parameters": "Stayed October 2008",
            "text": "The Location : The Inn is about an hour from the beginning of the Cabot Trail in the National Park so it is a bit of a trek every day to get to the park. It depends on what your plans are. If you want to go hiking every day, we would stay closer to the park in Cheticamp or Ingonish.",
            "title": "Charming",
            "user": "Go4itNewBrunswick"
        },
        {
            "date": "October 15, 2008",
            "detail_rating": {
                "business": 3.0,
                "cleanliness": 4.0,
                "desk": null,
                "front_desk": 3.0,
                "location": 2.0,
                "pool": null,
                "restaurant": null,
                "rooms": 4.0,
                "service": 4.0,
                "sleep": null,
                "value": 4.0
            },
            "helpfulness": 1,
            "id": 20909351,
            "likes": {
                "disliked": "\u2014 Far away from other aminities",
                "liked": "\u2014 Quit & Romantic Location"
            },
            "rating": 4.0,
            "stay_parameters": "Stayed October 2008, traveled as a couple",
            "text": "The Breakfast : Very tasty ! Large portions ! Worth Waking up for.",
            "title": "Home Away From Home",
            "user": "Chansey_7"
        }
    ],
    "slim_ranking": 0.5,
    "stars": null,
    "tripadvisor": {
        "VISITED": false,
        "country_name": null,
        "locality": null,
        "pic_link": null,
        "street_address": null
    },
    "user_rating": 5.0,
    "variance": {
        "average": 3,
        "excellent": 75,
        "poor": 0,
        "terrible": 0,
        "very good": 9
    }
}