{
    "aka": "Isandlwana Hotel",
    "description": "Isandlwana Lodge offers twelve luxury rooms all en-suite and tastefully decorated in a mixture of traditional and modern styles. The Lodge is carved into the iNyoni rock formation on top of which the Zulu commander stood during the battle of Isandlwana on 22 January 1879. Enjoy unparalleled views from the crisp early light of a sparkling Zulu dawn to the splendor of the African sunset.",
    "detail_rating": {
        "cleanliness": null,
        "location": null,
        "rooms": null,
        "service": null,
        "sleep": null,
        "value": null
    },
    "location": {
        "city": "Isandlwana",
        "continent": "Africa",
        "country": "South Africa",
        "proposed_city": null,
        "province": null,
        "region": null
    },
    "name": "Isandlwana Lodge",
    "places": {
        "aka": [],
        "hotel_description": [],
        "hotel_name": []
    },
    "review_count": 72,
    "review_count_current": 4,
    "reviews": [
        {
            "date": "April 24, 2007",
            "detail_rating": {
                "business": 2.0,
                "cleanliness": 5.0,
                "desk": null,
                "front_desk": 5.0,
                "location": 4.0,
                "pool": null,
                "restaurant": null,
                "rooms": 4.0,
                "service": 5.0,
                "sleep": null,
                "value": 4.0
            },
            "helpfulness": 1,
            "id": 7429872,
            "likes": {
                "disliked": "\u2014 no bath, only showers",
                "liked": "\u2014 Big comfy rooms with no TV"
            },
            "rating": 5.0,
            "stay_parameters": "Stayed April 2007, traveled as a couple",
            "text": "This hotel is amazing - in fact it was more like visiting some old (well off!) friends. With only 12 rooms, none of which have a TV, guests are encouraged by the polite and amiable staff to mingle and converse.",
            "title": "Fantastic Short Break",
            "user": "Vicky_and_Andy"
        },
        {
            "date": "April 16, 2007",
            "detail_rating": {
                "business": 5.0,
                "cleanliness": 5.0,
                "desk": null,
                "front_desk": 4.0,
                "location": 5.0,
                "pool": null,
                "restaurant": null,
                "rooms": 3.0,
                "service": 5.0,
                "sleep": null,
                "value": 4.0
            },
            "helpfulness": 1,
            "id": 7372364,
            "likes": {
                "disliked": "\u2014 nothing",
                "liked": "\u2014 built in tune with surroundings"
            },
            "rating": 5.0,
            "stay_parameters": "Stayed April 2007, traveled with friends",
            "text": "The rooms were of a good standard, clean and well maintained. If the lack of a TV puts you off, then you are probably the sort of person who wouldn't enjoy this style of hotel.",
            "title": "excellent experience",
            "user": "simtom652000"
        },
        {
            "date": "March 17, 2007",
            "detail_rating": {
                "business": null,
                "cleanliness": null,
                "desk": null,
                "location": null,
                "pool": null,
                "restaurant": null,
                "rooms": null,
                "service": null,
                "sleep": null,
                "value": null
            },
            "helpfulness": 2,
            "id": 7179111,
            "likes": {
                "disliked": null,
                "liked": null
            },
            "rating": 5.0,
            "stay_parameters": null,
            "text": "The hotel benefits from a fantastic vista, indeed the same vista afforded to the Zulu commander as he oversaw his army in the battle of Isandlwana. It's a stunning view.",
            "title": "Spectacular almost beyond description",
            "user": "DavidBLancs"
        },
        {
            "date": "August 29, 2006",
            "detail_rating": {
                "business": null,
                "cleanliness": 5.0,
                "desk": null,
                "front_desk": 5.0,
                "location": 5.0,
                "pool": null,
                "restaurant": null,
                "rooms": 4.0,
                "service": 5.0,
                "sleep": null,
                "value": 5.0
            },
            "helpfulness": 2,
            "id": 5722617,
            "likes": {
                "disliked": null,
                "liked": "\u2014 Design"
            },
            "rating": 5.0,
            "stay_parameters": "Stayed August 2006, traveled as a couple",
            "text": "The food was excellent - from the lavish buffet breakfast to the gourmet dinners - and the service and attitude of the staff was highlly professional but friendly.",
            "title": "Wonderful lodge, excellent battlefield tours",
            "user": "Sal123"
        }
    ],
    "slim_ranking": 1.0,
    "stars": 4,
    "tripadvisor": {
        "VISITED": false,
        "country_name": null,
        "locality": null,
        "pic_link": null,
        "street_address": null
    },
    "user_rating": 5.0,
    "variance": {
        "average": 1,
        "excellent": 65,
        "poor": 1,
        "terrible": 0,
        "very good": 5
    }
}