{
    "aka": null,
    "description": null,
    "detail_rating": {
        "cleanliness": null,
        "location": null,
        "rooms": null,
        "service": null,
        "sleep": null,
        "value": null
    },
    "location": {
        "city": null,
        "continent": null,
        "country": null,
        "proposed_city": null,
        "province": null,
        "region": null
    },
    "name": "North Eastern Hotel",
    "places": {
        "aka": [],
        "hotel_description": [],
        "hotel_name": []
    },
    "review_count": 29,
    "review_count_current": 18,
    "reviews": [
        {
            "date": "January 30, 2013",
            "detail_rating": {
                "business": null,
                "cleanliness": null,
                "desk": null,
                "location": null,
                "pool": null,
                "restaurant": null,
                "rooms": null,
                "service": 5.0,
                "sleep": null,
                "value": 5.0
            },
            "helpfulness": null,
            "id": 150985948,
            "likes": {
                "disliked": null,
                "liked": null
            },
            "rating": 5.0,
            "stay_parameters": "Visited January 2013",
            "text": "Ate here last night, great service on arrival, quickly read the menu, and decided on the excellent specials. They realised I was alone, and offered, great seating on the couch or anywhere, I opted for outside as a beautiful night.",
            "title": "Excellent food & value",
            "user": "JosephineClarey"
        },
        {
            "date": "January 17, 2013",
            "detail_rating": {
                "business": null,
                "cleanliness": null,
                "desk": null,
                "location": null,
                "pool": null,
                "restaurant": null,
                "rooms": null,
                "service": 5.0,
                "sleep": null,
                "value": 4.0
            },
            "helpfulness": null,
            "id": 149847227,
            "likes": {
                "disliked": null,
                "liked": null
            },
            "rating": 5.0,
            "stay_parameters": "Visited January 2013",
            "text": "Was delivered food promptly, and didn't want for anything more. No additional seasonings required, food was just perfect.",
            "title": "The place to eat at!",
            "user": "Leswant"
        },
        {
            "date": "December 30, 2012",
            "detail_rating": {
                "business": null,
                "cleanliness": null,
                "desk": null,
                "location": null,
                "pool": null,
                "restaurant": null,
                "rooms": null,
                "service": 5.0,
                "sleep": null,
                "value": 4.0
            },
            "helpfulness": null,
            "id": 148328973,
            "likes": {
                "disliked": null,
                "liked": null
            },
            "rating": 5.0,
            "stay_parameters": "Visited December 2012",
            "text": "I normally go to a different place each nigh to try them all, but decided, I'm back tonight to try something from the menu, maybe depending on the specials.",
            "title": "Excellent restaurant food and service",
            "user": "porcupinegirl"
        },
        {
            "date": "December 28, 2012",
            "detail_rating": {
                "business": null,
                "cleanliness": null,
                "desk": null,
                "location": null,
                "pool": null,
                "restaurant": null,
                "rooms": null,
                "service": 5.0,
                "sleep": null,
                "value": 5.0
            },
            "helpfulness": null,
            "id": 148179568,
            "likes": {
                "disliked": null,
                "liked": null
            },
            "rating": 5.0,
            "stay_parameters": null,
            "text": "Nice outdoor area, and the dining room looked lovely also.",
            "title": "Delicious and classy",
            "user": "Phase_02"
        },
        {
            "date": "December 21, 2012",
            "detail_rating": {
                "business": null,
                "cleanliness": null,
                "desk": null,
                "location": null,
                "pool": null,
                "restaurant": null,
                "rooms": null,
                "service": null,
                "sleep": null,
                "value": null
            },
            "helpfulness": null,
            "id": 147839268,
            "likes": {
                "disliked": null,
                "liked": null
            },
            "rating": 5.0,
            "stay_parameters": null,
            "text": "Staff and owners were great.",
            "title": "Worth seeking out when in Benalla",
            "user": "Easyriders1369"
        },
        {
            "date": "November 7, 2012",
            "detail_rating": {
                "business": null,
                "cleanliness": null,
                "desk": null,
                "location": null,
                "pool": null,
                "restaurant": null,
                "rooms": null,
                "service": 5.0,
                "sleep": null,
                "value": 5.0
            },
            "helpfulness": null,
            "id": 144892894,
            "likes": {
                "disliked": null,
                "liked": null
            },
            "rating": 5.0,
            "stay_parameters": "Visited November 2012",
            "text": "When overnighting in Benalla recently we were looking for a quality meal. We sure found it a the North Eastern Hotel. From the moment we walked into the lounge area, complete with open fires and cosy couches we were impressed. A wine list which included many local wines as well as a well planned menu that supported local producers. The food was excellent and presented beautifully. To round things out the staff, including our young waiter, were charming and attentive. This is a hotel not to be missed.",
            "title": "\"Ambience,wonderful food and excellent service\"",
            "user": "400Mary"
        },
        {
            "date": "September 18, 2012",
            "detail_rating": {
                "business": null,
                "cleanliness": null,
                "desk": null,
                "location": null,
                "pool": null,
                "restaurant": null,
                "rooms": null,
                "service": 5.0,
                "sleep": null,
                "value": 4.0
            },
            "helpfulness": null,
            "id": 140639503,
            "likes": {
                "disliked": null,
                "liked": null
            },
            "rating": 5.0,
            "stay_parameters": null,
            "text": "Benalla may not be loaded with fine dining options but the North Eastern Hotel would be a leading venue in any town or city.",
            "title": "Quality food, friendly service",
            "user": "VoiceOfReason73"
        },
        {
            "date": "August 3, 2012",
            "detail_rating": {
                "business": null,
                "cleanliness": null,
                "desk": null,
                "location": null,
                "pool": null,
                "restaurant": null,
                "rooms": null,
                "service": null,
                "sleep": null,
                "value": null
            },
            "helpfulness": null,
            "id": 136173242,
            "likes": {
                "disliked": null,
                "liked": null
            },
            "rating": 1.0,
            "stay_parameters": null,
            "text": "The food was very very good - interesting and flavoursome, filling in size but not excessive. And the service was warm and friendly. It's a small restaurant so they can take their time with each diner. The ambience is also very pleasant, especially on a cool winter evening.",
            "title": "Unwelcome.",
            "user": "RobChez"
        },
        {
            "date": "July 19, 2012",
            "detail_rating": {
                "business": null,
                "cleanliness": null,
                "desk": null,
                "location": null,
                "pool": null,
                "restaurant": null,
                "rooms": null,
                "service": 5.0,
                "sleep": null,
                "value": 4.0
            },
            "helpfulness": null,
            "id": 134785506,
            "likes": {
                "disliked": null,
                "liked": null
            },
            "rating": 5.0,
            "stay_parameters": null,
            "text": "It's not cheap but it's good value for what you get.",
            "title": "Surprising to find such great food in an out of the way location",
            "user": "Chenglim"
        },
        {
            "date": "January 17, 2012",
            "detail_rating": {
                "business": null,
                "cleanliness": null,
                "desk": null,
                "location": null,
                "pool": null,
                "restaurant": null,
                "rooms": null,
                "service": 5.0,
                "sleep": null,
                "value": 4.0
            },
            "helpfulness": 1,
            "id": 123235586,
            "likes": {
                "disliked": null,
                "liked": null
            },
            "rating": 5.0,
            "stay_parameters": null,
            "text": "70th birthday almost ruined because of managers intransience.",
            "title": "Beautiful meals - highly recommend!",
            "user": "lmax228"
        },
        {
            "date": "November 11, 2011",
            "detail_rating": {
                "business": null,
                "cleanliness": null,
                "desk": null,
                "location": null,
                "pool": null,
                "restaurant": null,
                "rooms": null,
                "service": 5.0,
                "sleep": null,
                "value": 5.0
            },
            "helpfulness": 1,
            "id": 120453675,
            "likes": {
                "disliked": null,
                "liked": null
            },
            "rating": 4.0,
            "stay_parameters": null,
            "text": "Found this place on trip ad. And I would totally agree wirh the last two reviewers. Great service, the young waiter was friendly and the owners very comfortable to chat to. Food was exceptional, my mum had king fish, dad eye fillet with a talagio cheese parcel \"superb\". The duck was the slightest bit over cooked, but I thoroughly enjoyed it all the same.",
            "title": "Not your average pub experience!",
            "user": "Linbaird"
        },
        {
            "date": "September 11, 2011",
            "detail_rating": {
                "business": null,
                "cleanliness": null,
                "desk": null,
                "location": null,
                "pool": null,
                "restaurant": null,
                "rooms": null,
                "service": 5.0,
                "sleep": null,
                "value": 5.0
            },
            "helpfulness": 1,
            "id": 117930526,
            "likes": {
                "disliked": null,
                "liked": null
            },
            "rating": 5.0,
            "stay_parameters": "Visited September 2011",
            "text": "We were reminded that we were dining in a pub when four very drunk blokes walked in to slobber and slump on the bar. When our publican politely refused them drinks things started to escalate. Two bouncers arrived, one strong man and a very small girl who must have got her courage from the land of Oz! The drunks were eventually pushed out the door and into the arms of the police! We were impressed with the way the staff dealt with the situation and were not in a hurry to let it spoil our night!",
            "title": "This is no ordinary pub!!!",
            "user": "golfsem"
        },
        {
            "date": "June 23, 2011",
            "detail_rating": {
                "business": null,
                "cleanliness": null,
                "desk": null,
                "location": null,
                "pool": null,
                "restaurant": null,
                "rooms": null,
                "service": 5.0,
                "sleep": null,
                "value": 5.0
            },
            "helpfulness": 3,
            "id": 114665113,
            "likes": {
                "disliked": null,
                "liked": null
            },
            "rating": 5.0,
            "stay_parameters": "Visited June 2011",
            "text": "We stayed for a good coffee and one of the best pannacottas I have had! Thank you to all of the team at The Norto, we will be back!",
            "title": "Outstanding Dining Experience with Exceptional Atmosphere",
            "user": "LouLouLouSyd"
        },
        {
            "date": "March 23, 2013",
            "detail_rating": {
                "business": null,
                "cleanliness": null,
                "desk": null,
                "location": null,
                "pool": null,
                "restaurant": null,
                "rooms": null,
                "service": 5.0,
                "sleep": null,
                "value": 5.0
            },
            "helpfulness": 1,
            "id": 155452708,
            "likes": {
                "disliked": null,
                "liked": null
            },
            "rating": 5.0,
            "stay_parameters": "Visited February 2013",
            "text": "Was in Benalla for a week and had tried 2 different restuarants before being recommended this restuarant by a colleague. As one of the earlier reviewers commented you can't judge this place by the exterior. Inside is very well laid out, clean and more importantly the food was excellent. So much so that I came back the next night.",
            "title": "Surprising",
            "user": "Australians_Abroad"
        },
        {
            "date": "March 7, 2013",
            "detail_rating": {
                "business": null,
                "cleanliness": null,
                "desk": null,
                "location": null,
                "pool": null,
                "restaurant": null,
                "rooms": null,
                "service": null,
                "sleep": null,
                "value": null
            },
            "helpfulness": null,
            "id": 153981012,
            "likes": {
                "disliked": null,
                "liked": null
            },
            "rating": 4.0,
            "stay_parameters": null,
            "text": "Hospitality was also very good and I would highly recommend this establishment.",
            "title": "Very Good Hotel Food",
            "user": "Paddy O"
        },
        {
            "date": "March 1, 2013",
            "detail_rating": {
                "business": null,
                "cleanliness": null,
                "desk": null,
                "location": null,
                "pool": null,
                "restaurant": null,
                "rooms": null,
                "service": null,
                "sleep": null,
                "value": null
            },
            "helpfulness": 1,
            "id": 153481713,
            "likes": {
                "disliked": null,
                "liked": null
            },
            "rating": 5.0,
            "stay_parameters": null,
            "text": "The ambience is excellent and the food of restaurant quality. Prices reflect the fact that the hotel is more than a bistro and the staff are professional in manner",
            "title": "One of our local haunts",
            "user": "AmandaJT17"
        },
        {
            "date": "February 25, 2013",
            "detail_rating": {
                "business": null,
                "cleanliness": null,
                "desk": null,
                "location": null,
                "pool": null,
                "restaurant": null,
                "rooms": null,
                "service": 4.0,
                "sleep": null,
                "value": 4.0
            },
            "helpfulness": 1,
            "id": 153137942,
            "likes": {
                "disliked": null,
                "liked": null
            },
            "rating": 5.0,
            "stay_parameters": "Visited February 2013",
            "text": "Fantastic, quality food, Classic decor. Great outdoor area. Always great service. One of our regular spots to eat.",
            "title": "Never judge a place by its outside.",
            "user": "generaljo"
        },
        {
            "date": "February 9, 2013",
            "detail_rating": {
                "business": null,
                "cleanliness": null,
                "desk": null,
                "location": null,
                "pool": null,
                "restaurant": null,
                "rooms": null,
                "service": 5.0,
                "sleep": null,
                "value": 5.0
            },
            "helpfulness": 1,
            "id": 151708562,
            "likes": {
                "disliked": null,
                "liked": null
            },
            "rating": 5.0,
            "stay_parameters": "Visited March 2012",
            "text": "The outside looks like any old style country pub, but step inside and you see a different side. We dined on a busy Friday night. From the moment we walked in, we were warmly welcomed, all the staff were tentative, knowledgeable and friendly. My elderly mother was catered for with a half serve of the \"James Squire\" beer battered fish n chips and stated it was the best she had eaten in her 85 yrs of life !!!!!!! All the other meals ordered from the menu were superb to say the least and could not find fault with any meal. The only down side was that we though the bar prices for drinks was on the higher side, other than that a fantastic meal was had by all.",
            "title": "A great suprize",
            "user": "Atlas86"
        }
    ],
    "slim_ranking": 1.0,
    "stars": null,
    "tripadvisor": {
        "VISITED": false,
        "country_name": null,
        "locality": null,
        "pic_link": null,
        "street_address": null
    },
    "user_rating": null,
    "variance": {
        "average": 0,
        "excellent": 22,
        "poor": 2,
        "terrible": 1,
        "very good": 4
    }
}