{
    "aka": "Extended Stay America Newark",
    "description": null,
    "detail_rating": {
        "cleanliness": null,
        "location": null,
        "rooms": null,
        "service": null,
        "sleep": null,
        "value": null
    },
    "location": {
        "city": "Newark",
        "continent": null,
        "country": "United States",
        "proposed_city": "Newark",
        "province": null,
        "region": null
    },
    "name": "Extended Stay America - Newark - Christiana - Wilmington",
    "places": {
        "aka": [
            "Newark"
        ],
        "hotel_description": [],
        "hotel_name": [
            "Newark",
            "Christiana",
            "Wilmington"
        ]
    },
    "review_count": 39,
    "review_count_current": 20,
    "reviews": [
        {
            "date": "December 10, 2012",
            "detail_rating": {
                "business": null,
                "cleanliness": 5.0,
                "desk": null,
                "location": 4.0,
                "pool": null,
                "restaurant": null,
                "rooms": 5.0,
                "service": 5.0,
                "sleep": 4.0,
                "value": 5.0
            },
            "helpfulness": null,
            "id": 147156237,
            "likes": {
                "disliked": null,
                "liked": null
            },
            "rating": 5.0,
            "stay_parameters": "Stayed March 2012, traveled on business",
            "text": "I have been staying at this hotel for about nine months now, and will be here until March of 2013. I must say that Diane and Cheryl, make me feel right at home. The staff is great, and the rooms clean. I will recommend this hotel to friends and family.",
            "title": "Great experience at the Hotel",
            "user": "Bobby R"
        },
        {
            "date": "October 24, 2012",
            "detail_rating": {
                "business": null,
                "cleanliness": 4.0,
                "desk": null,
                "location": 5.0,
                "pool": null,
                "restaurant": null,
                "rooms": 5.0,
                "service": 5.0,
                "sleep": 5.0,
                "value": 5.0
            },
            "helpfulness": null,
            "id": 143592870,
            "likes": {
                "disliked": null,
                "liked": null
            },
            "rating": 5.0,
            "stay_parameters": "Stayed October 2012, traveled on business",
            "text": "clean,quiet and excellent front desk help. never an issue .",
            "title": "Have stayed here over 20 times without an issue",
            "user": "avi r"
        },
        {
            "date": "October 13, 2012",
            "detail_rating": {
                "business": null,
                "cleanliness": 4.0,
                "desk": null,
                "location": 4.0,
                "pool": null,
                "restaurant": null,
                "rooms": 4.0,
                "service": 4.0,
                "sleep": 4.0,
                "value": 4.0
            },
            "helpfulness": null,
            "id": 142725467,
            "likes": {
                "disliked": null,
                "liked": null
            },
            "rating": 4.0,
            "stay_parameters": "Stayed February 2012, traveled on business",
            "text": "Price is right,location off 95 is perfect. This is a place where you can come on business or take your family.",
            "title": "Location is superb as is the staff !",
            "user": "Shaun_SWO"
        },
        {
            "date": "September 26, 2012",
            "detail_rating": {
                "business": null,
                "cleanliness": 5.0,
                "desk": null,
                "location": 5.0,
                "pool": null,
                "restaurant": null,
                "rooms": 5.0,
                "service": 5.0,
                "sleep": 5.0,
                "value": 5.0
            },
            "helpfulness": null,
            "id": 141373942,
            "likes": {
                "disliked": null,
                "liked": null
            },
            "rating": 4.0,
            "stay_parameters": "Stayed September 2012, traveled with family",
            "text": "5 minutes from Christiana mall and a few miles from Wilmington",
            "title": "Clean and convenient.",
            "user": "Paris1273"
        },
        {
            "date": "July 28, 2012",
            "detail_rating": {
                "business": null,
                "cleanliness": 4.0,
                "desk": null,
                "location": 4.0,
                "pool": null,
                "restaurant": null,
                "rooms": 4.0,
                "service": 4.0,
                "sleep": 4.0,
                "value": 5.0
            },
            "helpfulness": 1,
            "id": 135638293,
            "likes": {
                "disliked": null,
                "liked": null
            },
            "rating": 4.0,
            "stay_parameters": "Stayed July 2012, traveled with family",
            "text": "Location is very easy to locate and staff is amazing, everyone who is working there is very knowledgeable with the area and are just pleasant and helpful. Rooms are very nice and clean, large space for you to get work done or even have a meeting in the room if necessary. Hotel wifi is a bit sluggish being the only downfall. But clean rooms and great rates win out !",
            "title": "Pleasantly suprised",
            "user": "TourneyTraveler_18"
        },
        {
            "date": "May 29, 2013",
            "detail_rating": {
                "business": null,
                "cleanliness": 2.0,
                "desk": null,
                "location": 3.0,
                "pool": null,
                "restaurant": null,
                "rooms": 3.0,
                "service": 3.0,
                "sleep": 1.0,
                "value": 2.0
            },
            "helpfulness": null,
            "id": 162322138,
            "likes": {
                "disliked": null,
                "liked": null
            },
            "rating": 2.0,
            "stay_parameters": "Stayed May 2013, traveled as a couple",
            "text": "My husband and I recently spent a night here after Orbitz failed to confirm a reservation at another area hotel. It was graduation weekend, so rooms were hard to come buy. Orbitz was able to get us a room here as a replacement for the messed up reservation.",
            "title": "Ants!",
            "user": "mfnyc"
        },
        {
            "date": "May 11, 2013",
            "detail_rating": {
                "business": null,
                "cleanliness": 5.0,
                "desk": null,
                "location": 5.0,
                "pool": null,
                "restaurant": null,
                "rooms": 4.0,
                "service": 4.0,
                "sleep": null,
                "value": 3.0
            },
            "helpfulness": 1,
            "id": 160332198,
            "likes": {
                "disliked": null,
                "liked": null
            },
            "rating": 5.0,
            "stay_parameters": "Stayed April 2013",
            "text": "When we first arrived, we just left our bags and headed to dinner, so didn't get a good look at the room, but from what we saw, it seemed fine. When we returned from dinner and were settling in, I noticed ant crawling all over the kitchen area counter. Then I noticed the same in the bathroom.",
            "title": "King suite was worth ten extra bucks very clean",
            "user": "Gregg1980"
        },
        {
            "date": "May 10, 2013",
            "detail_rating": {
                "business": null,
                "cleanliness": null,
                "desk": null,
                "location": null,
                "pool": null,
                "restaurant": null,
                "rooms": null,
                "service": null,
                "sleep": null,
                "value": null
            },
            "helpfulness": 1,
            "id": 160305013,
            "likes": {
                "disliked": null,
                "liked": null
            },
            "rating": 1.0,
            "stay_parameters": null,
            "text": "From that point on, we just could not get comfortable. The front desk offered to spray the next day (which was useless to us, since we were leaving). Needless to say neither of us slept well. We were glad to leave the next morning.",
            "title": "Not clean",
            "user": "Nina C"
        },
        {
            "date": "April 20, 2013",
            "detail_rating": {
                "business": null,
                "cleanliness": 1.0,
                "desk": null,
                "location": null,
                "pool": null,
                "restaurant": null,
                "rooms": 1.0,
                "service": 1.0,
                "sleep": 1.0,
                "value": 1.0
            },
            "helpfulness": 2,
            "id": 158255374,
            "likes": {
                "disliked": null,
                "liked": null
            },
            "rating": 1.0,
            "stay_parameters": "Stayed April 2013, traveled with family",
            "text": "It did included a so-called breakfast, which basically consisted of instant oatmeal and chewy granola bars. The coffee was acceptable (probably the best thing the hotel had to offer).",
            "title": "I didn't like my stay",
            "user": "Unknown M"
        },
        {
            "date": "April 2, 2013",
            "detail_rating": {
                "business": null,
                "cleanliness": 1.0,
                "desk": null,
                "location": 1.0,
                "pool": null,
                "restaurant": null,
                "rooms": 1.0,
                "service": 1.0,
                "sleep": 1.0,
                "value": 1.0
            },
            "helpfulness": 2,
            "id": 156395022,
            "likes": {
                "disliked": null,
                "liked": null
            },
            "rating": 1.0,
            "stay_parameters": "Stayed March 2013, traveled as a couple",
            "text": "Very clean offers different rates depending on how long ur stay strongly advise anyone to get king suite with sofa bed it was roomy like a little apt BBQ grill nice laundry room only complaint no pool or gym considering the average stay is week plus they don't offer member club that offerspoints for loyal customers free nights but they have added a small breakfast in am its new",
            "title": "i would not give it one star if i did not have to",
            "user": "77jennifera"
        },
        {
            "date": "February 13, 2013",
            "detail_rating": {
                "business": null,
                "cleanliness": 4.0,
                "desk": null,
                "location": 5.0,
                "pool": null,
                "restaurant": null,
                "rooms": 4.0,
                "service": 5.0,
                "sleep": 4.0,
                "value": 4.0
            },
            "helpfulness": null,
            "id": 152023424,
            "likes": {
                "disliked": null,
                "liked": null
            },
            "rating": 5.0,
            "stay_parameters": "Stayed January 2013, traveled on business",
            "text": "My stay at Extended Stay America - Newark/Christiana was excellent, with a warm atmosphere and really great for family or business clients.",
            "title": "Great Experience at Extended Stay America - Newark",
            "user": "Michelle B"
        },
        {
            "date": "January 17, 2013",
            "detail_rating": {
                "business": null,
                "cleanliness": 5.0,
                "desk": null,
                "location": 5.0,
                "pool": null,
                "restaurant": null,
                "rooms": 5.0,
                "service": 5.0,
                "sleep": 5.0,
                "value": 5.0
            },
            "helpfulness": 1,
            "id": 149854919,
            "likes": {
                "disliked": null,
                "liked": null
            },
            "rating": 5.0,
            "stay_parameters": "Stayed November 2012, traveled on business",
            "text": "The staff interaction with guest seems to be unique because they really extend that olive branch to help you by either providing valuable area information to assisting us with hotel services. Just want to highlight extremely positive experiences that I was exposed to during my visit. Most of my experiences are my interaction with hotel manager Diane, Rowena, Cheryl and Chrissi. These individuals always take an extra step to ensure that I am having a possible experience during my stay.",
            "title": "Enjoying My Extended Stay at Extended Stay America Newark",
            "user": "Isma S"
        },
        {
            "date": "December 21, 2012",
            "detail_rating": {
                "business": null,
                "cleanliness": 5.0,
                "desk": null,
                "location": 4.0,
                "pool": null,
                "restaurant": null,
                "rooms": 5.0,
                "service": 5.0,
                "sleep": 5.0,
                "value": 4.0
            },
            "helpfulness": 1,
            "id": 147871821,
            "likes": {
                "disliked": null,
                "liked": null
            },
            "rating": 5.0,
            "stay_parameters": "Stayed October 2012, traveled on business",
            "text": "Since my positive experiences at my last stay at Extended Stay I have shared these positive experiences with family, friends and business customers.",
            "title": "I Am Enjoying My Stay",
            "user": "Jack K"
        },
        {
            "date": "December 18, 2012",
            "detail_rating": {
                "business": null,
                "cleanliness": 5.0,
                "desk": null,
                "location": 3.0,
                "pool": null,
                "restaurant": null,
                "rooms": 4.0,
                "service": 5.0,
                "sleep": 4.0,
                "value": 4.0
            },
            "helpfulness": null,
            "id": 147665835,
            "likes": {
                "disliked": null,
                "liked": null
            },
            "rating": 5.0,
            "stay_parameters": "Stayed December 2012, traveled solo",
            "text": "I've been booked by my company at this hotel last November 2012 when I was on assignment. I chose to be booked again at this hotel when I got back from my vacation over the Christmas holidays. The main reasons I chose this hotel are: 1) They have very excellent, accommodating and trustworthy manager and staff. They've helped me in any way they can from little things (like operating the laundry machines) to to big things (such as sending my very important fedex mail and keeping my paychecks when I was on vacation). With this, I'd like to commend and thank Rowena, Dianne, Cheryl, the other Cheryl (or Sheryl?) and Chrissi. I'd also like to thank Rowena for helping me when I was lost in Wilmington. 2) They got clean rooms and a comfortable bed. 3) The hotel staff and the room ambiance makes you feel at home. 4) The location is near the office and the mall.",
            "title": "Excellent experience at ESA-Newark-Christiana",
            "user": "Paul19713"
        },
        {
            "date": "December 12, 2012",
            "detail_rating": {
                "business": null,
                "cleanliness": 5.0,
                "desk": null,
                "location": 5.0,
                "pool": null,
                "restaurant": null,
                "rooms": 5.0,
                "service": 5.0,
                "sleep": 5.0,
                "value": 5.0
            },
            "helpfulness": null,
            "id": 147347787,
            "likes": {
                "disliked": null,
                "liked": null
            },
            "rating": 5.0,
            "stay_parameters": "Stayed December 2012, traveled on business",
            "text": "I'd just like to suggest to them to put up a gym. But overall, I'm having a great stay at the hotel.",
            "title": "Travel for Business more like Pleasure",
            "user": "Jim S"
        },
        {
            "date": "June 17, 2012",
            "detail_rating": {
                "business": null,
                "cleanliness": 1.0,
                "desk": null,
                "location": 3.0,
                "pool": null,
                "restaurant": null,
                "rooms": 3.0,
                "service": 1.0,
                "sleep": 2.0,
                "value": 2.0
            },
            "helpfulness": null,
            "id": 132193956,
            "likes": {
                "disliked": null,
                "liked": null
            },
            "rating": 2.0,
            "stay_parameters": "Stayed June 2012, traveled with family",
            "text": "This hotel seems to cater to smokers. I reserved a non-smoking room and was given",
            "title": "Don't stay here if you aren't a smoker",
            "user": "Lynne O"
        },
        {
            "date": "May 29, 2012",
            "detail_rating": {
                "business": null,
                "cleanliness": 5.0,
                "desk": null,
                "location": 5.0,
                "pool": null,
                "restaurant": null,
                "rooms": 5.0,
                "service": 5.0,
                "sleep": 5.0,
                "value": 5.0
            },
            "helpfulness": null,
            "id": 130912442,
            "likes": {
                "disliked": null,
                "liked": null
            },
            "rating": 5.0,
            "stay_parameters": "Stayed May 2012, traveled with family",
            "text": "a smoking room. When I complained, I was told they hadn't had any non-smoking rooms",
            "title": "This is an excellent hotel to stay in",
            "user": "Charlene1959"
        },
        {
            "date": "May 14, 2012",
            "detail_rating": {
                "business": null,
                "cleanliness": 5.0,
                "desk": null,
                "location": 5.0,
                "pool": null,
                "restaurant": null,
                "rooms": 5.0,
                "service": 5.0,
                "sleep": 5.0,
                "value": 5.0
            },
            "helpfulness": null,
            "id": 129917733,
            "likes": {
                "disliked": null,
                "liked": null
            },
            "rating": 5.0,
            "stay_parameters": "Stayed May 2012, traveled on business",
            "text": "available for the night we reserved for at least a month prior to my request. They claimed",
            "title": "Jimmy H",
            "user": "Jim H"
        },
        {
            "date": "March 16, 2012",
            "detail_rating": {
                "business": null,
                "cleanliness": 1.0,
                "desk": null,
                "location": 1.0,
                "pool": null,
                "restaurant": null,
                "rooms": 1.0,
                "service": 1.0,
                "sleep": 1.0,
                "value": 1.0
            },
            "helpfulness": 3,
            "id": 126183627,
            "likes": {
                "disliked": null,
                "liked": null
            },
            "rating": 1.0,
            "stay_parameters": "Stayed November 2011, traveled on business",
            "text": "that it was the company we reserved through (Hotels.com) who made the reservation knowing",
            "title": "Run away now!",
            "user": "Duane N"
        },
        {
            "date": "December 27, 2011",
            "detail_rating": {
                "business": null,
                "cleanliness": 5.0,
                "desk": null,
                "location": 5.0,
                "pool": null,
                "restaurant": null,
                "rooms": 5.0,
                "service": 5.0,
                "sleep": 5.0,
                "value": 5.0
            },
            "helpfulness": null,
            "id": 122161775,
            "likes": {
                "disliked": null,
                "liked": null
            },
            "rating": 5.0,
            "stay_parameters": "Stayed December 2011, traveled with family",
            "text": "there was not a room available to meet our request. I've reviewed Hotels.com separately.",
            "title": "My family was in a crisis---staff-sympathtic/empathetic-helpful--thanks",
            "user": "Brynna52"
        }
    ],
    "slim_ranking": 0.761904761905,
    "stars": 2.5,
    "tripadvisor": {
        "VISITED": false,
        "country_name": null,
        "locality": null,
        "pic_link": null,
        "street_address": null
    },
    "user_rating": 3.0,
    "variance": {
        "average": 3,
        "excellent": 13,
        "poor": 8,
        "terrible": 10,
        "very good": 5
    }
}