{
    "aka": null,
    "description": null,
    "detail_rating": {
        "cleanliness": null,
        "location": null,
        "rooms": null,
        "service": null,
        "sleep": null,
        "value": null
    },
    "location": {
        "city": null,
        "continent": "Europe",
        "country": "France",
        "proposed_city": "Central",
        "province": null,
        "region": "Picardy"
    },
    "name": "Hotel Central&Anzac",
    "places": {
        "aka": [],
        "hotel_description": [],
        "hotel_name": [
            "Central"
        ]
    },
    "review_count": 34,
    "review_count_current": 3,
    "reviews": [
        {
            "date": "February 24, 2011",
            "detail_rating": {
                "business": null,
                "cleanliness": 5.0,
                "desk": null,
                "location": 5.0,
                "pool": null,
                "restaurant": null,
                "rooms": 3.0,
                "service": 5.0,
                "sleep": 4.0,
                "value": 5.0
            },
            "helpfulness": null,
            "id": 97808223,
            "likes": {
                "disliked": null,
                "liked": null
            },
            "rating": 5.0,
            "stay_parameters": "Stayed February 2011, traveled with family",
            "text": "We loved this hotel! The woman at the front desk was extremely friendly and helpful. The location near the train station was so convienient, yet it wasn't much of a walk to the city center. The location was extremely quiet as well. The rooms were small and simple, but for the incredible price I'll take it!",
            "title": "Superb location & value",
            "user": "pepoling"
        },
        {
            "date": "October 9, 2010",
            "detail_rating": {
                "business": null,
                "cleanliness": 4.0,
                "desk": null,
                "location": 4.0,
                "pool": null,
                "restaurant": null,
                "rooms": 3.0,
                "service": 5.0,
                "sleep": 2.0,
                "value": 4.0
            },
            "helpfulness": null,
            "id": 82768521,
            "likes": {
                "disliked": null,
                "liked": null
            },
            "rating": 4.0,
            "stay_parameters": "Stayed October 2010, traveled with family",
            "text": "Pleasant service, very good balance of price and standard, great as a base for an overnight trip to Amiens, everything in easy walking distance. We booked two rooms and they were clean and quiet.",
            "title": "Good value, great location, beds a bit hard",
            "user": "AusInNetherlands"
        },
        {
            "date": "July 28, 2009",
            "detail_rating": {
                "business": null,
                "cleanliness": 3.0,
                "desk": null,
                "location": 4.0,
                "pool": null,
                "restaurant": null,
                "rooms": 3.0,
                "service": 3.0,
                "sleep": null,
                "value": 3.0
            },
            "helpfulness": null,
            "id": 36066179,
            "likes": {
                "disliked": null,
                "liked": null
            },
            "rating": 3.0,
            "stay_parameters": "Stayed July 2009, traveled as a couple",
            "text": "One thing though: the beds were a bit hard, and they put a plastic protective barrier between the cotton sheet and mattress, which is a bit squeaky and sweaty.",
            "title": "Budget hotel in decent location",
            "user": "MallyCole"
        }
    ],
    "slim_ranking": 0.473684210526,
    "stars": null,
    "tripadvisor": {
        "VISITED": false,
        "country_name": null,
        "locality": null,
        "pic_link": null,
        "street_address": null
    },
    "user_rating": 3.5,
    "variance": {
        "average": 14,
        "excellent": 5,
        "poor": 2,
        "terrible": 0,
        "very good": 13
    }
}