{
    "aka": "East Hotel Country",
    "description": null,
    "detail_rating": {
        "cleanliness": null,
        "location": null,
        "rooms": null,
        "service": null,
        "sleep": null,
        "value": null
    },
    "location": {
        "city": null,
        "continent": "Europe",
        "country": "United Kingdom (UK)",
        "proposed_city": null,
        "province": null,
        "region": null
    },
    "name": "East Lodge Country House Hotel",
    "places": {
        "aka": [],
        "hotel_description": [],
        "hotel_name": []
    },
    "review_count": 184,
    "review_count_current": 20,
    "reviews": [
        {
            "date": "March 26, 2008",
            "detail_rating": {
                "business": null,
                "cleanliness": null,
                "desk": null,
                "location": null,
                "pool": null,
                "restaurant": null,
                "rooms": null,
                "service": 1.0,
                "sleep": null,
                "value": 1.0
            },
            "helpfulness": 3,
            "id": 14545176,
            "likes": {
                "disliked": null,
                "liked": null
            },
            "rating": 1.0,
            "stay_parameters": "Stayed March 2008, traveled with friends",
            "text": "Went for Sunday lunch at Easter and was most disappointed for the following reasons:",
            "title": "Customer Service Non Existent",
            "user": "AnnieKensington"
        },
        {
            "date": "March 24, 2008",
            "detail_rating": {
                "business": 4.0,
                "cleanliness": 5.0,
                "desk": null,
                "front_desk": 5.0,
                "location": 4.0,
                "pool": null,
                "restaurant": null,
                "rooms": 5.0,
                "service": 5.0,
                "sleep": null,
                "value": 3.0
            },
            "helpfulness": null,
            "id": 14486453,
            "likes": {
                "disliked": "\u2014 Lack of flavour in evening meal",
                "liked": "\u2014 Relaxed and friendly atmosphere"
            },
            "rating": 4.0,
            "stay_parameters": "Stayed March 2008, traveled as a couple",
            "text": "- On arrival, customer service was non existent, front of house",
            "title": "A really relaxing hotel",
            "user": "Beanbagglos"
        },
        {
            "date": "March 24, 2008",
            "detail_rating": {
                "business": null,
                "cleanliness": null,
                "desk": null,
                "location": null,
                "pool": null,
                "restaurant": null,
                "rooms": null,
                "service": null,
                "sleep": null,
                "value": null
            },
            "helpfulness": 1,
            "id": 14484249,
            "likes": {
                "disliked": null,
                "liked": null
            },
            "rating": 1.0,
            "stay_parameters": null,
            "text": "staff were grumpy and unhelpful in finding us somewhere to",
            "title": "Good Food, Terrible Customer Service!",
            "user": "DenbySteve"
        },
        {
            "date": "December 31, 2007",
            "detail_rating": {
                "business": 3.0,
                "cleanliness": 3.0,
                "desk": null,
                "front_desk": 3.0,
                "location": 3.0,
                "pool": null,
                "restaurant": null,
                "rooms": 2.0,
                "service": 4.0,
                "sleep": null,
                "value": 2.0
            },
            "helpfulness": 3,
            "id": 12156763,
            "likes": {
                "disliked": null,
                "liked": null
            },
            "rating": 2.0,
            "stay_parameters": "Stayed November 2007, traveled with family",
            "text": "sit in the lounge when we wanted a pre lunch drink. At this",
            "title": "Maybe we were unlucky",
            "user": "LOkingsbury"
        },
        {
            "date": "November 6, 2007",
            "detail_rating": {
                "business": null,
                "cleanliness": 5.0,
                "desk": null,
                "front_desk": 5.0,
                "location": 5.0,
                "pool": null,
                "restaurant": null,
                "rooms": 5.0,
                "service": 5.0,
                "sleep": null,
                "value": 4.0
            },
            "helpfulness": null,
            "id": 10647161,
            "likes": {
                "disliked": null,
                "liked": null
            },
            "rating": 5.0,
            "stay_parameters": "Stayed August 2007, traveled with family",
            "text": "point, we almost left and went elsewhere!",
            "title": "Fantastic wedding, fantastic service",
            "user": "RickyTracey"
        },
        {
            "date": "November 24, 2008",
            "detail_rating": {
                "business": null,
                "cleanliness": 5.0,
                "desk": null,
                "front_desk": 5.0,
                "location": 5.0,
                "pool": null,
                "restaurant": null,
                "rooms": 5.0,
                "service": 5.0,
                "sleep": null,
                "value": 5.0
            },
            "helpfulness": 1,
            "id": 22132216,
            "likes": {
                "disliked": "\u2014 nothing",
                "liked": "\u2014 everything, but the chocolate dessert was just out of this world"
            },
            "rating": 5.0,
            "stay_parameters": "Stayed November 2008, traveled as a couple",
            "text": "Having visited East Lodge earlier this year, we returned again for another wonderful weekend at this gem of a hotel in the heart of Derbyshire. Nothing is too much trouble for any of the staff at East Lodge and you are treated as individuals and not just another number as often happens in other hotels at which we have stayed. What more can be said other than that East Lodge is just perfection.",
            "title": "Wonderful Hotel",
            "user": "MrsWeebs"
        },
        {
            "date": "November 10, 2008",
            "detail_rating": {
                "business": null,
                "cleanliness": null,
                "desk": null,
                "location": null,
                "pool": null,
                "restaurant": null,
                "rooms": null,
                "service": null,
                "sleep": null,
                "value": null
            },
            "helpfulness": 1,
            "id": 21688233,
            "likes": {
                "disliked": null,
                "liked": null
            },
            "rating": 4.0,
            "stay_parameters": null,
            "text": "My husband booked this hotel for a surprise 2night break to celebrate our 1st wedding anniversary. It was a lovely location, the staff were extremely polite, presentable and helpful. We had an initlal problem with the room temperature but this was swiftly resolved. The room was a bit small but beautifully furnished and appointed. The standards of cleanliness, quality and tidiness throughout the hotel were second to none. We dined in the restaurant due to its reputation, and were not disappointed. This was one of the reasons the hotel was chosen. The menu choice, presentation of food, quality and taste were superb - and the service was excellent too. Breakfasts were as you would expect - plenty of choice, waitress served and quality food. An experience not to be missed and we would certainly make a return visit and recommend this hotel to everyone we could.",
            "title": "Anniversary haven",
            "user": "curlyKateLancashire"
        },
        {
            "date": "November 5, 2008",
            "detail_rating": {
                "business": 5.0,
                "cleanliness": 5.0,
                "desk": null,
                "front_desk": 5.0,
                "location": 5.0,
                "pool": null,
                "restaurant": null,
                "rooms": 5.0,
                "service": 5.0,
                "sleep": null,
                "value": 5.0
            },
            "helpfulness": 1,
            "id": 21574182,
            "likes": {
                "disliked": "\u2014 Nothing",
                "liked": "\u2014 Clean, modern and well appointed"
            },
            "rating": 5.0,
            "stay_parameters": "Stayed November 2008, traveled as a couple",
            "text": "A thoroughly enjoyable two night break. We received a warm welcome and all staff were polite, friendly, approachable and very well turned out at all times. The room was well appointed, warm and most comfortable. All food was of a very high standard. We will certainly return to this hotel based on our experiences. Thank you to all staff for such a great weekend.",
            "title": "Wonderfully relaxing break",
            "user": "CabrioletQueen"
        },
        {
            "date": "September 24, 2008",
            "detail_rating": {
                "business": null,
                "cleanliness": 5.0,
                "desk": null,
                "front_desk": 5.0,
                "location": 5.0,
                "pool": null,
                "restaurant": null,
                "rooms": 4.0,
                "service": 5.0,
                "sleep": null,
                "value": 5.0
            },
            "helpfulness": null,
            "id": 20346696,
            "likes": {
                "disliked": "\u2014 tight closet quarters",
                "liked": "\u2014 the staff"
            },
            "rating": 5.0,
            "stay_parameters": "Stayed September 2008, traveled as a couple",
            "text": "This is a homey, comfy, lovely place. Feels like a home. Rooms have slanted floors and ours had 3 messages carved in the window glass from the 1800's. Yet the cleanliness and modern bathrooms make it up-to-date. Our room lacked nothing except the closet was so close to the bed that only one person at a time could use it. Small complaint. Bed excellent. Quiet. lovely view. Pleasant grounds with a beautiful garden. Food excellent. Highest quality. Staff superb--warm, caring and professional. Great location. 10 minutes from Chatsworth. Not much more to Haddon Hall and Hardwick Hall.",
            "title": "A Home Away From Home",
            "user": "mntraveler46"
        },
        {
            "date": "July 5, 2008",
            "detail_rating": {
                "business": null,
                "cleanliness": 4.0,
                "desk": null,
                "front_desk": 3.0,
                "location": 3.0,
                "pool": null,
                "restaurant": null,
                "rooms": 4.0,
                "service": 3.0,
                "sleep": null,
                "value": 3.0
            },
            "helpfulness": 2,
            "id": 17556434,
            "likes": {
                "disliked": "\u2014 Staff problems",
                "liked": "\u2014 Stunning Setting"
            },
            "rating": 3.0,
            "stay_parameters": "Stayed June 2008, traveled as a couple",
            "text": "I think we were unlucky in some respects hence my average rather than above average",
            "title": "Stunning Setting",
            "user": "Hilltop7"
        },
        {
            "date": "July 1, 2008",
            "detail_rating": {
                "business": null,
                "cleanliness": null,
                "desk": null,
                "location": null,
                "pool": null,
                "restaurant": null,
                "rooms": null,
                "service": null,
                "sleep": null,
                "value": null
            },
            "helpfulness": 1,
            "id": 17413048,
            "likes": {
                "disliked": null,
                "liked": null
            },
            "rating": 5.0,
            "stay_parameters": null,
            "text": "I took two visitors from the USA to East Lodge for Afternoon Tea.",
            "title": "Afternoon Tea",
            "user": "Vonny1952"
        },
        {
            "date": "June 23, 2008",
            "detail_rating": {
                "business": null,
                "cleanliness": 5.0,
                "desk": null,
                "front_desk": 5.0,
                "location": 5.0,
                "pool": null,
                "restaurant": null,
                "rooms": 5.0,
                "service": 5.0,
                "sleep": null,
                "value": 5.0
            },
            "helpfulness": 2,
            "id": 17151285,
            "likes": {
                "disliked": "\u2014 There was nothing not to like.",
                "liked": "\u2014 Staff"
            },
            "rating": 5.0,
            "stay_parameters": "Stayed June 2008, traveled as a couple",
            "text": "It was a beautiful day so we were able to sit on the patio overlooking the lake. The tea was gorgeous and beautifully presented . Staff were excellent.",
            "title": "Best Weekend of my life!",
            "user": "Cosmicdude"
        },
        {
            "date": "May 26, 2008",
            "detail_rating": {
                "business": null,
                "cleanliness": 3.0,
                "desk": null,
                "front_desk": 1.0,
                "location": 4.0,
                "pool": null,
                "restaurant": null,
                "rooms": 4.0,
                "service": 3.0,
                "sleep": null,
                "value": 1.0
            },
            "helpfulness": 6,
            "id": 16416605,
            "likes": {
                "disliked": null,
                "liked": null
            },
            "rating": 1.0,
            "stay_parameters": "Stayed February 2008, traveled with family",
            "text": "My Wife and I had our Wedding reception at East Lodge in early June. We had the hotel for the whole weekend. This also meant we had to have all 12 bedrooms included in the price, which wasn't a problem as we both have big families needing somewhere to stay and were quite happy with this.",
            "title": "No response to my complaints",
            "user": "family0ne"
        },
        {
            "date": "May 2, 2008",
            "detail_rating": {
                "business": null,
                "cleanliness": 2.0,
                "desk": null,
                "front_desk": 3.0,
                "location": 5.0,
                "pool": null,
                "restaurant": null,
                "rooms": 1.0,
                "service": 1.0,
                "sleep": null,
                "value": null
            },
            "helpfulness": 4,
            "id": 15569025,
            "likes": {
                "disliked": null,
                "liked": null
            },
            "rating": 1.0,
            "stay_parameters": "Stayed November 2007, traveled as a couple",
            "text": "Every single guest that came to celebrate with us that day (120 in total), could not believe how amazing the place was....from the grounds, to the most delicious food that was served not only for the Wedding Breakfast but for the hotel guests all weekend (all inclusive with the price).",
            "title": "Freezing cold room & appalling customer service",
            "user": "leothecatUk"
        },
        {
            "date": "April 9, 2008",
            "detail_rating": {
                "business": null,
                "cleanliness": null,
                "desk": null,
                "location": null,
                "pool": null,
                "restaurant": null,
                "rooms": null,
                "service": null,
                "sleep": null,
                "value": null
            },
            "helpfulness": 3,
            "id": 14913400,
            "likes": {
                "disliked": null,
                "liked": null
            },
            "rating": 2.0,
            "stay_parameters": null,
            "text": "My wife and I are so happy we chose East Lodge for our Reception, and loved it so much we are going to stay here again...even though we only live 4 miles away!!!",
            "title": "Cold winter breaks",
            "user": "chillledout"
        },
        {
            "date": "May 5, 2009",
            "detail_rating": {
                "business": null,
                "cleanliness": 5.0,
                "desk": null,
                "location": 5.0,
                "pool": null,
                "restaurant": null,
                "rooms": 4.0,
                "service": 5.0,
                "sleep": null,
                "value": 4.0
            },
            "helpfulness": 1,
            "id": 29403959,
            "likes": {
                "disliked": null,
                "liked": null
            },
            "rating": 4.0,
            "stay_parameters": "Stayed April 2009, traveled as a couple",
            "text": "The hotel is set back from the road with views over the hills or across the garden. The staff are very welcoming and friendly. This is an excellent small hotel for exploring the Peak District and returning in the evening for a drink in the conservatory and some excellent food and wine in the restaurant overlooking the mature garden and pond. Breakfasts are very good and the rooms are spacious, quiet and very comfortable.",
            "title": "Warm welcome and good food in the Peak District",
            "user": "Traveller118"
        },
        {
            "date": "February 11, 2009",
            "detail_rating": {
                "business": 4.0,
                "cleanliness": 5.0,
                "desk": null,
                "front_desk": 4.0,
                "location": 5.0,
                "pool": null,
                "restaurant": null,
                "rooms": 5.0,
                "service": 5.0,
                "sleep": null,
                "value": 5.0
            },
            "helpfulness": 1,
            "id": 24471621,
            "likes": {
                "disliked": "\u2014 nothing",
                "liked": "\u2014 the whole expereince including the quality of the food"
            },
            "rating": 5.0,
            "stay_parameters": "Stayed February 2009, traveled on business",
            "text": "A truely excellent hotel well worthy of its 4 star rating. The best hotel resturant I have ever stayed at and a most welcome and friendly service. Attention to detail was impressive.",
            "title": "outstanding family run hotel",
            "user": "markeygate"
        },
        {
            "date": "January 14, 2009",
            "detail_rating": {
                "business": null,
                "cleanliness": 5.0,
                "desk": null,
                "front_desk": 5.0,
                "location": 5.0,
                "pool": null,
                "restaurant": null,
                "rooms": 5.0,
                "service": 5.0,
                "sleep": null,
                "value": 5.0
            },
            "helpfulness": 1,
            "id": 23560016,
            "likes": {
                "disliked": "\u2014 Nothing!",
                "liked": "\u2014 Everything!"
            },
            "rating": 5.0,
            "stay_parameters": "Stayed December 2008",
            "text": "Great location for Chatsworth House and the National Park.",
            "title": "Perfect from start to finish..",
            "user": "travellerBelper"
        },
        {
            "date": "November 26, 2008",
            "detail_rating": {
                "business": null,
                "cleanliness": 5.0,
                "desk": null,
                "front_desk": 5.0,
                "location": 5.0,
                "pool": null,
                "restaurant": null,
                "rooms": 5.0,
                "service": 5.0,
                "sleep": null,
                "value": 5.0
            },
            "helpfulness": 2,
            "id": 22225247,
            "likes": {
                "disliked": "\u2014 Sister had young children not really welcome",
                "liked": "\u2014 The Friendly Staff Atmosphere and fantastic food"
            },
            "rating": 5.0,
            "stay_parameters": "Stayed August 2006, traveled with family",
            "text": "Small hotel which is a far cry from the municipal treatment of many major brands.",
            "title": "Fantastic Wedding",
            "user": "jka12"
        },
        {
            "date": "November 24, 2008",
            "detail_rating": {
                "business": 1.0,
                "cleanliness": 4.0,
                "desk": null,
                "front_desk": 2.0,
                "location": 3.0,
                "pool": null,
                "restaurant": null,
                "rooms": 2.0,
                "service": 2.0,
                "sleep": null,
                "value": 2.0
            },
            "helpfulness": 2,
            "id": 22143405,
            "likes": {
                "disliked": "\u2014 The freezing hotel room",
                "liked": "\u2014 The fabulous food in the restaurant"
            },
            "rating": 2.0,
            "stay_parameters": "Stayed November 2008, traveled with family",
            "text": "Having looked at several locations for our wedding we selected East Lodge. We fell in love with the venue immediately and the initial staff we had contact with were also very good. Throughout the whole planning process East Lodge staff were great. I made many (probably too many!) phone calls, visited on lots of occasions and was always made to feel important.",
            "title": "Wonderful food, freezing accommodation",
            "user": "Alison W"
        }
    ],
    "slim_ranking": 1.0,
    "stars": 3,
    "tripadvisor": {
        "VISITED": false,
        "country_name": null,
        "locality": null,
        "pic_link": null,
        "street_address": null
    },
    "user_rating": 4.5,
    "variance": {
        "average": 7,
        "excellent": 126,
        "poor": 9,
        "terrible": 10,
        "very good": 32
    }
}