{
    "aka": "Hilton Garden Inn Portland Airport Hotel Portland",
    "description": null,
    "detail_rating": {
        "cleanliness": null,
        "location": null,
        "rooms": null,
        "service": null,
        "sleep": null,
        "value": null
    },
    "location": {
        "city": "Portland",
        "continent": null,
        "country": "United States",
        "proposed_city": "Portland",
        "province": null,
        "region": null
    },
    "name": "Hilton Garden Inn Portland Airport",
    "places": {
        "aka": [
            "Portland"
        ],
        "hotel_description": [],
        "hotel_name": [
            "Portland"
        ]
    },
    "review_count": 166,
    "review_count_current": 20,
    "reviews": [
        {
            "date": "December 25, 2007",
            "detail_rating": {
                "business": 5.0,
                "cleanliness": 5.0,
                "desk": null,
                "front_desk": 3.0,
                "location": 5.0,
                "pool": null,
                "restaurant": null,
                "rooms": 4.0,
                "service": 1.0,
                "sleep": null,
                "value": 4.0
            },
            "helpfulness": null,
            "id": 11939002,
            "likes": {
                "disliked": "\u2014 Breakfast and service",
                "liked": "\u2014 Location and price"
            },
            "rating": 3.0,
            "stay_parameters": "Stayed October 2007, traveled as a couple",
            "text": "Overall, an average experience. Stayed for one night in a King room after attending a wedding in the area. We chose the room for it's convenient location and low price. (About 115 dollars including breakfast - which great for Portland) The hotel itself was nice enough - nothing fancy but modern, clean, and comfortable. Very close to the airport, which is good for travellers. Front-desk staff was efficient but not very friendly. The only really bad part of our stay was the breakfast. We arrived downstairs about 45-50 minutes before breakfast was supposed to be over, only to find very little food left. What was there was cold and unappetizing. We had already paid for the breakfast (booked through the hotel and paid extra for the it) so we went ahead and ate what we could scrape up. There was one bottle of ketchup for all the guests to share, unfortunately by the time it made it's way to us it was pretty much empty. There was no coffee left and I tried to flag down the one staff person that was flitting about the place, but to no avail. Also, it wasn't a proper restaurant, but just an area off to one side of the lobby. It felt strange sitting there and eating while people breezed in and out with suitcases. I did email the hotel once we returned home and complained about the situation, and was immediately (same day?) sent an apology from the manager, who also refunded the money paid for breakfast. I was impressed by this prompt attention to our problem, and therefore I would stay again. I'll just grab breakfast at Starbucks instead.",
            "title": "Great price, good room, fair service, bad breakfast",
            "user": "branmart"
        },
        {
            "date": "July 30, 2007",
            "detail_rating": {
                "business": null,
                "cleanliness": 4.0,
                "desk": null,
                "front_desk": 4.0,
                "location": 3.0,
                "pool": null,
                "restaurant": null,
                "rooms": 2.0,
                "service": 4.0,
                "sleep": null,
                "value": 3.0
            },
            "helpfulness": null,
            "id": 8260302,
            "likes": {
                "disliked": null,
                "liked": null
            },
            "rating": 2.0,
            "stay_parameters": "Stayed July 2007",
            "text": "The lobby is very attractive, the staff friendly, but my room felt rather cheap. I could hear the people upstairs too much - the fixtures felt inexpensive, as well.",
            "title": "felt cheap",
            "user": "caobhin"
        },
        {
            "date": "June 19, 2007",
            "detail_rating": {
                "business": null,
                "cleanliness": null,
                "desk": null,
                "location": null,
                "pool": null,
                "restaurant": null,
                "rooms": null,
                "service": null,
                "sleep": null,
                "value": null
            },
            "helpfulness": 3,
            "id": 7935627,
            "likes": {
                "disliked": null,
                "liked": null
            },
            "rating": 5.0,
            "stay_parameters": null,
            "text": "Overall a decent place, but I felt like the construction of the building was not up to par.",
            "title": "Surpise, found a Gem of a hotel",
            "user": "ElizabethStreetMoM"
        },
        {
            "date": "March 3, 2007",
            "detail_rating": {
                "business": 3.0,
                "cleanliness": 3.0,
                "desk": null,
                "front_desk": 3.0,
                "location": 3.0,
                "pool": null,
                "restaurant": null,
                "rooms": 2.0,
                "service": 2.0,
                "sleep": null,
                "value": 2.0
            },
            "helpfulness": 2,
            "id": 6908146,
            "likes": {
                "disliked": "\u2014 Breakfast, small television, no television stations",
                "liked": "\u2014 Nothing"
            },
            "rating": 2.0,
            "stay_parameters": "Stayed February 2007, traveled on business",
            "text": "Went to an event a Portland Airport hotel, but the hotel for the venue was booked up so grabbed the Hilton Garden Inn in the pinch as it was down the street from the venue hotel.",
            "title": "Decent but Breakfast Ruins the Stay",
            "user": "m.glenn"
        },
        {
            "date": "December 27, 2006",
            "detail_rating": {
                "business": 4.0,
                "cleanliness": 3.0,
                "desk": null,
                "front_desk": 3.0,
                "location": 3.0,
                "pool": null,
                "restaurant": null,
                "rooms": 3.0,
                "service": 4.0,
                "sleep": null,
                "value": 3.0
            },
            "helpfulness": 3,
            "id": 6503417,
            "likes": {
                "disliked": null,
                "liked": null
            },
            "rating": 3.0,
            "stay_parameters": "Stayed November 2006, traveled as a couple",
            "text": "What a surprise. The front desk staff was extremely personable, you would have thought I was checking into a 5 star hotel.",
            "title": "very nice hotel, a little noisy",
            "user": "PeTim123"
        },
        {
            "date": "March 11, 2011",
            "detail_rating": {
                "business": null,
                "cleanliness": 5.0,
                "desk": null,
                "location": 5.0,
                "pool": null,
                "restaurant": null,
                "rooms": 5.0,
                "service": 5.0,
                "sleep": 5.0,
                "value": 5.0
            },
            "helpfulness": null,
            "id": 99834551,
            "likes": {
                "disliked": null,
                "liked": null
            },
            "rating": 5.0,
            "stay_parameters": "Stayed March 2011, traveled as a couple",
            "text": "Not sure why all the negative reviews on this property. Was here for 1 night before early morning flight out. I needed pickup from National Car rental instead of from airport and staff was extremely accommodating about it. Shuttle drivers friendly and on time. Overall decor, lobby and room met standards I expected for a Hilton Garden Inn. I stayed on a first floor room and I didn't experience any bad street noise...then again, maybe I was lucky that night along with being I am a heavy sleeper. Not too many non-fast foody places to choose from but hey, it's an airport hotel. Overall satisfied.",
            "title": "What I expected for Garden properties",
            "user": "setiramm"
        },
        {
            "date": "February 13, 2011",
            "detail_rating": {
                "business": null,
                "cleanliness": 5.0,
                "desk": null,
                "location": 5.0,
                "pool": null,
                "restaurant": null,
                "rooms": 3.0,
                "service": 3.0,
                "sleep": 3.0,
                "value": 3.0
            },
            "helpfulness": null,
            "id": 96405362,
            "likes": {
                "disliked": null,
                "liked": null
            },
            "rating": 3.0,
            "stay_parameters": "Stayed February 2011, traveled solo",
            "text": "I chose this hotel since it was close to the airport and offered a free shuttle. I got a one bedroom suite and enjoyed a nice rest. The front desk was polite, but the woman that checked me in was obviously rushed and wanted to get me out of her way as soon as possible. I understand being busy, but I was not in a hurry and would've waited for her to finish with other guests as well so that I could get the information I needed. The rooms were nice and clean and I felt safe leaving my car parked here while away on my trip. The shuttle drivers were very pleasant. The room decor is fine and the bed was comfortable. Overall, not a bad stay.",
            "title": "Convenient",
            "user": "BeachGirl853"
        },
        {
            "date": "September 30, 2010",
            "detail_rating": {
                "business": null,
                "cleanliness": 4.0,
                "desk": null,
                "location": 2.0,
                "pool": null,
                "restaurant": null,
                "rooms": 3.0,
                "service": 2.0,
                "sleep": 2.0,
                "value": 2.0
            },
            "helpfulness": null,
            "id": 81675770,
            "likes": {
                "disliked": null,
                "liked": null
            },
            "rating": 2.0,
            "stay_parameters": "Stayed July 2010, traveled as a couple",
            "text": "We arrived around 4:00 pm and we asked for a room at the back of the hotel and the woman at the front desk said they were all occupied. We went to our assigned room and the noise from the road in front of the hotel was very loud. We went back to the front desk again to talk about the room location and the woman assured us the traffic would be minimal during the night... Of course, it was noisy the whole night because of the traffic. Needless to say, the staff was not that helpful.",
            "title": "Noise and promises",
            "user": "BYJP"
        },
        {
            "date": "July 10, 2010",
            "detail_rating": {
                "business": null,
                "cleanliness": 4.0,
                "desk": null,
                "location": 4.0,
                "pool": null,
                "restaurant": null,
                "rooms": 2.0,
                "service": 4.0,
                "sleep": 1.0,
                "value": 3.0
            },
            "helpfulness": null,
            "id": 70435925,
            "likes": {
                "disliked": null,
                "liked": null
            },
            "rating": 2.0,
            "stay_parameters": "Stayed July 2010, traveled on business",
            "text": "This hotel is conveniently located, if you need to be near Portland International Airport, and it is moderately priced. It looks nice and is clean. But it fails to deliver on the one thing a hotel should: A good night's sleep.",
            "title": "Not a Good Night's Sleep!",
            "user": "canada611"
        },
        {
            "date": "November 5, 2009",
            "detail_rating": {
                "business": null,
                "cleanliness": 3.0,
                "desk": null,
                "location": 2.0,
                "pool": null,
                "restaurant": null,
                "rooms": 1.0,
                "service": 1.0,
                "sleep": null,
                "value": 1.0
            },
            "helpfulness": null,
            "id": 48556781,
            "likes": {
                "disliked": null,
                "liked": null
            },
            "rating": 2.0,
            "stay_parameters": "Stayed November 2009, traveled on business",
            "text": "This is a cheaply constructed wood frame building, such that floors bounce like a trampoline and walls are thin. Thus, you get to hear every footstep, every door slam, every TV set, in every nearby room, above, below next door and across the hall. And, the guests were not even being particulary noisy - just normal sounds amplified by this poor construction.",
            "title": "Noisy",
            "user": "campermanSeattle"
        },
        {
            "date": "March 27, 2009",
            "detail_rating": {
                "business": null,
                "cleanliness": 5.0,
                "desk": null,
                "location": 5.0,
                "pool": null,
                "restaurant": null,
                "rooms": 5.0,
                "service": 5.0,
                "sleep": null,
                "value": 5.0
            },
            "helpfulness": null,
            "id": 26906822,
            "likes": {
                "disliked": null,
                "liked": null
            },
            "rating": 5.0,
            "stay_parameters": "Stayed March 2009, traveled on business",
            "text": "I wound up staying for two nights at this hotel due to my air travel being cancelled. I chose the HGI airport because it was close and I'm an honors member. I had to make my reservation after 10pm but got the room I preferred.",
            "title": "Fabulous service!",
            "user": "polarspeech"
        },
        {
            "date": "July 22, 2008",
            "detail_rating": {
                "business": 5.0,
                "cleanliness": 5.0,
                "desk": null,
                "front_desk": 5.0,
                "location": 4.0,
                "pool": null,
                "restaurant": null,
                "rooms": 4.0,
                "service": 5.0,
                "sleep": null,
                "value": 5.0
            },
            "helpfulness": null,
            "id": 18154509,
            "likes": {
                "disliked": "\u2014 Parking Lot Not Big Enough for all the Guests",
                "liked": "\u2014 Convenient Location, Close to Airport and Rental Car Lots"
            },
            "rating": 4.0,
            "stay_parameters": "Stayed June 2008, traveled with family",
            "text": "The free shuttle from the airport was quick to pick me up. What wonderful drivers they had! The next day a different driver drove me to the train station so I could look around town. He made sure I had the best route, how to navigate the system and the best way to get picked up There is a Starbucks around the corner from here and a McDonald's next door if you need to clog some arteries.",
            "title": "No Surprises: Another Clean, Comfortable Hilton Garden Inn",
            "user": "GoingEverywhere"
        },
        {
            "date": "May 12, 2008",
            "detail_rating": {
                "business": 4.0,
                "cleanliness": 5.0,
                "desk": null,
                "front_desk": 5.0,
                "location": 5.0,
                "pool": null,
                "restaurant": null,
                "rooms": 5.0,
                "service": 5.0,
                "sleep": null,
                "value": 5.0
            },
            "helpfulness": 1,
            "id": 15977280,
            "likes": {
                "disliked": "\u2014 Internet occasionaly slow",
                "liked": "\u2014 Cleanliness"
            },
            "rating": 5.0,
            "stay_parameters": "Stayed May 2008, traveled on business",
            "text": "The fitness center was small but not crowded. The food was good too. Make sure to try a microbrew while you're there.",
            "title": "Great Room, Nice Amenities",
            "user": "StateAuditor"
        },
        {
            "date": "April 10, 2008",
            "detail_rating": {
                "business": 4.0,
                "cleanliness": 3.0,
                "desk": null,
                "front_desk": 5.0,
                "location": 3.0,
                "pool": null,
                "restaurant": null,
                "rooms": 4.0,
                "service": 4.0,
                "sleep": null,
                "value": 4.0
            },
            "helpfulness": null,
            "id": 14927442,
            "likes": {
                "disliked": "\u2014 couch seemed a bit old and dated",
                "liked": "\u2014 gym, upgrade to suite"
            },
            "rating": 4.0,
            "stay_parameters": "Stayed April 2008, traveled on business",
            "text": "We arrived at PDX Airport late and grabbed the shuttle to the rental car lot. After getting the car, we were so happy to find the hotel is just a few blocks from the Thrifty car lot. We were tired, and we were quite happy with the Hilton Garden Inn PDX.",
            "title": "Great Rate, Nice Hotel, Fair Room",
            "user": "taprennoc"
        },
        {
            "date": "January 20, 2008",
            "detail_rating": {
                "business": null,
                "cleanliness": 3.0,
                "desk": null,
                "front_desk": 3.0,
                "location": 3.0,
                "pool": null,
                "restaurant": null,
                "rooms": 3.0,
                "service": 3.0,
                "sleep": null,
                "value": 2.0
            },
            "helpfulness": null,
            "id": 12815465,
            "likes": {
                "disliked": null,
                "liked": null
            },
            "rating": 2.0,
            "stay_parameters": "Stayed January 2008, traveled on business",
            "text": "The hotel appeared older than any previous HGI I've stayed in, but it was kept impeccably clean to Hilton standards. Check-in was quick and efficient, the bed comfortable, and everything worked. Our room had a view of the parking lot, which was not exactly interesting. There are a few fast food outlets close by, and the hotel also has a small restaurant. If you've stayed at a Hilton Garden Inn before, you won't get any surprises here. There are certainly many more interesting places to stay, but sometimes you just need/want to be close to the airport. If that's the case, and especially if you're renting a car, this hotel is well located and quite nice.",
            "title": "typical airport hotel...",
            "user": "beatricepugzilla"
        },
        {
            "date": "August 8, 2011",
            "detail_rating": {
                "business": null,
                "cleanliness": 4.0,
                "desk": null,
                "location": null,
                "pool": null,
                "restaurant": null,
                "rooms": null,
                "service": 4.0,
                "sleep": 5.0,
                "value": 5.0
            },
            "helpfulness": 1,
            "id": 116452358,
            "likes": {
                "disliked": null,
                "liked": null
            },
            "rating": 4.0,
            "stay_parameters": "Stayed August 2011, traveled as a couple",
            "text": "Stayed one weekend night in a King Evolution room. Pleasant, comfortable, no real problems. I've stayed at all 3 of Portland's HGI (Lake Oswego, Beaverton, and PDX) now, and this property appears the oldest.",
            "title": "solid airport hotel",
            "user": "PDXBigGuy"
        },
        {
            "date": "July 18, 2011",
            "detail_rating": {
                "business": null,
                "cleanliness": 4.0,
                "desk": null,
                "location": 4.0,
                "pool": null,
                "restaurant": null,
                "rooms": 4.0,
                "service": 5.0,
                "sleep": null,
                "value": 5.0
            },
            "helpfulness": 1,
            "id": 115480166,
            "likes": {
                "disliked": null,
                "liked": null
            },
            "rating": 4.0,
            "stay_parameters": "Stayed July 2011",
            "text": "PROS:",
            "title": "Excellent value",
            "user": "Kitchenpiper"
        },
        {
            "date": "June 28, 2011",
            "detail_rating": {
                "business": null,
                "cleanliness": 4.0,
                "desk": null,
                "location": null,
                "pool": null,
                "restaurant": null,
                "rooms": null,
                "service": 5.0,
                "sleep": 5.0,
                "value": 5.0
            },
            "helpfulness": 4,
            "id": 114829234,
            "likes": {
                "disliked": null,
                "liked": null
            },
            "rating": 4.0,
            "stay_parameters": "Stayed June 2011, traveled on business",
            "text": "-usually the lowest priced room of the 3 HGI's",
            "title": "Comfortable and Conventiently Located Near PDX",
            "user": "Flying_Lawyer"
        },
        {
            "date": "June 15, 2011",
            "detail_rating": {
                "business": null,
                "cleanliness": 5.0,
                "desk": null,
                "location": 5.0,
                "pool": null,
                "restaurant": null,
                "rooms": 5.0,
                "service": 5.0,
                "sleep": null,
                "value": 5.0
            },
            "helpfulness": 1,
            "id": 113664983,
            "likes": {
                "disliked": null,
                "liked": null
            },
            "rating": 5.0,
            "stay_parameters": "Stayed June 2011",
            "text": "-very spacious room, seems about 25% larger compared to the same room type at the other 2 HGI's",
            "title": "Excellent Service and location",
            "user": "Orthodromic"
        },
        {
            "date": "May 15, 2011",
            "detail_rating": {
                "business": null,
                "cleanliness": 2.0,
                "desk": null,
                "location": 4.0,
                "pool": null,
                "restaurant": null,
                "rooms": 2.0,
                "service": 3.0,
                "sleep": null,
                "value": 3.0
            },
            "helpfulness": null,
            "id": 108398195,
            "likes": {
                "disliked": null,
                "liked": null
            },
            "rating": 2.0,
            "stay_parameters": "Stayed May 2011",
            "text": "-24 hour airport shuttle; has park and fly rate option",
            "title": "Rooms clean and restaurant needs a clean job",
            "user": "Challenger300"
        }
    ],
    "slim_ranking": 0.338461538462,
    "stars": 2.5,
    "tripadvisor": {
        "VISITED": false,
        "country_name": null,
        "locality": null,
        "pic_link": null,
        "street_address": null
    },
    "user_rating": 4.0,
    "variance": {
        "average": 26,
        "excellent": 55,
        "poor": 18,
        "terrible": 5,
        "very good": 62
    }
}