{
    "aka": "Hyatt Regency Calgary Hotel Calgary",
    "description": "Hyatt Regency Calgary offers world-class service, elegant surroundings and unsurpassed modern convenience. *355 modern guestrooms including 13 suites, all with high speed internet access. *Over 31,000 square feet of flexible meeting space,including a 13,500 - square foot ballroom. *Stillwater Spa. A 6,000-square-foot, European-inspired, full-service spa, offering a variety of rejuvenating treatments.",
    "detail_rating": {
        "cleanliness": null,
        "location": null,
        "rooms": null,
        "service": null,
        "sleep": null,
        "value": null
    },
    "location": {
        "city": "Calgary",
        "continent": null,
        "country": "Canada",
        "proposed_city": "Calgary",
        "province": null,
        "region": null
    },
    "name": "Hyatt Regency Calgary",
    "places": {
        "aka": [
            "Calgary"
        ],
        "hotel_description": [
            "Calgary",
            "Stillwater"
        ],
        "hotel_name": [
            "Calgary"
        ]
    },
    "review_count": 492,
    "review_count_current": 5,
    "reviews": [
        {
            "date": "December 21, 2013",
            "detail_rating": {
                "business": null,
                "cleanliness": 5.0,
                "desk": null,
                "location": 5.0,
                "pool": null,
                "restaurant": null,
                "rooms": 4.0,
                "service": 4.0,
                "sleep": 5.0,
                "value": 3.0
            },
            "helpfulness": null,
            "id": 188223727,
            "likes": {
                "disliked": null,
                "liked": null
            },
            "rating": 4.0,
            "stay_parameters": "Stayed December 2013, traveled on business",
            "text": "Located right in the heard of downtown Calgary, this hotel is modern and upscale looking.",
            "title": "Great Location and comfortable beds",
            "user": "AKLVancouver_Canada_"
        },
        {
            "date": "December 17, 2013",
            "detail_rating": {
                "business": null,
                "cleanliness": 5.0,
                "desk": null,
                "location": 5.0,
                "pool": null,
                "restaurant": null,
                "rooms": 5.0,
                "service": 5.0,
                "sleep": 5.0,
                "value": 4.0
            },
            "helpfulness": null,
            "id": 187924754,
            "likes": {
                "disliked": null,
                "liked": null
            },
            "rating": 5.0,
            "stay_parameters": "Stayed December 2013, traveled on business",
            "text": "The 2 C-train lines are just at the door steps in case you want to explore other parts of the city on a budget.",
            "title": "Great place to stay",
            "user": "Douglas F"
        },
        {
            "date": "December 13, 2013",
            "detail_rating": {
                "business": null,
                "cleanliness": 5.0,
                "desk": null,
                "location": 5.0,
                "pool": null,
                "restaurant": null,
                "rooms": 5.0,
                "service": 5.0,
                "sleep": 5.0,
                "value": 4.0
            },
            "helpfulness": 1,
            "id": 187565478,
            "likes": {
                "disliked": null,
                "liked": null
            },
            "rating": 5.0,
            "stay_parameters": "Stayed November 2013, traveled on business",
            "text": "Check-in was a breeze, and the corner room I had had a weird layout. Bathroom is totally separate from the sleeping area. I am curious who designed it? Perhaps the separating wall was a structural one. Also one of very few hotels that still have a fridge that guest cannot use. This is problematic if you have an extended stay here and want to keep some personal stuff in the fridge (special drinks or such). And btw, the prices for those items in the fridge is pretty expensive.",
            "title": "Excellent overall hotel",
            "user": "shminley"
        },
        {
            "date": "December 13, 2013",
            "detail_rating": {
                "business": null,
                "cleanliness": 5.0,
                "desk": null,
                "location": 5.0,
                "pool": null,
                "restaurant": null,
                "rooms": 3.0,
                "service": 3.0,
                "sleep": 4.0,
                "value": 3.0
            },
            "helpfulness": 2,
            "id": 187546965,
            "likes": {
                "disliked": null,
                "liked": null
            },
            "rating": 3.0,
            "stay_parameters": "Stayed December 2013, traveled on business",
            "text": "Another issue is the conference rooms. It's in another building attached to the hotel. However, to get there, you need to go down to the lobby, walk to the other building (yes, connected), then take the elevator or escalator to the conference room.",
            "title": "Business Friendly - but not very family Friendly",
            "user": "LLA4"
        },
        {
            "date": "December 12, 2013",
            "detail_rating": {
                "business": null,
                "cleanliness": 4.0,
                "desk": null,
                "location": 5.0,
                "pool": null,
                "restaurant": null,
                "rooms": 4.0,
                "service": 5.0,
                "sleep": 4.0,
                "value": 4.0
            },
            "helpfulness": 1,
            "id": 187480032,
            "likes": {
                "disliked": null,
                "liked": null
            },
            "rating": 4.0,
            "stay_parameters": "Stayed December 2013, traveled as a couple",
            "text": "Used their gym a couple times. Good new equipments, a little cramped, but no complaint overall. Wish they put the sauna in the changing room instead of next to the pool, but not a big deal.",
            "title": "Lovely hotel with great customer service but be cautious of using the phone.",
            "user": "mishyrose"
        }
    ],
    "slim_ranking": 0.113402061856,
    "stars": 4,
    "tripadvisor": {
        "VISITED": false,
        "country_name": null,
        "locality": null,
        "pic_link": null,
        "street_address": null
    },
    "user_rating": 4.0,
    "variance": {
        "average": 67,
        "excellent": 231,
        "poor": 20,
        "terrible": 7,
        "very good": 167
    }
}