{
    "aka": "The Secret Garden Hotel Krakow",
    "description": null,
    "detail_rating": {
        "cleanliness": 4.5,
        "location": 4.5,
        "rooms": 4.5,
        "service": 4.5,
        "sleep": 4.0,
        "value": 4.5
    },
    "location": {
        "city": null,
        "continent": "Europe",
        "country": "Poland",
        "proposed_city": null,
        "province": null,
        "region": "Southern Poland"
    },
    "name": "The Secret Garden Hostel",
    "places": {
        "aka": [],
        "hotel_description": [],
        "hotel_name": []
    },
    "review_count": 190,
    "review_count_current": 6,
    "reviews": [
        {
            "date": "October 21, 2008",
            "detail_rating": {
                "business": null,
                "cleanliness": null,
                "desk": null,
                "location": null,
                "pool": null,
                "restaurant": null,
                "rooms": null,
                "service": null,
                "sleep": null,
                "value": null
            },
            "helpfulness": null,
            "id": 21075174,
            "likes": {
                "disliked": null,
                "liked": null
            },
            "rating": 4.0,
            "stay_parameters": null,
            "text": "was pleasantly surprised how the secret garden hostel in kazimierz was quiet at night, good priced and with free internet, tea/coffee.",
            "title": "lovely city",
            "user": "betshean"
        },
        {
            "date": "September 28, 2008",
            "detail_rating": {
                "business": 4.0,
                "cleanliness": 4.0,
                "desk": null,
                "front_desk": 5.0,
                "location": 3.0,
                "pool": null,
                "restaurant": null,
                "rooms": 3.0,
                "service": 3.0,
                "sleep": null,
                "value": 5.0
            },
            "helpfulness": null,
            "id": 20435239,
            "likes": {
                "disliked": "\u2014 The paper thin walls",
                "liked": "\u2014 The staff was very friendly"
            },
            "rating": 4.0,
            "stay_parameters": "Stayed September 2008, traveled solo",
            "text": "Room was clean with comfortable bed, and shower only across the way from bedroom. No queues for shower/toilet so was happy to pay for a room with these facilities.",
            "title": "A good value in Krakow",
            "user": "Canuckker"
        },
        {
            "date": "September 13, 2008",
            "detail_rating": {
                "business": null,
                "cleanliness": null,
                "desk": null,
                "location": null,
                "pool": null,
                "restaurant": null,
                "rooms": null,
                "service": null,
                "sleep": null,
                "value": null
            },
            "helpfulness": null,
            "id": 20024985,
            "likes": {
                "disliked": null,
                "liked": null
            },
            "rating": 4.0,
            "stay_parameters": null,
            "text": "No safefy deposit box in room, but staff happy to keep valuable in theres with a paper to say what was in their possesion of yours.",
            "title": "a bit out of the way",
            "user": "spaghetto150"
        },
        {
            "date": "August 7, 2008",
            "detail_rating": {
                "business": 5.0,
                "cleanliness": 5.0,
                "desk": null,
                "front_desk": 5.0,
                "location": 4.0,
                "pool": null,
                "restaurant": null,
                "rooms": 5.0,
                "service": 5.0,
                "sleep": null,
                "value": 5.0
            },
            "helpfulness": 2,
            "id": 18707206,
            "likes": {
                "disliked": "\u2014 nothing",
                "liked": "\u2014 cleanliness"
            },
            "rating": 5.0,
            "stay_parameters": "Stayed August 2008, traveled as a couple",
            "text": "this i was happy with.",
            "title": "A Fantastic Hostel...if you like them clean and quiet.",
            "user": "SandLCook"
        },
        {
            "date": "August 5, 2008",
            "detail_rating": {
                "business": 5.0,
                "cleanliness": 5.0,
                "desk": null,
                "front_desk": 5.0,
                "location": 3.0,
                "pool": null,
                "restaurant": null,
                "rooms": 4.0,
                "service": 5.0,
                "sleep": null,
                "value": 5.0
            },
            "helpfulness": 2,
            "id": 18646929,
            "likes": {
                "disliked": "\u2014 having to leave",
                "liked": "\u2014 left in peace"
            },
            "rating": 5.0,
            "stay_parameters": "Stayed July 2008, traveled with family",
            "text": "With good transport links to town centre and only about 20 minutes walk into town anyway, i felt this was a good location.",
            "title": "Secret Garden is great value",
            "user": "chowWales"
        },
        {
            "date": "July 28, 2008",
            "detail_rating": {
                "business": 5.0,
                "cleanliness": 5.0,
                "desk": null,
                "front_desk": 5.0,
                "location": 4.0,
                "pool": null,
                "restaurant": null,
                "rooms": 4.0,
                "service": 5.0,
                "sleep": null,
                "value": 5.0
            },
            "helpfulness": null,
            "id": 18338277,
            "likes": {
                "disliked": null,
                "liked": "\u2014 Staff."
            },
            "rating": 5.0,
            "stay_parameters": "Stayed July 2008, traveled with friends",
            "text": "The Secret Garden Hostel is a very clean and welcoming place to stay. Located approx a 20 minute walk (or 5 mins by tram) south of the Old Town, this accommodation offers clean and spacious rooms with shared bath / toilet facilities. The facilities are excellent - local information, free internet, TV room. Adequate breakfast and free tea / coffe throughout the day is offered.",
            "title": "Excellent Hostel",
            "user": "travelmikeuk"
        }
    ],
    "slim_ranking": 0.173728813559,
    "stars": 3,
    "tripadvisor": {
        "VISITED": false,
        "country_name": null,
        "locality": null,
        "pic_link": null,
        "street_address": null
    },
    "user_rating": 4.5,
    "variance": {
        "average": 4,
        "excellent": 110,
        "poor": 6,
        "terrible": 4,
        "very good": 66
    }
}