{
    "aka": "Villa Modigliani Hotel Paris",
    "description": null,
    "detail_rating": {
        "cleanliness": null,
        "location": null,
        "rooms": null,
        "service": null,
        "sleep": null,
        "value": null
    },
    "location": {
        "city": "Paris",
        "continent": "Europe",
        "country": "France",
        "proposed_city": "Paris",
        "province": null,
        "region": "Ile-de-France"
    },
    "name": "Villa Modigliani",
    "places": {
        "aka": [
            "Paris"
        ],
        "hotel_description": [],
        "hotel_name": []
    },
    "review_count": 255,
    "review_count_current": 11,
    "reviews": [
        {
            "date": "May 12, 2008",
            "detail_rating": {
                "business": null,
                "cleanliness": 4.0,
                "desk": null,
                "front_desk": 4.0,
                "location": 5.0,
                "pool": null,
                "restaurant": null,
                "rooms": 4.0,
                "service": 3.0,
                "sleep": null,
                "value": 4.0
            },
            "helpfulness": 2,
            "id": 15970945,
            "likes": {
                "disliked": null,
                "liked": null
            },
            "rating": 4.0,
            "stay_parameters": "Stayed April 2008, traveled as a couple",
            "text": "Very clean. Great location, very convenient. Half a block from 2 major subway lines. Reasonable price. Never ate a meal there because the area is swarming with great choices. Perfect stay.",
            "title": "Absolutely Charming",
            "user": "Tricia79"
        },
        {
            "date": "May 6, 2008",
            "detail_rating": {
                "business": 4.0,
                "cleanliness": 5.0,
                "desk": null,
                "front_desk": 5.0,
                "location": 4.0,
                "pool": null,
                "restaurant": null,
                "rooms": 4.0,
                "service": 5.0,
                "sleep": null,
                "value": 5.0
            },
            "helpfulness": 1,
            "id": 15713919,
            "likes": {
                "disliked": "\u2014 Nothing",
                "liked": "\u2014 Quiet location close to area of interest"
            },
            "rating": 5.0,
            "stay_parameters": "Stayed May 2008, traveled as a couple",
            "text": "Note - if you leave your luggage (prior to check-in or after check-out), they simply give you the key to a \"secured\" room that every other guest holding bags has access to. The room is really a closet.",
            "title": "Excellent experience",
            "user": "TobyNorwich"
        },
        {
            "date": "December 28, 2007",
            "detail_rating": {
                "business": null,
                "cleanliness": null,
                "desk": null,
                "location": null,
                "pool": null,
                "restaurant": null,
                "rooms": null,
                "service": null,
                "sleep": null,
                "value": null
            },
            "helpfulness": 2,
            "id": 12010651,
            "likes": {
                "disliked": null,
                "liked": null
            },
            "rating": 4.0,
            "stay_parameters": null,
            "text": "We have stayed in numerous hotels in Paris and this was the best yet. Situated around two courtyards, the hotel was quiet but very convenient for the metro, superb restaurants and some interesting places to visit. The staff were friendly, spoke good English and tolerated our shaky French and the rooms, although quite small, were very clean and well equipped inc satellite TV. The included breakfast was generous and with a wide selection of food, inc English breakfast.",
            "title": "Decent hotel, great location",
            "user": "wubbleNJ"
        },
        {
            "date": "September 25, 2007",
            "detail_rating": {
                "business": null,
                "cleanliness": null,
                "desk": null,
                "location": null,
                "pool": null,
                "restaurant": null,
                "rooms": null,
                "service": null,
                "sleep": null,
                "value": null
            },
            "helpfulness": null,
            "id": 10001314,
            "likes": {
                "disliked": null,
                "liked": null
            },
            "rating": 4.0,
            "stay_parameters": null,
            "text": "The area of Montparnasse is clean and friendly and there are many good places to eat. We particularly like the traditional French food at Parnasse 138 at 138 Rue du Montparnasse, which was 5 minutes walk from the hotel. There are some excellent seafood restaurants, with \"garcons\" standing outside preparing oysters, crabs, mussels etc for these huge platters of seafood. Not cheap, but you can get an excellent croquette of moules, plus frites and bread for around 20 Euros per head inc wine.",
            "title": "Oasis in Montparnasse",
            "user": "Insightful"
        },
        {
            "date": "September 23, 2007",
            "detail_rating": {
                "business": null,
                "cleanliness": 5.0,
                "desk": null,
                "front_desk": 5.0,
                "location": 5.0,
                "pool": null,
                "restaurant": null,
                "rooms": 4.0,
                "service": 5.0,
                "sleep": null,
                "value": 5.0
            },
            "helpfulness": 1,
            "id": 8863014,
            "likes": {
                "disliked": "\u2014 Beds were hard, a bit noisy at night with windows open",
                "liked": "\u2014 Atmosphere, close to metro"
            },
            "rating": 5.0,
            "stay_parameters": "Stayed September 2007, traveled with friends",
            "text": "Do visit Jardin du Luxembourg just 10 minutes walk away and take some baguettes, cheese etc, all obtainable from the boulangerie and the supermarche along the street from the hotel.",
            "title": "Charming gem on Paris' left bank",
            "user": "NYC_W0rld_Traveler"
        },
        {
            "date": "November 3, 2008",
            "detail_rating": {
                "business": null,
                "cleanliness": 5.0,
                "desk": null,
                "front_desk": 5.0,
                "location": 4.0,
                "pool": null,
                "restaurant": null,
                "rooms": 4.0,
                "service": 4.0,
                "sleep": null,
                "value": 5.0
            },
            "helpfulness": 1,
            "id": 21501660,
            "likes": {
                "disliked": "\u2014 Nothing",
                "liked": "\u2014 Cleanliness, friendly, price"
            },
            "rating": 5.0,
            "stay_parameters": "Stayed October 2008, traveled with family",
            "text": "Our time at the Villa Modigliani was excellent. Traveling with my wife (we are both in our 50's), my son (20) and my Dad (age 72), I was nervous about what to expect from this little charmer. But it delivered! The rooms were small, but clean and modern, with plenty of closet space. The front desk staff was very helpful and pleasant in answering all our questions (in English). The buffet breakfast provided everything we needed - fruit, bread, cereal, juice, coffee, bacon, sausage, and outstanding scrambled eggs.",
            "title": "Ideal Hotel for Your Trip to Paris",
            "user": "OldCager"
        },
        {
            "date": "October 6, 2008",
            "detail_rating": {
                "business": 3.0,
                "cleanliness": 5.0,
                "desk": null,
                "front_desk": 5.0,
                "location": 5.0,
                "pool": null,
                "restaurant": null,
                "rooms": 4.0,
                "service": 5.0,
                "sleep": null,
                "value": 5.0
            },
            "helpfulness": 1,
            "id": 20678836,
            "likes": {
                "disliked": "\u2014 Small rooms",
                "liked": "\u2014 Location"
            },
            "rating": 5.0,
            "stay_parameters": "Stayed May 2008",
            "text": "The hotel is set back off the street, and we missed it the first time we walked by. But after finding the sign, we walked thru a short passageway to an open courtyard that leads to the front door.",
            "title": "Great location",
            "user": "NewtravelerHawaii"
        },
        {
            "date": "August 10, 2008",
            "detail_rating": {
                "business": null,
                "cleanliness": 4.0,
                "desk": null,
                "front_desk": 4.0,
                "location": 5.0,
                "pool": null,
                "restaurant": null,
                "rooms": 4.0,
                "service": 4.0,
                "sleep": null,
                "value": 5.0
            },
            "helpfulness": 1,
            "id": 18798113,
            "likes": {
                "disliked": "\u2014 there was not much to dislike",
                "liked": "\u2014 Set back from the road, feels exclusive"
            },
            "rating": 5.0,
            "stay_parameters": "Stayed August 2008, traveled as a couple",
            "text": "The Modigliani's location is superb. It is in Montparnasse, and 50 yards down to the end of the block you will discover that you are standing in front of the world famous bistros La Dome, La Coupole and La Rotonde. Go the other direction ( the street is only 2 blocks long) and there is another corner full of cafes and bistros. The street, Rue Delambre, also has bars, restaurants, and small shops. We had dinner across the street from the hotel one night at the Venice restaurant and it was reasonable and delicious. The Metro has stations at both ends of the street - one takes you to Cite and Notre Dame, the other takes you to the Eiffel Tower.",
            "title": "Loved It!",
            "user": "philandrachel"
        },
        {
            "date": "June 17, 2008",
            "detail_rating": {
                "business": 1.0,
                "cleanliness": 1.0,
                "desk": null,
                "front_desk": 1.0,
                "location": 4.0,
                "pool": null,
                "restaurant": null,
                "rooms": 1.0,
                "service": 1.0,
                "sleep": null,
                "value": 1.0
            },
            "helpfulness": 2,
            "id": 17005623,
            "likes": {
                "disliked": "\u2014 grime and dirt in carpets and bug in bed",
                "liked": "\u2014 It's in Paris"
            },
            "rating": 1.0,
            "stay_parameters": "Stayed May 2008",
            "text": "We highly recommend the Villa Modigliani and will stay here again if we ever get back to Paris.",
            "title": "Nasty Cramped Dirty Rooms, Awful Food, Terrible Service",
            "user": "mentaltraveller"
        },
        {
            "date": "June 13, 2008",
            "detail_rating": {
                "business": 1.0,
                "cleanliness": 4.0,
                "desk": null,
                "front_desk": 3.0,
                "location": 3.0,
                "pool": null,
                "restaurant": null,
                "rooms": 3.0,
                "service": 4.0,
                "sleep": null,
                "value": 4.0
            },
            "helpfulness": 1,
            "id": 16897698,
            "likes": {
                "disliked": "\u2014 smokers in courtyard",
                "liked": "\u2014 location and pretty clean"
            },
            "rating": 3.0,
            "stay_parameters": "Stayed June 2008, traveled with family",
            "text": "FAntastic location near Metro stations, wonderful/charming neighborhood. Hotel is quaint and clean. Rooms are typical European - small but comfortable. Hotel staff were cordial and helpful. I would certainly return and recommend it highly.",
            "title": "Not great, but certainly okay",
            "user": "damonandtina"
        },
        {
            "date": "September 15, 2007",
            "detail_rating": {
                "business": 5.0,
                "cleanliness": 5.0,
                "desk": null,
                "front_desk": 5.0,
                "location": 5.0,
                "pool": null,
                "restaurant": null,
                "rooms": 4.0,
                "service": 4.0,
                "sleep": null,
                "value": 5.0
            },
            "helpfulness": 1,
            "id": 8719323,
            "likes": {
                "disliked": "\u2014 If you're looking for George V luxury, keep looking",
                "liked": "\u2014 Location, location, location"
            },
            "rating": 5.0,
            "stay_parameters": "Stayed April 2005, traveled with family",
            "text": "I have stayed in the Villa Modigliani many times when I visit Paris and it is consistently a great travel experience for the price. And, I have recommended it to many friends and relatives, and they all have had the same satisfied experience as I have had.",
            "title": "My Favorite Hotel in Paris",
            "user": "mustangpammy"
        }
    ],
    "slim_ranking": 0.430563301729,
    "stars": 3,
    "tripadvisor": {
        "VISITED": false,
        "country_name": null,
        "locality": null,
        "pic_link": null,
        "street_address": null
    },
    "user_rating": 4.0,
    "variance": {
        "average": 45,
        "excellent": 53,
        "poor": 9,
        "terrible": 4,
        "very good": 144
    }
}