{
    "aka": null,
    "description": "Seamlessly blending modern European design with late 19th century Canadian architecture, Swiss Hotel is the perfect combination of old and new. Whether you're coming to town for business or pleasure, the Swiss Hotel is the best choice for any trip to Ottawa.Swiss Hotel has 22 cozy rooms with and i-Pad in every room and Free internet. Optional European buffet breakfast available for $15 per person. Located in the heart of the city within walking distance to all major tourist attractions, only steps from the Ottawa Convention Centre, University of Ottawa, ByWard Market, Parliament Hill, National Gallery of Canada and the best Ottawa has to offer, it provides a unique hotel experience.",
    "detail_rating": {
        "cleanliness": null,
        "location": null,
        "rooms": null,
        "service": null,
        "sleep": null,
        "value": null
    },
    "location": {
        "city": null,
        "continent": null,
        "country": "Canada",
        "proposed_city": null,
        "province": null,
        "region": null
    },
    "name": "Swiss Hotel",
    "places": {
        "aka": [],
        "hotel_description": [
            "Ottawa",
            "University"
        ],
        "hotel_name": []
    },
    "review_count": 206,
    "review_count_current": 20,
    "reviews": [
        {
            "date": "August 28, 2007",
            "detail_rating": {
                "business": 5.0,
                "cleanliness": 5.0,
                "desk": null,
                "front_desk": 5.0,
                "location": 5.0,
                "pool": null,
                "restaurant": null,
                "rooms": 5.0,
                "service": 5.0,
                "sleep": null,
                "value": 5.0
            },
            "helpfulness": 2,
            "id": 8525405,
            "likes": {
                "disliked": "\u2014 limited parking",
                "liked": "\u2014 personal attention"
            },
            "rating": 5.0,
            "stay_parameters": "Stayed July 2007, traveled as a couple",
            "text": "As everyone mentioned, this place is a great find. It's within walking distance to most Ottawa attractions, very clean and extremely comfortable, with a great breakfast. The owner is super friendly and very helpful. Our room had a sitting area and there were chocolates and champagne on ice when we arrived. The only negative is that there is not enough parking for all guests so we had to use street parking. There is normally plenty of street parking though.",
            "title": "Would gladly return!",
            "user": "Acemom3"
        },
        {
            "date": "August 10, 2007",
            "detail_rating": {
                "business": 5.0,
                "cleanliness": 5.0,
                "desk": null,
                "front_desk": 5.0,
                "location": 5.0,
                "pool": null,
                "restaurant": null,
                "rooms": 5.0,
                "service": 5.0,
                "sleep": null,
                "value": 5.0
            },
            "helpfulness": 4,
            "id": 8391400,
            "likes": {
                "disliked": null,
                "liked": null
            },
            "rating": 5.0,
            "stay_parameters": "Stayed August 2007",
            "text": "We actually happened upon Gasthaus Switzerland about 10 years ago. It has only gotten better with time. The owners, Sabina and Josef have always been friendly and accommodating as has the house staff. Never once have I felt like I made mistake staying here. It's great that it's so close to the Byward Market, restaurants and the grocery store and pretty much most of the attractions are within walking distance. We come in the winter also and I love it that it's not far from the canal at all. After a cold day of skating and a warm dinner somewhere in Ottawa, it's great to settle into the beds which are the most comfortable beds I've every stayed in away from home. The comforters just wrap around you like a big hug! Because we've stayed here a few times, we've had different rooms. Every one of them has been clean and comfortable.",
            "title": "Absolutely love this Inn!!!!",
            "user": "NYKati"
        },
        {
            "date": "July 29, 2007",
            "detail_rating": {
                "business": 3.0,
                "cleanliness": 4.0,
                "desk": null,
                "front_desk": 3.0,
                "location": 4.0,
                "pool": null,
                "restaurant": null,
                "rooms": 3.0,
                "service": 3.0,
                "sleep": null,
                "value": 3.0
            },
            "helpfulness": 3,
            "id": 8252203,
            "likes": {
                "disliked": null,
                "liked": "\u2014 location and room rate"
            },
            "rating": 3.0,
            "stay_parameters": "Stayed May 2007, traveled as a couple",
            "text": "Actually, I'm pretty surprised to read some of the negative reviews on this site. I have stayed at many B&Bs around the world. This one is up there with the best! The breakfast has a varied array of delicious treats. Try the muesli...it's yummy!",
            "title": "Good for the price",
            "user": "Larzfrommarz"
        },
        {
            "date": "July 22, 2007",
            "detail_rating": {
                "business": 5.0,
                "cleanliness": 5.0,
                "desk": null,
                "front_desk": 5.0,
                "location": 5.0,
                "pool": null,
                "restaurant": null,
                "rooms": 5.0,
                "service": 5.0,
                "sleep": null,
                "value": 5.0
            },
            "helpfulness": 2,
            "id": 8216014,
            "likes": {
                "disliked": null,
                "liked": "\u2014 comfort"
            },
            "rating": 5.0,
            "stay_parameters": "Stayed July 2007, traveled on business",
            "text": "It's great place all in all and I look forward to going back this winter!",
            "title": "Home away from home",
            "user": "bluegreen7"
        },
        {
            "date": "June 26, 2007",
            "detail_rating": {
                "business": null,
                "cleanliness": null,
                "desk": null,
                "location": null,
                "pool": null,
                "restaurant": null,
                "rooms": null,
                "service": null,
                "sleep": null,
                "value": null
            },
            "helpfulness": 3,
            "id": 8001148,
            "likes": {
                "disliked": null,
                "liked": null
            },
            "rating": 5.0,
            "stay_parameters": null,
            "text": "Nice location, short walk to the square. Street was relatively quiet (i.e. - college was not in session) except for the construction on the next building beginning both mornings shortly after 8 am.",
            "title": "What a great place!",
            "user": "zubi21"
        },
        {
            "date": "May 20, 2008",
            "detail_rating": {
                "business": 3.0,
                "cleanliness": 4.0,
                "desk": null,
                "front_desk": 4.0,
                "location": 4.0,
                "pool": null,
                "restaurant": null,
                "rooms": 3.0,
                "service": 5.0,
                "sleep": null,
                "value": 5.0
            },
            "helpfulness": null,
            "id": 16259543,
            "likes": {
                "disliked": "\u2014 Basic bathroom.",
                "liked": "\u2014 Knowledgeable and friendly host, and an awesome breakfast!"
            },
            "rating": 4.0,
            "stay_parameters": "Stayed May 2008, traveled on business",
            "text": "When I first arrived at the Gasthaus Switzerland Inn, I wasn't too sure if I had made the right choice. I walked a strange way from the Rideau Centre bus stop down a fairly unsavoury street, and when I arrived at around 11 in the morning the downstairs reception was dark and empty.",
            "title": "Little Gem in Ottawa",
            "user": "mandyc"
        },
        {
            "date": "April 14, 2008",
            "detail_rating": {
                "business": 5.0,
                "cleanliness": 5.0,
                "desk": null,
                "front_desk": 5.0,
                "location": 5.0,
                "pool": null,
                "restaurant": null,
                "rooms": 5.0,
                "service": 5.0,
                "sleep": null,
                "value": 5.0
            },
            "helpfulness": null,
            "id": 15038079,
            "likes": {
                "disliked": "\u2014 Can't think of anything that I could complain about..",
                "liked": "\u2014 Friendliness"
            },
            "rating": 5.0,
            "stay_parameters": "Stayed April 2008, traveled on business",
            "text": "However, I left my bags and returned at 3pm - the earliest time you can check in. And I was very glad I did! My room - the cheapest available - was prettily decorated and perfectly adequate in size for one person for a short stay. The bed was perfectly comfortable and the bathroom adequate. I think there are much nicer rooms available, but you get what you pay for, and my room had no real faults, it was just fairly basic. But the reason I would call this place a little gem is because of the owner - Sabina. She is a real character and very happy to help with advice. She will make your stay memorable no matter how short it is!",
            "title": "Memorable Weekend Get-a-way",
            "user": "2_Moms_from_SK"
        },
        {
            "date": "March 4, 2008",
            "detail_rating": {
                "business": 3.0,
                "cleanliness": 3.0,
                "desk": null,
                "front_desk": 2.0,
                "location": 4.0,
                "pool": null,
                "restaurant": null,
                "rooms": 2.0,
                "service": 3.0,
                "sleep": null,
                "value": 2.0
            },
            "helpfulness": null,
            "id": 14044942,
            "likes": {
                "disliked": "\u2014 Bare, utilitarian room",
                "liked": "\u2014 Great location"
            },
            "rating": 2.0,
            "stay_parameters": "Stayed February 2008, traveled as a couple",
            "text": "The other reasons to stay here are a convenient location, within an easy walk of Parliament Hill for sightseeing and the Byward Market for eating out or shopping. But the best reason of all is the breakfast! Excellent swiss coffee, homemade Bircher muesli (which might look like a bowl of wallpaper paste with rapsberries on top but is one of the most delicious breakfasts I have ever eaten), a large selction of breads and pastries, fresh fruit, cheeses - wonderful!",
            "title": "It depends on your expectations...",
            "user": "jampling"
        },
        {
            "date": "February 13, 2008",
            "detail_rating": {
                "business": null,
                "cleanliness": null,
                "desk": null,
                "front_desk": 5.0,
                "location": null,
                "pool": null,
                "restaurant": null,
                "rooms": null,
                "service": null,
                "sleep": null,
                "value": 5.0
            },
            "helpfulness": null,
            "id": 13528883,
            "likes": {
                "disliked": "\u2014 I had no problems at all. Maybe if a check-in was allowed earlier that would be nice...",
                "liked": "\u2014 The cozy and atmosphere, location, the HOSTS"
            },
            "rating": 5.0,
            "stay_parameters": "Stayed January 2007, traveled on business",
            "text": "If I go back to Ottawa, which is not top on my list of things to do, I would stay here again. You can probably find more luxurious accomodations, but for personal service, charm and value for money this place is a good bet.",
            "title": "\"A genuine European hospitality with a wonderful aura\"",
            "user": "EkaGabelia"
        },
        {
            "date": "October 7, 2007",
            "detail_rating": {
                "business": 4.0,
                "cleanliness": 4.0,
                "desk": null,
                "front_desk": 5.0,
                "location": 5.0,
                "pool": null,
                "restaurant": null,
                "rooms": 3.0,
                "service": 4.0,
                "sleep": null,
                "value": 4.0
            },
            "helpfulness": 1,
            "id": 10049258,
            "likes": {
                "disliked": "\u2014 three flights of stairs",
                "liked": "\u2014 location"
            },
            "rating": 4.0,
            "stay_parameters": "Stayed October 2007, traveled as a couple",
            "text": "This B & B was amazing! Sabina and the staff were very helpful when asking where to go for dinner and giving directions. The location was very central and we could walk everywhere we wanted, including the Byward Market, Parliament Buildings, and the Rideau Center. On a rainy day Sabina lent us an umbrella, and when we had to check out the early she packed us some fruit and drinks for the trip, as we left before breakfast was served. The bedding was soft and comfortable, and we enjoyed the wireless internet.",
            "title": "good value, great location",
            "user": "nativenewyorker69"
        },
        {
            "date": "May 15, 2007",
            "detail_rating": {
                "business": 5.0,
                "cleanliness": 5.0,
                "desk": null,
                "front_desk": 5.0,
                "location": 5.0,
                "pool": null,
                "restaurant": null,
                "rooms": 5.0,
                "service": 5.0,
                "sleep": null,
                "value": 5.0
            },
            "helpfulness": 4,
            "id": 7626385,
            "likes": {
                "disliked": null,
                "liked": null
            },
            "rating": 5.0,
            "stay_parameters": "Stayed February 2007, traveled as a couple",
            "text": "Gasthaus Switzerland Inn is a wonderful B&B in downtown Ottawa. The host\u2019s utmost dedication to their business is felt through their warm treatment of their guests \u2013 we felt right at home! Being in Ottawa for the first time, Sabina, one of the owners, was gracious to direct us to all of the interesting places to go in the city and with the superb location of the B&B, everywhere was just a short walk! Furthermore, our room was clean and comfortable and the delicious breakfast by the large stone fireplace in their beautiful new dining room gave us a great start to our day.",
            "title": "A Great Experience!",
            "user": "BCCyrano"
        },
        {
            "date": "January 6, 2007",
            "detail_rating": {
                "business": 5.0,
                "cleanliness": 5.0,
                "desk": null,
                "front_desk": 5.0,
                "location": null,
                "pool": null,
                "restaurant": null,
                "rooms": 5.0,
                "service": 5.0,
                "sleep": null,
                "value": 5.0
            },
            "helpfulness": 8,
            "id": 6559488,
            "likes": {
                "disliked": "\u2014 what i liked least..? maybe that i couldnt stay any longer.",
                "liked": "\u2014 very clean, modern and up to date."
            },
            "rating": 5.0,
            "stay_parameters": "Stayed June 2006, traveled solo",
            "text": "Ottawa is a great city and Gasthaus Switzerland is a great place \u2013 we are coming back soon!",
            "title": "felt like i was in europe again",
            "user": "MitchellWard"
        },
        {
            "date": "October 22, 2006",
            "detail_rating": {
                "business": 5.0,
                "cleanliness": 5.0,
                "desk": null,
                "front_desk": 5.0,
                "location": 5.0,
                "pool": null,
                "restaurant": null,
                "rooms": 5.0,
                "service": 5.0,
                "sleep": null,
                "value": 5.0
            },
            "helpfulness": 3,
            "id": 5984521,
            "likes": {
                "disliked": null,
                "liked": "\u2014 friendliness, comfort and value"
            },
            "rating": 5.0,
            "stay_parameters": "Stayed June 2006, traveled solo",
            "text": "I spent a few days at the Gasthaus after spending 5 weeks in Quebec (some intensive French immersion training). To sum up my stay - it was amazing. I normally don't review hotels in my home country but I felt this one was a step above the rest so I should give it the credit it deserves. My first night was brief, but very, very comfortable. The beds were amazing. I think it may be the Swiss pillows and mattress, whatever it was, I slept like I had never slept before. This was quite nice considering I had just traveled 10 hours on a train.",
            "title": "Great place in Ottawa",
            "user": "masterdiver"
        },
        {
            "date": "October 13, 2006",
            "detail_rating": {
                "business": 4.0,
                "cleanliness": 4.0,
                "desk": null,
                "front_desk": 2.0,
                "location": 4.0,
                "pool": null,
                "restaurant": null,
                "rooms": 3.0,
                "service": 3.0,
                "sleep": null,
                "value": 3.0
            },
            "helpfulness": 3,
            "id": 5950829,
            "likes": {
                "disliked": null,
                "liked": null
            },
            "rating": 2.0,
            "stay_parameters": "Stayed September 2006, traveled as a couple",
            "text": "I have stayed at quite a few Inn's when I traveled through Europe in 2004 and loved most of them. I felt the exact same atmosphere at the Gasthaus. Bright and early in the morning after I had awakened I went downstairs to see a nicely laid out breakfast, which included juices, breads, cheeses and most importantly - Muesli. I probably ate 5 or 6 bowls on my first day it was so good, and that is probably an understatement. Nonetheless Sabina (your housekeeper) just kept feeding it to me! I felt like I was at home, away from home.",
            "title": "Pokey and Noisy",
            "user": "Jez&Carly"
        },
        {
            "date": "October 11, 2006",
            "detail_rating": {
                "business": null,
                "cleanliness": null,
                "desk": null,
                "location": null,
                "pool": null,
                "restaurant": null,
                "rooms": null,
                "service": null,
                "sleep": null,
                "value": null
            },
            "helpfulness": 3,
            "id": 5939126,
            "likes": {
                "disliked": null,
                "liked": null
            },
            "rating": 5.0,
            "stay_parameters": null,
            "text": "There is plenty of space to hang out while you're there. There is a computer (a nice one, not some crappy passed down thing) with free internet, and access was always available. I know they have free Wi-Fi as well if you bring your laptop (nice for the rooms). I spent most of my time on the patio (see pictures) and in the dining room. It was a real pleasurable experience because I was able to conversate with so many different people and they were all so happy.",
            "title": "excellent Inn",
            "user": "flurries"
        },
        {
            "date": "September 30, 2006",
            "detail_rating": {
                "business": 1.0,
                "cleanliness": 3.0,
                "desk": null,
                "front_desk": 1.0,
                "location": 1.0,
                "pool": null,
                "restaurant": null,
                "rooms": 2.0,
                "service": 1.0,
                "sleep": null,
                "value": 1.0
            },
            "helpfulness": 2,
            "id": 5894625,
            "likes": {
                "disliked": "\u2014 The service",
                "liked": "\u2014 None"
            },
            "rating": 1.0,
            "stay_parameters": "Stayed September 2006, traveled on business",
            "text": "I stayed in this hotel after a friend advises. I arrived at 8:00 PM and left the next day. I cannot recall a worse treatment in any other hotel that I have stayed in my life. The receptionist was very unwelcoming in the first day. She did not explain where to park the car and she did not tell me that they have there own parking.",
            "title": "Do not stay in this hotel",
            "user": "Doboom"
        },
        {
            "date": "September 18, 2006",
            "detail_rating": {
                "business": null,
                "cleanliness": 4.0,
                "desk": null,
                "front_desk": 1.0,
                "location": 3.0,
                "pool": null,
                "restaurant": null,
                "rooms": 3.0,
                "service": 1.0,
                "sleep": null,
                "value": 2.0
            },
            "helpfulness": 3,
            "id": 5812998,
            "likes": {
                "disliked": "\u2014 Service from staff",
                "liked": "\u2014 location"
            },
            "rating": 2.0,
            "stay_parameters": "Stayed September 2006, traveled as a couple",
            "text": "She yelled at me the next day because I rang the bell at 7:00 AM, which is half hour before the check out time. I did ring the bell due to an urgent matter to check out earlier.",
            "title": "OK but not worth another stay.",
            "user": "reelman59"
        },
        {
            "date": "June 11, 2006",
            "detail_rating": {
                "business": null,
                "cleanliness": 3.0,
                "desk": null,
                "location": null,
                "pool": null,
                "restaurant": null,
                "rooms": 3.0,
                "service": 3.0,
                "sleep": null,
                "value": 5.0
            },
            "helpfulness": 4,
            "id": 5330823,
            "likes": {
                "disliked": null,
                "liked": null
            },
            "rating": 4.0,
            "stay_parameters": "Stayed June 2006, traveled on business",
            "text": "It is located near downtown, but not nice area.",
            "title": "Home away from home",
            "user": "Saskatoonmd"
        },
        {
            "date": "May 25, 2006",
            "detail_rating": {
                "business": null,
                "cleanliness": 5.0,
                "desk": null,
                "location": null,
                "pool": null,
                "restaurant": null,
                "rooms": 5.0,
                "service": 5.0,
                "sleep": null,
                "value": 5.0
            },
            "helpfulness": 4,
            "id": 5225661,
            "likes": {
                "disliked": null,
                "liked": null
            },
            "rating": 5.0,
            "stay_parameters": "Stayed May 2006, traveled on business",
            "text": "I do not advice you to stay if you are there for business, unless you do not care about services.",
            "title": "Wonderful accommodation",
            "user": "BellaCoolaman"
        },
        {
            "date": "March 15, 2006",
            "detail_rating": {
                "business": null,
                "cleanliness": 5.0,
                "desk": null,
                "location": null,
                "pool": null,
                "restaurant": null,
                "rooms": 4.0,
                "service": 5.0,
                "sleep": null,
                "value": 4.0
            },
            "helpfulness": 10,
            "id": 4623784,
            "likes": {
                "disliked": null,
                "liked": null
            },
            "rating": 5.0,
            "stay_parameters": "Stayed February 2006, traveled on business",
            "text": "This is the second time in 2 years my wife and I stayed at this establishment but won't return because of a bad experience with our \"included\" breakfast on our second day. We were virtually ignored by the wait staff. I got fed up and left while my wife stayed to finish her dry bagel. (no coffee was offered, no butter on the table,no greeting, but staff were busy chatting in another room.) Rooms are small but clean, and quiet. Parking is included which is a plus, but there are only 5 spaces available for 22 rooms. They do not accept payment by debit card, and they won't allow you inside the building until the 3:00 PM check in time.(so don't arrive early)",
            "title": "a more than happy guest at the Gasthaus Switzerland",
            "user": "Fernando A"
        }
    ],
    "slim_ranking": 0.089552238806,
    "stars": null,
    "tripadvisor": {
        "VISITED": false,
        "country_name": null,
        "locality": null,
        "pic_link": null,
        "street_address": null
    },
    "user_rating": 4.5,
    "variance": {
        "average": 15,
        "excellent": 111,
        "poor": 5,
        "terrible": 6,
        "very good": 69
    }
}