{
    "aka": "Guest And The City Hotel",
    "description": "Guest and the City is a boutique Guesthouse that reflects all that we love about Brighton. With seven private bedrooms, situated in the heart of Kemptown, minutes from the centre of Brighton, 30 seconds from the beach and opposite the famous Palace Pier, it\u2019s the perfect location to explore Brighton for Business or pleasure. We want our guesthouse to reflect everything we like about staying in Brighton. Guest in the City therefore takes the best bits of a traditional B&B \u2013 a relaxed, friendly service, a central location and of course a top-notch breakfast with locally sourced ingredients \u2013 and puts them in modern, high-spec surroundings. The result is a boutique feel without luxury prices. To us, that\u2019s what Brighton is all about \u2013 finding new things that surprise you and make you smile.",
    "detail_rating": {
        "cleanliness": 5.0,
        "location": 5.0,
        "rooms": 5.0,
        "service": 5.0,
        "sleep": 5.0,
        "value": 5.0
    },
    "location": {
        "city": null,
        "continent": "Europe",
        "country": "United Kingdom (UK)",
        "proposed_city": "Brighton",
        "province": null,
        "region": null
    },
    "name": "Guest and the City",
    "places": {
        "aka": [],
        "hotel_description": [
            "Brighton"
        ],
        "hotel_name": []
    },
    "review_count": 609,
    "review_count_current": 20,
    "reviews": [
        {
            "date": "August 24, 2012",
            "detail_rating": {
                "business": null,
                "cleanliness": 5.0,
                "desk": null,
                "location": 5.0,
                "pool": null,
                "restaurant": null,
                "rooms": 5.0,
                "service": 5.0,
                "sleep": 5.0,
                "value": 5.0
            },
            "helpfulness": 1,
            "id": 138192401,
            "likes": {
                "disliked": null,
                "liked": null
            },
            "rating": 5.0,
            "stay_parameters": "Stayed August 2012, traveled with friends",
            "text": "From the moment we arrived through to us leaving our hosts were fantastic. we were given a warm and friendly welcome. Dan and Mardi were very helpful in helping us to decide where to eat out. They were so right about the restaurant we ate in, might have missed it if they had not mentioned it.",
            "title": "Manhattan by the sea",
            "user": "george2455"
        },
        {
            "date": "August 21, 2012",
            "detail_rating": {
                "business": null,
                "cleanliness": 5.0,
                "desk": null,
                "location": 5.0,
                "pool": null,
                "restaurant": null,
                "rooms": 4.0,
                "service": 5.0,
                "sleep": 4.0,
                "value": 4.0
            },
            "helpfulness": null,
            "id": 137882377,
            "likes": {
                "disliked": null,
                "liked": null
            },
            "rating": 5.0,
            "stay_parameters": "Stayed August 2012, traveled solo",
            "text": "We were in the loft which had a feeling of being separate from the rest of the bed and breakfast.",
            "title": "Really special",
            "user": "Lisa P"
        },
        {
            "date": "August 17, 2012",
            "detail_rating": {
                "business": null,
                "cleanliness": 5.0,
                "desk": null,
                "location": 5.0,
                "pool": null,
                "restaurant": null,
                "rooms": 5.0,
                "service": 5.0,
                "sleep": 5.0,
                "value": 4.0
            },
            "helpfulness": null,
            "id": 137484315,
            "likes": {
                "disliked": null,
                "liked": null
            },
            "rating": 5.0,
            "stay_parameters": "Stayed August 2012, traveled solo",
            "text": "the rooms are not large but you have all you need and the bed was so comfortable.",
            "title": "The perfect stay",
            "user": "Mitchell G"
        },
        {
            "date": "August 17, 2012",
            "detail_rating": {
                "business": null,
                "cleanliness": 5.0,
                "desk": null,
                "location": 5.0,
                "pool": null,
                "restaurant": null,
                "rooms": 5.0,
                "service": 5.0,
                "sleep": 5.0,
                "value": 5.0
            },
            "helpfulness": 1,
            "id": 137425228,
            "likes": {
                "disliked": null,
                "liked": null
            },
            "rating": 5.0,
            "stay_parameters": "Stayed August 2012, traveled as a couple",
            "text": "The actual B & B was in a great location for town, the beach and the promenade.",
            "title": "Thank you!!",
            "user": "Peter C"
        },
        {
            "date": "August 15, 2012",
            "detail_rating": {
                "business": null,
                "cleanliness": 5.0,
                "desk": null,
                "location": 5.0,
                "pool": null,
                "restaurant": null,
                "rooms": 5.0,
                "service": 5.0,
                "sleep": null,
                "value": 5.0
            },
            "helpfulness": null,
            "id": 137249090,
            "likes": {
                "disliked": null,
                "liked": null
            },
            "rating": 5.0,
            "stay_parameters": "Stayed August 2012",
            "text": "overall we had a great stay and would have no hesitation in returning..hopefully very soon",
            "title": "Couldn't ask for more.",
            "user": "jmgrinbergs"
        },
        {
            "date": "August 14, 2012",
            "detail_rating": {
                "business": null,
                "cleanliness": null,
                "desk": null,
                "location": null,
                "pool": null,
                "restaurant": null,
                "rooms": null,
                "service": 5.0,
                "sleep": null,
                "value": null
            },
            "helpfulness": null,
            "id": 137175017,
            "likes": {
                "disliked": null,
                "liked": null
            },
            "rating": 5.0,
            "stay_parameters": "Stayed August 2012, traveled as a couple",
            "text": "I dont very often write reviews for a hotel, expecially when I havent even stayed here!! However i felt I had to write in because I called guest and the city to book a room, unfortunately they had no vacancies but were so so helpful and gave me the numbers of some other guest houses that may have availabiltiy. Thankyou so much xx Laura",
            "title": "thankyou",
            "user": "laura_dan34"
        },
        {
            "date": "August 8, 2012",
            "detail_rating": {
                "business": null,
                "cleanliness": 5.0,
                "desk": null,
                "location": 5.0,
                "pool": null,
                "restaurant": null,
                "rooms": 5.0,
                "service": 5.0,
                "sleep": 5.0,
                "value": 5.0
            },
            "helpfulness": null,
            "id": 136620509,
            "likes": {
                "disliked": null,
                "liked": null
            },
            "rating": 5.0,
            "stay_parameters": "Stayed August 2012, traveled as a couple",
            "text": "Dan and Mardi have got it sorted with this modern accommodation. The rooms are top-notch, I got the best sleep in years, better than home even! The breakfasts were first rate and the hosts were so welcoming, like nothing was too much trouble. The location is very central with shops, seafront, pier and buses all very close by but with none of the noise you would normally associate with being near the action. As suggested on their website we said in advance that we wanted parking, they will sort you out with parking permits and my car spent the next 5 days in the very next street which meant one less thing to worry about. If (when?) we choose to stay overnight in Brighton for any length of time The Guest and The City will be our first choice, very well done D & M!",
            "title": "First class care",
            "user": "Gavin R"
        },
        {
            "date": "August 5, 2012",
            "detail_rating": {
                "business": null,
                "cleanliness": null,
                "desk": null,
                "location": null,
                "pool": null,
                "restaurant": null,
                "rooms": null,
                "service": 5.0,
                "sleep": null,
                "value": null
            },
            "helpfulness": null,
            "id": 136319704,
            "likes": {
                "disliked": null,
                "liked": null
            },
            "rating": 5.0,
            "stay_parameters": "Stayed August 2012, traveled as a couple",
            "text": "After looking at the advertisement on the internet showing the modern outlook of the guest house we knew it would be the one for us.Soon as we arrived we knew we made the right choice.The hospitality of Mardi and Dan was second to none,the breakfast was fantastic ,room was lovely as is the rest of the guest house and the attention to detail was marvelous.Location is excellent and would definately stay there again and would highly recommend to anyone.",
            "title": "\"Oustanding\"",
            "user": "laura_dan34"
        },
        {
            "date": "August 4, 2012",
            "detail_rating": {
                "business": null,
                "cleanliness": 5.0,
                "desk": null,
                "location": 5.0,
                "pool": null,
                "restaurant": null,
                "rooms": 5.0,
                "service": 5.0,
                "sleep": 5.0,
                "value": 5.0
            },
            "helpfulness": 1,
            "id": 136192993,
            "likes": {
                "disliked": null,
                "liked": null
            },
            "rating": 5.0,
            "stay_parameters": "Stayed May 2012, traveled as a couple",
            "text": "Such a beautiful and modern place to stay. Dan and Mardi made us feel right at home as soon as we arrived. It was exactly what we needed after we'd been staying in very basic hotels for a while. The location was fantastic as well- you can walk everywhere and there is a great view of the pier from the bottom of the street. Breakfast was so delicious. I will never forget the smiley face on my hot chocolate every morning! We didn't want to leave and can't wait to stay there again.",
            "title": "You have to stay here when you're in Brighton",
            "user": "Emma P"
        },
        {
            "date": "August 2, 2012",
            "detail_rating": {
                "business": null,
                "cleanliness": 5.0,
                "desk": null,
                "location": 5.0,
                "pool": null,
                "restaurant": null,
                "rooms": 4.0,
                "service": 5.0,
                "sleep": 5.0,
                "value": 5.0
            },
            "helpfulness": 1,
            "id": 136032493,
            "likes": {
                "disliked": null,
                "liked": null
            },
            "rating": 5.0,
            "stay_parameters": "Stayed July 2012, traveled as a couple",
            "text": "Decided to dtay here having read the fantastic reviews on here and have to say we were not disappointed. Excellent location, literally a 2 minute walk from the pier and seafront. Hosts were very friendly and helpful, recommending places to go, restaurants to eat at, etc. They even went the extra mile by going and buying a fan for our room as we were there in the hottest week of the year and it got very warm! Breakfast was the best I have ever had at any B&B or hotel; fresh, beautifully cooked and in plentiful supply! Our room (a standard en-suite double) was fairly small but had everything you needed and was beautifully decorated with quality fixtures, fittings and furnishings - as is the rest of the property. All in all, highly recommended.",
            "title": "Quality through and through",
            "user": "stuandtoy"
        },
        {
            "date": "August 29, 2012",
            "detail_rating": {
                "business": null,
                "cleanliness": 4.0,
                "desk": null,
                "location": 4.0,
                "pool": null,
                "restaurant": null,
                "rooms": 4.0,
                "service": 5.0,
                "sleep": 4.0,
                "value": 4.0
            },
            "helpfulness": null,
            "id": 138762557,
            "likes": {
                "disliked": null,
                "liked": null
            },
            "rating": 4.0,
            "stay_parameters": "Stayed August 2012, traveled with friends",
            "text": "Myself and two friends decided on a long weekend in Brighton for fun, and knowing Brighton pretty well, and having stayed in some of the hotels there but not feeling that they were what we were looking for I decided to research B&B's, and came across Guest and the Citys website and read the reviews on Trip Advisor and really loved it. Once I had booked the room (we went for the family room upstairs which sleeps four but for three of us this was perfect) and from the onset I emailed Mardi and Dan to tell them our arrival plans and also asked them for any restaurant and bar recommendations, and they were really helpful.",
            "title": "Loved it!",
            "user": "em7748"
        },
        {
            "date": "August 26, 2012",
            "detail_rating": {
                "business": null,
                "cleanliness": null,
                "desk": null,
                "location": null,
                "pool": null,
                "restaurant": null,
                "rooms": null,
                "service": null,
                "sleep": null,
                "value": null
            },
            "helpfulness": null,
            "id": 138435267,
            "likes": {
                "disliked": null,
                "liked": null
            },
            "rating": 5.0,
            "stay_parameters": null,
            "text": "Once we arrived at the B&B we parked up (this was a bit of a pain to find spaces, but we did get there just after the rush hour hometime traffic, so probably better to get there early afternoon to get a parking space nearby) they were really welcoming and showed us to our rooms which were about 4 flights of stairs up so a bit of a trek but the two adjecent rooms between the 3 of us were lovely. The bathoom (actually a wet room, which took a bit of getting used to but was lovely, as were the Pecknsniffs toilettries) lots of nice little touches, like bottled water, fizz wizz popping candy and love hearts, plus the kitchen area outside our room was well stocked with plates and cutlery, should we need them, plus tea, coffee and biscuits, and lovely glasses for our fizz later!",
            "title": "Friendly with great location, will stay there again",
            "user": "bentdavid"
        },
        {
            "date": "August 26, 2012",
            "detail_rating": {
                "business": null,
                "cleanliness": 5.0,
                "desk": null,
                "location": 5.0,
                "pool": null,
                "restaurant": null,
                "rooms": 3.0,
                "service": 4.0,
                "sleep": 4.0,
                "value": 3.0
            },
            "helpfulness": null,
            "id": 138380735,
            "likes": {
                "disliked": null,
                "liked": null
            },
            "rating": 4.0,
            "stay_parameters": "Stayed July 2012, traveled as a couple",
            "text": "Breakfast was a great selection which was made each night before we went to bed, and it was brilliantly cooked by Dan, eggs how you like them, bacon, sausages, toast, beans, hash browns, plus fruit, we really didnt go hungry, and it helped with our hangovers the next day!",
            "title": "Friendly clean hotel in quiet location",
            "user": "avbradley1978"
        },
        {
            "date": "August 24, 2012",
            "detail_rating": {
                "business": null,
                "cleanliness": 5.0,
                "desk": null,
                "location": 5.0,
                "pool": null,
                "restaurant": null,
                "rooms": 5.0,
                "service": 5.0,
                "sleep": 4.0,
                "value": 4.0
            },
            "helpfulness": null,
            "id": 138256107,
            "likes": {
                "disliked": null,
                "liked": null
            },
            "rating": 5.0,
            "stay_parameters": "Stayed August 2012, traveled as a couple",
            "text": "Overall we loved our stay at Guest and the City, would absolutely recommend it to family and friends and would go back, thanks Mardi and Dan for being great hosts!",
            "title": "Just fantastic",
            "user": "RubyDG"
        },
        {
            "date": "August 24, 2012",
            "detail_rating": {
                "business": null,
                "cleanliness": 5.0,
                "desk": null,
                "location": 5.0,
                "pool": null,
                "restaurant": null,
                "rooms": 5.0,
                "service": 5.0,
                "sleep": 5.0,
                "value": 5.0
            },
            "helpfulness": null,
            "id": 138252273,
            "likes": {
                "disliked": null,
                "liked": null
            },
            "rating": 5.0,
            "stay_parameters": "Stayed August 2012, traveled with family",
            "text": "My wife and I really enjoyed our stay. The owners were very friendly, with useful recommendations for nightlife. Gorgeous breakfast, stylish rooms and walking distance from everything. I'd definitely recommend to a friend and would love to stay again.",
            "title": "Wonderful Stay :)",
            "user": "Sam P"
        },
        {
            "date": "July 30, 2012",
            "detail_rating": {
                "business": null,
                "cleanliness": 5.0,
                "desk": null,
                "location": 5.0,
                "pool": null,
                "restaurant": null,
                "rooms": 5.0,
                "service": 5.0,
                "sleep": 5.0,
                "value": 5.0
            },
            "helpfulness": 2,
            "id": 135784217,
            "likes": {
                "disliked": null,
                "liked": null
            },
            "rating": 5.0,
            "stay_parameters": "Stayed July 2012, traveled as a couple",
            "text": "What a fantastic stay, Both Mardi and Dan are the best hosts ever! Dan called us on our way down to make sure he had a parking space waiting for us. When we arrived Mardi gave us her fantastic knowledge on all the best places to visit and dine.",
            "title": "Simply the best",
            "user": "David D"
        },
        {
            "date": "July 29, 2012",
            "detail_rating": {
                "business": null,
                "cleanliness": 5.0,
                "desk": null,
                "location": 5.0,
                "pool": null,
                "restaurant": null,
                "rooms": 5.0,
                "service": 5.0,
                "sleep": 5.0,
                "value": 5.0
            },
            "helpfulness": null,
            "id": 135686665,
            "likes": {
                "disliked": null,
                "liked": null
            },
            "rating": 5.0,
            "stay_parameters": "Stayed July 2012, traveled as a couple",
            "text": "The hotel was perfectly located for all activities! and the breakfast that Dan cooks is truly incredable and cooked to perfection.",
            "title": "Well looked after by friendly and attentive hosts",
            "user": "Frederick711"
        },
        {
            "date": "July 26, 2012",
            "detail_rating": {
                "business": null,
                "cleanliness": 5.0,
                "desk": null,
                "location": 5.0,
                "pool": null,
                "restaurant": null,
                "rooms": 5.0,
                "service": 5.0,
                "sleep": 5.0,
                "value": 5.0
            },
            "helpfulness": null,
            "id": 135426515,
            "likes": {
                "disliked": null,
                "liked": null
            },
            "rating": 5.0,
            "stay_parameters": "Stayed July 2012, traveled with friends",
            "text": "The next time we are in Brighton we will be staying at Guest and the City,",
            "title": "Wonderful Hotel",
            "user": "Tatiana1907"
        },
        {
            "date": "July 24, 2012",
            "detail_rating": {
                "business": null,
                "cleanliness": 5.0,
                "desk": null,
                "location": 5.0,
                "pool": null,
                "restaurant": null,
                "rooms": 3.0,
                "service": 5.0,
                "sleep": 4.0,
                "value": 4.0
            },
            "helpfulness": 1,
            "id": 135221406,
            "likes": {
                "disliked": null,
                "liked": null
            },
            "rating": 5.0,
            "stay_parameters": "Stayed July 2012, traveled with friends",
            "text": "(David & Sonja)",
            "title": "Enjoyable stay",
            "user": "KayVienna"
        },
        {
            "date": "July 23, 2012",
            "detail_rating": {
                "business": null,
                "cleanliness": 5.0,
                "desk": null,
                "location": 5.0,
                "pool": null,
                "restaurant": null,
                "rooms": 5.0,
                "service": 5.0,
                "sleep": 5.0,
                "value": 5.0
            },
            "helpfulness": null,
            "id": 135190828,
            "likes": {
                "disliked": null,
                "liked": null
            },
            "rating": 5.0,
            "stay_parameters": "Stayed July 2012, traveled as a couple",
            "text": "We stayed in one of the smaller doubles which was great for a couple of nights stay. Dan and Mardi took the time to find out the kind of things we liked doing and made some great recommendations for bars and restaurants which made a big difference - as we were on such a short trip we didn't really have time to explore too much. Very nice veggie breakfast and coffee in the morning cleared our heads for good times out and about in Brighton :D",
            "title": "Book now for a friendly welcome, great night's sleep and scrummy brekkie!",
            "user": "Andrew_and_Zoe_2612"
        }
    ],
    "slim_ranking": 0.0285714285714,
    "stars": null,
    "tripadvisor": {
        "VISITED": false,
        "country_name": null,
        "locality": null,
        "pic_link": null,
        "street_address": null
    },
    "user_rating": 5.0,
    "variance": {
        "average": 2,
        "excellent": 569,
        "poor": 0,
        "terrible": 0,
        "very good": 38
    }
}