{
    "aka": "Hilton Garden Inn Indianapolis Downtown Hotel",
    "description": "Luxury and value combine in this historic building in downtown Indianapolis. Oversized guest rooms with picture windows, refrigerators, microwaves and complimentary Wi-Fi ensure a comfortable and convenient stay experience.",
    "detail_rating": {
        "cleanliness": null,
        "location": null,
        "rooms": null,
        "service": null,
        "sleep": null,
        "value": null
    },
    "location": {
        "city": "Indianapolis",
        "continent": null,
        "country": "United States",
        "proposed_city": "Indianapolis",
        "province": null,
        "region": null
    },
    "name": "Hilton Garden Inn Indianapolis Downtown",
    "places": {
        "aka": [
            "Indianapolis"
        ],
        "hotel_description": [
            "Indianapolis"
        ],
        "hotel_name": [
            "Indianapolis"
        ]
    },
    "review_count": 300,
    "review_count_current": 20,
    "reviews": [
        {
            "date": "November 2, 2011",
            "detail_rating": {
                "business": null,
                "cleanliness": 4.0,
                "desk": null,
                "location": 5.0,
                "pool": null,
                "restaurant": null,
                "rooms": 4.0,
                "service": 5.0,
                "sleep": 4.0,
                "value": 4.0
            },
            "helpfulness": null,
            "id": 120065422,
            "likes": {
                "disliked": null,
                "liked": null
            },
            "rating": 4.0,
            "stay_parameters": "Stayed September 2011, traveled on business",
            "text": "I've stayed here several times and have hosted 2 breakfast meetings in the Ovid Butler Room. The staff is friendly and easy to work with, especially Celia for meeting planning. It's a great location for visiting downtown Indianapolis clients. My only complaint is that is takes forever to get your car when you valet. It's an issue for several downtown hotels in Indianapolis so always call 10-15 minutes ahead to have your car brought up.",
            "title": "One of the Best Hotel in Downtown Indianapolis",
            "user": "LizzChicago"
        },
        {
            "date": "October 31, 2011",
            "detail_rating": {
                "business": null,
                "cleanliness": 5.0,
                "desk": null,
                "location": 5.0,
                "pool": null,
                "restaurant": null,
                "rooms": 5.0,
                "service": 4.0,
                "sleep": 5.0,
                "value": 4.0
            },
            "helpfulness": 1,
            "id": 119952517,
            "likes": {
                "disliked": null,
                "liked": null
            },
            "rating": 5.0,
            "stay_parameters": "Stayed October 2011, traveled on business",
            "text": "Stayed here for a convention and it was a great hotel as most Hilton garden Inn's are. Walking distance to the Indianapolis Convention Center and plenty of places to eat. Rooms very clean. Staff was great and helpful. Also Valet parking.",
            "title": "Great Hotel, Great Staff",
            "user": "kio607"
        },
        {
            "date": "October 29, 2011",
            "detail_rating": {
                "business": null,
                "cleanliness": 5.0,
                "desk": null,
                "location": 5.0,
                "pool": null,
                "restaurant": null,
                "rooms": 5.0,
                "service": 5.0,
                "sleep": 5.0,
                "value": 4.0
            },
            "helpfulness": 1,
            "id": 119856908,
            "likes": {
                "disliked": null,
                "liked": null
            },
            "rating": 5.0,
            "stay_parameters": "Stayed October 2011, traveled with friends",
            "text": "Wow. Superb service, location, price, cleanliness, quietness. Couldn't have asked for a better experience.",
            "title": "WOW!",
            "user": "243Guest243"
        },
        {
            "date": "October 26, 2011",
            "detail_rating": {
                "business": null,
                "cleanliness": 5.0,
                "desk": null,
                "location": 5.0,
                "pool": null,
                "restaurant": null,
                "rooms": 5.0,
                "service": 3.0,
                "sleep": 4.0,
                "value": 4.0
            },
            "helpfulness": 1,
            "id": 119772588,
            "likes": {
                "disliked": null,
                "liked": null
            },
            "rating": 4.0,
            "stay_parameters": "Stayed October 2011, traveled with family",
            "text": "My family and I stayed for one night and felt this was an excellent experience.",
            "title": "Great value! Excellent property.",
            "user": "Bulldozers"
        },
        {
            "date": "October 14, 2011",
            "detail_rating": {
                "business": null,
                "cleanliness": 5.0,
                "desk": null,
                "location": 5.0,
                "pool": null,
                "restaurant": null,
                "rooms": 5.0,
                "service": 5.0,
                "sleep": 5.0,
                "value": 5.0
            },
            "helpfulness": 1,
            "id": 119303078,
            "likes": {
                "disliked": null,
                "liked": null
            },
            "rating": 5.0,
            "stay_parameters": "Stayed September 2011, traveled as a couple",
            "text": "Free wifi, easy access to late night snack, located near multiple family friendly restaurants.",
            "title": "Love the old buildings",
            "user": "LAJFJ2"
        },
        {
            "date": "July 27, 2011",
            "detail_rating": {
                "business": null,
                "cleanliness": 3.0,
                "desk": null,
                "location": 4.0,
                "pool": null,
                "restaurant": null,
                "rooms": 2.0,
                "service": 3.0,
                "sleep": null,
                "value": 4.0
            },
            "helpfulness": null,
            "id": 115874246,
            "likes": {
                "disliked": null,
                "liked": null
            },
            "rating": 2.0,
            "stay_parameters": "Stayed July 2011",
            "text": "I stayed here for four nights on business. Rock hard bed, my room smelled of cigarettes, the ac couldn't keep up, the room was humid and dank, and I ate something in the restaurant that had me sick for three days. Yuck.",
            "title": "Won't stay here again unless I have to.",
            "user": "motogrrl2003"
        },
        {
            "date": "June 7, 2011",
            "detail_rating": {
                "business": null,
                "cleanliness": 4.0,
                "desk": null,
                "location": null,
                "pool": null,
                "restaurant": null,
                "rooms": null,
                "service": 2.0,
                "sleep": 1.0,
                "value": 1.0
            },
            "helpfulness": 1,
            "id": 111997385,
            "likes": {
                "disliked": null,
                "liked": null
            },
            "rating": 2.0,
            "stay_parameters": "Stayed May 2011, traveled with friends",
            "text": "I returned to the HGI Indianapolis Downtown for the 4th or 5th time when attending the Indianapolis 500. It was my favorite place to stay for the race. However, this year I was really disappointed with the experience. To start, I was given a really compact room upon arrival. One of the things I recall fondly was the large rooms and even getting a HHonors Diamond upgrade during my stays. This time I was not even acknowledged as a Diamond member and then had to complain to get moved to a larger room. Unfortunately, the room was also showing signs of age and need of renovation. I had a room with two beds and the bed I had was terribly uncomfortable. I stay at HGI often but the adjustable bed I had was not working properly and was like sleeping in a large bowl. Add to that the issue that the HVAC was not working properly and the only way to keep the room even slightly cool was to keep it running 24/7 and keeping the windows covered the entire stay. The result was also a dampness to our clothing and a loud hum of a barely working AC the entire stay. We also needed a refrigerator. Well, the one in our room was also barely cooling. I twice stopped by the front desk upon leaving the hotel and asked for someone to PLEASE look at the situation with HVAC and Fridge. I was assured they would. Well, to the best of my knowledge, nobody ever stopped by. I did not receive the ususal courtesy call/message and it was obvious neither issue was resolved. Bottom line is that I cannot recommend this hotel any longer until they begin to address issues of an aging hotel.",
            "title": "Used to LOVE this hotel",
            "user": "Thecard14"
        },
        {
            "date": "May 21, 2011",
            "detail_rating": {
                "business": null,
                "cleanliness": 4.0,
                "desk": null,
                "location": 5.0,
                "pool": null,
                "restaurant": null,
                "rooms": 4.0,
                "service": 5.0,
                "sleep": 4.0,
                "value": 5.0
            },
            "helpfulness": 1,
            "id": 109219248,
            "likes": {
                "disliked": null,
                "liked": null
            },
            "rating": 5.0,
            "stay_parameters": "Stayed May 2011, traveled as a couple",
            "text": "One last note, the valet parking attendant was extremely rude when we needed his assistance when we found the self parking garage was closed for Memorial Day. What was up with that.? Also, the self parking attendant was also unbelievably rude. We had the appropriate parking pass from the fornt desk but he did not want to let us out of the garage since we did not have the original ticket (front desk took it in exchange for the red parking badge). He was furious and wanted me to call teh front desk to resolved. Since the hotel partners are a reflection of the hotel itself, I cannot just brush it off as being th eparking garage or the valet parking company. It is another issue on the list the contributed tomy dissatisfaction with the HGI Indy.",
            "title": "Best kept secret in Indy!",
            "user": "miss_bea_heyvin"
        },
        {
            "date": "April 14, 2011",
            "detail_rating": {
                "business": null,
                "cleanliness": 4.0,
                "desk": null,
                "location": 5.0,
                "pool": null,
                "restaurant": null,
                "rooms": 4.0,
                "service": 5.0,
                "sleep": 5.0,
                "value": 3.0
            },
            "helpfulness": 1,
            "id": 104091666,
            "likes": {
                "disliked": null,
                "liked": null
            },
            "rating": 4.0,
            "stay_parameters": "Stayed March 2011, traveled with family",
            "text": "As I said, it was always my choice when in Indy, but now I will stay at another Hilton property for the 2012 race.",
            "title": "Nice place, kids enjoyed the pool",
            "user": "bluto_74"
        },
        {
            "date": "March 28, 2011",
            "detail_rating": {
                "business": null,
                "cleanliness": 5.0,
                "desk": null,
                "location": 5.0,
                "pool": null,
                "restaurant": null,
                "rooms": 5.0,
                "service": 5.0,
                "sleep": 5.0,
                "value": 5.0
            },
            "helpfulness": 1,
            "id": 101875811,
            "likes": {
                "disliked": null,
                "liked": null
            },
            "rating": 5.0,
            "stay_parameters": "Stayed March 2011, traveled as a couple",
            "text": "Great place to stay in downtown Indy. The queen suites are huge and quite a value for the space and location. Hotel is just off the circle and within walking distance to a variety of attractions and restaurants. I've stayed there twice and haven't been disappointed.",
            "title": "WONDERFUL STAY",
            "user": "DawnZHebron"
        },
        {
            "date": "September 13, 2011",
            "detail_rating": {
                "business": null,
                "cleanliness": null,
                "desk": null,
                "location": 5.0,
                "pool": null,
                "restaurant": null,
                "rooms": 4.0,
                "service": 4.0,
                "sleep": null,
                "value": 5.0
            },
            "helpfulness": 1,
            "id": 118065064,
            "likes": {
                "disliked": null,
                "liked": null
            },
            "rating": 5.0,
            "stay_parameters": "Stayed September 2011, traveled as a couple",
            "text": "We went to Indy for a getaway weekend and a concert. The hotel was in the center of downtown and very short walking distance from shopping, restaurants, night clubs and sporting venues. The hotel is located steps away from the historic Monument Circle, and close to the river walk and the new 9/11 exhibit. Hotel staff were very nice, and their restuarant recommendation was spot on. Hotel rooms were average size and very clean but the lobby has the look of an older hotel. Hotel bar is nothing special. Valet parking is not necessary as there is a parking deck literally across the street for $9 per day. Perfect location if you are headed to downtown Indy !",
            "title": "Perfect !",
            "user": "Thomas S"
        },
        {
            "date": "September 12, 2011",
            "detail_rating": {
                "business": null,
                "cleanliness": 4.0,
                "desk": null,
                "location": null,
                "pool": null,
                "restaurant": null,
                "rooms": null,
                "service": 5.0,
                "sleep": 4.0,
                "value": 4.0
            },
            "helpfulness": 1,
            "id": 117990236,
            "likes": {
                "disliked": null,
                "liked": null
            },
            "rating": 4.0,
            "stay_parameters": "Stayed July 2011, traveled on business",
            "text": "I stayed here for a conference in July. The staff was very friendly and accommodating. I usually stay at Marriott but all Marriott properties were sold out and they (Marriott) doubled their prices for this busy weekend in Indianapolis. I called this property and got a very large double room for a great price. The location was wonderful and I will defiantly stay at this property again.",
            "title": "Great stay",
            "user": "Sipp2K09"
        },
        {
            "date": "August 18, 2011",
            "detail_rating": {
                "business": null,
                "cleanliness": 5.0,
                "desk": null,
                "location": null,
                "pool": null,
                "restaurant": null,
                "rooms": null,
                "service": 5.0,
                "sleep": 5.0,
                "value": 4.0
            },
            "helpfulness": null,
            "id": 116892109,
            "likes": {
                "disliked": null,
                "liked": null
            },
            "rating": 5.0,
            "stay_parameters": "Stayed August 2011, traveled on business",
            "text": "I've stayed in downtown Indy several times and was excited to try this property. I'm so glad I did! The elegant lobby and friendly staff immediately made me feel at home. The location was exceptional: just steps away from Monument Circle with dozens of restaurants in the surrounding blocks.",
            "title": "Classy Hotel, Prime Location, Friendly Staff",
            "user": "RipplesGuy"
        },
        {
            "date": "August 17, 2011",
            "detail_rating": {
                "business": null,
                "cleanliness": 5.0,
                "desk": null,
                "location": null,
                "pool": null,
                "restaurant": null,
                "rooms": null,
                "service": 5.0,
                "sleep": 5.0,
                "value": 5.0
            },
            "helpfulness": 2,
            "id": 116857966,
            "likes": {
                "disliked": null,
                "liked": null
            },
            "rating": 5.0,
            "stay_parameters": "Stayed May 2011, traveled as a couple",
            "text": "I had a minor maintenance issue that they addressed lightning fast (less than 10 minutes after I called there was a knock on my door).",
            "title": "Great hotel!!",
            "user": "pacersguy31"
        },
        {
            "date": "August 17, 2011",
            "detail_rating": {
                "business": null,
                "cleanliness": 5.0,
                "desk": null,
                "location": null,
                "pool": null,
                "restaurant": null,
                "rooms": null,
                "service": 4.0,
                "sleep": 5.0,
                "value": 4.0
            },
            "helpfulness": null,
            "id": 116845897,
            "likes": {
                "disliked": null,
                "liked": null
            },
            "rating": 3.0,
            "stay_parameters": "Stayed August 2011, traveled with family",
            "text": "I forgot to ask about the history of the building--I'm guessing it must have been an historic hotel that was extensively renovated to meet Hilton Garden Inn's high standards.",
            "title": "Helpful staff. Nice enough hotel",
            "user": "MisplacedOhioan"
        },
        {
            "date": "October 11, 2011",
            "detail_rating": {
                "business": null,
                "cleanliness": 4.0,
                "desk": null,
                "location": 4.0,
                "pool": null,
                "restaurant": null,
                "rooms": 4.0,
                "service": 5.0,
                "sleep": 1.0,
                "value": 3.0
            },
            "helpfulness": 1,
            "id": 119203415,
            "likes": {
                "disliked": null,
                "liked": null
            },
            "rating": 3.0,
            "stay_parameters": "Stayed October 2011, traveled on business",
            "text": "Overall this is a great hotel walking distance to everything in Downtown. The staff was very attentative and friendly in assisting us. My only complain is the beds are hard and lumpy and the the hot water when taking a shower was not consistent. We were told the hotel was older and used steam for the plumbing so it caused the noises we heard and reason for inconsistent water temperature. If you do not mind the latter, this a good hotel.",
            "title": "Great Location! Friendly Staff! Hard Beds!",
            "user": "stretchuga100"
        },
        {
            "date": "September 28, 2011",
            "detail_rating": {
                "business": null,
                "cleanliness": 5.0,
                "desk": null,
                "location": 5.0,
                "pool": null,
                "restaurant": null,
                "rooms": 5.0,
                "service": 5.0,
                "sleep": 5.0,
                "value": 5.0
            },
            "helpfulness": 1,
            "id": 118718098,
            "likes": {
                "disliked": null,
                "liked": null
            },
            "rating": 5.0,
            "stay_parameters": "Stayed September 2011, traveled on business",
            "text": "A gem in downtown Indianapolis",
            "title": "A Fantastic HGI",
            "user": "Nitroxprt"
        },
        {
            "date": "September 21, 2011",
            "detail_rating": {
                "business": null,
                "cleanliness": 3.0,
                "desk": null,
                "location": 5.0,
                "pool": null,
                "restaurant": null,
                "rooms": 4.0,
                "service": 5.0,
                "sleep": 5.0,
                "value": 4.0
            },
            "helpfulness": 1,
            "id": 118424399,
            "likes": {
                "disliked": null,
                "liked": null
            },
            "rating": 4.0,
            "stay_parameters": "Stayed September 2011, traveled on business",
            "text": "What a great find!!! This is a renovated historic building from 1916 (Wikepdia) in the heart of downtown Indy. It was once a bank (Fletcher Savings and Trust) and still shows a lot of the ambience from that by gone era. Everything is here and within walking distance, including Lucas Oil Stadium. I had a spacious room on the 14th floor that offered a great view of the downtown skyline. As with all HGI\u2019s the standards are above average with a very personal and attentive staff. To me this experience was totally positive,and I would have no hesitation staying at this property again, or recommending it to anyone. A+++++",
            "title": "Very decent stay",
            "user": "citysuburb"
        },
        {
            "date": "September 18, 2011",
            "detail_rating": {
                "business": null,
                "cleanliness": null,
                "desk": null,
                "location": 5.0,
                "pool": null,
                "restaurant": null,
                "rooms": 4.0,
                "service": 5.0,
                "sleep": null,
                "value": 4.0
            },
            "helpfulness": null,
            "id": 118278151,
            "likes": {
                "disliked": null,
                "liked": null
            },
            "rating": 4.0,
            "stay_parameters": "Stayed September 2011, traveled on business",
            "text": "Stayed for one night. Helpful front desk staff. Terrific downtown location.Easy walk to convention center. Very large room. Accessible outlets - nice that some hotels have figured this out. TV had a wide swivel range - it's the little things that make a stay so much easier. Neutrogena bath products. i would stay here again.",
            "title": "Always nice",
            "user": "jwrichte"
        },
        {
            "date": "September 16, 2011",
            "detail_rating": {
                "business": null,
                "cleanliness": null,
                "desk": null,
                "location": 5.0,
                "pool": null,
                "restaurant": null,
                "rooms": 5.0,
                "service": 5.0,
                "sleep": null,
                "value": 3.0
            },
            "helpfulness": 1,
            "id": 118213136,
            "likes": {
                "disliked": null,
                "liked": null
            },
            "rating": 4.0,
            "stay_parameters": "Stayed June 2011, traveled as a couple",
            "text": "Nice hotel for the price. Nothing spectacular as far as views go, but great service and very clean.",
            "title": "Very Accommodating!",
            "user": "INDrob83"
        }
    ],
    "slim_ranking": 0.0934065934066,
    "stars": 3,
    "tripadvisor": {
        "VISITED": false,
        "country_name": null,
        "locality": null,
        "pic_link": null,
        "street_address": null
    },
    "user_rating": 4.5,
    "variance": {
        "average": 36,
        "excellent": 149,
        "poor": 10,
        "terrible": 5,
        "very good": 100
    }
}