{
    "aka": null,
    "description": "Wollongong's newest boutique accommodation & conference and events destination for 2010 and beyond - The Quality Suites Pioneer Sands - is ideally located on the Sydney side of Wollongong at only 55 minutes drive from Sydney Airport. Be one of the first to enjoy our contemporary one and two bedroom serviced apartments with large open plan space flowing onto balconies with ocean, escarpment or Wollongong skyline views. All apartments feature modern finishes, Austar cable on LCD TV's, internet, air conditioning and fully self contained kitchen facilities. Other facilities include a cafe, outdoor pool, gym spa and sauna, and onsite business services. This new coastal retreat could be your next business stop over.",
    "detail_rating": {
        "cleanliness": null,
        "location": null,
        "rooms": null,
        "service": null,
        "sleep": null,
        "value": null
    },
    "location": {
        "city": null,
        "continent": "South Pacific",
        "country": "Australia",
        "proposed_city": null,
        "province": null,
        "region": null
    },
    "name": "Quality Suites Pioneer Sands",
    "places": {
        "aka": [],
        "hotel_description": [
            "Wollongong",
            "Sydney"
        ],
        "hotel_name": []
    },
    "review_count": 85,
    "review_count_current": 5,
    "reviews": [
        {
            "date": "January 6, 2014",
            "detail_rating": {
                "business": null,
                "cleanliness": 4.0,
                "desk": null,
                "location": 4.0,
                "pool": null,
                "restaurant": null,
                "rooms": 4.0,
                "service": 4.0,
                "sleep": 5.0,
                "value": 5.0
            },
            "helpfulness": null,
            "id": 189837028,
            "likes": {
                "disliked": null,
                "liked": null
            },
            "rating": 4.0,
            "stay_parameters": "Stayed January 2014, traveled as a couple",
            "text": "Had a 1 night stay following coastal drive from Melbourne prior to moving on to Blue Mountains. As previous reviewer had said very spacious apartments. Excellent facilities with all kitchen facilities. Found air conditioning only in lounge a little odd but soon had right room temperatures throughout apartment.",
            "title": "Much better than expected and wished we had booked longer",
            "user": "RandGP"
        },
        {
            "date": "January 5, 2014",
            "detail_rating": {
                "business": null,
                "cleanliness": 4.0,
                "desk": null,
                "location": 4.0,
                "pool": null,
                "restaurant": null,
                "rooms": 5.0,
                "service": 3.0,
                "sleep": 4.0,
                "value": 3.0
            },
            "helpfulness": null,
            "id": 189691359,
            "likes": {
                "disliked": null,
                "liked": null
            },
            "rating": 4.0,
            "stay_parameters": "Stayed December 2013, traveled with family",
            "text": "Breakfast was very good and again better than expected.",
            "title": "nice apartment",
            "user": "Jana V"
        },
        {
            "date": "December 28, 2013",
            "detail_rating": {
                "business": null,
                "cleanliness": 5.0,
                "desk": null,
                "location": 4.0,
                "pool": null,
                "restaurant": null,
                "rooms": 5.0,
                "service": 5.0,
                "sleep": 5.0,
                "value": 5.0
            },
            "helpfulness": null,
            "id": 188747681,
            "likes": {
                "disliked": null,
                "liked": null
            },
            "rating": 5.0,
            "stay_parameters": "Stayed December 2013, traveled with family",
            "text": "There was some basic maintenance issues which we notified to reception but never cause us an issue. It was a good area and in hindsight we would have stayed an extra night.",
            "title": "Unbelievable Value",
            "user": "Zoe268"
        },
        {
            "date": "December 18, 2013",
            "detail_rating": {
                "business": null,
                "cleanliness": 5.0,
                "desk": null,
                "location": 3.0,
                "pool": null,
                "restaurant": null,
                "rooms": 4.0,
                "service": 4.0,
                "sleep": 4.0,
                "value": 5.0
            },
            "helpfulness": null,
            "id": 187959753,
            "likes": {
                "disliked": null,
                "liked": null
            },
            "rating": 4.0,
            "stay_parameters": "Stayed November 2013, traveled with family",
            "text": "The one bedroom suite we stayed in was surprisingly spacious. It's modern with very good shower. It was clean on first sight but some of the dishes and glasses were little bit dirty. We stayed for 5 nights and paid more that in Sydney. It could be because it was over Christmas. It was rather strange to ask every time for shower gel and shampoo because it was not given to us when the housekeeping was done.",
            "title": "Good Value",
            "user": "shouen"
        },
        {
            "date": "December 6, 2013",
            "detail_rating": {
                "business": null,
                "cleanliness": null,
                "desk": null,
                "location": null,
                "pool": null,
                "restaurant": null,
                "rooms": null,
                "service": null,
                "sleep": null,
                "value": null
            },
            "helpfulness": null,
            "id": 186876079,
            "likes": {
                "disliked": null,
                "liked": null
            },
            "rating": 4.0,
            "stay_parameters": null,
            "text": "The staff was pleasant enough.",
            "title": "Great \"Gong\" value apartment",
            "user": "A TripAdvisor user"
        }
    ],
    "slim_ranking": 0.0625,
    "stars": 4.5,
    "tripadvisor": {
        "VISITED": false,
        "country_name": null,
        "locality": null,
        "pic_link": null,
        "street_address": null
    },
    "user_rating": 4.5,
    "variance": {
        "average": 4,
        "excellent": 45,
        "poor": 3,
        "terrible": 0,
        "very good": 33
    }
}