{
    "aka": "Club Quarters World Trade Hotel New York City",
    "description": "Private, full service club-like hotel with 252 rooms located on the south side of the World Trade Center with unfettered views of what will become the United States\u2019 most famous landmark. In the heart of downtown Manhattan, nearby neighborhoods include Tribeca, Soho, Battery Park, South Street Seaport, Wall Street and Chinatown and close to dining, shopping and entertainment. Club Quarters is the best value hotel based on quality and the prime location.Club Quarters provide:\u2022 Safe, restricted entry\u2022 Instant registration and check out\u2022 Free high speed internet access throughout the hotel\u2022 Onsite restaurant \u2022 Multi-menu in room dining options (through onsite restaurant and many local restaurants)\u2022 Fridge and microwave available\u2022 Unlimited complimentary chilled purified bottled water \u2022 3 meeting and event rooms available (maximum reception style 100 people)\u2022 Free use of computer/printer \u2022 Ergonomic workstations\u2022 State of the art guest rooms with premium bedding\u2022 Contemporary furnishings\u2022 Flat panel HD TVs\u2022 Complimentary coffee and tea\u2022 24 hour guest service desk \u2022 Fitness room \u2022 Exercise equipment delivered to guest room upon request \u2022 Corporate Apartments available \u2022 Value rates\u2022 Government per diem rates 365 day a year with valid ID\u2022 Laundry facilities.",
    "detail_rating": {
        "cleanliness": 4.5,
        "location": 4.5,
        "rooms": 4.0,
        "service": 4.0,
        "sleep": 4.0,
        "value": 4.0
    },
    "location": {
        "city": "New York City",
        "continent": null,
        "country": "United States",
        "proposed_city": null,
        "province": null,
        "region": null
    },
    "name": "Club Quarters World Trade Center",
    "places": {
        "aka": [
            "York"
        ],
        "hotel_description": [
            "Manhattan"
        ],
        "hotel_name": []
    },
    "review_count": 558,
    "review_count_current": 20,
    "reviews": [
        {
            "date": "December 23, 2012",
            "detail_rating": {
                "business": null,
                "cleanliness": 5.0,
                "desk": null,
                "location": 4.0,
                "pool": null,
                "restaurant": null,
                "rooms": 5.0,
                "service": 5.0,
                "sleep": 5.0,
                "value": 5.0
            },
            "helpfulness": 1,
            "id": 147928931,
            "likes": {
                "disliked": null,
                "liked": null
            },
            "rating": 4.0,
            "stay_parameters": "Stayed December 2012, traveled solo",
            "text": "Probably one of the bigger hotels I've stayed in while in NYC. Easy to check in and out with the computers and convenient to the subway which is a plus. If you're catholic, 4 pm mass at St Peter's about a 10 min walk away on Saturdays. Staff was friendly, free water on the floors which is a plus. Lots to do within walking distance",
            "title": "NYC",
            "user": "Christine G"
        },
        {
            "date": "December 10, 2012",
            "detail_rating": {
                "business": null,
                "cleanliness": 4.0,
                "desk": null,
                "location": 5.0,
                "pool": null,
                "restaurant": null,
                "rooms": 4.0,
                "service": 4.0,
                "sleep": 4.0,
                "value": 5.0
            },
            "helpfulness": null,
            "id": 147161056,
            "likes": {
                "disliked": null,
                "liked": null
            },
            "rating": 4.0,
            "stay_parameters": "Stayed December 2012, traveled on business",
            "text": "Downside is the construction going on, but wasn't in my room when they were doing anything to really care about it. Since you are at Ground Zero, you have the tour groups going around so that adds to the already congested NYC sidewalks but that's something the hotel has no control over.",
            "title": "Always great, but not this time",
            "user": "Zezo07"
        },
        {
            "date": "December 8, 2012",
            "detail_rating": {
                "business": null,
                "cleanliness": 4.0,
                "desk": null,
                "location": 4.0,
                "pool": null,
                "restaurant": null,
                "rooms": 4.0,
                "service": 4.0,
                "sleep": 4.0,
                "value": 5.0
            },
            "helpfulness": 1,
            "id": 147032910,
            "likes": {
                "disliked": null,
                "liked": null
            },
            "rating": 4.0,
            "stay_parameters": "Stayed December 2012, traveled as a couple",
            "text": "This hotel has always been my first choice, but since my latest stay I'll have to think twice. Due to poor maintenance I had to change rooms twice. On the first room the temperature control was not working. On the second room the TV was broken, which was acceptable for the first night. I complained to guest services, but they did nothing. At night the technician came in and suggested I changed rooms. By the way, temperature control was also broken.",
            "title": "Great value",
            "user": "ilovetozipline"
        },
        {
            "date": "December 4, 2012",
            "detail_rating": {
                "business": null,
                "cleanliness": 4.0,
                "desk": null,
                "location": 3.0,
                "pool": null,
                "restaurant": null,
                "rooms": 3.0,
                "service": 4.0,
                "sleep": 3.0,
                "value": 4.0
            },
            "helpfulness": 1,
            "id": 146790980,
            "likes": {
                "disliked": null,
                "liked": null
            },
            "rating": 4.0,
            "stay_parameters": "Stayed July 2012, traveled solo",
            "text": "Right now I'm moving to the third room. Let's see how it goes.",
            "title": "Great Value",
            "user": "J M"
        },
        {
            "date": "December 3, 2012",
            "detail_rating": {
                "business": null,
                "cleanliness": 5.0,
                "desk": null,
                "location": 5.0,
                "pool": null,
                "restaurant": null,
                "rooms": 4.0,
                "service": 3.0,
                "sleep": 5.0,
                "value": 3.0
            },
            "helpfulness": 1,
            "id": 146724773,
            "likes": {
                "disliked": null,
                "liked": null
            },
            "rating": 4.0,
            "stay_parameters": "Stayed December 2012, traveled as a couple",
            "text": "I booked through a third party and got a good deal.",
            "title": "Very comfortable, clean and well located hotel",
            "user": "Phillip R"
        },
        {
            "date": "January 23, 2013",
            "detail_rating": {
                "business": null,
                "cleanliness": 4.0,
                "desk": null,
                "location": 5.0,
                "pool": null,
                "restaurant": null,
                "rooms": 4.0,
                "service": 2.0,
                "sleep": 4.0,
                "value": 4.0
            },
            "helpfulness": null,
            "id": 150382912,
            "likes": {
                "disliked": null,
                "liked": null
            },
            "rating": 4.0,
            "stay_parameters": "Stayed January 2013, traveled with friends",
            "text": "I try to book lower Manhattan as much as possible do this is my area. I really enjoyed this hotel. I booked a one room suite and got moved to the World Center - which means I had to walk through a door when I got off the elevators. My friands who booked this hotel stayed on the Club Quarters side in a standard room. These hotels are the same. They have the same amenities etc.",
            "title": "Great Hotel - Same as World Ceneter Hotel",
            "user": "Highclasslowrent"
        },
        {
            "date": "January 21, 2013",
            "detail_rating": {
                "business": null,
                "cleanliness": 5.0,
                "desk": null,
                "location": 5.0,
                "pool": null,
                "restaurant": null,
                "rooms": 4.0,
                "service": 3.0,
                "sleep": null,
                "value": 4.0
            },
            "helpfulness": null,
            "id": 150226341,
            "likes": {
                "disliked": null,
                "liked": null
            },
            "rating": 4.0,
            "stay_parameters": "Stayed January 2013",
            "text": "Location: Great",
            "title": "Great option for the price point",
            "user": "Nicole C"
        },
        {
            "date": "January 19, 2013",
            "detail_rating": {
                "business": null,
                "cleanliness": 4.0,
                "desk": null,
                "location": 3.0,
                "pool": null,
                "restaurant": null,
                "rooms": 3.0,
                "service": 4.0,
                "sleep": null,
                "value": 4.0
            },
            "helpfulness": 1,
            "id": 150039842,
            "likes": {
                "disliked": null,
                "liked": null
            },
            "rating": 4.0,
            "stay_parameters": "Stayed January 2013",
            "text": "Service: Good - Bellmen lost the luggage cart and had not found it by checkout. No real motivation to assist guests. Yes and no Answers and no I'll get that fixed for you attitude.",
            "title": "Good hotel but lots of walking for main sight seeing",
            "user": "Dazed125"
        },
        {
            "date": "January 19, 2013",
            "detail_rating": {
                "business": null,
                "cleanliness": 4.0,
                "desk": null,
                "location": 5.0,
                "pool": null,
                "restaurant": null,
                "rooms": 4.0,
                "service": 3.0,
                "sleep": 4.0,
                "value": 3.0
            },
            "helpfulness": null,
            "id": 150024623,
            "likes": {
                "disliked": null,
                "liked": null
            },
            "rating": 4.0,
            "stay_parameters": "Stayed December 2012, traveled on business",
            "text": "General Upkeep - Good. Rooms were in good shape and fairly new. The coffe machine in lobby was broken for two days. The free newspapers that are advertised were not in the lobby due to construction.",
            "title": "Comfortable place to stay for a quick trip",
            "user": "DannyDp"
        },
        {
            "date": "January 17, 2013",
            "detail_rating": {
                "business": null,
                "cleanliness": 4.0,
                "desk": null,
                "location": 4.0,
                "pool": null,
                "restaurant": null,
                "rooms": 4.0,
                "service": 4.0,
                "sleep": 4.0,
                "value": 4.0
            },
            "helpfulness": null,
            "id": 149914007,
            "likes": {
                "disliked": null,
                "liked": null
            },
            "rating": 4.0,
            "stay_parameters": "Stayed September 2012, traveled on business",
            "text": "Cleanliness - Great - no issues.",
            "title": "Got what it needs for business traveller",
            "user": "Candice213"
        },
        {
            "date": "January 16, 2013",
            "detail_rating": {
                "business": null,
                "cleanliness": 4.0,
                "desk": null,
                "location": 5.0,
                "pool": null,
                "restaurant": null,
                "rooms": 4.0,
                "service": 3.0,
                "sleep": 4.0,
                "value": 5.0
            },
            "helpfulness": null,
            "id": 149822727,
            "likes": {
                "disliked": null,
                "liked": null
            },
            "rating": 4.0,
            "stay_parameters": "Stayed December 2012, traveled with family",
            "text": "We arrive on the 22 of Dec.make my reservation for 3 people me and my wife the queen bed our daugther (22) got a pull out chair not so confortable, eventhought the hotel was almost empty, i ask for a larger room but did not get it.the hotel has a large area for costumers downstairs coffee and tea all the time!!! free wi-fi!!! and a very secure area been close to 911 memorial, very close to almost every line on subway!!! great prices!!!!",
            "title": "Great Hotel, So So Service.",
            "user": "juanSavannahGa"
        },
        {
            "date": "January 16, 2013",
            "detail_rating": {
                "business": null,
                "cleanliness": 4.0,
                "desk": null,
                "location": 5.0,
                "pool": null,
                "restaurant": null,
                "rooms": 4.0,
                "service": 5.0,
                "sleep": 5.0,
                "value": 4.0
            },
            "helpfulness": null,
            "id": 149810511,
            "likes": {
                "disliked": null,
                "liked": null
            },
            "rating": 4.0,
            "stay_parameters": "Stayed June 2012, traveled as a couple",
            "text": "I really enjoyed my stay at this hotel, yes the restaurant was not top notch, but you cannot blame the location. Right beside ground zero and close to many good places such as battery park, the holocaust museum and the tube.",
            "title": "In the heart of the financial city at a good price",
            "user": "AndersVasa"
        },
        {
            "date": "January 14, 2013",
            "detail_rating": {
                "business": null,
                "cleanliness": 4.0,
                "desk": null,
                "location": 4.0,
                "pool": null,
                "restaurant": null,
                "rooms": 4.0,
                "service": 4.0,
                "sleep": 5.0,
                "value": 5.0
            },
            "helpfulness": null,
            "id": 149641876,
            "likes": {
                "disliked": null,
                "liked": null
            },
            "rating": 5.0,
            "stay_parameters": "Stayed December 2012, traveled with family",
            "text": "+ Friendly staff",
            "title": "Great for a long stay",
            "user": "M Q"
        },
        {
            "date": "January 14, 2013",
            "detail_rating": {
                "business": null,
                "cleanliness": 3.0,
                "desk": null,
                "location": 5.0,
                "pool": null,
                "restaurant": null,
                "rooms": 3.0,
                "service": 3.0,
                "sleep": 4.0,
                "value": 5.0
            },
            "helpfulness": null,
            "id": 149634494,
            "likes": {
                "disliked": null,
                "liked": null
            },
            "rating": 3.0,
            "stay_parameters": "Stayed April 2012, traveled on business",
            "text": "+ Pretty good room, although try to get a room with windows towards ground zero.",
            "title": "Value for Money",
            "user": "Rajinder G"
        },
        {
            "date": "January 6, 2013",
            "detail_rating": {
                "business": null,
                "cleanliness": 4.0,
                "desk": null,
                "location": 2.0,
                "pool": null,
                "restaurant": null,
                "rooms": 4.0,
                "service": 2.0,
                "sleep": 4.0,
                "value": 3.0
            },
            "helpfulness": null,
            "id": 148974007,
            "likes": {
                "disliked": null,
                "liked": null
            },
            "rating": 2.0,
            "stay_parameters": "Stayed September 2012, traveled on business",
            "text": "+ Fantastic location",
            "title": "Suite not available. Neglected to give package then sent 2-day air sticking me with the FEDEX charges!",
            "user": "Coolride"
        },
        {
            "date": "November 16, 2012",
            "detail_rating": {
                "business": null,
                "cleanliness": 4.0,
                "desk": null,
                "location": 5.0,
                "pool": null,
                "restaurant": null,
                "rooms": 3.0,
                "service": 4.0,
                "sleep": 4.0,
                "value": 4.0
            },
            "helpfulness": null,
            "id": 145552497,
            "likes": {
                "disliked": null,
                "liked": null
            },
            "rating": 4.0,
            "stay_parameters": "Stayed July 2012, traveled on business",
            "text": "Comfortable and clean hotel in the hart of Manhattan. Its roof terrace gives you an amazing view on ground zero and Liberty Tower. Too bad the restaurant only offers a limited menu, otherwise it would be an absolute top dining experience.",
            "title": "Excellent value",
            "user": "Bart F"
        },
        {
            "date": "November 12, 2012",
            "detail_rating": {
                "business": null,
                "cleanliness": 4.0,
                "desk": null,
                "location": 4.0,
                "pool": null,
                "restaurant": null,
                "rooms": 4.0,
                "service": 4.0,
                "sleep": 4.0,
                "value": 4.0
            },
            "helpfulness": null,
            "id": 145214807,
            "likes": {
                "disliked": null,
                "liked": null
            },
            "rating": 4.0,
            "stay_parameters": "Stayed October 2012, traveled on business",
            "text": "I stayed at this hotel for a short business trip. The rooms were quiet and bed comfortable, the restaurant upstairs has great view of the ground zero. The rooms were clean and comfortable. The business center at the entrance is useful.They have free water on all floors which is cool. The only problem was there was some kind of damp smell coming from the bathroom.If you have business in the financial district area would recommend this hotel.",
            "title": "for business trip",
            "user": "tncya2010"
        },
        {
            "date": "November 6, 2012",
            "detail_rating": {
                "business": null,
                "cleanliness": 4.0,
                "desk": null,
                "location": 4.0,
                "pool": null,
                "restaurant": null,
                "rooms": 3.0,
                "service": 4.0,
                "sleep": 3.0,
                "value": 3.0
            },
            "helpfulness": 1,
            "id": 144755144,
            "likes": {
                "disliked": null,
                "liked": null
            },
            "rating": 3.0,
            "stay_parameters": "Stayed October 2012, traveled with friends",
            "text": "The hotel is situated right opposite the rebuilding of the world trade center so some noise and mess.",
            "title": "Nice hotel but small rooms for the money",
            "user": "MARKEITH69"
        },
        {
            "date": "November 6, 2012",
            "detail_rating": {
                "business": null,
                "cleanliness": 5.0,
                "desk": null,
                "location": 5.0,
                "pool": null,
                "restaurant": null,
                "rooms": 5.0,
                "service": 5.0,
                "sleep": 4.0,
                "value": 5.0
            },
            "helpfulness": null,
            "id": 144746881,
            "likes": {
                "disliked": null,
                "liked": null
            },
            "rating": 5.0,
            "stay_parameters": "Stayed October 2012, traveled as a couple",
            "text": "The standard rooms are very small for the money,we upgraded for $25 a night and was worth it got great view of the 9/11 memorial.The big downside for me was the fact the hotel will not call you a cab so you have to carry all your luggage around the block and wait ages for a cab,and this is why i wouldn't stay here again.",
            "title": "Great location, very affordable",
            "user": "Greg D"
        },
        {
            "date": "November 5, 2012",
            "detail_rating": {
                "business": null,
                "cleanliness": 5.0,
                "desk": null,
                "location": 5.0,
                "pool": null,
                "restaurant": null,
                "rooms": 3.0,
                "service": 4.0,
                "sleep": 5.0,
                "value": 5.0
            },
            "helpfulness": 1,
            "id": 144639808,
            "likes": {
                "disliked": null,
                "liked": null
            },
            "rating": 4.0,
            "stay_parameters": "Stayed September 2012, traveled on business",
            "text": "My wife and I stayed here the weekend of Oct. 26th. It was our 10 year anniversary and we were pleasently surprised. The thing that we liked the most was the feeling of safety all around the hotel, with so many police at every corner for the WTC memorial. It was also very clean and modern. We will be coming back next year and bringing the kids with us. I would highly recommend this Hotel to everyone.",
            "title": "Great location, Great view, Great value",
            "user": "MA F"
        }
    ],
    "slim_ranking": 0.266365688488,
    "stars": 4,
    "tripadvisor": {
        "VISITED": false,
        "country_name": null,
        "locality": null,
        "pic_link": null,
        "street_address": null
    },
    "user_rating": 4.0,
    "variance": {
        "average": 59,
        "excellent": 244,
        "poor": 25,
        "terrible": 12,
        "very good": 218
    }
}