{
    "aka": "Best Western Menzies Strathmore Hotel",
    "description": "Modern 4 star hotel situated in the town centre overlooking St. George's Square. Minutes from London Luton Airport, across the road from London Luton train station and 2 miles from the M1 motorway. Lots to do on the doorstep of the hotel within walking distance. New shopping mall 2010.",
    "detail_rating": {
        "cleanliness": null,
        "location": null,
        "rooms": null,
        "service": null,
        "sleep": null,
        "value": null
    },
    "location": {
        "city": null,
        "continent": "Europe",
        "country": "United Kingdom (UK)",
        "proposed_city": "London",
        "province": null,
        "region": null
    },
    "name": "Menzies London Luton Strathmore",
    "places": {
        "aka": [
            "Best"
        ],
        "hotel_description": [
            "George",
            "London",
            "Luton"
        ],
        "hotel_name": [
            "London",
            "Luton"
        ]
    },
    "review_count": 336,
    "review_count_current": 20,
    "reviews": [
        {
            "date": "November 21, 2010",
            "detail_rating": {
                "business": null,
                "cleanliness": 4.0,
                "desk": null,
                "location": 4.0,
                "pool": null,
                "restaurant": null,
                "rooms": 3.0,
                "service": 3.0,
                "sleep": 4.0,
                "value": 5.0
            },
            "helpfulness": 1,
            "id": 87794463,
            "likes": {
                "disliked": null,
                "liked": null
            },
            "rating": 4.0,
            "stay_parameters": "Stayed November 2010, traveled on business",
            "text": "I stayed here for one night as I needed to be nearly for a business conference the next day. Booked on line and was charged a v reasonable \u00a349, less than the on line prices for both the local Travelodge and Premier Inn.",
            "title": "Nice Hotel, Very Good Value, Parking Odd but Fine",
            "user": "rolo36"
        },
        {
            "date": "November 8, 2010",
            "detail_rating": {
                "business": null,
                "cleanliness": null,
                "desk": null,
                "location": null,
                "pool": null,
                "restaurant": null,
                "rooms": null,
                "service": null,
                "sleep": null,
                "value": null
            },
            "helpfulness": null,
            "id": 86382534,
            "likes": {
                "disliked": null,
                "liked": null
            },
            "rating": 2.0,
            "stay_parameters": null,
            "text": "As I would be arriving late and leaving early I was looking for a comfortable, clean room to sleep in and that was what I got. The room was quite nice - I would describe it as a very typical hotel room - quite plush in fact but lacking any real character, but that was ok. I was on one of the upper floors and it was nice and quiet. The staff were businesslike and helpful.",
            "title": "Not four star service",
            "user": "Ystrady"
        },
        {
            "date": "October 22, 2010",
            "detail_rating": {
                "business": null,
                "cleanliness": 2.0,
                "desk": null,
                "location": 4.0,
                "pool": null,
                "restaurant": null,
                "rooms": 1.0,
                "service": 2.0,
                "sleep": 2.0,
                "value": 2.0
            },
            "helpfulness": null,
            "id": 84473986,
            "likes": {
                "disliked": null,
                "liked": null
            },
            "rating": 2.0,
            "stay_parameters": "Stayed October 2010, traveled on business",
            "text": "The car parking was a bit odd as it involved leaving the car in an allocated part of a multi storey car park the other end of the shopping centre and then walking through the shopping centre to the hotel. As I arrived late (gone 12) this was strange as the shopping centre was completely empty apart from a security guard at one end who directed me to the hotel entrance. I was pleased that I had called the hotel earlier and had got directions (a post code for the sat nav) for the car park entrance which might otherwise had been difficult to find.",
            "title": "Never again",
            "user": "MalachiWilliams"
        },
        {
            "date": "September 28, 2010",
            "detail_rating": {
                "business": null,
                "cleanliness": 5.0,
                "desk": null,
                "location": 5.0,
                "pool": null,
                "restaurant": null,
                "rooms": 4.0,
                "service": 5.0,
                "sleep": 5.0,
                "value": 5.0
            },
            "helpfulness": null,
            "id": 81329746,
            "likes": {
                "disliked": null,
                "liked": null
            },
            "rating": 5.0,
            "stay_parameters": "Stayed September 2010, traveled as a couple",
            "text": "I can see that some people might find the walk from the car park to the hotel a little bit unnerving, as multi storey car parks are rather strange places at night, but it was only a question of walking to the lifts nearby which go straight into the shopping centre. There were about 15 other cars there and I did not feel my car was unsafe being left overnight. Also an advantage in the cold weather because the windscreen would not ice up.",
            "title": "lovely stay....will def stay again",
            "user": "lovetotravelMunster"
        },
        {
            "date": "September 18, 2010",
            "detail_rating": {
                "business": null,
                "cleanliness": 5.0,
                "desk": null,
                "location": 4.0,
                "pool": null,
                "restaurant": null,
                "rooms": 4.0,
                "service": 5.0,
                "sleep": 4.0,
                "value": 5.0
            },
            "helpfulness": null,
            "id": 80049120,
            "likes": {
                "disliked": null,
                "liked": null
            },
            "rating": 4.0,
            "stay_parameters": "Stayed September 2010",
            "text": "Overall I would recommend the hotel and was perfectly satisfied with my choice and thought it was very good value.",
            "title": "couldnt have been better",
            "user": "mac351"
        },
        {
            "date": "December 17, 2010",
            "detail_rating": {
                "business": null,
                "cleanliness": 5.0,
                "desk": null,
                "location": 5.0,
                "pool": null,
                "restaurant": null,
                "rooms": 5.0,
                "service": 5.0,
                "sleep": 5.0,
                "value": 5.0
            },
            "helpfulness": 1,
            "id": 90083908,
            "likes": {
                "disliked": null,
                "liked": null
            },
            "rating": 5.0,
            "stay_parameters": "Stayed December 2010, traveled as a couple",
            "text": "Second time we have had our staff annual fuction at the Menzies Luton, food fanstastic, great atmosphere,service brilliant .Many of our staffed stayed the night.,and enjoyed the great breakfast in the morning.",
            "title": "staff christmas party",
            "user": "sarlau01"
        },
        {
            "date": "December 16, 2010",
            "detail_rating": {
                "business": null,
                "cleanliness": 5.0,
                "desk": null,
                "location": 5.0,
                "pool": null,
                "restaurant": null,
                "rooms": 5.0,
                "service": 5.0,
                "sleep": 5.0,
                "value": 5.0
            },
            "helpfulness": null,
            "id": 89982803,
            "likes": {
                "disliked": null,
                "liked": null
            },
            "rating": 5.0,
            "stay_parameters": "Stayed December 2010",
            "text": "All the team great thankyou.",
            "title": "Ignore any negative reviews about this Hotel.... it's absolutely brilliant",
            "user": "SocialCommittee"
        },
        {
            "date": "December 11, 2010",
            "detail_rating": {
                "business": null,
                "cleanliness": 1.0,
                "desk": null,
                "location": 3.0,
                "pool": null,
                "restaurant": null,
                "rooms": 1.0,
                "service": 2.0,
                "sleep": 1.0,
                "value": 2.0
            },
            "helpfulness": null,
            "id": 89569233,
            "likes": {
                "disliked": null,
                "liked": null
            },
            "rating": 2.0,
            "stay_parameters": "Stayed December 2010, traveled on business",
            "text": "Ignore any negative reviews about this Hotel.",
            "title": "Uninspiring - annoyed me enough to write my first review!",
            "user": "loal_10"
        },
        {
            "date": "December 8, 2010",
            "detail_rating": {
                "business": null,
                "cleanliness": 2.0,
                "desk": null,
                "location": 5.0,
                "pool": null,
                "restaurant": null,
                "rooms": 1.0,
                "service": 1.0,
                "sleep": 1.0,
                "value": 1.0
            },
            "helpfulness": null,
            "id": 89373717,
            "likes": {
                "disliked": null,
                "liked": null
            },
            "rating": 2.0,
            "stay_parameters": "Stayed December 2010",
            "text": "I am part of the social committee for a large international organisation. We held our Christmas Party in the Best Western Strathmore Hotel in Luton this year. We needed a venue which was easy to get to, could cater for a large party (there were over 160 of us who attended) and had accommodation.",
            "title": "terrible experience",
            "user": "heather_haire"
        },
        {
            "date": "December 1, 2010",
            "detail_rating": {
                "business": null,
                "cleanliness": 2.0,
                "desk": null,
                "location": 4.0,
                "pool": null,
                "restaurant": null,
                "rooms": 1.0,
                "service": 1.0,
                "sleep": 1.0,
                "value": 1.0
            },
            "helpfulness": 1,
            "id": 88776734,
            "likes": {
                "disliked": null,
                "liked": null
            },
            "rating": 1.0,
            "stay_parameters": "Stayed November 2010, traveled solo",
            "text": "Location: This Hotel is in the centre of Luton and just a short drive from the M1. We had people travelling from Hemel and Milton Keynes without any difficulty. The car park is secure and manned 24 hours by a security guard who lets you up and down the lift. There is no need to go through the shopping mall since the lift takes you to just outside the Hotel.",
            "title": "Cold room, cheap shower, dirty shower curtain, cold reception and bar area, lack of staff, poor service",
            "user": "robmct77"
        },
        {
            "date": "September 5, 2010",
            "detail_rating": {
                "business": null,
                "cleanliness": 2.0,
                "desk": null,
                "location": 1.0,
                "pool": null,
                "restaurant": null,
                "rooms": 2.0,
                "service": 2.0,
                "sleep": 1.0,
                "value": 1.0
            },
            "helpfulness": null,
            "id": 78359975,
            "likes": {
                "disliked": null,
                "liked": null
            },
            "rating": 2.0,
            "stay_parameters": "Stayed September 2010, traveled as a couple",
            "text": "If you have to stay in or near Luton, avoid this hotel, it is souless, lacking any thing I could praise it for for this number of stars.I have been to better Travelodges.",
            "title": "Don't stay here",
            "user": "ukbase"
        },
        {
            "date": "August 17, 2010",
            "detail_rating": {
                "business": null,
                "cleanliness": 5.0,
                "desk": null,
                "location": 3.0,
                "pool": null,
                "restaurant": null,
                "rooms": 5.0,
                "service": 5.0,
                "sleep": 5.0,
                "value": 5.0
            },
            "helpfulness": null,
            "id": 75588104,
            "likes": {
                "disliked": null,
                "liked": null
            },
            "rating": 5.0,
            "stay_parameters": "Stayed August 2010, traveled with friends",
            "text": "It is in a shoppinhg centre which is being refurbished, I hope they do the same to the hotel",
            "title": "Excellent Service, Friendly Staff, Plenty of Excellent Food",
            "user": "jacintacolette"
        },
        {
            "date": "August 14, 2010",
            "detail_rating": {
                "business": null,
                "cleanliness": 5.0,
                "desk": null,
                "location": 5.0,
                "pool": null,
                "restaurant": null,
                "rooms": 5.0,
                "service": 5.0,
                "sleep": 5.0,
                "value": 5.0
            },
            "helpfulness": null,
            "id": 75203637,
            "likes": {
                "disliked": null,
                "liked": null
            },
            "rating": 5.0,
            "stay_parameters": "Stayed August 2010, traveled on business",
            "text": "Our king size room was tiny. The bathroom was really small with a very big basin that made it even smaller, my partner and I are thin, heavens knows how one manages if you are a big person.The toilet was grubby, I tried to clean it before we used it,but it needed proper cleaning stuff. There is no fan in the bathroom and no air con in the room. The window had to be open all night as it was the only way to stop me feeling claustrophobic. The noise from the street was incredible, so loud! We have never slept so badly in a hotel.",
            "title": "Unbelieveable value for money",
            "user": "alextrav"
        },
        {
            "date": "August 1, 2010",
            "detail_rating": {
                "business": null,
                "cleanliness": 4.0,
                "desk": null,
                "location": 4.0,
                "pool": null,
                "restaurant": null,
                "rooms": 2.0,
                "service": 3.0,
                "sleep": 2.0,
                "value": 3.0
            },
            "helpfulness": null,
            "id": 73282756,
            "likes": {
                "disliked": null,
                "liked": null
            },
            "rating": 3.0,
            "stay_parameters": "Stayed July 2010, traveled on business",
            "text": "Breakfast continues till 11am on a Sunday, but by 10.30am most hot food was past it, no one came to refill dishes and there were no eggs of any description in the 15 minutes we were in the room. I heard the table next to ours ask the waitress if the eggs she ordered were ever coming!",
            "title": "Central location but not the best",
            "user": "Hills86"
        },
        {
            "date": "July 13, 2010",
            "detail_rating": {
                "business": null,
                "cleanliness": 5.0,
                "desk": null,
                "location": 4.0,
                "pool": null,
                "restaurant": null,
                "rooms": 5.0,
                "service": 5.0,
                "sleep": 5.0,
                "value": 5.0
            },
            "helpfulness": null,
            "id": 70790311,
            "likes": {
                "disliked": null,
                "liked": null
            },
            "rating": 5.0,
            "stay_parameters": "Stayed July 2010",
            "text": "We did not have dinner there, despite the AA rosettes, we were put off by the water carafes, yuk, and the motorway services circa 1980's set up for the food.",
            "title": "The most friendly and helpful hotel staff I have ever come across!",
            "user": "F1Lu"
        },
        {
            "date": "February 21, 2011",
            "detail_rating": {
                "business": null,
                "cleanliness": 3.0,
                "desk": null,
                "location": 4.0,
                "pool": null,
                "restaurant": null,
                "rooms": 2.0,
                "service": 3.0,
                "sleep": null,
                "value": 3.0
            },
            "helpfulness": null,
            "id": 97427145,
            "likes": {
                "disliked": null,
                "liked": null
            },
            "rating": 3.0,
            "stay_parameters": "Stayed January 2011",
            "text": "Stayed for 4 nights with a large group on business. On checking in five rooms were double booked and part of my group were sent to an alternative hotel by taxi. They then had to return as they could not obtain any food at the other venue due to the late hour. After a quick bar meal they then had to get another taxi back to the hotel. They were promised an upgrade for the remainder of the trip but there was no recognisable difference. In fairness the manager provided some complimentary drinks for our group. I'm led to believe that the hotel makes a profit by providing rooms for stranded passengers and flight crew from the airport and ships out the unfortunate guests to other hotels. Not such a big deal if you had just made a reservation but a bit of a liberty when a party had paid for 15 rooms up front for 4 nights",
            "title": "Ok for a night",
            "user": "mince963"
        },
        {
            "date": "February 8, 2011",
            "detail_rating": {
                "business": null,
                "cleanliness": 4.0,
                "desk": null,
                "location": 4.0,
                "pool": null,
                "restaurant": null,
                "rooms": 4.0,
                "service": 4.0,
                "sleep": 4.0,
                "value": 4.0
            },
            "helpfulness": 2,
            "id": 95859124,
            "likes": {
                "disliked": null,
                "liked": null
            },
            "rating": 4.0,
            "stay_parameters": "Stayed February 2011, traveled with family",
            "text": "In short. Spar is good. Bar food good. Restaurant average. Breakfast ok. Rooms nothing special. Service hit and miss",
            "title": "Pleasant hotel, helpful staff, nice leisure facilities",
            "user": "greathostie"
        },
        {
            "date": "February 2, 2011",
            "detail_rating": {
                "business": null,
                "cleanliness": 5.0,
                "desk": null,
                "location": 5.0,
                "pool": null,
                "restaurant": null,
                "rooms": 3.0,
                "service": 3.0,
                "sleep": 5.0,
                "value": 4.0
            },
            "helpfulness": 1,
            "id": 95329104,
            "likes": {
                "disliked": null,
                "liked": null
            },
            "rating": 4.0,
            "stay_parameters": "Stayed January 2011, traveled on business",
            "text": "Not much better than a Travelodge to be honest, only the use of the pool makes it worthwhile",
            "title": "Good Location, Comfortable Stay - Menzies Strathmore",
            "user": "aditya80"
        },
        {
            "date": "February 1, 2011",
            "detail_rating": {
                "business": null,
                "cleanliness": 3.0,
                "desk": null,
                "location": 4.0,
                "pool": null,
                "restaurant": null,
                "rooms": 2.0,
                "service": 2.0,
                "sleep": 2.0,
                "value": 3.0
            },
            "helpfulness": null,
            "id": 95174867,
            "likes": {
                "disliked": null,
                "liked": null
            },
            "rating": 3.0,
            "stay_parameters": "Stayed January 2011, traveled as a couple",
            "text": "Not the worst place to stay but glad I wasn't picking up the bill",
            "title": "Reception is not goo!!!",
            "user": "marie6323"
        },
        {
            "date": "January 11, 2011",
            "detail_rating": {
                "business": null,
                "cleanliness": 4.0,
                "desk": null,
                "location": 4.0,
                "pool": null,
                "restaurant": null,
                "rooms": 4.0,
                "service": 5.0,
                "sleep": 5.0,
                "value": 5.0
            },
            "helpfulness": 1,
            "id": 92528575,
            "likes": {
                "disliked": null,
                "liked": null
            },
            "rating": 5.0,
            "stay_parameters": "Stayed December 2010, traveled with friends",
            "text": "Stayed at hotel while husband did cookery course nearby at Tea Green.",
            "title": "wonderful service",
            "user": "Lipmans"
        }
    ],
    "slim_ranking": 0.5,
    "stars": 4,
    "tripadvisor": {
        "VISITED": false,
        "country_name": null,
        "locality": null,
        "pic_link": null,
        "street_address": null
    },
    "user_rating": 3.5,
    "variance": {
        "average": 88,
        "excellent": 92,
        "poor": 40,
        "terrible": 20,
        "very good": 96
    }
}