{
    "aka": "Bellettini Hotel Florence",
    "description": "The Hotel Bellettini is located in the historical center of Florence near the most important museums and church. Near the reception there is a little bar for the guest. We are at your disposal to help you during your stay to do restaurants and museums reservations, tours, arrange train tickets.",
    "detail_rating": {
        "cleanliness": null,
        "location": null,
        "rooms": null,
        "service": null,
        "sleep": null,
        "value": null
    },
    "location": {
        "city": null,
        "continent": "Europe",
        "country": "Italy",
        "proposed_city": "Florence",
        "province": null,
        "region": "Tuscany"
    },
    "name": "Bellettini Hotel",
    "places": {
        "aka": [
            "Florence"
        ],
        "hotel_description": [
            "Florence"
        ],
        "hotel_name": []
    },
    "review_count": 203,
    "review_count_current": 4,
    "reviews": [
        {
            "date": "March 30, 2006",
            "detail_rating": {
                "business": null,
                "cleanliness": null,
                "desk": null,
                "location": null,
                "pool": null,
                "restaurant": null,
                "rooms": null,
                "service": null,
                "sleep": null,
                "value": null
            },
            "helpfulness": 9,
            "id": 4781891,
            "likes": {
                "disliked": null,
                "liked": null
            },
            "rating": 4.0,
            "stay_parameters": null,
            "text": "I was very pleased with the hotel during my stay there in January, 2006. It's a half block from the San Lorenzo street fair and only a few blocks from the Duomo, and a manageable walk from the train station (even with a very large bag). The staff was very friendly, the breakfast good, and I never had any problem using the free internet connection. There is a lift to the hotel lobby, but my room was on the 2nd floor, which is only accessible by stairs. If you overpack, as I do, this may not be ideal if you're only staying a day or two, but there weren't many stairs and it was well worth it for me since they gave me a very large double room in spite of my being a single. I will definitely make the Belletini my first choice for future trips to Firenze.",
            "title": "A Real Pleasure",
            "user": "CaravaggioFan"
        },
        {
            "date": "January 21, 2006",
            "detail_rating": {
                "business": null,
                "cleanliness": null,
                "desk": null,
                "location": null,
                "pool": null,
                "restaurant": null,
                "rooms": null,
                "service": null,
                "sleep": null,
                "value": null
            },
            "helpfulness": 11,
            "id": 4367047,
            "likes": {
                "disliked": null,
                "liked": null
            },
            "rating": 4.0,
            "stay_parameters": null,
            "text": "I chose this hotel after reading previous reviews and also because it had a great deal on room prices.still not sure what to expect as all views subjective. however it is in a great position for sightseeing,the single room was fine altho a little dark and would probably be noisy in summer with the shutters open.",
            "title": "What a good find.",
            "user": "ashlea"
        },
        {
            "date": "November 12, 2005",
            "detail_rating": {
                "business": null,
                "cleanliness": null,
                "desk": null,
                "location": null,
                "pool": null,
                "restaurant": null,
                "rooms": null,
                "service": null,
                "sleep": null,
                "value": null
            },
            "helpfulness": 18,
            "id": 4108255,
            "likes": {
                "disliked": null,
                "liked": null
            },
            "rating": 3.0,
            "stay_parameters": null,
            "text": "a very good breakfast and pleasant friendly staff.one word of warning -most rooms are up stairs at various levels-altho there is a lift from street level to reception.would certainly stay here again.",
            "title": "Big room, small bathroom",
            "user": "A TripAdvisor user"
        },
        {
            "date": "October 23, 2005",
            "detail_rating": {
                "business": null,
                "cleanliness": 3.0,
                "desk": null,
                "location": null,
                "pool": null,
                "restaurant": null,
                "rooms": 3.0,
                "service": 3.0,
                "sleep": null,
                "value": 3.0
            },
            "helpfulness": 7,
            "id": 4046458,
            "likes": {
                "disliked": null,
                "liked": null
            },
            "rating": 3.0,
            "stay_parameters": "Stayed October 2005",
            "text": "Our review of this hotel is hot and cold. We stayed in room 44. The bedroom was large and seemed to have nothing wrong with it. An added plus\u2026was our very nice deck/patio off our room. It didn\u2019t have a view\u2026but was nice to go outside and have lunch and some vino. It was a very quiet spot\u2026there was no noise from any of the other rooms or the city.",
            "title": "Good location and clean, but over-rated!",
            "user": "mar02"
        }
    ],
    "slim_ranking": 0.521739130435,
    "stars": 2,
    "tripadvisor": {
        "VISITED": false,
        "country_name": null,
        "locality": null,
        "pic_link": null,
        "street_address": null
    },
    "user_rating": 4.0,
    "variance": {
        "average": 25,
        "excellent": 74,
        "poor": 13,
        "terrible": 6,
        "very good": 85
    }
}