{
    "aka": null,
    "description": null,
    "detail_rating": {
        "cleanliness": null,
        "location": null,
        "rooms": null,
        "service": null,
        "sleep": null,
        "value": null
    },
    "location": {
        "city": null,
        "continent": null,
        "country": "Canada",
        "proposed_city": "Victoria",
        "province": null,
        "region": null
    },
    "name": "HI Victoria Hostel",
    "places": {
        "aka": [],
        "hotel_description": [],
        "hotel_name": [
            "Victoria"
        ]
    },
    "review_count": 55,
    "review_count_current": 8,
    "reviews": [
        {
            "date": "October 20, 2008",
            "detail_rating": {
                "business": 4.0,
                "cleanliness": 4.0,
                "desk": null,
                "front_desk": 5.0,
                "location": 5.0,
                "pool": null,
                "restaurant": null,
                "rooms": 3.0,
                "service": 4.0,
                "sleep": null,
                "value": 5.0
            },
            "helpfulness": null,
            "id": 21037683,
            "likes": {
                "disliked": null,
                "liked": null
            },
            "rating": 4.0,
            "stay_parameters": "Stayed June 2008, traveled solo",
            "text": "Stayed for 2 nights in June 08. The hostel is located centrally in downtown across from the harbour. There's a large kitchen and good common areas with lots of books and travel resources. I highly recommend this hostel for exploring Victoria.",
            "title": "Great hostel in a great location",
            "user": "lovebeachtravel"
        },
        {
            "date": "September 27, 2008",
            "detail_rating": {
                "business": 4.0,
                "cleanliness": 2.0,
                "desk": null,
                "front_desk": 4.0,
                "location": 5.0,
                "pool": null,
                "restaurant": null,
                "rooms": 1.0,
                "service": 3.0,
                "sleep": null,
                "value": 3.0
            },
            "helpfulness": null,
            "id": 20431512,
            "likes": {
                "disliked": "\u2014 Noisy, smelly hallways, uncomfortable beds, weird people staying in dorms",
                "liked": "\u2014 Location"
            },
            "rating": 2.0,
            "stay_parameters": "Stayed September 2008, traveled with friends",
            "text": "This hostel is in a great location, central to downtown and management were quite friendly however the hostel is quite old and run down. We slept in a dorm room which I dont advise as it was quite noisy. As it is close by niteclubs and eateries it is quite noisy out on streets until about 2am, especially on weekends. The showers offer no privacy with clear screens and no cubicles for changing.",
            "title": "Think again about HI Victoria",
            "user": "Aussie3216"
        },
        {
            "date": "August 4, 2008",
            "detail_rating": {
                "business": 2.0,
                "cleanliness": 3.0,
                "desk": null,
                "front_desk": 3.0,
                "location": 4.0,
                "pool": null,
                "restaurant": null,
                "rooms": 3.0,
                "service": 3.0,
                "sleep": null,
                "value": 3.0
            },
            "helpfulness": null,
            "id": 18623082,
            "likes": {
                "disliked": null,
                "liked": null
            },
            "rating": 3.0,
            "stay_parameters": "Stayed May 2008",
            "text": "Bunk beds were quite uncomfortable and we both woke up with sore backs.",
            "title": "Great Location!",
            "user": "svalbard_view"
        },
        {
            "date": "January 15, 2008",
            "detail_rating": {
                "business": null,
                "cleanliness": 4.0,
                "desk": null,
                "front_desk": 5.0,
                "location": 4.0,
                "pool": null,
                "restaurant": null,
                "rooms": 4.0,
                "service": 5.0,
                "sleep": null,
                "value": 4.0
            },
            "helpfulness": null,
            "id": 12665959,
            "likes": {
                "disliked": null,
                "liked": null
            },
            "rating": 4.0,
            "stay_parameters": "Stayed January 2008, traveled as a couple",
            "text": "This is a fantastic location for an HI backpackers hostel. Right in the centre of the old town, and a short walk from most of the attractions in central Victoria.",
            "title": "Wanted To Stay Longer!",
            "user": "Adventure2008"
        },
        {
            "date": "August 31, 2007",
            "detail_rating": {
                "business": null,
                "cleanliness": null,
                "desk": null,
                "location": null,
                "pool": null,
                "restaurant": null,
                "rooms": null,
                "service": null,
                "sleep": null,
                "value": null
            },
            "helpfulness": null,
            "id": 8591082,
            "likes": {
                "disliked": null,
                "liked": null
            },
            "rating": 5.0,
            "stay_parameters": null,
            "text": "The building is one of the older buildings in the area, and the style is that of an older HI hostel with (very) large dorm rooms. There is one co-ed room with three bunk beds for couples or families, so if you are looking to stay with your boy/girlfriend or partner then you should request this when you book.",
            "title": "I've stayed here several times and in different seasons.",
            "user": "blanton"
        },
        {
            "date": "July 5, 2007",
            "detail_rating": {
                "business": 2.0,
                "cleanliness": 1.0,
                "desk": null,
                "front_desk": 5.0,
                "location": 4.0,
                "pool": null,
                "restaurant": null,
                "rooms": 2.0,
                "service": 5.0,
                "sleep": null,
                "value": 2.0
            },
            "helpfulness": 1,
            "id": 8064982,
            "likes": {
                "disliked": "\u2014 Other than the staff, I have nothing good to say about this hostel.",
                "liked": "\u2014 Staff were really nice."
            },
            "rating": 2.0,
            "stay_parameters": "Stayed July 2007, traveled as a couple",
            "text": "My husband and I just stayed two nights at this hostel. We stayed in the semi-private room, which means that although you have a key to your door--the walls of the room we stayed in do not reach the ceiling! To be fair, we were warned of this when making the reservation and it actually wasn't much of a problem, except for turning the light on at night and waking up the bunks next to us. The room was really small which the staff were apologetic about, but I actually felt quite lucky when I saw the majority of the accomadations which were huge rooms with lots of bunk beds and no door at all.",
            "title": "Relatively sketchy place",
            "user": "ashlibrooks"
        },
        {
            "date": "May 13, 2007",
            "detail_rating": {
                "business": null,
                "cleanliness": 3.0,
                "desk": null,
                "front_desk": 1.0,
                "location": 3.0,
                "pool": null,
                "restaurant": null,
                "rooms": 3.0,
                "service": null,
                "sleep": null,
                "value": 1.0
            },
            "helpfulness": 2,
            "id": 7594364,
            "likes": {
                "disliked": "\u2014 Walking through multi-bed dorm to bathroom.",
                "liked": "\u2014 Low cost"
            },
            "rating": 1.0,
            "stay_parameters": "Stayed January 2006, traveled with family",
            "text": "The staff were fantastic and you could tell they spent a lot of time ensuring the safety and security of the guests. That said, having stayed in many European hostels, I was surprised that many of the guests were not youth at all. There were many mid-aged adults and some older adults. Some of the mid-aged adults seemed to be staying on an extended basis for the low cost accomadations, rather than being travelers like you usually find in hostels. Specifically, there was one guy who was there all three days we were there who spent the whole day by himself sleeping in a chair. This kind of thing and the general look and smell of the hostel made it feel more like a homeless shelter than a thriving hostel.",
            "title": "Sorry, can't recommend it.",
            "user": "nambourlady"
        },
        {
            "date": "June 4, 2006",
            "detail_rating": {
                "business": null,
                "cleanliness": null,
                "desk": null,
                "location": null,
                "pool": null,
                "restaurant": null,
                "rooms": null,
                "service": null,
                "sleep": null,
                "value": null
            },
            "helpfulness": 4,
            "id": 5297399,
            "likes": {
                "disliked": null,
                "liked": null
            },
            "rating": 2.0,
            "stay_parameters": null,
            "text": "Other small things that made the hostel seem sketchy...the TV in in the TV lounge doesn't have the ability to be turned down as both the down arrows for channels and volume are literally worn out; the showers don't have a changing area; the carpet is old and nasty; the furniture is gross; the disabled bathroom smelled like urine the whole time we were there (despite being cleaned regularily) and had a commode next to the toilet at all times even though I'm not sure this would be useful to people in wheelchairs necessarily since it too was on wheels. All of these things left us with the impression that the place was dirty and never made you feel at home. I didn't get the same sense of community that I've felt in other hostels since many guests were not travelers in the sense that you find in Europe.",
            "title": "sleepless in the HI",
            "user": "A TripAdvisor user"
        }
    ],
    "slim_ranking": 0.5,
    "stars": null,
    "tripadvisor": {
        "VISITED": false,
        "country_name": null,
        "locality": null,
        "pic_link": null,
        "street_address": null
    },
    "user_rating": 3.0,
    "variance": {
        "average": 20,
        "excellent": 4,
        "poor": 13,
        "terrible": 8,
        "very good": 10
    }
}