{
    "aka": "Premier Inn Hayes Heathrow Hotel",
    "description": null,
    "detail_rating": {
        "cleanliness": null,
        "location": null,
        "rooms": null,
        "service": null,
        "sleep": null,
        "value": null
    },
    "location": {
        "city": null,
        "continent": "Europe",
        "country": "United Kingdom (UK)",
        "proposed_city": "Hayes",
        "province": null,
        "region": null
    },
    "name": "Premier Inn Hayes Heathrow",
    "places": {
        "aka": [
            "Hayes"
        ],
        "hotel_description": [],
        "hotel_name": [
            "Hayes"
        ]
    },
    "review_count": 182,
    "review_count_current": 7,
    "reviews": [
        {
            "date": "August 14, 2005",
            "detail_rating": {
                "business": null,
                "cleanliness": 4.0,
                "desk": null,
                "location": null,
                "pool": null,
                "restaurant": null,
                "rooms": 3.0,
                "service": 3.0,
                "sleep": null,
                "value": 2.0
            },
            "helpfulness": 1,
            "id": 3761127,
            "likes": {
                "disliked": null,
                "liked": null
            },
            "rating": 2.0,
            "stay_parameters": "Stayed August 2005, traveled on business",
            "text": "Travel Inn at Hayes. The room itself was comfortable and the bathroom good in that it was clean and not too poky. It's typical of a Travel Inn in that it's consistent: you get the same sort of standards whichever one you go to and they're generally welcoming ones. The problem here was that they had fire doors on each room which made a VERY loud bang each time they were closed and people en masse did not seem to be very considerate. The place was fully booked (holidays), so there was a succession of banged doors for most of the night until midnight and then from round 5.30am onwards which meant that our sleep was quite broken. The children stomping around upstairs didn't help either. The restaurant adjoining it has a very kitch theme to it that's quite funny and the food's fine. Location-wise: a very dodgy area.",
            "title": "Not the Kind of Bang You Want.",
            "user": "LauraBoo1"
        },
        {
            "date": "June 29, 2005",
            "detail_rating": {
                "business": null,
                "cleanliness": 4.0,
                "desk": null,
                "location": null,
                "pool": null,
                "restaurant": null,
                "rooms": 4.0,
                "service": 4.0,
                "sleep": null,
                "value": 4.0
            },
            "helpfulness": 8,
            "id": 3621054,
            "likes": {
                "disliked": null,
                "liked": null
            },
            "rating": 4.0,
            "stay_parameters": "Stayed May 2005",
            "text": "I usually use the Ibis for a budget stay at Heathrow but now I'll switch to here. It's close to the airport and on the HotelHoppa bus route. It is very close to the runway but the sound-proofing is excellent and the rooms are quiet. The standard of furnishing is good for a cheap hotel. It's the sort of place you just sleep and shower and it had a comfortable bed and decent shower so no complaints",
            "title": "Quiet night",
            "user": "sjanes"
        },
        {
            "date": "March 17, 2008",
            "detail_rating": {
                "business": 3.0,
                "cleanliness": 5.0,
                "desk": null,
                "front_desk": 5.0,
                "location": 4.0,
                "pool": null,
                "restaurant": null,
                "rooms": 4.0,
                "service": 5.0,
                "sleep": null,
                "value": 5.0
            },
            "helpfulness": 1,
            "id": 14338666,
            "likes": {
                "disliked": "\u2014 People smoking by the entrance",
                "liked": "\u2014 Fresh breakfast buffet with good quality service"
            },
            "rating": 4.0,
            "stay_parameters": "Stayed March 2008, traveled with family",
            "text": "Find it hard to fault this hotel as a family place for an overnight stay in London. It is fair to say that Hounslow isn't pretty but hey most cities on the outskirts aren't. Not the place to stay in my opinion if you are looking to base a holiday in London there as it's greyness may get to you. Compared to the many London hotels I have stayed in over 20 years this has to be the best for cleanliness, service and price if you need a short stay.",
            "title": "Fantastic breakfast buffet",
            "user": "BaaCheshireUK"
        },
        {
            "date": "June 29, 2007",
            "detail_rating": {
                "business": 5.0,
                "cleanliness": 4.0,
                "desk": null,
                "front_desk": 4.0,
                "location": 3.0,
                "pool": null,
                "restaurant": null,
                "rooms": 4.0,
                "service": 4.0,
                "sleep": null,
                "value": 4.0
            },
            "helpfulness": 1,
            "id": 8025000,
            "likes": {
                "disliked": "\u2014 Grapes pub next door, busy area",
                "liked": "\u2014 Cheap, cheerful, clean, friendly staff"
            },
            "rating": 2.0,
            "stay_parameters": "Stayed May 2007, traveled on business",
            "text": "This hotel is not trying to be anything but what it is:",
            "title": "Not impressed",
            "user": "Gingersiren"
        },
        {
            "date": "November 19, 2006",
            "detail_rating": {
                "business": null,
                "cleanliness": 4.0,
                "desk": null,
                "front_desk": 5.0,
                "location": 3.0,
                "pool": null,
                "restaurant": null,
                "rooms": 4.0,
                "service": 4.0,
                "sleep": null,
                "value": 4.0
            },
            "helpfulness": 1,
            "id": 6153122,
            "likes": {
                "disliked": "\u2014 travelling into central London, too congested",
                "liked": "\u2014 Clean and comfortable and very friendly staff"
            },
            "rating": 4.0,
            "stay_parameters": "Stayed November 2006, traveled as a couple",
            "text": "an efficient and clean place to put down your head",
            "title": "Not bad for \u00a354=",
            "user": "Gazza2007"
        },
        {
            "date": "October 23, 2005",
            "detail_rating": {
                "business": null,
                "cleanliness": 4.0,
                "desk": null,
                "location": null,
                "pool": null,
                "restaurant": null,
                "rooms": 3.0,
                "service": 3.0,
                "sleep": null,
                "value": 4.0
            },
            "helpfulness": 3,
            "id": 4044878,
            "likes": {
                "disliked": null,
                "liked": null
            },
            "rating": 3.0,
            "stay_parameters": "Stayed October 2005, traveled on business",
            "text": "close to the airport",
            "title": "Far better than some",
            "user": "NomadQatar"
        },
        {
            "date": "August 17, 2005",
            "detail_rating": {
                "business": null,
                "cleanliness": null,
                "desk": null,
                "location": null,
                "pool": null,
                "restaurant": null,
                "rooms": null,
                "service": null,
                "sleep": null,
                "value": null
            },
            "helpfulness": 3,
            "id": 3781068,
            "likes": {
                "disliked": null,
                "liked": null
            },
            "rating": 4.0,
            "stay_parameters": null,
            "text": "half an hour from central London ( OK - on a good day ! )",
            "title": "Relaxing",
            "user": "A TripAdvisor user"
        }
    ],
    "slim_ranking": 0.3,
    "stars": null,
    "tripadvisor": {
        "VISITED": false,
        "country_name": null,
        "locality": null,
        "pic_link": null,
        "street_address": null
    },
    "user_rating": 4.0,
    "variance": {
        "average": 27,
        "excellent": 72,
        "poor": 8,
        "terrible": 10,
        "very good": 65
    }
}