{
    "aka": "4 Seasons Hotel Gresham Palace",
    "description": null,
    "detail_rating": {
        "cleanliness": 5.0,
        "location": 5.0,
        "rooms": 4.5,
        "service": 5.0,
        "sleep": 5.0,
        "value": 5.0
    },
    "location": {
        "city": "Budapest",
        "continent": "Europe",
        "country": "Hungary",
        "proposed_city": "Gresham",
        "province": null,
        "region": "Central Hungary"
    },
    "name": "Four Seasons Hotel Gresham Palace",
    "places": {
        "aka": [
            "Gresham"
        ],
        "hotel_description": [],
        "hotel_name": [
            "Gresham"
        ]
    },
    "review_count": 802,
    "review_count_current": 40,
    "reviews": [
        {
            "date": "January 12, 2012",
            "detail_rating": {
                "business": null,
                "cleanliness": 5.0,
                "desk": null,
                "location": 5.0,
                "pool": null,
                "restaurant": null,
                "rooms": 5.0,
                "service": 5.0,
                "sleep": 5.0,
                "value": 5.0
            },
            "helpfulness": null,
            "id": 122980287,
            "likes": {
                "disliked": null,
                "liked": null
            },
            "rating": 5.0,
            "stay_parameters": "Stayed January 2012, traveled as a couple",
            "text": "have just returned from a birthday stay at four seasons.have had the pleasure of staying in some wonderful places around the world and this hotel ranks at the top! from the moment we arrived to the moment we left everything was first class.a beautiful room with a fantastic view. amazing service from every member of staff....a very tasty complimentary birthday cake delivered to our room..we were made to feel very very special indeed.the creme de la creme was my experience with my treatments in the spa...unbelievable and i go to alot of spas! amazing massage and facial...out of this world. A HUGE THANK YOU to everybody who looked after us while we were there,just wished it could have been longer...go on treat yourselves to a magical stay at the four seasons.. from suzanne and hani.",
            "title": "AN ABSOLUTELY FABULOUS STAY...A WONDERFUL EXPERIENCE",
            "user": "suzanneFarnhamSurrey"
        },
        {
            "date": "January 11, 2012",
            "detail_rating": {
                "business": null,
                "cleanliness": 5.0,
                "desk": null,
                "location": 5.0,
                "pool": null,
                "restaurant": null,
                "rooms": 5.0,
                "service": 5.0,
                "sleep": 5.0,
                "value": 5.0
            },
            "helpfulness": null,
            "id": 122943402,
            "likes": {
                "disliked": null,
                "liked": null
            },
            "rating": 5.0,
            "stay_parameters": "Stayed December 2011, traveled with family",
            "text": "From the moment we were picked up at the airport we knew this was going to be a great experience & we weren't disappointed. the staff were excellent, very professional but still very caring. Our rooms were magnificent, very very comfortable. Nothing was too much trouble.",
            "title": "A wonderful hotel I would recommend this hotel very highly. Every aspect of the hotel excelled! We would definitely stay",
            "user": "Kathie G"
        },
        {
            "date": "January 5, 2012",
            "detail_rating": {
                "business": null,
                "cleanliness": 5.0,
                "desk": null,
                "location": 4.0,
                "pool": null,
                "restaurant": null,
                "rooms": 3.0,
                "service": 5.0,
                "sleep": 5.0,
                "value": 1.0
            },
            "helpfulness": 1,
            "id": 122618753,
            "likes": {
                "disliked": null,
                "liked": null
            },
            "rating": 4.0,
            "stay_parameters": "Stayed September 2011, traveled as a couple",
            "text": "Spent 3 nights at this hotel in a suite. It was a lovely room but not what I would have expected for the price. It was just a large room with a sitting area not a suite. The bathroom was another issue. I would expect that in a suite the bathroom would be large enough to separate the toilet with a door from the rest of the bathroom. We also felt that for the price we were paying Internet should have been included. It was an additional $35 per device per day for Internet usage. That was an additional $70 per day. Ridiculous! We ate at the restaurant one night and it was excellent. We also had a drink in the lobby bar while listening to the piano player and that was lovely, but very, very expensive! The location of the hotel is",
            "title": "Elegant Hotel",
            "user": "bridgette41"
        },
        {
            "date": "January 4, 2012",
            "detail_rating": {
                "business": null,
                "cleanliness": 5.0,
                "desk": null,
                "location": 5.0,
                "pool": null,
                "restaurant": null,
                "rooms": 5.0,
                "service": 5.0,
                "sleep": 5.0,
                "value": 5.0
            },
            "helpfulness": null,
            "id": 122510193,
            "likes": {
                "disliked": null,
                "liked": null
            },
            "rating": 5.0,
            "stay_parameters": "Stayed December 2011, traveled solo",
            "text": "very good and we could walk to many places. Budapest is a beautiful, friendly city. Wonderful food, beautiful views of the river and fun",
            "title": "Wonderful hotel",
            "user": "Clotilde C"
        },
        {
            "date": "January 3, 2012",
            "detail_rating": {
                "business": null,
                "cleanliness": 5.0,
                "desk": null,
                "location": 5.0,
                "pool": null,
                "restaurant": null,
                "rooms": 5.0,
                "service": 4.0,
                "sleep": 5.0,
                "value": 4.0
            },
            "helpfulness": 3,
            "id": 122479709,
            "likes": {
                "disliked": null,
                "liked": null
            },
            "rating": 4.0,
            "stay_parameters": "Stayed December 2011, traveled as a couple",
            "text": "markets make it a great place to visit. While this hotel is beautiful, has excellent service and is in a good location it was not worth what we paid. I've stayed in many other Four Seasons and felt that their value for dollar was much greater.",
            "title": "Best Location In Budapest",
            "user": "dkpot"
        },
        {
            "date": "February 19, 2012",
            "detail_rating": {
                "business": null,
                "cleanliness": 5.0,
                "desk": null,
                "location": 5.0,
                "pool": null,
                "restaurant": null,
                "rooms": 5.0,
                "service": 5.0,
                "sleep": 5.0,
                "value": 5.0
            },
            "helpfulness": 2,
            "id": 124824376,
            "likes": {
                "disliked": null,
                "liked": null
            },
            "rating": 5.0,
            "stay_parameters": "Stayed February 2012, traveled solo",
            "text": "I had last stayed at the Gresham Palace in 2009 and am pleased to say that the hotel is still as beautifully maintained and as faultlessly managed as it was three years ago. Even 5-star lux properties occasionally suffer neglect over time, so I was pleased to see the continued attention to detail that makes this Four Seasons an especially fine property.",
            "title": "A Return Visit: As Magical As Ever",
            "user": "TurtleCreekTraveller"
        },
        {
            "date": "February 17, 2012",
            "detail_rating": {
                "business": null,
                "cleanliness": 5.0,
                "desk": null,
                "location": 5.0,
                "pool": null,
                "restaurant": null,
                "rooms": 5.0,
                "service": 5.0,
                "sleep": 5.0,
                "value": 5.0
            },
            "helpfulness": 1,
            "id": 124733357,
            "likes": {
                "disliked": null,
                "liked": null
            },
            "rating": 5.0,
            "stay_parameters": "Stayed June 2011, traveled on business",
            "text": "I was indeed happy to visit again with the extremely gracious Richard Koos and to also build a new relationship with Shirley Catubao. I was traveling solo over my birthday, and they were especially kind to provide both a complimentary upgrade and a cake for the occasion. Their friendship certainly made me feel both welcomed and at home, and all my staff interactions were uniformly positive.",
            "title": "This Hotel is an Experience!",
            "user": "girlinmotion101"
        },
        {
            "date": "February 16, 2012",
            "detail_rating": {
                "business": null,
                "cleanliness": null,
                "desk": null,
                "location": null,
                "pool": null,
                "restaurant": null,
                "rooms": null,
                "service": null,
                "sleep": null,
                "value": null
            },
            "helpfulness": 1,
            "id": 124674910,
            "likes": {
                "disliked": null,
                "liked": null
            },
            "rating": 5.0,
            "stay_parameters": null,
            "text": "The winter season is an exceptional time to enjoy the hotel in my estimation, as the lighter occupancy and the typically discrete nature of the clientele lends a feel of leasing a private residence, and I appreciate the hushed and bespoke luxury on offer.",
            "title": "Top Notch",
            "user": "BrightonBecki"
        },
        {
            "date": "February 7, 2012",
            "detail_rating": {
                "business": null,
                "cleanliness": 5.0,
                "desk": null,
                "location": 5.0,
                "pool": null,
                "restaurant": null,
                "rooms": 5.0,
                "service": 5.0,
                "sleep": 5.0,
                "value": 5.0
            },
            "helpfulness": 2,
            "id": 124255441,
            "likes": {
                "disliked": null,
                "liked": null
            },
            "rating": 5.0,
            "stay_parameters": "Stayed April 2011, traveled solo",
            "text": "As others have indicated, the property is an architectural gem both in and out and it invites you to linger over a cocktail or simply amble around to appreciate the design, materials, and quality of the restoration, as I recall the state of the building before its current life as the Four Seasons.",
            "title": "The best in Budapest!",
            "user": "CCLGRS"
        },
        {
            "date": "February 5, 2012",
            "detail_rating": {
                "business": null,
                "cleanliness": 5.0,
                "desk": null,
                "location": 5.0,
                "pool": null,
                "restaurant": null,
                "rooms": 5.0,
                "service": 5.0,
                "sleep": 5.0,
                "value": 4.0
            },
            "helpfulness": 1,
            "id": 124154339,
            "likes": {
                "disliked": null,
                "liked": null
            },
            "rating": 5.0,
            "stay_parameters": "Stayed January 2012, traveled on business",
            "text": "I also give quite high marks to both the spa and the Gresham Kavehaz restaurant, and even if one were staying in another Pest luxury property, I would highly recommend enjoying the restaurant, as I find it leagues ahead of other hotel restaurants and very much in the same price point. Even better, I encourage you to make the Four Seasons your outpost, as it is perfectly located for both business and leisure guests, and it offers a luxury experience that soars above the other 5-star properties in the area.",
            "title": "Stunning property and great service",
            "user": "WeekendGuest"
        },
        {
            "date": "January 30, 2012",
            "detail_rating": {
                "business": null,
                "cleanliness": 5.0,
                "desk": null,
                "location": 5.0,
                "pool": null,
                "restaurant": null,
                "rooms": 5.0,
                "service": 5.0,
                "sleep": 5.0,
                "value": 5.0
            },
            "helpfulness": null,
            "id": 123846419,
            "likes": {
                "disliked": null,
                "liked": null
            },
            "rating": 5.0,
            "stay_parameters": "Stayed January 2012, traveled solo",
            "text": "On Saturday morning i called the hotel directly after booking on the internet, my plan was for them to pick me up and make the whole visit organized. When the train arrived at Budapest Keleti station the hotels driver was waiting on the platform, it was a quick drive to the hotel where i was met by the Reception staff on getting out of the car....The most well organized hotel arrival i have seen in years....The whole stay was faultless, hotel is spotlessly clean and all staff where very personable and professional. We had breakfast and lunch in the hotel restaurant, after having just spent the week in Italy i can say they have a real espresso machine in this restaurant and can make real coffee....Western European prices but the quality is here at this property...I would stay again without hesitation....",
            "title": "Outstanding & Impeccable Service",
            "user": "wadeonplanetearth"
        },
        {
            "date": "January 25, 2012",
            "detail_rating": {
                "business": null,
                "cleanliness": 5.0,
                "desk": null,
                "location": 5.0,
                "pool": null,
                "restaurant": null,
                "rooms": 5.0,
                "service": 5.0,
                "sleep": 5.0,
                "value": 5.0
            },
            "helpfulness": 1,
            "id": 123591247,
            "likes": {
                "disliked": null,
                "liked": null
            },
            "rating": 5.0,
            "stay_parameters": "Stayed January 2012, traveled as a couple",
            "text": "Fantastic hotel, location, staff. Everything you'd expect. 24 hr free business centre, lovely calm pool and spa area, nice gym with TVs on all the cardio machines.",
            "title": "Budapest in January",
            "user": "divster27"
        },
        {
            "date": "January 17, 2012",
            "detail_rating": {
                "business": null,
                "cleanliness": 5.0,
                "desk": null,
                "location": 5.0,
                "pool": null,
                "restaurant": null,
                "rooms": 5.0,
                "service": 5.0,
                "sleep": 5.0,
                "value": 5.0
            },
            "helpfulness": null,
            "id": 123236176,
            "likes": {
                "disliked": null,
                "liked": null
            },
            "rating": 5.0,
            "stay_parameters": "Stayed May 2011, traveled as a couple",
            "text": "Highly recommended",
            "title": "Perhaps one of the best and best run properties in Europe",
            "user": "Gareth S"
        },
        {
            "date": "January 17, 2012",
            "detail_rating": {
                "business": null,
                "cleanliness": 5.0,
                "desk": null,
                "location": 5.0,
                "pool": null,
                "restaurant": null,
                "rooms": 5.0,
                "service": 5.0,
                "sleep": 5.0,
                "value": 4.0
            },
            "helpfulness": 1,
            "id": 123227134,
            "likes": {
                "disliked": null,
                "liked": null
            },
            "rating": 5.0,
            "stay_parameters": "Stayed January 2012, traveled as a couple",
            "text": "Not only is this a spectacular landmark property located at the very heart of Budapest - at the end of the chain bridge - it is managed with such care, precision and concern you might think you are royalty while there. Our room was well priced (around $350) and wonderful. But the magic just starts there. Every time we left the front door to take a walk, a staff member or door attendant would say \"one moment Mr. Seltzer\" and hand us a bottle of water for our walk. How did they know our names at the door?",
            "title": "Memorable Experience!!",
            "user": "MrMontreal"
        },
        {
            "date": "January 13, 2012",
            "detail_rating": {
                "business": null,
                "cleanliness": 5.0,
                "desk": null,
                "location": 5.0,
                "pool": null,
                "restaurant": null,
                "rooms": 5.0,
                "service": 5.0,
                "sleep": 5.0,
                "value": 4.0
            },
            "helpfulness": null,
            "id": 123027164,
            "likes": {
                "disliked": null,
                "liked": null
            },
            "rating": 5.0,
            "stay_parameters": "Stayed December 2011, traveled as a couple",
            "text": "We wanted tickets to the Opera and asked the concierge. He not only arranged wonderful tickets, but also at the face price with a modest service charge somewhere around $20 if I recall. In any case, I left in the morning with the request and returned that afternoon with outstanding tickets.",
            "title": "Fantastic",
            "user": "Broc912"
        },
        {
            "date": "August 30, 2007",
            "detail_rating": {
                "business": null,
                "cleanliness": null,
                "desk": null,
                "location": null,
                "pool": null,
                "restaurant": null,
                "rooms": null,
                "service": null,
                "sleep": null,
                "value": null
            },
            "helpfulness": 2,
            "id": 8552734,
            "likes": {
                "disliked": null,
                "liked": null
            },
            "rating": 5.0,
            "stay_parameters": null,
            "text": "I echo the raves elsewhere on this page. This is one fantastic hotel -- competently staffed, stunningly decorated. Our bathroom was probably the best we've ever seen in a hotel.",
            "title": "Great Bathrooms, Great Everything",
            "user": "dwsact"
        },
        {
            "date": "August 28, 2007",
            "detail_rating": {
                "business": null,
                "cleanliness": 5.0,
                "desk": null,
                "front_desk": 5.0,
                "location": 5.0,
                "pool": null,
                "restaurant": null,
                "rooms": 5.0,
                "service": 5.0,
                "sleep": null,
                "value": 5.0
            },
            "helpfulness": 4,
            "id": 8522761,
            "likes": {
                "disliked": "\u2014 Absolutely nothing",
                "liked": "\u2014 Style, beauty and fabulous 4 Seasons service"
            },
            "rating": 5.0,
            "stay_parameters": "Stayed August 2007, traveled with family",
            "text": "We are 4 Seasons fans already (and have high expectations from this great hotel group), and we simply LOVED this hotel. It is the most beautiful building that I've ever stayed in (glorious Art Nouveau original tilework, wrought iron and art just abound) but it's the 4 Seasons Staff, you can't beat them! Firstly, even before we arrived, I had corresponded with the Concierge who were very well informed and efficient. We booked the private Mercedes to collect us at the airport, which is an excellent service.",
            "title": "A little gem",
            "user": "TM99"
        },
        {
            "date": "July 19, 2007",
            "detail_rating": {
                "business": 5.0,
                "cleanliness": 5.0,
                "desk": null,
                "front_desk": 5.0,
                "location": 5.0,
                "pool": null,
                "restaurant": null,
                "rooms": 5.0,
                "service": 5.0,
                "sleep": null,
                "value": 5.0
            },
            "helpfulness": 4,
            "id": 8193285,
            "likes": {
                "disliked": "\u2014 extra charge for the use of computer in business center",
                "liked": "\u2014 service and charm"
            },
            "rating": 5.0,
            "stay_parameters": "Stayed June 2007, traveled as a couple",
            "text": "Everyone we met in the hotel was charming, helpful and enthusiastic: a real pleaure to experience. For example, my husband went running each morning and, on his way back ,he was waiting to cross the road to get to the hotel. The doorman spotted him, nipped inside and proferred a cool bottle of water as my husband jogged in. Wonderful!",
            "title": "This hotel is worth every penny!!",
            "user": "CristinaTx"
        },
        {
            "date": "July 4, 2007",
            "detail_rating": {
                "business": 5.0,
                "cleanliness": 5.0,
                "desk": null,
                "front_desk": 5.0,
                "location": 5.0,
                "pool": null,
                "restaurant": null,
                "rooms": 5.0,
                "service": 5.0,
                "sleep": null,
                "value": 5.0
            },
            "helpfulness": 9,
            "id": 8056407,
            "likes": {
                "disliked": null,
                "liked": "\u2014 plush accomodations-- top notch service"
            },
            "rating": 5.0,
            "stay_parameters": "Stayed July 2007, traveled with family",
            "text": "We had a large Gresham Room (and had asked not to be on the 5th floor thanks to other TA reviewers); it was spacious, with lofty ceilings, and still plenty of room for my young son's rollaway.",
            "title": "Best Four Seasons Property Yet!",
            "user": "lbj2"
        },
        {
            "date": "July 2, 2007",
            "detail_rating": {
                "business": 4.0,
                "cleanliness": 5.0,
                "desk": null,
                "front_desk": 4.0,
                "location": 5.0,
                "pool": null,
                "restaurant": null,
                "rooms": 4.0,
                "service": 5.0,
                "sleep": null,
                "value": 3.0
            },
            "helpfulness": 10,
            "id": 8039506,
            "likes": {
                "disliked": "\u2014 Pricey Danube view rooms and pricey Pava Restaurant.",
                "liked": "\u2014 Ideal location and great staff who speaks perfect English"
            },
            "rating": 4.0,
            "stay_parameters": "Stayed July 2007, traveled as a couple",
            "text": "One evening, we ate at their main restaurant, Pava (modern Italian). We had the most sublime Goose liver starter (my husband said it would be worth flying back to Budapest just to eat this) and also a superb asparagus and truffle risotto (another signature dish). The waiting staff were pleasantly attentive and knowledgable and really helpful too, guiding us with Hungarian wine selections (I tried several, before selecting the one I preferred).",
            "title": "Unbeatable Location & Superb Staff!",
            "user": "JChua"
        },
        {
            "date": "January 15, 2008",
            "detail_rating": {
                "business": 5.0,
                "cleanliness": 5.0,
                "desk": null,
                "front_desk": 5.0,
                "location": 5.0,
                "pool": null,
                "restaurant": null,
                "rooms": 5.0,
                "service": 5.0,
                "sleep": null,
                "value": 5.0
            },
            "helpfulness": 8,
            "id": 12662320,
            "likes": {
                "disliked": null,
                "liked": null
            },
            "rating": 5.0,
            "stay_parameters": "Stayed June 2007, traveled as a couple",
            "text": "Much delayed review!",
            "title": "Glorious!",
            "user": "pursuit"
        },
        {
            "date": "December 19, 2007",
            "detail_rating": {
                "business": null,
                "cleanliness": null,
                "desk": null,
                "location": null,
                "pool": null,
                "restaurant": null,
                "rooms": null,
                "service": null,
                "sleep": null,
                "value": null
            },
            "helpfulness": 6,
            "id": 11698586,
            "likes": {
                "disliked": null,
                "liked": null
            },
            "rating": 5.0,
            "stay_parameters": null,
            "text": "Divided our stay between Prague and Budapest.",
            "title": "One of the most beautiful hotels anywhere!",
            "user": "SFO777"
        },
        {
            "date": "December 8, 2007",
            "detail_rating": {
                "business": null,
                "cleanliness": 5.0,
                "desk": null,
                "front_desk": 5.0,
                "location": 5.0,
                "pool": null,
                "restaurant": null,
                "rooms": 5.0,
                "service": 5.0,
                "sleep": null,
                "value": 5.0
            },
            "helpfulness": 4,
            "id": 11326343,
            "likes": {
                "disliked": "\u2014 Nothing",
                "liked": "\u2014 Liked everything"
            },
            "rating": 5.0,
            "stay_parameters": "Stayed September 2006, traveled as a couple",
            "text": "We love the Four Seasons and stay there whenever we can\u2014as far as the hotel is concerned, the Gresham is breathtaking---superb, well deserving of all of the fabulous reviews. Truly luxurious, from the grand lobby to each and every floor.",
            "title": "Fantastic Hotel",
            "user": "jmojpo"
        },
        {
            "date": "November 29, 2007",
            "detail_rating": {
                "business": null,
                "cleanliness": 5.0,
                "desk": null,
                "front_desk": 5.0,
                "location": 5.0,
                "pool": null,
                "restaurant": null,
                "rooms": 5.0,
                "service": 5.0,
                "sleep": null,
                "value": 5.0
            },
            "helpfulness": 5,
            "id": 11145070,
            "likes": {
                "disliked": "\u2014 The price....always sticker shock, but worth the money",
                "liked": "\u2014 The staff"
            },
            "rating": 5.0,
            "stay_parameters": "Stayed November 2007, traveled as a couple",
            "text": "Rooms are impeccable\u2014spotless, very comfortable. They use some fragrant powder when they clean, making the halls and rooms smell wonderful every day.",
            "title": "Great hotel. Succeeds in getting the details right.",
            "user": "Travel147"
        },
        {
            "date": "November 28, 2007",
            "detail_rating": {
                "business": 5.0,
                "cleanliness": 5.0,
                "desk": null,
                "front_desk": 5.0,
                "location": 5.0,
                "pool": null,
                "restaurant": null,
                "rooms": 5.0,
                "service": 5.0,
                "sleep": null,
                "value": 4.0
            },
            "helpfulness": 2,
            "id": 11124899,
            "likes": {
                "disliked": null,
                "liked": "\u2014 decor of hotel and rooms"
            },
            "rating": 5.0,
            "stay_parameters": "Stayed November 2007, traveled on business",
            "text": "Location cannot be beat\u2014directly facing the Chain Bridge and the Buda castle, walking distance to the Parliament and anywhere else. Walked nearly everywhere, down to the Vasarcsarnok, across the Danube to Buda castle and the Fisherman\u2019s Bastion (granted, not all in the same day!).",
            "title": "lovely hotel",
            "user": "LuxTraveller"
        },
        {
            "date": "January 1, 2012",
            "detail_rating": {
                "business": null,
                "cleanliness": 5.0,
                "desk": null,
                "location": 5.0,
                "pool": null,
                "restaurant": null,
                "rooms": null,
                "service": 5.0,
                "sleep": null,
                "value": 5.0
            },
            "helpfulness": null,
            "id": 122366939,
            "likes": {
                "disliked": null,
                "liked": null
            },
            "rating": 5.0,
            "stay_parameters": "Stayed December 2011, traveled as a couple",
            "text": "For the holidays, my wife and I thought we owed ourselves a little rest and relaxation, and what a better way than a day at the spa. And more specifically the spa at the Four Seasons. At we were not disappointed.",
            "title": "A Great Day of Spa Indulgence",
            "user": "Jeremy F"
        },
        {
            "date": "December 28, 2011",
            "detail_rating": {
                "business": null,
                "cleanliness": 5.0,
                "desk": null,
                "location": 5.0,
                "pool": null,
                "restaurant": null,
                "rooms": 5.0,
                "service": 5.0,
                "sleep": 5.0,
                "value": 5.0
            },
            "helpfulness": null,
            "id": 122183043,
            "likes": {
                "disliked": null,
                "liked": null
            },
            "rating": 5.0,
            "stay_parameters": "Stayed November 2011, traveled solo",
            "text": "While we are not spa experts, we do have them occasionally both here in Budapest and while traveling abroad. The facilities themselves are excellent. A well-stocked locker room that was roomy and comfortable. A short walk upstairs (or elevator ride) took us to the floor with the pool, co-ed sauna and jacuzzi and separate steam rooms. All nice and in the comfort expected from a Four Seasons property.",
            "title": "Awesome !!",
            "user": "Joce B"
        },
        {
            "date": "December 25, 2011",
            "detail_rating": {
                "business": null,
                "cleanliness": 5.0,
                "desk": null,
                "location": 5.0,
                "pool": null,
                "restaurant": null,
                "rooms": 5.0,
                "service": 5.0,
                "sleep": null,
                "value": 5.0
            },
            "helpfulness": 1,
            "id": 122084785,
            "likes": {
                "disliked": null,
                "liked": null
            },
            "rating": 5.0,
            "stay_parameters": "Stayed December 2011",
            "text": "And then the massage. In a word - outstanding. In detail - we selected the couples chocolate indulgence, more for the experience than anything. The massage was excellent and while I thought the chocolate was a bit overwhelming my better half loved it. The massage service was thorough with warm blanket wraps, warm shower (to rinse the chocolate off). All-in-all, the massage service and facilities were very good and highly recommended.",
            "title": "Christmas Day Brunch - fantastic!!",
            "user": "Gidgetshare"
        },
        {
            "date": "December 19, 2011",
            "detail_rating": {
                "business": null,
                "cleanliness": 5.0,
                "desk": null,
                "location": 5.0,
                "pool": null,
                "restaurant": null,
                "rooms": 5.0,
                "service": 5.0,
                "sleep": 5.0,
                "value": 5.0
            },
            "helpfulness": null,
            "id": 121890166,
            "likes": {
                "disliked": null,
                "liked": null
            },
            "rating": 5.0,
            "stay_parameters": "Stayed October 2011, traveled as a couple",
            "text": "And one final topic. The service. Top notch. Outstanding. Personable. We felt very welcome as the masseuses checked our comfort occasionally as did he front desk and pool area staff. The service was not overwhelming in anyway, just professional and welcoming.",
            "title": "Wow What a Place",
            "user": "Miamijim"
        },
        {
            "date": "December 19, 2011",
            "detail_rating": {
                "business": null,
                "cleanliness": 5.0,
                "desk": null,
                "location": 5.0,
                "pool": null,
                "restaurant": null,
                "rooms": 4.0,
                "service": 5.0,
                "sleep": 5.0,
                "value": 5.0
            },
            "helpfulness": null,
            "id": 121886267,
            "likes": {
                "disliked": null,
                "liked": null
            },
            "rating": 5.0,
            "stay_parameters": "Stayed November 2011, traveled with friends",
            "text": "Well done Four Seasons Gresham Palace Spa Team. We'll be back!",
            "title": "http://c1.tacdn.com/img2/sprites/ratings-v3.png",
            "user": "elm053"
        },
        {
            "date": "November 19, 2007",
            "detail_rating": {
                "business": null,
                "cleanliness": 5.0,
                "desk": null,
                "front_desk": 5.0,
                "location": 5.0,
                "pool": null,
                "restaurant": null,
                "rooms": 4.0,
                "service": 5.0,
                "sleep": null,
                "value": 5.0
            },
            "helpfulness": 5,
            "id": 10919305,
            "likes": {
                "disliked": "\u2014 that I had to leave.",
                "liked": "\u2014 the feeling of total luxury, being looked after impecably."
            },
            "rating": 5.0,
            "stay_parameters": "Stayed November 2007, traveled with family",
            "text": "We were a bit nervous that the 4 Seasons Staff would be a bit snooty when introduced to our lovely 9 month old daughter but we couldn't have been more wrong. We were asked her age when we checked in and a few moments later the receptionist formally introduced himself to her, welcomed her and gave her a gorgeous little wooden racing car. We were upgraded to a large room with an extra sleeping area with a cot for our daughter. The cot contained a basket of goodies and toiletries for babies! baby towels, baby lotion, nappy cream, bath oil, nappies and a little rubber duck for the bath..... not to mention the lovely l'occitane verbena adult toiletries in the bathroom. Room service was fab after our late night flight and we asked for a kettle (for bottles), a high chair and some spoons and bowls for baby food, all of which were delivered in minutes. The next day, at lunch, we asked for a banana for baby. It arrived, beautifully presented, mashed up in very cute baby crockery with spoon!",
            "title": "Budapest with Baby",
            "user": "Caitjim"
        },
        {
            "date": "November 6, 2007",
            "detail_rating": {
                "business": null,
                "cleanliness": null,
                "desk": null,
                "location": null,
                "pool": null,
                "restaurant": null,
                "rooms": null,
                "service": null,
                "sleep": null,
                "value": null
            },
            "helpfulness": 2,
            "id": 10650088,
            "likes": {
                "disliked": null,
                "liked": null
            },
            "rating": 4.0,
            "stay_parameters": null,
            "text": "The food was wonderful, the staff attentive and friendly without being OTT, the spa was stunning and the architecture and view unsurpassed in eastern europe. It was an amazing stay - we really didn't want to leave. We are going to New York for a week at christmas and had just booked our hotel. I'm going to try to cancel and go to the 4 Seasons NYC instead!!",
            "title": "Great Expereince at Gresham Palace",
            "user": "runalot"
        },
        {
            "date": "October 23, 2007",
            "detail_rating": {
                "business": 5.0,
                "cleanliness": 5.0,
                "desk": null,
                "front_desk": 5.0,
                "location": 5.0,
                "pool": null,
                "restaurant": null,
                "rooms": 5.0,
                "service": 5.0,
                "sleep": null,
                "value": 5.0
            },
            "helpfulness": 4,
            "id": 10253426,
            "likes": {
                "disliked": "\u2014 Service",
                "liked": "\u2014 Location, Amenities, Service"
            },
            "rating": 5.0,
            "stay_parameters": "Stayed January 2007, traveled on business",
            "text": "This is a wonderful hotel in a beautiful, historic building. Two great restaurants inside the hotel. Also a fantastic, scenic location right in front of the Chain Bridge. Would have rated it a 5, but room service quality was consistently mediocre, at best (e.g. didn't have things on the menu and replaced them in our order without asking us).",
            "title": "The Best Hotel I've Ever Stayed In",
            "user": "SLHerman"
        },
        {
            "date": "October 12, 2007",
            "detail_rating": {
                "business": 4.0,
                "cleanliness": 5.0,
                "desk": null,
                "front_desk": 5.0,
                "location": 5.0,
                "pool": null,
                "restaurant": null,
                "rooms": 5.0,
                "service": 5.0,
                "sleep": null,
                "value": 5.0
            },
            "helpfulness": 13,
            "id": 10071470,
            "likes": {
                "disliked": "\u2014 Nothing at all",
                "liked": "\u2014 The service and the beauty of the place"
            },
            "rating": 5.0,
            "stay_parameters": "Stayed September 2007, traveled on business",
            "text": "The Four Seasons Gresham Palace is truly a palace. From the grand foyer, to the luxurious rooms, to the personalized service, this hotel is by far the best hotel I've ever stayed at. I have stayed at the Gresham Palace three times over the past two years as I've traveled to Budapest on business a few times and I've never been disappointed. The rooms are beautiful and comfortable, the hallways grand and decorative, the spa offers incredible services and the restaurants in the hotel are both excellent. You also can't beat the location - directly across from the Chain Bridge with phenomal views of the Castle District and a short walk to many great restaurants. My now husband proposed along the Danube so Budapest will always have a very special place in my heart.",
            "title": "Faboulos 3-night stay",
            "user": "patrickbatemanParis"
        },
        {
            "date": "September 3, 2007",
            "detail_rating": {
                "business": 1.0,
                "cleanliness": 5.0,
                "desk": null,
                "front_desk": 4.0,
                "location": 5.0,
                "pool": null,
                "restaurant": null,
                "rooms": 4.0,
                "service": 3.0,
                "sleep": null,
                "value": 3.0
            },
            "helpfulness": 12,
            "id": 8614140,
            "likes": {
                "disliked": "\u2014 Service",
                "liked": "\u2014 Beautiful hotel, rooms, bathrooms, spa, common areas, great renovation,"
            },
            "rating": 4.0,
            "stay_parameters": "Stayed August 2007, traveled with family",
            "text": "I was scheduled to come to Budapest because of my Company' business is expanding in the city... I have found that property to be perfect for both business and leisure...",
            "title": "Beautiful Hotel, Service needs improvement",
            "user": "wwtravelerBoston_MA"
        },
        {
            "date": "March 17, 2008",
            "detail_rating": {
                "business": 4.0,
                "cleanliness": 5.0,
                "desk": null,
                "front_desk": 4.0,
                "location": 5.0,
                "pool": null,
                "restaurant": null,
                "rooms": 5.0,
                "service": 5.0,
                "sleep": null,
                "value": 5.0
            },
            "helpfulness": null,
            "id": 14349633,
            "likes": {
                "disliked": null,
                "liked": "\u2014 Location, Building itself, Attentive Service"
            },
            "rating": 5.0,
            "stay_parameters": "Stayed March 2006, traveled solo",
            "text": "I must tell you, both Budapest and the Fours Seasons in that city are hidden treasures!",
            "title": "Four Seasons Budapest - a hidden treasure!",
            "user": "budgee"
        },
        {
            "date": "March 11, 2008",
            "detail_rating": {
                "business": 5.0,
                "cleanliness": 5.0,
                "desk": null,
                "front_desk": 5.0,
                "location": 5.0,
                "pool": null,
                "restaurant": null,
                "rooms": 5.0,
                "service": 5.0,
                "sleep": null,
                "value": 5.0
            },
            "helpfulness": null,
            "id": 14205192,
            "likes": {
                "disliked": "\u2014 Nothing!!!",
                "liked": "\u2014 Where to start...EVERYTHING"
            },
            "rating": 5.0,
            "stay_parameters": "Stayed February 2008, traveled on business",
            "text": "If they call George V to be the number one hotel of the world, than they should check out this hotel, too!",
            "title": "Elegant and Extraordinary",
            "user": "weaverville"
        },
        {
            "date": "February 25, 2008",
            "detail_rating": {
                "business": 5.0,
                "cleanliness": 5.0,
                "desk": null,
                "front_desk": 5.0,
                "location": 5.0,
                "pool": null,
                "restaurant": null,
                "rooms": 5.0,
                "service": 5.0,
                "sleep": null,
                "value": 3.0
            },
            "helpfulness": 4,
            "id": 13841094,
            "likes": {
                "disliked": "\u2014 nothing",
                "liked": "\u2014 service ,architecture and position"
            },
            "rating": 5.0,
            "stay_parameters": "Stayed February 2008, traveled as a couple",
            "text": "The lobby is just amazing with a glass dome, a huge chrystal chandelier that looks like floating above the Front Desk, beautiful mosaic tiles under your feet, and unbelievable what ironwork, glasswork and tiles are throughout the whole building!",
            "title": "Fabulous stay at the Gresham",
            "user": "jimbo"
        },
        {
            "date": "February 16, 2008",
            "detail_rating": {
                "business": 5.0,
                "cleanliness": 5.0,
                "desk": null,
                "front_desk": 5.0,
                "location": 5.0,
                "pool": null,
                "restaurant": null,
                "rooms": 5.0,
                "service": 5.0,
                "sleep": null,
                "value": 5.0
            },
            "helpfulness": 2,
            "id": 13601018,
            "likes": {
                "disliked": "\u2014 Nothing at all",
                "liked": "\u2014 Absolutly everything"
            },
            "rating": 5.0,
            "stay_parameters": "Stayed January 2008, traveled as a couple",
            "text": "The basic rooms are quite small, just as in Prague, if you can afford, try the Gresham rooms, one of the largest, or even better, the corner suites, called here Park Suites. I stayed in 312, what an amazing room with spectacular views over the Danube river, Chain bridge, Castle district! Simply amazing!",
            "title": "Just Sublime",
            "user": "tryanythingonce"
        },
        {
            "date": "January 27, 2008",
            "detail_rating": {
                "business": 5.0,
                "cleanliness": 5.0,
                "desk": null,
                "front_desk": 5.0,
                "location": 5.0,
                "pool": null,
                "restaurant": null,
                "rooms": 5.0,
                "service": 5.0,
                "sleep": null,
                "value": 5.0
            },
            "helpfulness": 17,
            "id": 13039147,
            "likes": {
                "disliked": null,
                "liked": "\u2014 Quality in all things"
            },
            "rating": 5.0,
            "stay_parameters": "Stayed January 2008, traveled solo",
            "text": "Staff is very helpful, attentive, and discreet, not too pushy...",
            "title": "The Paris of Eastern Europe with a hotel to match",
            "user": "miroj"
        }
    ],
    "slim_ranking": 0.00299401197605,
    "stars": 5,
    "tripadvisor": {
        "VISITED": false,
        "country_name": null,
        "locality": null,
        "pic_link": null,
        "street_address": null
    },
    "user_rating": 5.0,
    "variance": {
        "average": 19,
        "excellent": 707,
        "poor": 4,
        "terrible": 1,
        "very good": 71
    }
}