{
    "aka": "Hotel La Jolla",
    "description": "Boutique hotel with upscale decor and high end bedding and amenities. All non-smoking rooms, glass balconies, small gym, heated pool, walking distance to beach and La Jolla Shores shops and restaurants.",
    "detail_rating": {
        "cleanliness": null,
        "location": null,
        "rooms": null,
        "service": null,
        "sleep": null,
        "value": null
    },
    "location": {
        "city": null,
        "continent": null,
        "country": "United States",
        "proposed_city": null,
        "province": null,
        "region": null
    },
    "name": "Hotel La Jolla, a Kimpton Hotel",
    "places": {
        "aka": [],
        "hotel_description": [],
        "hotel_name": []
    },
    "review_count": 408,
    "review_count_current": 20,
    "reviews": [
        {
            "date": "July 21, 2009",
            "detail_rating": {
                "business": null,
                "cleanliness": 2.0,
                "desk": null,
                "location": 4.0,
                "pool": null,
                "restaurant": null,
                "rooms": 4.0,
                "service": 2.0,
                "sleep": null,
                "value": 2.0
            },
            "helpfulness": null,
            "id": 35396862,
            "likes": {
                "disliked": null,
                "liked": null
            },
            "rating": 3.0,
            "stay_parameters": "Stayed July 2009, traveled with family",
            "text": "This hotel WILL BE great when fully renovated and they get their act together. This was the first time I've bid on a hotel room and didn't feel I got my money's worth.",
            "title": "Will be nice, eventually, but avoid until the renovation is done.",
            "user": "MontsterTX"
        },
        {
            "date": "June 16, 2009",
            "detail_rating": {
                "business": null,
                "cleanliness": null,
                "desk": null,
                "location": null,
                "pool": null,
                "restaurant": null,
                "rooms": null,
                "service": 1.0,
                "sleep": null,
                "value": null
            },
            "helpfulness": null,
            "id": 32484576,
            "likes": {
                "disliked": null,
                "liked": null
            },
            "rating": 1.0,
            "stay_parameters": "Stayed May 2009",
            "text": "The WiFi and gym (two of three amenities touted in their advertising) were both inoperable. With no business center or internet, we had no options for getting online to plan each day in an unfamiliar city.",
            "title": "They kicked our Wedding party out 2 weeks before!!",
            "user": "FlyingRuby"
        },
        {
            "date": "May 27, 2009",
            "detail_rating": {
                "business": null,
                "cleanliness": 2.0,
                "desk": null,
                "location": 3.0,
                "pool": null,
                "restaurant": null,
                "rooms": 1.0,
                "service": 1.0,
                "sleep": null,
                "value": 1.0
            },
            "helpfulness": null,
            "id": 30934624,
            "likes": {
                "disliked": null,
                "liked": null
            },
            "rating": 1.0,
            "stay_parameters": "Stayed May 2009, traveled as a couple",
            "text": "The thermostats were indecipherable. Aside from being in Celsius instead of Farenheit, they were some sort of fancy programmable thermostat with no instructions, save for some icons that might as well have been heiroglyphics. Someone from maintenance, who admitted he didn't fully understand how the thermostat worked, showed us how to at least move a few numbers up and down to adjust the air.",
            "title": "Poor Service - Overbooked hotel and sent us to the Sheraton with no warning",
            "user": "EnjoyTheDay8000"
        },
        {
            "date": "May 23, 2009",
            "detail_rating": {
                "business": null,
                "cleanliness": 1.0,
                "desk": null,
                "location": 4.0,
                "pool": null,
                "restaurant": null,
                "rooms": 1.0,
                "service": 1.0,
                "sleep": null,
                "value": 1.0
            },
            "helpfulness": null,
            "id": 30613722,
            "likes": {
                "disliked": null,
                "liked": null
            },
            "rating": 1.0,
            "stay_parameters": "Stayed May 2009, traveled as a couple",
            "text": "Our parking fee was waived since the internet wasn't working, but I don't see how they can charge $15 a day when I would guess more than half the rooms are still being renovated. The renovated rooms are nicely decorated with modern furnishings and fixtures. Still a few things left undone in the room -- masking tape behind the TV, exposed plumbing in the bathroom -- but overall very nice and comfortable. Elevators are trashed from construction traffic. No lobby or common areas to speak of, except for a tiny front desk. The restaurant on the top floor looks nice, but we didn't eat there (too exorbitant).",
            "title": "Don't Ever Stay Here!!",
            "user": "leefrog99"
        },
        {
            "date": "May 21, 2009",
            "detail_rating": {
                "business": null,
                "cleanliness": 3.0,
                "desk": null,
                "location": 4.0,
                "pool": null,
                "restaurant": null,
                "rooms": 2.0,
                "service": 1.0,
                "sleep": null,
                "value": 2.0
            },
            "helpfulness": null,
            "id": 30494066,
            "likes": {
                "disliked": null,
                "liked": null
            },
            "rating": 2.0,
            "stay_parameters": "Stayed February 2009, traveled on business",
            "text": "The rest of the stay was fairly pleasant, except for the lack of maid service on our first full day. It will eventually be a good place to stay, but until the renovations are complete, not nearly worthy of its rate or star rating.",
            "title": "Unbelievably Poor Customer Service- Limited sleep per heavy construction, pounding, and power tools",
            "user": "travelcafe"
        },
        {
            "date": "February 27, 2009",
            "detail_rating": {
                "business": null,
                "cleanliness": 3.0,
                "desk": null,
                "location": 4.0,
                "pool": null,
                "restaurant": null,
                "rooms": 3.0,
                "service": 3.0,
                "sleep": null,
                "value": 4.0
            },
            "helpfulness": null,
            "id": 25268268,
            "likes": {
                "disliked": null,
                "liked": null
            },
            "rating": 4.0,
            "stay_parameters": "Stayed September 2007, traveled with friends",
            "text": "Good location, about 10 min walk to the nearest beach. About 15 minute walk to the La Jolla village center. Rooms were clean and comfortable but not fancy. Staff was friendly.",
            "title": "A great value in beautiful La Jolla",
            "user": "jodamo"
        },
        {
            "date": "February 25, 2009",
            "detail_rating": {
                "business": null,
                "cleanliness": 4.0,
                "desk": null,
                "location": 5.0,
                "pool": null,
                "restaurant": null,
                "rooms": 4.0,
                "service": 5.0,
                "sleep": null,
                "value": 4.0
            },
            "helpfulness": null,
            "id": 25168149,
            "likes": {
                "disliked": null,
                "liked": null
            },
            "rating": 4.0,
            "stay_parameters": "Stayed February 2009, traveled with family",
            "text": "Great ocean views on the higher floors. If you dont want to pay the extra for a high-floor room, you can still visit the restaurant on the top floor. Go up at sunset for a glass of wine and appetizers!",
            "title": "Great Vacation Location",
            "user": "love2garden"
        },
        {
            "date": "December 8, 2008",
            "detail_rating": {
                "business": 2.0,
                "cleanliness": 2.0,
                "desk": null,
                "front_desk": 2.0,
                "location": 3.0,
                "pool": null,
                "restaurant": null,
                "rooms": 1.0,
                "service": 2.0,
                "sleep": null,
                "value": 2.0
            },
            "helpfulness": null,
            "id": 22565416,
            "likes": {
                "disliked": "\u2014 Decor, renovation chaos, inexperienced staff.",
                "liked": "\u2014 Pool and hot tub were small but nice. Location is great."
            },
            "rating": 2.0,
            "stay_parameters": "Stayed December 2008, traveled on business",
            "text": "Our stay at Hotel La Jolla was great. We had a ground floor room. We did not hear the construction noises that other reviewers complained about. If we were outside they were pretty loud, but our room was below the noise. The room was cleaned each day and our requests for extra pillows and blankets were fulfilled ASAP. The maid even started leaving extra towels after the first day after seeing there were three of us in the room.",
            "title": "Go in with low expectations...",
            "user": "millertimegen"
        },
        {
            "date": "November 4, 2008",
            "detail_rating": {
                "business": null,
                "cleanliness": 4.0,
                "desk": null,
                "front_desk": 3.0,
                "location": 3.0,
                "pool": null,
                "restaurant": null,
                "rooms": 4.0,
                "service": 4.0,
                "sleep": null,
                "value": 4.0
            },
            "helpfulness": null,
            "id": 21521209,
            "likes": {
                "disliked": "\u2014 street noise",
                "liked": "\u2014 close to the beach, value, pool"
            },
            "rating": 4.0,
            "stay_parameters": "Stayed October 2008, traveled with family",
            "text": "The front desk staff was helpful and if they didn't know the answer they found one for me. The recommendations they made for dinner was on spot and they were quite helpful with directions. Just don't ask for a pencil to do homework with a 1st grader. They don't have any.",
            "title": "Good people, good value",
            "user": "omahamomma"
        },
        {
            "date": "September 29, 2008",
            "detail_rating": {
                "business": null,
                "cleanliness": null,
                "desk": null,
                "location": null,
                "pool": null,
                "restaurant": null,
                "rooms": null,
                "service": null,
                "sleep": null,
                "value": null
            },
            "helpfulness": null,
            "id": 20487929,
            "likes": {
                "disliked": null,
                "liked": null
            },
            "rating": 2.0,
            "stay_parameters": null,
            "text": "The pool was small, but enjoyable. Considering we're from the Northeast and we were swimming outside in February we were quite impressed.",
            "title": "Unimpressed",
            "user": "kitLosAngeles"
        },
        {
            "date": "August 27, 2008",
            "detail_rating": {
                "business": 5.0,
                "cleanliness": 5.0,
                "desk": null,
                "front_desk": 5.0,
                "location": 5.0,
                "pool": null,
                "restaurant": null,
                "rooms": 5.0,
                "service": 5.0,
                "sleep": null,
                "value": 5.0
            },
            "helpfulness": null,
            "id": 19438872,
            "likes": {
                "disliked": null,
                "liked": "\u2014 The friendly employees and location"
            },
            "rating": 5.0,
            "stay_parameters": "Stayed August 2008, traveled with friends",
            "text": "My best friend and I drove up to La Jolla for one last mini vacation before school started. We loved Hotel La Jolla because of it's location. The lady that checked us in was so friendly and helpful throughout our stay. We had a room with a great view and the hotel was not too far from the beach. There was pleanty to do within a short distance of the hotel. We loved being able to work out and also sun bathe at pool site. Our room was kept exceptionally clean every day. Everyone we encountered at the hotel was very pleasant which made us feel welcome!",
            "title": "Wonderful Stay At Hotel La Jolla",
            "user": "Brandi4996"
        },
        {
            "date": "August 12, 2008",
            "detail_rating": {
                "business": 5.0,
                "cleanliness": 5.0,
                "desk": null,
                "front_desk": 5.0,
                "location": 5.0,
                "pool": null,
                "restaurant": null,
                "rooms": 5.0,
                "service": 5.0,
                "sleep": null,
                "value": 5.0
            },
            "helpfulness": null,
            "id": 18885333,
            "likes": {
                "disliked": null,
                "liked": "\u2014 The friendly staff and great restaurant"
            },
            "rating": 5.0,
            "stay_parameters": "Stayed July 2008, traveled on business",
            "text": "Our stay at Hotel La Jolla was amazing. I was hesitant to stay at an older hotel but, I was pleasantly surprised at how the staff was so accomodating. I was at the hotel while my husband had meetings to attend. I mentioned to the front desk clerk that I would like to rent a car so that I could go to the movie theatre. The hotel manager over heard my conversation and to my surprise he quickly made arrangements for the shuttle driver to drive me to the movie theatre! I felt like I was really appreciated and it also made me feel like someone was looking after me. The hotel's location is great in the evenings we were able to have a delicious dinner while enjoing a breath taking view. They have a small fitness center with some great equipment. The pool area is great place to bask in the sun. We will definitely return to this hotel because of the attention we received from the staff.",
            "title": "Sun & Fun At Hotel La Jolla",
            "user": "JAFDallas"
        },
        {
            "date": "August 4, 2008",
            "detail_rating": {
                "business": null,
                "cleanliness": 5.0,
                "desk": null,
                "front_desk": 5.0,
                "location": 4.0,
                "pool": null,
                "restaurant": null,
                "rooms": 4.0,
                "service": 4.0,
                "sleep": null,
                "value": 4.0
            },
            "helpfulness": null,
            "id": 18613070,
            "likes": {
                "disliked": "\u2014 Walking distance to the beach....and the beach that was there waiting",
                "liked": "\u2014 The View"
            },
            "rating": 5.0,
            "stay_parameters": "Stayed August 2008, traveled as a couple",
            "text": "We stayed for two nights Aug 1-3 and had booked thru the hotel website. We paid for an ocean view room and boy did we get it! We checked in early (1:00) and asked specifically for a room on floors 7-9....we got one on the 8th floor and the view was spectacular. What we liked about it over maybe one of the hotels directly on the beach (like The Shores at La Jolla) was that it gives a panoamic view of La Jolla, including the ocean. One of the most beautiful things about La Jolla is the actual town and hills so we felt like we got the best of both worlds. The room was extremely clean, large, comfortable and lovely. Not contemporary, but lovely. They are actually going to undergo a renovation to contemporary in the fall. The staff was friendly and helpful. Loved the free shuttle service. We did not hear the outside traffic from our room, unless we were outside on the balcony.",
            "title": "A Real Gem",
            "user": "werealreadythere"
        },
        {
            "date": "August 1, 2008",
            "detail_rating": {
                "business": 5.0,
                "cleanliness": 5.0,
                "desk": null,
                "front_desk": 5.0,
                "location": 5.0,
                "pool": null,
                "restaurant": null,
                "rooms": 5.0,
                "service": 5.0,
                "sleep": null,
                "value": 5.0
            },
            "helpfulness": null,
            "id": 18497763,
            "likes": {
                "disliked": "\u2014 Nothing",
                "liked": "\u2014 The comfort of the bed and size of hotel"
            },
            "rating": 5.0,
            "stay_parameters": "Stayed July 2008, traveled with family",
            "text": "We are beach people - primarily Mexican carribean (Riviera Maya, Cozumel, etc) so have pretty high beach standards. If you are looking for a pristine white beach don't go to The Shores beach, which is walking distance from the hotel (also where The Shores La Jolla hotel is). It was a very crowded, hard-packed sand beach. Apparently the tide pretty much comes all the way up at night so its really just not that pretty or comfortable. Though there are some nice little outdoor restaurants/cafes down there. Instead of trying one of the other La Jolla beaches (which the shuttle would take you to), we actually went over to Coronado for our second day. A great choice. I heard WindAndSea beach was better. We just decided we wanted to see the world-famous Coronado and also one of the local shop owners suggested we would like it better.",
            "title": "Relaxing at Hotel La Jolla",
            "user": "CASunnyLosAngeles"
        },
        {
            "date": "July 18, 2008",
            "detail_rating": {
                "business": 5.0,
                "cleanliness": 5.0,
                "desk": null,
                "front_desk": 5.0,
                "location": 5.0,
                "pool": null,
                "restaurant": null,
                "rooms": 5.0,
                "service": 5.0,
                "sleep": null,
                "value": 5.0
            },
            "helpfulness": null,
            "id": 18005550,
            "likes": {
                "disliked": "\u2014 nothing.",
                "liked": "\u2014 It's very clean!"
            },
            "rating": 5.0,
            "stay_parameters": "Stayed July 2008, traveled as a couple",
            "text": "Note - the hotel has free beach chairs to use.....get one as you will want one. They also offer free towels - they are small so get about 3 per person.",
            "title": "Awesome Experience",
            "user": "rtrr"
        },
        {
            "date": "September 23, 2009",
            "detail_rating": {
                "business": null,
                "cleanliness": 2.0,
                "desk": null,
                "location": 1.0,
                "pool": null,
                "restaurant": null,
                "rooms": 2.0,
                "service": 1.0,
                "sleep": null,
                "value": 1.0
            },
            "helpfulness": null,
            "id": 43962240,
            "likes": {
                "disliked": null,
                "liked": null
            },
            "rating": 1.0,
            "stay_parameters": "Stayed September 2009, traveled solo",
            "text": "I cut short my planned four day stay at the Hotel La Jolla at the Shores. My room was in the renovated half of the hotel. The other half was in the full swing of construction with furniture and building materials stacked in the halls. Only one (slow) elevator was available to guests; the other dedicated to the workers.",
            "title": "Wait Until the Renovation is Finished",
            "user": "Mel_Paris"
        },
        {
            "date": "September 9, 2009",
            "detail_rating": {
                "business": null,
                "cleanliness": 2.0,
                "desk": null,
                "location": 4.0,
                "pool": null,
                "restaurant": null,
                "rooms": 1.0,
                "service": 2.0,
                "sleep": null,
                "value": 2.0
            },
            "helpfulness": 1,
            "id": 40481611,
            "likes": {
                "disliked": null,
                "liked": null
            },
            "rating": 2.0,
            "stay_parameters": "Stayed June 2009, traveled as a couple",
            "text": "My room was fully renovated with a great view of the ocean. It still smelled strongly from paint and chemicals. At least everything worked and the bed was comfortable. The Internet connection was very slow.",
            "title": "Maybe after the remodel",
            "user": "jcw1212"
        },
        {
            "date": "September 3, 2009",
            "detail_rating": {
                "business": null,
                "cleanliness": 5.0,
                "desk": null,
                "location": 4.0,
                "pool": null,
                "restaurant": null,
                "rooms": 5.0,
                "service": 5.0,
                "sleep": null,
                "value": 4.0
            },
            "helpfulness": null,
            "id": 39717039,
            "likes": {
                "disliked": null,
                "liked": null
            },
            "rating": 5.0,
            "stay_parameters": "Stayed July 2009, traveled on business",
            "text": "I was not impressed with the piles of debris around the building nor the RV's parked in the parking lot. Neither was I impressed with the receptionist who did know the way to anything.",
            "title": "My clients and I were extremely satisfied with our stay at the Hotel La Jolla",
            "user": "banker1234"
        },
        {
            "date": "September 3, 2009",
            "detail_rating": {
                "business": null,
                "cleanliness": 5.0,
                "desk": null,
                "location": 5.0,
                "pool": null,
                "restaurant": null,
                "rooms": 5.0,
                "service": 5.0,
                "sleep": null,
                "value": 5.0
            },
            "helpfulness": null,
            "id": 39716489,
            "likes": {
                "disliked": null,
                "liked": null
            },
            "rating": 5.0,
            "stay_parameters": "Stayed August 2009, traveled on business",
            "text": "While the views are commanding, the hotel is located next to a large, noisy service station and, more importantly, overlooks a very noisy four lane highway.",
            "title": "Very enjoyable stary at Hotel La Jolla at the Shores",
            "user": "lenn5"
        },
        {
            "date": "August 22, 2009",
            "detail_rating": {
                "business": null,
                "cleanliness": null,
                "desk": null,
                "location": null,
                "pool": null,
                "restaurant": null,
                "rooms": null,
                "service": null,
                "sleep": null,
                "value": null
            },
            "helpfulness": null,
            "id": 38484741,
            "likes": {
                "disliked": null,
                "liked": null
            },
            "rating": 1.0,
            "stay_parameters": null,
            "text": "The hotel is located next to a number of run down apartments and is far from anything except the freeway.",
            "title": "HORRIBLE!!!! THINGS STOLEN OUT OF ROOM! HORRIBLE CUSTOMER SERVICE!",
            "user": "AndreaMartin"
        }
    ],
    "slim_ranking": 0.434782608696,
    "stars": 4,
    "tripadvisor": {
        "VISITED": false,
        "country_name": null,
        "locality": null,
        "pic_link": null,
        "street_address": null
    },
    "user_rating": 4.0,
    "variance": {
        "average": 55,
        "excellent": 165,
        "poor": 33,
        "terrible": 27,
        "very good": 128
    }
}