{
    "aka": "Echo Motel & Oceanfront Cottages Hotel Old Orchard Beach",
    "description": "The Echo Motel & Cottages are centrally located and within walking distance to the pier. The Oceanfront Cottages are large with wraparound decks that offer incredible views of the beach and bay. Other cottages within feet of the ocean are also available. Clean and comfortable motel units with or without kitchenettes are located 50 feet from the ocean with no streets to cross. All accommodations are reasonably priced.",
    "detail_rating": {
        "cleanliness": null,
        "location": null,
        "rooms": null,
        "service": null,
        "sleep": null,
        "value": null
    },
    "location": {
        "city": "Old Orchard Beach",
        "continent": null,
        "country": "United States",
        "proposed_city": null,
        "province": null,
        "region": null
    },
    "name": "Echo Motel & Oceanfront Cottages",
    "places": {
        "aka": [],
        "hotel_description": [],
        "hotel_name": []
    },
    "review_count": 127,
    "review_count_current": 5,
    "reviews": [
        {
            "date": "September 26, 2013",
            "detail_rating": {
                "business": null,
                "cleanliness": 5.0,
                "desk": null,
                "location": 5.0,
                "pool": null,
                "restaurant": null,
                "rooms": 5.0,
                "service": 5.0,
                "sleep": 5.0,
                "value": 5.0
            },
            "helpfulness": 4,
            "id": 178708787,
            "likes": {
                "disliked": null,
                "liked": null
            },
            "rating": 5.0,
            "stay_parameters": "Stayed September 2013, traveled with family",
            "text": "This place is wonderful. We were in town for a quick weekend away. It was supposed to be a kid free weekend, but unfortunately our plans changed last minute. Leslie and Paul were very accommodating, moving us to a bigger room and even dealt with our late arrival with a friendly smile.",
            "title": "Diamond in the Rough",
            "user": "goRedSox1"
        },
        {
            "date": "September 22, 2013",
            "detail_rating": {
                "business": null,
                "cleanliness": 5.0,
                "desk": null,
                "location": 5.0,
                "pool": null,
                "restaurant": null,
                "rooms": 5.0,
                "service": 5.0,
                "sleep": 5.0,
                "value": 5.0
            },
            "helpfulness": 3,
            "id": 178215745,
            "likes": {
                "disliked": null,
                "liked": null
            },
            "rating": 5.0,
            "stay_parameters": "Stayed September 2013, traveled with family",
            "text": "We stayed in room #9. We found it very clean and suited our needs just fine. The pool is great and even though we didn't take full advantage of it, being so close to the beach is a huge plus. You can tell that they take pride in the place. It is updated with nice trex decking and weather proof vinyl fencing - no worries about splinters in little feet here!",
            "title": "Simply outstanding!",
            "user": "Johanne R"
        },
        {
            "date": "September 17, 2013",
            "detail_rating": {
                "business": null,
                "cleanliness": 5.0,
                "desk": null,
                "location": 5.0,
                "pool": null,
                "restaurant": null,
                "rooms": 5.0,
                "service": 5.0,
                "sleep": 5.0,
                "value": 5.0
            },
            "helpfulness": 3,
            "id": 177527908,
            "likes": {
                "disliked": null,
                "liked": null
            },
            "rating": 5.0,
            "stay_parameters": "Stayed August 2013, traveled with family",
            "text": "We would love to return to the Echo next summer, maybe in a cottage next time!",
            "title": "Wonderful",
            "user": "Judy F"
        },
        {
            "date": "September 16, 2013",
            "detail_rating": {
                "business": null,
                "cleanliness": 5.0,
                "desk": null,
                "location": 5.0,
                "pool": null,
                "restaurant": null,
                "rooms": 5.0,
                "service": 5.0,
                "sleep": 5.0,
                "value": 5.0
            },
            "helpfulness": 3,
            "id": 177382704,
            "likes": {
                "disliked": null,
                "liked": null
            },
            "rating": 5.0,
            "stay_parameters": "Stayed September 2013, traveled as a couple",
            "text": "Have just spent three days in awe from sunrise to sunset at the breathtaking views from the veranda of cottage Echo 3 set on a private beach overlooking the sea grass and public beach.",
            "title": "One of Old Orchard Beach's better places",
            "user": "WTL2013"
        },
        {
            "date": "September 16, 2013",
            "detail_rating": {
                "business": null,
                "cleanliness": 5.0,
                "desk": null,
                "location": 5.0,
                "pool": null,
                "restaurant": null,
                "rooms": 5.0,
                "service": 5.0,
                "sleep": 4.0,
                "value": 5.0
            },
            "helpfulness": 2,
            "id": 177367291,
            "likes": {
                "disliked": null,
                "liked": null
            },
            "rating": 5.0,
            "stay_parameters": "Stayed September 2013, traveled solo",
            "text": "The cottage, a home away from home, was just so bright, airy, warm, comfortable, spotless and provided all the amenities one could wish for.",
            "title": "The Best Place To Stay in Old Orchard",
            "user": "SusanK55"
        }
    ],
    "slim_ranking": 0.046511627907,
    "stars": null,
    "tripadvisor": {
        "VISITED": false,
        "country_name": null,
        "locality": null,
        "pic_link": null,
        "street_address": null
    },
    "user_rating": 5.0,
    "variance": {
        "average": 4,
        "excellent": 109,
        "poor": 0,
        "terrible": 1,
        "very good": 13
    }
}