{
    "aka": null,
    "description": "Hotel Haveli is a heritage Hotel Offering Personalized Services and Attention in detail that makes the Welcome Warm and Stay Unforgettable.The Rooms have attached Bathrooms with Running Hot and Cold Water. The Heritage rooms ,Deluxe and Standard rooms have attached bathrooms with hot and cold shower. Spotlessly clean, traditional rooms have nice and comfortable antique beds. 24 Luxurious rooms, each decorated with an eye for traditional details and historical themes of Rajasthan. Each stay will be memorable because of its serene, soothing and salubrious atmosphere.Hotel Haveli Restaurant ( \"JHAROKHA\"......The Window ) offers ultimate Food and Dinning Services. The Magnificent and Majestic View of the Mehrangarh Fort and the Blue City add to the Appeal of the Hotel. The Environment becomes Live and Entertaining during Nights with exotic food and the lights up on the Fort adds a Romantic Climax. Also the traditional folk dance & musices attracks everybody's interest to spent the evening on the Roof Top Restaurant even to the non boarder guest.FREE entry for EVERY evening.Hotel Haveli Jodhpur has an in house Boutique with a finest collection of handicraft items, traditional jewelery, cloths, hand wooven carpets etc., for its Guests and outside visitors and is known to be called as a \"Boutique Hotel in Jodhpur\" amongst all the foreigner tourists.",
    "detail_rating": {
        "cleanliness": null,
        "location": null,
        "rooms": null,
        "service": null,
        "sleep": null,
        "value": null
    },
    "location": {
        "city": "Jodhpur",
        "continent": "Asia",
        "country": "India",
        "proposed_city": null,
        "province": null,
        "region": "Rajasthan"
    },
    "name": "Hotel Haveli Jodhpur",
    "places": {
        "aka": [],
        "hotel_description": [
            "Haveli",
            "Jodhpur"
        ],
        "hotel_name": [
            "Haveli",
            "Jodhpur"
        ]
    },
    "review_count": 236,
    "review_count_current": 2,
    "reviews": [
        {
            "date": "January 4, 2007",
            "detail_rating": {
                "business": 5.0,
                "cleanliness": 5.0,
                "desk": null,
                "front_desk": 5.0,
                "location": 5.0,
                "pool": null,
                "restaurant": null,
                "rooms": 5.0,
                "service": 5.0,
                "sleep": null,
                "value": 5.0
            },
            "helpfulness": 2,
            "id": 6551947,
            "likes": {
                "disliked": "\u2014 not much of a view from our room",
                "liked": "\u2014 just a great place to stay"
            },
            "rating": 5.0,
            "stay_parameters": "Stayed December 2006, traveled with family",
            "text": "Stayed here Dec 06 and paid Rs850. Found it an excellent hotel, friendly staff and very helpful. First place in India to give me a map of the surrounding alleys, sights etc.",
            "title": "excellent",
            "user": "Captain_Caveman"
        },
        {
            "date": "April 13, 2005",
            "detail_rating": {
                "business": null,
                "cleanliness": null,
                "desk": null,
                "location": null,
                "pool": null,
                "restaurant": null,
                "rooms": null,
                "service": null,
                "sleep": null,
                "value": null
            },
            "helpfulness": 15,
            "id": 3355047,
            "likes": {
                "disliked": null,
                "liked": null
            },
            "rating": 5.0,
            "stay_parameters": null,
            "text": "Rooms were spacious and clean. Hot water also.",
            "title": "The best hotel so far",
            "user": "A TripAdvisor user"
        }
    ],
    "slim_ranking": 0.353846153846,
    "stars": 2.5,
    "tripadvisor": {
        "VISITED": false,
        "country_name": null,
        "locality": null,
        "pic_link": null,
        "street_address": null
    },
    "user_rating": 3.5,
    "variance": {
        "average": 50,
        "excellent": 54,
        "poor": 28,
        "terrible": 22,
        "very good": 82
    }
}