{
    "aka": null,
    "description": "Bengaluru Marriott Hotel Whitefield blends contemporary style and warmth to provide premium accommodation for the business and leisure traveler. Located next to Inorbit Mall and Sri Satya Sai Super Speciality Hospital. The hotel offers 324 rooms, including 17 suites. Located 50 minutes from the Bengaluru International Airport & 30 minutes from the city centre.",
    "detail_rating": {
        "cleanliness": null,
        "location": null,
        "rooms": null,
        "service": null,
        "sleep": null,
        "value": null
    },
    "location": {
        "city": "Bangalore",
        "continent": "Asia",
        "country": "India",
        "proposed_city": "Whitefield",
        "province": null,
        "region": "Karnataka"
    },
    "name": "Bengaluru Marriott Hotel Whitefield",
    "places": {
        "aka": [],
        "hotel_description": [
            "Whitefield"
        ],
        "hotel_name": [
            "Whitefield"
        ]
    },
    "review_count": 118,
    "review_count_current": 20,
    "reviews": [
        {
            "date": "August 5, 2013",
            "detail_rating": {
                "business": null,
                "cleanliness": 5.0,
                "desk": null,
                "location": 4.0,
                "pool": null,
                "restaurant": null,
                "rooms": 5.0,
                "service": 5.0,
                "sleep": 5.0,
                "value": 5.0
            },
            "helpfulness": 1,
            "id": 170911912,
            "likes": {
                "disliked": null,
                "liked": null
            },
            "rating": 5.0,
            "stay_parameters": "Stayed July 2013, traveled on business",
            "text": "Stayed here one week in June and just returned from 2 week stay in July.",
            "title": "BEST STAY EVER!",
            "user": "PPTA"
        },
        {
            "date": "August 3, 2013",
            "detail_rating": {
                "business": null,
                "cleanliness": null,
                "desk": null,
                "location": null,
                "pool": null,
                "restaurant": null,
                "rooms": null,
                "service": null,
                "sleep": null,
                "value": null
            },
            "helpfulness": 1,
            "id": 170629421,
            "likes": {
                "disliked": null,
                "liked": null
            },
            "rating": 5.0,
            "stay_parameters": null,
            "text": "Let me start by just saying that this has to be my favorite Hotel ever--The entire staff is outstanding! Got to chat with GM Mathew Copper and I understand how he inspires the staff to the highest standard of Customer Service!",
            "title": "Definitely will stay here next time",
            "user": "Lincoln L"
        },
        {
            "date": "July 31, 2013",
            "detail_rating": {
                "business": null,
                "cleanliness": 5.0,
                "desk": null,
                "location": 5.0,
                "pool": null,
                "restaurant": null,
                "rooms": 5.0,
                "service": 5.0,
                "sleep": 5.0,
                "value": 5.0
            },
            "helpfulness": 1,
            "id": 170142634,
            "likes": {
                "disliked": null,
                "liked": null
            },
            "rating": 5.0,
            "stay_parameters": "Stayed February 2013, traveled on business",
            "text": "Having had issues with food and water during previous trips to India, the cleanliness and infrastructure of the Marriott erased my worries (RO water filtration system!)",
            "title": "Awesome!",
            "user": "lbmckin"
        },
        {
            "date": "July 29, 2013",
            "detail_rating": {
                "business": null,
                "cleanliness": 5.0,
                "desk": null,
                "location": 5.0,
                "pool": null,
                "restaurant": null,
                "rooms": 5.0,
                "service": 5.0,
                "sleep": null,
                "value": 5.0
            },
            "helpfulness": 1,
            "id": 169693638,
            "likes": {
                "disliked": null,
                "liked": null
            },
            "rating": 5.0,
            "stay_parameters": "Stayed July 2013, traveled on business",
            "text": "Breakfast in the M Cafe was a fine start to every day; the staff is always smiling and running to assist you, the selection is endless and the fresh juices rock.",
            "title": "Great hotel with excellent food",
            "user": "john o"
        },
        {
            "date": "July 28, 2013",
            "detail_rating": {
                "business": null,
                "cleanliness": 5.0,
                "desk": null,
                "location": 5.0,
                "pool": null,
                "restaurant": null,
                "rooms": 5.0,
                "service": 5.0,
                "sleep": 5.0,
                "value": 4.0
            },
            "helpfulness": null,
            "id": 169491791,
            "likes": {
                "disliked": null,
                "liked": null
            },
            "rating": 5.0,
            "stay_parameters": "Stayed July 2013, traveled on business",
            "text": "I want to give special recognition to the Alto Vino Italian restaurant where the food is marvelous and Chef Alfonso Montefusco is the BEST. He and his staff spoiled me and my colleagues with special dishes and the most delightful service.",
            "title": "Best yet in Whitefield",
            "user": "thomas n"
        },
        {
            "date": "June 19, 2013",
            "detail_rating": {
                "business": null,
                "cleanliness": 5.0,
                "desk": null,
                "location": 5.0,
                "pool": null,
                "restaurant": null,
                "rooms": 5.0,
                "service": 5.0,
                "sleep": 5.0,
                "value": 5.0
            },
            "helpfulness": null,
            "id": 164483803,
            "likes": {
                "disliked": null,
                "liked": null
            },
            "rating": 5.0,
            "stay_parameters": "Stayed May 2013, traveled on business",
            "text": "The Marriott in Whitefield is a very impressive hotel. I have used it both for business and for pleasure. I held a very important business meeting at the Marriott several weeks back, and I was blown away by the level of service I was provided. The room was exceptional and the service was top of the line. We had everything we needed and were very well taken care of throughout the day. Several of my colleagues said that this was the best offsite experience they have had in Bangalore. If you are looking for a place to hold your next meeting, give the Marriott a try. I thought we got great value for the money and a great location for the team to get our work done. In addition to the business aspect, I have eaten at the Marriott several times, including Sunday Brunch and dinner at the new Italian restaurant, Alto Vino. Both have been great experiences. The food is always good, and the service has also been exceptional. We have lived in Bangalore for two years now, and hands down, I have had the most consistent and pleasing experiences at the Marriott in Whitefield.",
            "title": "Top Notch Hotel ... Don't Miss It",
            "user": "Britten M"
        },
        {
            "date": "June 16, 2013",
            "detail_rating": {
                "business": null,
                "cleanliness": 5.0,
                "desk": null,
                "location": 5.0,
                "pool": null,
                "restaurant": null,
                "rooms": 5.0,
                "service": 5.0,
                "sleep": 5.0,
                "value": 5.0
            },
            "helpfulness": 2,
            "id": 164171331,
            "likes": {
                "disliked": null,
                "liked": null
            },
            "rating": 5.0,
            "stay_parameters": "Stayed June 2013, traveled on business",
            "text": "My first visit to India made even more enjoyable by the management and colleagues of this newly built first class hotel.",
            "title": "Marriot Hotel Bangalore",
            "user": "Dave C"
        },
        {
            "date": "June 12, 2013",
            "detail_rating": {
                "business": null,
                "cleanliness": 5.0,
                "desk": null,
                "location": 4.0,
                "pool": null,
                "restaurant": null,
                "rooms": 5.0,
                "service": 5.0,
                "sleep": 5.0,
                "value": 4.0
            },
            "helpfulness": null,
            "id": 163790361,
            "likes": {
                "disliked": null,
                "liked": null
            },
            "rating": 4.0,
            "stay_parameters": "Stayed June 2013, traveled on business",
            "text": "Typically Marriot and a brand that you can trust with confidence.",
            "title": "Highly recommended hotel in Whitefiled",
            "user": "kmquek"
        },
        {
            "date": "June 12, 2013",
            "detail_rating": {
                "business": null,
                "cleanliness": 4.0,
                "desk": null,
                "location": 4.0,
                "pool": null,
                "restaurant": null,
                "rooms": 4.0,
                "service": 5.0,
                "sleep": 5.0,
                "value": 4.0
            },
            "helpfulness": null,
            "id": 163781494,
            "likes": {
                "disliked": null,
                "liked": null
            },
            "rating": 5.0,
            "stay_parameters": "Stayed June 2013, traveled on business",
            "text": "Being mindful of stories of food challenges, I was always concious of culinary cautions..... however, that was soon disposed of as the quality and variety of cuisine has contributed to me gaining, not losing weight.......First class food and in an excellent ambience.",
            "title": "A new experience",
            "user": "Maarten K"
        },
        {
            "date": "June 9, 2013",
            "detail_rating": {
                "business": null,
                "cleanliness": 5.0,
                "desk": null,
                "location": 4.0,
                "pool": null,
                "restaurant": null,
                "rooms": 5.0,
                "service": 5.0,
                "sleep": 4.0,
                "value": 4.0
            },
            "helpfulness": 1,
            "id": 163471081,
            "likes": {
                "disliked": null,
                "liked": null
            },
            "rating": 5.0,
            "stay_parameters": "Stayed June 2013, traveled solo",
            "text": "From the front desk (Vini the duty manager when I arrived) the ladies and gents in the M Cafe for a smorgesbord of breakfast and evening buffet (Santosh, Deepak, Needhu, Shalini, Rohan, Sushmita) and the guys in the Alto Vino...you know who you are Amandeep, Ramul, Ganesh, the wonderful Manisha and all the team...who I know went over and above to ensure my meals were just right.",
            "title": "Excellent option for Whitefield area",
            "user": "SanjayIV"
        },
        {
            "date": "July 28, 2013",
            "detail_rating": {
                "business": null,
                "cleanliness": 5.0,
                "desk": null,
                "location": 5.0,
                "pool": null,
                "restaurant": null,
                "rooms": 5.0,
                "service": 5.0,
                "sleep": null,
                "value": 4.0
            },
            "helpfulness": null,
            "id": 169385585,
            "likes": {
                "disliked": null,
                "liked": null
            },
            "rating": 5.0,
            "stay_parameters": "Stayed July 2013",
            "text": "Wow!! Amazing room service!!",
            "title": "Great stay in Whitefield!!",
            "user": "Ashish R"
        },
        {
            "date": "July 23, 2013",
            "detail_rating": {
                "business": null,
                "cleanliness": 5.0,
                "desk": null,
                "location": 5.0,
                "pool": null,
                "restaurant": null,
                "rooms": 5.0,
                "service": 5.0,
                "sleep": 5.0,
                "value": 5.0
            },
            "helpfulness": null,
            "id": 168747265,
            "likes": {
                "disliked": null,
                "liked": null
            },
            "rating": 5.0,
            "stay_parameters": "Stayed July 2013, traveled on business",
            "text": "None of their restaurants had pizza in dinner menu but chef especially made it for us and highly customised with arugula leaves on it...",
            "title": "Solid Hotel Choice in the Whitefield area",
            "user": "CincyLonghorns"
        },
        {
            "date": "July 22, 2013",
            "detail_rating": {
                "business": null,
                "cleanliness": null,
                "desk": null,
                "location": null,
                "pool": null,
                "restaurant": null,
                "rooms": null,
                "service": null,
                "sleep": null,
                "value": null
            },
            "helpfulness": null,
            "id": 168644454,
            "likes": {
                "disliked": null,
                "liked": null
            },
            "rating": 5.0,
            "stay_parameters": null,
            "text": "Then our breakfast buffet was a treat especially when chef Rohan got a pan cake of letters naming my kid..",
            "title": "Great hotel",
            "user": "C W"
        },
        {
            "date": "July 18, 2013",
            "detail_rating": {
                "business": null,
                "cleanliness": 5.0,
                "desk": null,
                "location": 5.0,
                "pool": null,
                "restaurant": null,
                "rooms": 5.0,
                "service": 5.0,
                "sleep": 5.0,
                "value": 5.0
            },
            "helpfulness": null,
            "id": 167996549,
            "likes": {
                "disliked": null,
                "liked": null
            },
            "rating": 5.0,
            "stay_parameters": "Stayed February 2013, traveled as a couple",
            "text": "I recommend this place",
            "title": "Classy, elegant and up to speed...in India...good internet is priceless!",
            "user": "CynSpecht"
        },
        {
            "date": "July 14, 2013",
            "detail_rating": {
                "business": null,
                "cleanliness": 5.0,
                "desk": null,
                "location": 4.0,
                "pool": null,
                "restaurant": null,
                "rooms": 5.0,
                "service": 4.0,
                "sleep": 5.0,
                "value": 3.0
            },
            "helpfulness": null,
            "id": 167561529,
            "likes": {
                "disliked": null,
                "liked": null
            },
            "rating": 4.0,
            "stay_parameters": "Stayed May 2013, traveled on business",
            "text": "Having sampled many hotels in Bangalore, I think the Marriott in Whitefield is the best combination of luxury and value. The hotel was opened in April 2013 and has all the amenities one would hope for while in Bangalore. The hotel restaurant was a good choice for breakfast and dinner. I was surprised they didn't serve hot dinner items until 7 PM, but the menu had a nice mix of items and the buffet had a wide range of international options. The staff was willing to accommodate special requests for food so the menu listed could grow to accommodate your tastes.",
            "title": "Great hotel, Excellent breakfast",
            "user": "Praz666"
        },
        {
            "date": "July 14, 2013",
            "detail_rating": {
                "business": null,
                "cleanliness": null,
                "desk": null,
                "location": null,
                "pool": null,
                "restaurant": null,
                "rooms": null,
                "service": null,
                "sleep": null,
                "value": null
            },
            "helpfulness": null,
            "id": 167511305,
            "likes": {
                "disliked": null,
                "liked": null
            },
            "rating": 5.0,
            "stay_parameters": null,
            "text": "Had a wonderful stay at this new Marriott. Great to see how my favorite chain sees the latest in room design and facilities. What they have come up with is excellent. I enjoyed a very spacious room with contemporary bathroom, amazing bed and pleasant glass desk. As for facilities, the breakfast buffet is relaxed with a wonderful selection, the Alto Vino Italian Restaurant has a pleasant vibe and excellent food and the lobby coffe shop (Whiefield Bakery) top notch coffee and very fresh pastries. All staff are happy and greet you with a smile. Overall a very pleasant experience",
            "title": "Great New Hotel",
            "user": "Bro44"
        },
        {
            "date": "July 5, 2013",
            "detail_rating": {
                "business": null,
                "cleanliness": 5.0,
                "desk": null,
                "location": 4.0,
                "pool": null,
                "restaurant": null,
                "rooms": 5.0,
                "service": 5.0,
                "sleep": 4.0,
                "value": 5.0
            },
            "helpfulness": 1,
            "id": 166366167,
            "likes": {
                "disliked": null,
                "liked": null
            },
            "rating": 5.0,
            "stay_parameters": "Stayed June 2013, traveled on business",
            "text": "From airport pick up to drop off a week later I cannot fault this hotel for the level of service and commitment of the staff to delvier. It was not 100% smooth, on one occasion a car picknig me up went to the wrong place, but the effort put in by the staff to rectify it and mae me happy afterward was top-notch.",
            "title": "Service up at the top levels",
            "user": "Stephen_Lloyd"
        },
        {
            "date": "July 3, 2013",
            "detail_rating": {
                "business": null,
                "cleanliness": 5.0,
                "desk": null,
                "location": 5.0,
                "pool": null,
                "restaurant": null,
                "rooms": 5.0,
                "service": 5.0,
                "sleep": 5.0,
                "value": 5.0
            },
            "helpfulness": null,
            "id": 166116411,
            "likes": {
                "disliked": null,
                "liked": null
            },
            "rating": 5.0,
            "stay_parameters": "Stayed June 2013, traveled on business",
            "text": "The hotel is new and feels it, with a comfortable bar area, good range of drinks and two restaurants - only one of which I ate in. The club luonge is relaxed (although they did paly Christmas music one day in there which was a tad bizarre!) with good range of food and adequate drinks, served with a smile.",
            "title": "Very nice facility with true Hospitality and excellent Service",
            "user": "Subbiah V"
        },
        {
            "date": "June 30, 2013",
            "detail_rating": {
                "business": null,
                "cleanliness": 3.0,
                "desk": null,
                "location": null,
                "pool": null,
                "restaurant": null,
                "rooms": null,
                "service": 4.0,
                "sleep": null,
                "value": 1.0
            },
            "helpfulness": null,
            "id": 165732471,
            "likes": {
                "disliked": null,
                "liked": null
            },
            "rating": 3.0,
            "stay_parameters": "Stayed June 2013, traveled on business",
            "text": "My room was on the 12th floor, with good view of the city and toward the nearby lake, large comfortable bed, similar lfat screen TV and DVD player, cable films and TV plus a good side work desk and very good working internet. Remote access to work was excellent from the room. Good size bathroom and great shower.",
            "title": "Hotel is good but the food is below average",
            "user": "ajay60"
        },
        {
            "date": "June 20, 2013",
            "detail_rating": {
                "business": null,
                "cleanliness": 5.0,
                "desk": null,
                "location": 3.0,
                "pool": null,
                "restaurant": null,
                "rooms": 4.0,
                "service": 5.0,
                "sleep": 4.0,
                "value": 4.0
            },
            "helpfulness": null,
            "id": 164581100,
            "likes": {
                "disliked": null,
                "liked": null
            },
            "rating": 5.0,
            "stay_parameters": "Stayed May 2013, traveled on business",
            "text": "Breakfast was a treat - good range of local and western foods.",
            "title": "Outstanding property and service",
            "user": "ravim84"
        }
    ],
    "slim_ranking": 0.00919117647059,
    "stars": 5,
    "tripadvisor": {
        "VISITED": false,
        "country_name": null,
        "locality": null,
        "pic_link": null,
        "street_address": null
    },
    "user_rating": 4.5,
    "variance": {
        "average": 7,
        "excellent": 85,
        "poor": 0,
        "terrible": 0,
        "very good": 26
    }
}