{
    "aka": "Dunheanish Guest House Hotel Oban",
    "description": "William and Linda would like to welcome you to Dunheanish Guest House, one of Oban's newest guest houses, an elegant detached Victorian villa beside Oban's landmark, McCaig\u2019s Tower with stunning panoramic views overlooking Oban Bay and the surrounding islands of Kerrera, Lismore and Mull. Dunheanish is the perfect base for anyone who wants to have the town center 5 mins away, with easy access to shops, restaurants and the Caledonian MacBrayne ferry terminal.",
    "detail_rating": {
        "cleanliness": 5.0,
        "location": 5.0,
        "rooms": 5.0,
        "service": 5.0,
        "sleep": 5.0,
        "value": 5.0
    },
    "location": {
        "city": null,
        "continent": "Europe",
        "country": "United Kingdom (UK)",
        "proposed_city": null,
        "province": null,
        "region": null
    },
    "name": "Dunheanish Guest House",
    "places": {
        "aka": [],
        "hotel_description": [
            "Linda",
            "Bay",
            "Lismore"
        ],
        "hotel_name": []
    },
    "review_count": 303,
    "review_count_current": 20,
    "reviews": [
        {
            "date": "April 14, 2010",
            "detail_rating": {
                "business": null,
                "cleanliness": 5.0,
                "desk": null,
                "location": 5.0,
                "pool": null,
                "restaurant": null,
                "rooms": 5.0,
                "service": 5.0,
                "sleep": 5.0,
                "value": 5.0
            },
            "helpfulness": null,
            "id": 61289450,
            "likes": {
                "disliked": null,
                "liked": null
            },
            "rating": 5.0,
            "stay_parameters": "Stayed April 2010, traveled with family",
            "text": "We stayed here for 2 nights with my parents. We had travelled around Scotland and this was our last stop. Upon our arrival I think my parents almost had a heart attack at the location of the B&B as it is a fair way up a steep hill and they are in their 70s. However, we found the B&B to be excellent in every aspect. So uch so that we forgot about the hill! The rooms are spacious and well presented, breakfast was freshly cooked by William. William is a super host too, ensuring that all of us were tended to and we got the best out of our stay in Oban.",
            "title": "Wow!",
            "user": "backtoback"
        },
        {
            "date": "April 11, 2010",
            "detail_rating": {
                "business": null,
                "cleanliness": 5.0,
                "desk": null,
                "location": 5.0,
                "pool": null,
                "restaurant": null,
                "rooms": 5.0,
                "service": 5.0,
                "sleep": 5.0,
                "value": 5.0
            },
            "helpfulness": null,
            "id": 61019927,
            "likes": {
                "disliked": null,
                "liked": null
            },
            "rating": 5.0,
            "stay_parameters": "Stayed April 2010, traveled as a couple",
            "text": "My parents did end up getting a taxi home when we walked to Oban seafront, but they did not mind this and were very very impressed by the views and service we all received.",
            "title": "Excellent hospitality",
            "user": "phil.lynneleech"
        },
        {
            "date": "April 8, 2010",
            "detail_rating": {
                "business": null,
                "cleanliness": 5.0,
                "desk": null,
                "location": 4.0,
                "pool": null,
                "restaurant": null,
                "rooms": 5.0,
                "service": 5.0,
                "sleep": 5.0,
                "value": 4.0
            },
            "helpfulness": null,
            "id": 60743214,
            "likes": {
                "disliked": null,
                "liked": null
            },
            "rating": 5.0,
            "stay_parameters": "Stayed March 2010, traveled as a couple",
            "text": "We have just returned from Oban,having stayed with William and Linda at the Dunheanish. The standard of cleanliness and friendliness was overwhelming,our room on the front of the hotel offered magnificent views over Oban bay and Mull.We could not have been made more welcome and will certainly return.As for the person who damaged the car,I suggest you learn to drive,we didnt have a problem!!!!",
            "title": "A very warm welcome",
            "user": "Satsuma_girl"
        },
        {
            "date": "April 4, 2010",
            "detail_rating": {
                "business": null,
                "cleanliness": 5.0,
                "desk": null,
                "location": 4.0,
                "pool": null,
                "restaurant": null,
                "rooms": 5.0,
                "service": 5.0,
                "sleep": 4.0,
                "value": 5.0
            },
            "helpfulness": null,
            "id": 60325810,
            "likes": {
                "disliked": null,
                "liked": null
            },
            "rating": 5.0,
            "stay_parameters": "Stayed April 2010, traveled as a couple",
            "text": "A lovely guest house. It's a large converted Victorian house so the bathrooms are, as some people have said, compact but spotless. The rooms are traditionally decorated (but not twee) with 4 poster beds etc. When booking you can request certain rooms to be reserved, these are the ones at the fromt (I think a little more expensive), but the views are spectacular.",
            "title": "A Great find with amazing views",
            "user": "garioch77"
        },
        {
            "date": "April 3, 2010",
            "detail_rating": {
                "business": null,
                "cleanliness": 5.0,
                "desk": null,
                "location": 5.0,
                "pool": null,
                "restaurant": null,
                "rooms": 5.0,
                "service": 5.0,
                "sleep": 5.0,
                "value": 5.0
            },
            "helpfulness": null,
            "id": 60281000,
            "likes": {
                "disliked": null,
                "liked": null
            },
            "rating": 5.0,
            "stay_parameters": "Stayed February 2010, traveled as a couple",
            "text": "William met us on arrival and was incredibly helpful. Breakfast was good too. Overall a lovely guesthouse (but maybe not so good if you are elderly/infirm as it is quite a steep climb up from the high street in Oban, but the views are definately worth it!",
            "title": "Elegant and welcoming guest house.",
            "user": "GarranTraveller"
        },
        {
            "date": "October 18, 2009",
            "detail_rating": {
                "business": null,
                "cleanliness": null,
                "desk": null,
                "location": null,
                "pool": null,
                "restaurant": null,
                "rooms": null,
                "service": null,
                "sleep": null,
                "value": null
            },
            "helpfulness": null,
            "id": 47166308,
            "likes": {
                "disliked": null,
                "liked": null
            },
            "rating": 5.0,
            "stay_parameters": null,
            "text": "We have stayed in the Dunheanish before and were delighted with our room - number 1- and the friendly welcome extended to us by William and Linda. I am delighted to say that nothing has changed . We stayed in the same room and William, Linda and the views were just as we remembered them! This is a lovely Ban B with a great breakfast and clean and comfortable rooms. William and Linda always take an interest in what you are doing and where you have eaten and are always ready to add their own recommendations. We will be back again - perhaps we might even get to stay in the elusive room 4 - it is always booked when we want to go!",
            "title": "Another lovely stay at the Dunheanish",
            "user": "Allison-Scotland"
        },
        {
            "date": "October 18, 2009",
            "detail_rating": {
                "business": null,
                "cleanliness": null,
                "desk": null,
                "location": null,
                "pool": null,
                "restaurant": null,
                "rooms": null,
                "service": null,
                "sleep": null,
                "value": null
            },
            "helpfulness": null,
            "id": 47149998,
            "likes": {
                "disliked": null,
                "liked": null
            },
            "rating": 5.0,
            "stay_parameters": null,
            "text": "We stayed here for only two nights - my husband and I plus my elderly parents. This is one of the nicest places we stayed in two weeks in Scotland.",
            "title": "Absolutely marvellous",
            "user": "MGCTravels"
        },
        {
            "date": "October 11, 2009",
            "detail_rating": {
                "business": null,
                "cleanliness": null,
                "desk": null,
                "location": null,
                "pool": null,
                "restaurant": null,
                "rooms": null,
                "service": null,
                "sleep": null,
                "value": null
            },
            "helpfulness": null,
            "id": 46521405,
            "likes": {
                "disliked": null,
                "liked": null
            },
            "rating": 4.0,
            "stay_parameters": null,
            "text": "I don't think I can say much about the accommodations other than what you see on the B&B's website is accurate. The place is gorgeous, the rooms are spacious and spotless, breakfasts were tasty, and the host was fantastic. This B&B definitely deserves the great rating that it is getting on the Trip Advisor website.",
            "title": "Great views but the guest house was nothing out of the ordinary",
            "user": "citychick1"
        },
        {
            "date": "October 6, 2009",
            "detail_rating": {
                "business": null,
                "cleanliness": null,
                "desk": null,
                "location": null,
                "pool": null,
                "restaurant": null,
                "rooms": null,
                "service": null,
                "sleep": null,
                "value": null
            },
            "helpfulness": null,
            "id": 46031044,
            "likes": {
                "disliked": null,
                "liked": null
            },
            "rating": 5.0,
            "stay_parameters": null,
            "text": "My mother - well into her 'of a certain age' - managed to trip over something two days before leaving for Scotland, so she arrived with a lame knee. Even so, she managed the stairway from the street up to the B&B without much trouble, and that was with a small piece of luggage. We moved our car to the small car park (which will hold 3 cars if they are parked correctly), but other guests who left their car at street level said that they had no problems with that arrangement.",
            "title": "Excellent",
            "user": "grbh"
        },
        {
            "date": "October 6, 2009",
            "detail_rating": {
                "business": null,
                "cleanliness": null,
                "desk": null,
                "location": null,
                "pool": null,
                "restaurant": null,
                "rooms": null,
                "service": null,
                "sleep": null,
                "value": null
            },
            "helpfulness": null,
            "id": 46023756,
            "likes": {
                "disliked": null,
                "liked": null
            },
            "rating": 5.0,
            "stay_parameters": null,
            "text": "There is a pedestrian path to the downtown area, and a good choice of restaurants and the ferry terminal (for Mull) are a fifteen minute walk away. Going down isn't too bad. If the steepness of the walk bothers you, taxis are available to take you back to the B&B (there is a taxi stand downtown).",
            "title": "Beautiful view of the city.",
            "user": "rmarmil"
        },
        {
            "date": "April 2, 2010",
            "detail_rating": {
                "business": null,
                "cleanliness": 2.0,
                "desk": null,
                "location": 1.0,
                "pool": null,
                "restaurant": null,
                "rooms": 2.0,
                "service": 2.0,
                "sleep": 1.0,
                "value": 2.0
            },
            "helpfulness": 1,
            "id": 60160843,
            "likes": {
                "disliked": null,
                "liked": null
            },
            "rating": 1.0,
            "stay_parameters": "Stayed March 2010, traveled as a couple",
            "text": "Great view yes, but beware of the car park. I damaged my car on the wall and I see from the reviews that others have also damaged there vehicles.",
            "title": "Beware of The Car Park",
            "user": "IrelandBrighteyes"
        },
        {
            "date": "March 29, 2010",
            "detail_rating": {
                "business": null,
                "cleanliness": 5.0,
                "desk": null,
                "location": 5.0,
                "pool": null,
                "restaurant": null,
                "rooms": 4.0,
                "service": 5.0,
                "sleep": 5.0,
                "value": 5.0
            },
            "helpfulness": null,
            "id": 59846071,
            "likes": {
                "disliked": null,
                "liked": null
            },
            "rating": 5.0,
            "stay_parameters": "Stayed March 2010, traveled as a couple",
            "text": "Our room was nothing special and we did not have a good view from our room. The shower room was cold and the breakfast was nothing special. I also found the walk back from the town hard as a big hill to climb and then steps to the house. I would not come again or tell my friends about it.i",
            "title": "Best B&B ever",
            "user": "LizAtk"
        },
        {
            "date": "March 29, 2010",
            "detail_rating": {
                "business": null,
                "cleanliness": 5.0,
                "desk": null,
                "location": 5.0,
                "pool": null,
                "restaurant": null,
                "rooms": 5.0,
                "service": 5.0,
                "sleep": 5.0,
                "value": 5.0
            },
            "helpfulness": null,
            "id": 59812901,
            "likes": {
                "disliked": null,
                "liked": null
            },
            "rating": 5.0,
            "stay_parameters": "Stayed March 2010, traveled with family",
            "text": "This is the nicest B&B we have ever found. Our room was massive, well appointed and with views to die for across Oban Bay towards Kerrera and Mull. William, the owner, was friendly and helpful and cooked a great breakfast (or was that his partner...|). If I had to nitpick, it would be on two points - the room COULD have been a little warmer - it's a big room, and even two radiators failed to make it cosy. Secondly, the bathroom, although perfectly adequate and spotlessly clean, was no more than that, and such a lovely room really deserved a more generously sized bathroom, preferably with a bath to warm your bones after a cold day out. This guesthouse is also very well situated for exploring both Oban and the surrounding countryside.",
            "title": "Wonderful",
            "user": "Fran_from_Edinburgh"
        },
        {
            "date": "March 21, 2010",
            "detail_rating": {
                "business": null,
                "cleanliness": 5.0,
                "desk": null,
                "location": 4.0,
                "pool": null,
                "restaurant": null,
                "rooms": 5.0,
                "service": 5.0,
                "sleep": 5.0,
                "value": 5.0
            },
            "helpfulness": 1,
            "id": 59117376,
            "likes": {
                "disliked": null,
                "liked": null
            },
            "rating": 5.0,
            "stay_parameters": "Stayed March 2010, traveled with friends",
            "text": "We had a fantastic welcome when we arrived at Dunheanish on a wet Friday afternoon. The house is completely spotless and has an amazing view of Oban - we were in Room 5 and my Mum in Room 6. The beds were comfortable and the rooms were warm. Can't fault our stay - even if it was for one night. The walk back up the hill from town is not as strenuous as you may think if you take the short cut.",
            "title": "superb",
            "user": "ScottieChester"
        },
        {
            "date": "March 3, 2010",
            "detail_rating": {
                "business": null,
                "cleanliness": 5.0,
                "desk": null,
                "location": 5.0,
                "pool": null,
                "restaurant": null,
                "rooms": 5.0,
                "service": 5.0,
                "sleep": 5.0,
                "value": 5.0
            },
            "helpfulness": null,
            "id": 57608418,
            "likes": {
                "disliked": null,
                "liked": null
            },
            "rating": 5.0,
            "stay_parameters": "Stayed February 2010, traveled with friends",
            "text": "Breakfast was lovely - try the smoked salmon and scrambled eggs if salmon is your thing. Highly recommended.",
            "title": "Great view, stunning rooms and entertaining host!",
            "user": "vingeren"
        },
        {
            "date": "November 29, 2009",
            "detail_rating": {
                "business": null,
                "cleanliness": 5.0,
                "desk": null,
                "location": 5.0,
                "pool": null,
                "restaurant": null,
                "rooms": 5.0,
                "service": 5.0,
                "sleep": null,
                "value": 4.0
            },
            "helpfulness": null,
            "id": 50287229,
            "likes": {
                "disliked": null,
                "liked": null
            },
            "rating": 5.0,
            "stay_parameters": "Stayed September 2009, traveled as a couple",
            "text": "My partner and I stayed 2 nights at Dunheanish in September and had a great time. Our room (room 4) was very spacious and comfortable with a fantastic view over Oban and out towards Mull. Breakfasts were generous and freshly cooked and William was a most welcoming host. Only potential downsides are the limited off road parking and steep entrance if, like us, you suffer with bad knees but overall we would thoroughly recommend Dunheanish and very much like to return.",
            "title": "Great service and fabulous view",
            "user": "OlicanaWanderers"
        },
        {
            "date": "November 15, 2009",
            "detail_rating": {
                "business": null,
                "cleanliness": 5.0,
                "desk": null,
                "location": 5.0,
                "pool": null,
                "restaurant": null,
                "rooms": 5.0,
                "service": 5.0,
                "sleep": null,
                "value": 5.0
            },
            "helpfulness": null,
            "id": 49289494,
            "likes": {
                "disliked": null,
                "liked": null
            },
            "rating": 5.0,
            "stay_parameters": "Stayed October 2009, traveled as a couple",
            "text": "My husband and I stayed in the Dunheanish for the first two nights of our honeymoon, and were very impressed with the experience. The owners are extremely helpful and courteous, our room was lovely and the breakfast was delicious. We had a beautiful view out over the harbor from our room (Room 1). We also thought the price was very reasonable for such a high quality place. We would recommend the Dunheanish to anyone, and will definitely stay there again the next time we're in Oban.",
            "title": "Fantastic B&B experience",
            "user": "b0nnylass"
        },
        {
            "date": "November 7, 2009",
            "detail_rating": {
                "business": null,
                "cleanliness": 5.0,
                "desk": null,
                "location": 4.0,
                "pool": null,
                "restaurant": null,
                "rooms": 5.0,
                "service": 5.0,
                "sleep": null,
                "value": 5.0
            },
            "helpfulness": null,
            "id": 48692227,
            "likes": {
                "disliked": null,
                "liked": null
            },
            "rating": 5.0,
            "stay_parameters": "Stayed October 2009, traveled as a couple",
            "text": "We stayed one night at Dunheanish before taking the ferry to Isle of Mull. William was a very friendly host who helped us with directions and with choosing a place for dinner. We went to Cuan Mor which was lovely. Our room was beautiful and we had everything we needed. Breakfast was huge and delicious... I could not finish I was so full. The walk down the the harbour front was very very steep so be sure to bring good walking shoes.",
            "title": "Very friendly B&B in Oban near ferries",
            "user": "Laurie.22"
        },
        {
            "date": "October 25, 2009",
            "detail_rating": {
                "business": null,
                "cleanliness": 5.0,
                "desk": null,
                "location": 5.0,
                "pool": null,
                "restaurant": null,
                "rooms": 5.0,
                "service": 5.0,
                "sleep": null,
                "value": 5.0
            },
            "helpfulness": null,
            "id": 47678694,
            "likes": {
                "disliked": null,
                "liked": null
            },
            "rating": 5.0,
            "stay_parameters": "Stayed October 2009, traveled as a couple",
            "text": "My wife and I recently stayed here en route to Mull and were extremely impressed with all aspects of our stay. We booked into room 5 which overlooks the harbour in Oban and were treated to a well sized, very clean and well looked after room. William could not have been more helpful during our stay - a really pleasant and decent chap who made sure we were happy with everything but was in no way overbearing.",
            "title": "Great location and amazing service from William",
            "user": "ManchesterBen2009"
        },
        {
            "date": "October 21, 2009",
            "detail_rating": {
                "business": null,
                "cleanliness": 5.0,
                "desk": null,
                "location": 5.0,
                "pool": null,
                "restaurant": null,
                "rooms": 5.0,
                "service": 5.0,
                "sleep": null,
                "value": 5.0
            },
            "helpfulness": null,
            "id": 47403950,
            "likes": {
                "disliked": null,
                "liked": null
            },
            "rating": 5.0,
            "stay_parameters": "Stayed October 2009, traveled as a couple",
            "text": "We had an early ferry to catch the following morning and had a great cooked breakfast in the dining room on the ground floor before we left.",
            "title": "A gem overlooking the bay",
            "user": "NoQuarter"
        }
    ],
    "slim_ranking": 0.0291262135922,
    "stars": null,
    "tripadvisor": {
        "VISITED": false,
        "country_name": null,
        "locality": null,
        "pic_link": null,
        "street_address": null
    },
    "user_rating": 5.0,
    "variance": {
        "average": 2,
        "excellent": 274,
        "poor": 0,
        "terrible": 2,
        "very good": 25
    }
}