{
    "aka": "Holiday Inn Select St. Louis - Downtown (Conv Center) Hotel Saint Louis",
    "description": "Welcome to the Ramada Plaza Hotel - Downtown Convention Center! We are located in the heart of downtown Saint Louis, next to America's Convention Center, Edward Jones Dome-home of the Rams, 1 block from St. Louis' newest expansion area 'Washington Avenue' featuring unique dining, shopping boutiques and entertainment, and only 9 blocks from the New Busch Stadium, home of the 11 time World Champion St. Louis Cardinals! Visit Saint Louis' historical sites, St Louis Gateway Arch, Anheuser Busch Brewery, Busch Stadium, Forest Park Zoo, Lumiere Place, Casino Queen Riverboat Gaming, and St Louis Union Station. The Ramada Plaza Hotel Downtown Convention Center is only blocks from the Metro Link rail system. Travel to the 'Gateway City' on business or pleasure and enjoy superior banquet and meeting facilities, a 24 hour business center, complimentary wireless high speed Internet, 24-hour snack and convenience center, and our newest restaurant, the 9th Street Bar and Grille. Relax at the Ramada Plaza Hotel Downtown in own atrium indoor pool and exercise room. Our hotel features 291 beautifully appointed guest rooms and suites. Covered parking is available adjacent to the hotel for a fee. We're the perfect business address for visitors to AT&T, Proctor & Gamble, US Bank, Nestle Purina, CPI, Fiserv & Saint Louis University.",
    "detail_rating": {
        "cleanliness": null,
        "location": null,
        "rooms": null,
        "service": null,
        "sleep": null,
        "value": null
    },
    "location": {
        "city": null,
        "continent": null,
        "country": "United States",
        "proposed_city": "Ramada",
        "province": null,
        "region": null
    },
    "name": "Ramada Plaza Hotel - Downtown Convention Center",
    "places": {
        "aka": [
            "Holiday"
        ],
        "hotel_description": [
            "Ramada",
            "Dome",
            "Washington",
            "Union",
            "Metro",
            "Bar",
            "University"
        ],
        "hotel_name": [
            "Ramada"
        ]
    },
    "review_count": 747,
    "review_count_current": 20,
    "reviews": [
        {
            "date": "August 20, 2010",
            "detail_rating": {
                "business": null,
                "cleanliness": 4.0,
                "desk": null,
                "location": 5.0,
                "pool": null,
                "restaurant": null,
                "rooms": 3.0,
                "service": 3.0,
                "sleep": 4.0,
                "value": 5.0
            },
            "helpfulness": null,
            "id": 76092335,
            "likes": {
                "disliked": null,
                "liked": null
            },
            "rating": 3.0,
            "stay_parameters": "Stayed July 2010, traveled on business",
            "text": "I stayed at the hotel while I attended a conference that was held in the convention center. The room had two queen size beds that were comfortable. We stayed on the third floor and never had to wait long for an elevator. I chose the hotel for its convenient location and free Wi-Fi in the rooms. The location was great, but I never got the free",
            "title": "Excellent location for convention lodging; poorly trained staff",
            "user": "Lovestogo2"
        },
        {
            "date": "August 20, 2010",
            "detail_rating": {
                "business": null,
                "cleanliness": 4.0,
                "desk": null,
                "location": 2.0,
                "pool": null,
                "restaurant": null,
                "rooms": 3.0,
                "service": 1.0,
                "sleep": 3.0,
                "value": 2.0
            },
            "helpfulness": null,
            "id": 76035862,
            "likes": {
                "disliked": null,
                "liked": null
            },
            "rating": 1.0,
            "stay_parameters": "Stayed August 2010, traveled as a couple",
            "text": "Wi-Fi in my room due to reception problems. I had to sit either in the lobby or at a table in the pool area to get reception. Apparently, the rooms on one side of the hotel get reception; my side did not. I found it interesting that I was able to connect to a pay Internet provider in the room.",
            "title": "Chaos in St. Louis",
            "user": "dkinsla"
        },
        {
            "date": "August 11, 2010",
            "detail_rating": {
                "business": null,
                "cleanliness": 4.0,
                "desk": null,
                "location": 4.0,
                "pool": null,
                "restaurant": null,
                "rooms": 4.0,
                "service": 4.0,
                "sleep": 4.0,
                "value": 4.0
            },
            "helpfulness": 1,
            "id": 74831371,
            "likes": {
                "disliked": null,
                "liked": null
            },
            "rating": 4.0,
            "stay_parameters": "Stayed August 2010, traveled on business",
            "text": "I ate breakfast and lunch on most days at the hotel. The buffets were fairly tasty, but the food service staff needed additional training. They were nice, but somewhat backwards. I ate dinner in the bar area one night and was surprised that customers were allowed to smoke where I was eating. That was unpleasant.",
            "title": "Better than expected (++)",
            "user": "RetiredMilitary"
        },
        {
            "date": "August 4, 2010",
            "detail_rating": {
                "business": null,
                "cleanliness": 4.0,
                "desk": null,
                "location": 3.0,
                "pool": null,
                "restaurant": null,
                "rooms": 3.0,
                "service": 3.0,
                "sleep": 4.0,
                "value": 4.0
            },
            "helpfulness": null,
            "id": 73744331,
            "likes": {
                "disliked": null,
                "liked": null
            },
            "rating": 3.0,
            "stay_parameters": "Stayed August 2010, traveled with family",
            "text": "Even though there was room for improvement, I would stay there again. I was able to walk to the convention center in two or three minutes.",
            "title": "Don't pay extra for the breakfast buffet",
            "user": "iamkennysmom"
        },
        {
            "date": "August 3, 2010",
            "detail_rating": {
                "business": null,
                "cleanliness": 2.0,
                "desk": null,
                "location": 3.0,
                "pool": null,
                "restaurant": null,
                "rooms": 1.0,
                "service": 1.0,
                "sleep": 1.0,
                "value": 1.0
            },
            "helpfulness": null,
            "id": 73658766,
            "likes": {
                "disliked": null,
                "liked": null
            },
            "rating": 1.0,
            "stay_parameters": "Stayed July 2010, traveled as a couple",
            "text": "We had a terrible customer service experience at this hotel. While the rooms were updated and comfortable, the staffing and infrastructure are a mess. Every staffing area of the facility appeared under staffed and poorly trained. At check in there was a long line one guy behind the counter and phones blaring with other guests or potential guests looking for service. Behind the desk was a dissassembled circuit box with wires all over the place. Breakfast was a disaster. Two workers for an entire restaurant. Ran out of silverware, ran out of coffee, the workers were crabby and about ready to walk out. Came back to the bar area at night and had to wait with other patrons for over 5 minutes before anyone was behind the bar. Toilets on first floor covered and out of order. Broken window pane in entrance.",
            "title": "Hot, Sweaty, Dirty, Loud and a Rash to boot",
            "user": "MarlinMan35"
        },
        {
            "date": "February 13, 2011",
            "detail_rating": {
                "business": null,
                "cleanliness": 3.0,
                "desk": null,
                "location": 5.0,
                "pool": null,
                "restaurant": null,
                "rooms": 3.0,
                "service": 4.0,
                "sleep": 4.0,
                "value": 4.0
            },
            "helpfulness": null,
            "id": 96512228,
            "likes": {
                "disliked": null,
                "liked": null
            },
            "rating": 4.0,
            "stay_parameters": "Stayed February 2011, traveled with family",
            "text": "Stayed one night and enjoyed the location of this hotel. It is close to everything in downtown St-Louis. Service was excellent and very friendly. Breakfast is not included but excellent with lots of choices. Would return again.",
            "title": "Great Location and Great Service !",
            "user": "Like_a_fish"
        },
        {
            "date": "January 15, 2011",
            "detail_rating": {
                "business": null,
                "cleanliness": 4.0,
                "desk": null,
                "location": 4.0,
                "pool": null,
                "restaurant": null,
                "rooms": 4.0,
                "service": 4.0,
                "sleep": 4.0,
                "value": 4.0
            },
            "helpfulness": 1,
            "id": 93115885,
            "likes": {
                "disliked": null,
                "liked": null
            },
            "rating": 4.0,
            "stay_parameters": "Stayed December 2010, traveled with family",
            "text": "Pros:",
            "title": "Great Place Near the Arch",
            "user": "BSpeaker"
        },
        {
            "date": "December 16, 2010",
            "detail_rating": {
                "business": null,
                "cleanliness": 4.0,
                "desk": null,
                "location": 3.0,
                "pool": null,
                "restaurant": null,
                "rooms": 3.0,
                "service": 4.0,
                "sleep": 3.0,
                "value": 3.0
            },
            "helpfulness": null,
            "id": 90003383,
            "likes": {
                "disliked": null,
                "liked": null
            },
            "rating": 3.0,
            "stay_parameters": "Stayed November 2010, traveled as a couple",
            "text": "- Two blocks from the arch",
            "title": "What makes this Select?",
            "user": "BrownStreet"
        },
        {
            "date": "December 13, 2010",
            "detail_rating": {
                "business": null,
                "cleanliness": 4.0,
                "desk": null,
                "location": 4.0,
                "pool": null,
                "restaurant": null,
                "rooms": 4.0,
                "service": 3.0,
                "sleep": 5.0,
                "value": 5.0
            },
            "helpfulness": 1,
            "id": 89768456,
            "likes": {
                "disliked": null,
                "liked": null
            },
            "rating": 3.0,
            "stay_parameters": "Stayed December 2010, traveled as a couple",
            "text": "- Beautiful lobby",
            "title": "Not too bad.",
            "user": "scottpajason"
        },
        {
            "date": "December 6, 2010",
            "detail_rating": {
                "business": null,
                "cleanliness": 3.0,
                "desk": null,
                "location": 4.0,
                "pool": null,
                "restaurant": null,
                "rooms": 2.0,
                "service": 3.0,
                "sleep": null,
                "value": 4.0
            },
            "helpfulness": null,
            "id": 89163653,
            "likes": {
                "disliked": null,
                "liked": null
            },
            "rating": 3.0,
            "stay_parameters": "Stayed July 2010, traveled as a couple",
            "text": "- Hotwire rate: $49",
            "title": "Just Okay",
            "user": "Alicialee45"
        },
        {
            "date": "November 6, 2010",
            "detail_rating": {
                "business": null,
                "cleanliness": 5.0,
                "desk": null,
                "location": 5.0,
                "pool": null,
                "restaurant": null,
                "rooms": 5.0,
                "service": 5.0,
                "sleep": 5.0,
                "value": 5.0
            },
            "helpfulness": null,
            "id": 86207005,
            "likes": {
                "disliked": null,
                "liked": null
            },
            "rating": 5.0,
            "stay_parameters": "Stayed October 2010, traveled with friends",
            "text": "I read some complaints and was skeptical to book at this hotel.",
            "title": "We would stay there again",
            "user": "TKALL17"
        },
        {
            "date": "October 22, 2010",
            "detail_rating": {
                "business": null,
                "cleanliness": 5.0,
                "desk": null,
                "location": 5.0,
                "pool": null,
                "restaurant": null,
                "rooms": 5.0,
                "service": 5.0,
                "sleep": 5.0,
                "value": 5.0
            },
            "helpfulness": 1,
            "id": 84430985,
            "likes": {
                "disliked": null,
                "liked": null
            },
            "rating": 5.0,
            "stay_parameters": "Stayed October 2010, traveled on business",
            "text": "The staff at the front desk was very nice. The elevators were not slow, and I was able to get internet service. We had three rooms, two on the 4th floor overlooking the pool (426, 428) Very nice rooms, and clean. Yes we paid for parking, but all hotels in this area charge for parking. At some hotels in this area you have to park a lot farther away from the hotel itself. We had no problems with our room and we would stay there again. Very close to everything, a very, very short walk to Washington.",
            "title": "Great Looking, Friendly, Professional, Comfortable",
            "user": "TabithaMontgomery"
        },
        {
            "date": "October 2, 2010",
            "detail_rating": {
                "business": null,
                "cleanliness": 3.0,
                "desk": null,
                "location": 5.0,
                "pool": null,
                "restaurant": null,
                "rooms": 3.0,
                "service": 3.0,
                "sleep": 3.0,
                "value": 3.0
            },
            "helpfulness": 1,
            "id": 81818321,
            "likes": {
                "disliked": null,
                "liked": null
            },
            "rating": 2.0,
            "stay_parameters": "Stayed October 2010, traveled on business",
            "text": "I don't know what the complaints were about.",
            "title": "Need Internet? Don't stay here. Tired.",
            "user": "Indianaman"
        },
        {
            "date": "September 30, 2010",
            "detail_rating": {
                "business": null,
                "cleanliness": 3.0,
                "desk": null,
                "location": 5.0,
                "pool": null,
                "restaurant": null,
                "rooms": 2.0,
                "service": 2.0,
                "sleep": null,
                "value": 3.0
            },
            "helpfulness": null,
            "id": 81672644,
            "likes": {
                "disliked": null,
                "liked": null
            },
            "rating": 3.0,
            "stay_parameters": "Stayed September 2010",
            "text": "I stayed at the Holiday Inn Downtown (Conv Center) and was very pleased with the renovations. The lobby was amazing and looked very modern and comfortable. It didn't have the old Holiday Inn look, but rather an upscale look like the high dollar, down town hotels. When I checked in, it went very quickly and smoothly - I was greeted as a Priority customer and given extras - paper, later check out time. My room was clean, comfortable and there were no problems with noise or supplies.",
            "title": "A mess at first!!!!",
            "user": "Mzzdimples"
        },
        {
            "date": "September 27, 2010",
            "detail_rating": {
                "business": null,
                "cleanliness": 2.0,
                "desk": null,
                "location": 3.0,
                "pool": null,
                "restaurant": null,
                "rooms": 2.0,
                "service": 3.0,
                "sleep": 3.0,
                "value": 2.0
            },
            "helpfulness": null,
            "id": 81280460,
            "likes": {
                "disliked": null,
                "liked": null
            },
            "rating": 2.0,
            "stay_parameters": "Stayed September 2010, traveled on business",
            "text": "My overall felling about this hotel is that I would rather stay here than any other hotel in downtown St Louis. The price is very reasonable and the amenities great!",
            "title": "Should have known better",
            "user": "Manteno"
        },
        {
            "date": "June 23, 2011",
            "detail_rating": {
                "business": null,
                "cleanliness": null,
                "desk": null,
                "location": null,
                "pool": null,
                "restaurant": null,
                "rooms": null,
                "service": null,
                "sleep": null,
                "value": null
            },
            "helpfulness": null,
            "id": 114672704,
            "likes": {
                "disliked": null,
                "liked": null
            },
            "rating": 2.0,
            "stay_parameters": null,
            "text": "Yes, this place SMELLS bad! The rooms are just OK, barely OK. The carpets are dirty and the walls are paper thin. Service is to be desired. For a nickel more, go first class to the Rennissance up the road...",
            "title": "Not Good",
            "user": "daisy20071960"
        },
        {
            "date": "June 20, 2011",
            "detail_rating": {
                "business": null,
                "cleanliness": 3.0,
                "desk": null,
                "location": 5.0,
                "pool": null,
                "restaurant": null,
                "rooms": 2.0,
                "service": 2.0,
                "sleep": null,
                "value": 3.0
            },
            "helpfulness": null,
            "id": 114580841,
            "likes": {
                "disliked": null,
                "liked": null
            },
            "rating": 3.0,
            "stay_parameters": "Stayed July 2010",
            "text": "Old smell, not the best upkeep. Only good thing is location. They do not deal with crowds well. Avoid the pool courtyard, it is very loud.",
            "title": "Road Crew lodging",
            "user": "Mitchie69"
        },
        {
            "date": "May 12, 2011",
            "detail_rating": {
                "business": null,
                "cleanliness": 5.0,
                "desk": null,
                "location": 5.0,
                "pool": null,
                "restaurant": null,
                "rooms": 3.0,
                "service": 4.0,
                "sleep": 3.0,
                "value": 4.0
            },
            "helpfulness": null,
            "id": 108009074,
            "likes": {
                "disliked": null,
                "liked": null
            },
            "rating": 3.0,
            "stay_parameters": "Stayed May 2011, traveled as a couple",
            "text": "The hotel site says it went through an extensive remodeling. Unfortunately, in all that, you can't get out the old smell. Like when you go into the home of an elderly person, it smells a certain way, same thing. The room we were upgraded to was attached to a parlor, which was pretty cool. The bed was nice, not amazing. The rooms had regular tv's, not flat screens, which addd to the retro vibe. The staff was friendly. The proximity to restaurants and downtown activities is great, even though the rooms have no view. (It's only 5 stories high and you can't see over the convention center). I would rather check into other hotels if we were coming back to the area.",
            "title": "Good Location, Smells old!",
            "user": "Frugalista83"
        },
        {
            "date": "April 20, 2011",
            "detail_rating": {
                "business": null,
                "cleanliness": 4.0,
                "desk": null,
                "location": 4.0,
                "pool": null,
                "restaurant": null,
                "rooms": 4.0,
                "service": 3.0,
                "sleep": 5.0,
                "value": 3.0
            },
            "helpfulness": null,
            "id": 104792156,
            "likes": {
                "disliked": null,
                "liked": null
            },
            "rating": 3.0,
            "stay_parameters": "Stayed April 2011, traveled with friends",
            "text": "I got the deal from hot-wire. We got a great price. The motel was nice. It was like any other Holiday inn. It was kind of slow. The bar closed early on Friday and wan't to go to the bar and it was closed by 11:00. was hoping to spend time on Sat in the bar and was again closed 11:00. The mail bartender was super nice.. He was very friendly, made great drinks and get service. The women with the tattoo is rude and slow and complains in front of everyone. The only front desk person that was nice was Tim the rest was rude and didn't seem to care.",
            "title": "good deal",
            "user": "justforfun99"
        },
        {
            "date": "March 28, 2011",
            "detail_rating": {
                "business": null,
                "cleanliness": 4.0,
                "desk": null,
                "location": 3.0,
                "pool": null,
                "restaurant": null,
                "rooms": 4.0,
                "service": 4.0,
                "sleep": null,
                "value": 5.0
            },
            "helpfulness": null,
            "id": 101928819,
            "likes": {
                "disliked": null,
                "liked": null
            },
            "rating": 4.0,
            "stay_parameters": "Stayed March 2011",
            "text": "We booked this hotel online and got a really good deal. It was a nice hotel. We arrived at 2pm and already had our room ready. In the evening for diner there was tons of restaurants near by. The parking was $15 per night. If you want to sleep in late do not get a room over looking the pool. 2 screaming kids woke us up way earlier than we wanted to get up. We work nights and that really sucked. Other than that it was a good hotel for the price.",
            "title": "Nice hotel, very good price.",
            "user": "kimberstudio"
        }
    ],
    "slim_ranking": 0.650406504065,
    "stars": 3,
    "tripadvisor": {
        "VISITED": false,
        "country_name": null,
        "locality": null,
        "pic_link": null,
        "street_address": null
    },
    "user_rating": 3.0,
    "variance": {
        "average": 219,
        "excellent": 95,
        "poor": 171,
        "terrible": 99,
        "very good": 163
    }
}