{
    "aka": null,
    "description": "Masked by its unassuming fa\u00e7ade, lies a haven of luxuriant calm. Pass through its portals to enter the enchanted world of a traditional medina, where you will be embraced by the Moroccan art of living and overwhelmed by so much to discover. Personalized service with a caring staff to enjoy the tranquility of the six rooms.Home airport, evening and traditional cuisine, car rental, steam neighborhood. Many services to make your stay unforgettable. Hidden in the medina in the heart of a labyrinth of alleys, opened a haven of peace delivering you the enchanting world of a riad in the authentic preserved. You will taste the Moroccan art of living, real dazzle to your sense of wonder..",
    "detail_rating": {
        "cleanliness": null,
        "location": null,
        "rooms": null,
        "service": null,
        "sleep": null,
        "value": null
    },
    "location": {
        "city": "Marrakech",
        "continent": "Africa",
        "country": "Morocco",
        "proposed_city": null,
        "province": null,
        "region": "Marrakech-Tensift-El Haouz Region"
    },
    "name": "Riad Chamali",
    "places": {
        "aka": [],
        "hotel_description": [],
        "hotel_name": []
    },
    "review_count": 183,
    "review_count_current": 6,
    "reviews": [
        {
            "date": "December 9, 2008",
            "detail_rating": {
                "business": null,
                "cleanliness": 5.0,
                "desk": null,
                "front_desk": 3.0,
                "location": 4.0,
                "pool": null,
                "restaurant": null,
                "rooms": 4.0,
                "service": 5.0,
                "sleep": null,
                "value": 5.0
            },
            "helpfulness": 1,
            "id": 22585185,
            "likes": {
                "disliked": "\u2014 Shared bathroom",
                "liked": "\u2014 Location, the terrace"
            },
            "rating": 4.0,
            "stay_parameters": "Stayed December 2008",
            "text": "My friend and I (both female) stayed here for three nights in the Gnaoua room., and I thought what we got for the price, which was only 30 euros, was excellent. Ok so it was a shared bathroom, but the communal areas were attractive, the staff were lovely, bringing us breakfast on the terrace, and the place was spotless. We looked at other places but would have had to stay in a dorm for the same money. The riad is located by the Royal Palace, south of the mellah, which is about a 20 minute walk from the square, so isn't brilliant if you don't like walking. However on the way you pass through many interesting sites, the mellah market (a much more authentic feel than the main roads of the souks), the excellent kosybar and tanjir bars for a late night drink, lots of hammams, shops etc. Seeing some reviews of other riads makes me think people have unrealistic expectations of what they will get for their money, so don't expect luxury rooms or 5 star service or no- dirt on the street, local kids being kids, dust or hassle because that is what marrakech is like and if these things offend you then you shouldn't go there. But if you like simple clean attractive accomodation with lots of character then this place is great and I would go back tomorrow!",
            "title": "Great value riad!",
            "user": "Monkey4009"
        },
        {
            "date": "January 13, 2010",
            "detail_rating": {
                "business": null,
                "cleanliness": 4.0,
                "desk": null,
                "location": 3.0,
                "pool": null,
                "restaurant": null,
                "rooms": 4.0,
                "service": 4.0,
                "sleep": null,
                "value": 4.0
            },
            "helpfulness": null,
            "id": 53352007,
            "likes": {
                "disliked": null,
                "liked": null
            },
            "rating": 4.0,
            "stay_parameters": "Stayed January 2010, traveled as a couple",
            "text": "Riad Chamali is a lovely guesthouse in the middle of quite a suburban area (about 20mins walk from the main square). It's almost impossible to find on your own, we arrived at dark and were actually a bit scared! It does seem to be in quite a shady part of town.",
            "title": "Beautiful Riad - but be warned if you are not bilingual",
            "user": "Beckiboo1983"
        },
        {
            "date": "December 10, 2009",
            "detail_rating": {
                "business": null,
                "cleanliness": 5.0,
                "desk": null,
                "location": 5.0,
                "pool": null,
                "restaurant": null,
                "rooms": 5.0,
                "service": 5.0,
                "sleep": null,
                "value": 5.0
            },
            "helpfulness": null,
            "id": 51006256,
            "likes": {
                "disliked": null,
                "liked": null
            },
            "rating": 5.0,
            "stay_parameters": "Stayed November 2009, traveled as a couple",
            "text": "Unfortunately the Riad did not send a driver to pick us up, even though I had asked for one... maybe this was a mistake due to the language barrier, but we ended up having to get a taxi from the airport, then paying a local boy to take us to the Riad!",
            "title": "Gorgeous Riad - Peaceful Haven in Crazy Marrakech!",
            "user": "LaurenAndChrisHols"
        },
        {
            "date": "November 26, 2009",
            "detail_rating": {
                "business": null,
                "cleanliness": 5.0,
                "desk": null,
                "location": 4.0,
                "pool": null,
                "restaurant": null,
                "rooms": 5.0,
                "service": 5.0,
                "sleep": null,
                "value": 5.0
            },
            "helpfulness": null,
            "id": 50124513,
            "likes": {
                "disliked": null,
                "liked": null
            },
            "rating": 5.0,
            "stay_parameters": "Stayed November 2009, traveled with friends",
            "text": "I would advise anyone who is booking that the staff there speak NO ENGLISH at all, not even a little bit. We struggled a bit to converse with the staff there, although this is due to our own ignorance as they spoke French, Spanish and Arabic, but unfortunately no English. This made it difficult to ask for things we needed... on the first morning we wanted to ask where things were, how to book tours etc, but weren't able to - although we did get by with my very basic French!",
            "title": "Incredible value for money",
            "user": "raqueluchi"
        },
        {
            "date": "September 12, 2009",
            "detail_rating": {
                "business": null,
                "cleanliness": 5.0,
                "desk": null,
                "location": 5.0,
                "pool": null,
                "restaurant": null,
                "rooms": 5.0,
                "service": 5.0,
                "sleep": null,
                "value": 5.0
            },
            "helpfulness": null,
            "id": 41104026,
            "likes": {
                "disliked": null,
                "liked": null
            },
            "rating": 5.0,
            "stay_parameters": "Stayed June 2009, traveled on business",
            "text": "Our room cost \u20ac60 a night, it was a very nice room, big and with a WC/hot shower, although it wasn't as cheap as I thought it would be. I think Marrakech has been hit by the tourist boom so don't expect things to be as cheap as you would imagine!",
            "title": "une oasis de tranquilit\u00e9, un reve marocain, \u00e0 petits prix",
            "user": "chloe0312"
        },
        {
            "date": "August 9, 2009",
            "detail_rating": {
                "business": null,
                "cleanliness": 5.0,
                "desk": null,
                "location": 3.0,
                "pool": null,
                "restaurant": null,
                "rooms": 5.0,
                "service": 5.0,
                "sleep": null,
                "value": 5.0
            },
            "helpfulness": 1,
            "id": 37164571,
            "likes": {
                "disliked": null,
                "liked": null
            },
            "rating": 5.0,
            "stay_parameters": "Stayed July 2009, traveled as a couple",
            "text": "Breakfast was lovely, fresh breads, butter and jam, with coffee or tea. The staff were all very nice and professional, but I would say if you don't know ANY French or Spanish to consider this before booking the hotel.",
            "title": "Amazing value hidden gem",
            "user": "LondonJoH"
        }
    ],
    "slim_ranking": 0.189536031589,
    "stars": 2,
    "tripadvisor": {
        "VISITED": false,
        "country_name": null,
        "locality": null,
        "pic_link": null,
        "street_address": null
    },
    "user_rating": 4.5,
    "variance": {
        "average": 4,
        "excellent": 133,
        "poor": 3,
        "terrible": 2,
        "very good": 41
    }
}