{
    "aka": "Hotel Siroco Benalmadena",
    "description": "The Siroco hotel is located at the tourist center of Benalmadena, at 200m from the beach (which is accessible through an underground tunnel) and the marina.",
    "detail_rating": {
        "cleanliness": 4.0,
        "location": 4.0,
        "rooms": 3.5,
        "service": 3.5,
        "sleep": 3.5,
        "value": 3.5
    },
    "location": {
        "city": null,
        "continent": "Europe",
        "country": "Spain",
        "proposed_city": null,
        "province": null,
        "region": "Andalucia"
    },
    "name": "Siroco Hotel",
    "places": {
        "aka": [],
        "hotel_description": [],
        "hotel_name": []
    },
    "review_count": 645,
    "review_count_current": 20,
    "reviews": [
        {
            "date": "February 14, 2011",
            "detail_rating": {
                "business": null,
                "cleanliness": 5.0,
                "desk": null,
                "location": 5.0,
                "pool": null,
                "restaurant": null,
                "rooms": 3.0,
                "service": 1.0,
                "sleep": 3.0,
                "value": 5.0
            },
            "helpfulness": null,
            "id": 96599928,
            "likes": {
                "disliked": null,
                "liked": null
            },
            "rating": 3.0,
            "stay_parameters": "Stayed February 2011, traveled as a couple",
            "text": "had a 2 week stay..............",
            "title": "brill location",
            "user": "Bridgang"
        },
        {
            "date": "February 9, 2011",
            "detail_rating": {
                "business": null,
                "cleanliness": 4.0,
                "desk": null,
                "location": 5.0,
                "pool": null,
                "restaurant": null,
                "rooms": 4.0,
                "service": 4.0,
                "sleep": 4.0,
                "value": 5.0
            },
            "helpfulness": 1,
            "id": 96062246,
            "likes": {
                "disliked": null,
                "liked": null
            },
            "rating": 4.0,
            "stay_parameters": "Stayed February 2011, traveled as a couple",
            "text": "room cleaned everyday.",
            "title": "Return visit - Excellent value",
            "user": "Ystrady"
        },
        {
            "date": "February 9, 2011",
            "detail_rating": {
                "business": null,
                "cleanliness": 5.0,
                "desk": null,
                "location": 4.0,
                "pool": null,
                "restaurant": null,
                "rooms": 5.0,
                "service": 4.0,
                "sleep": 5.0,
                "value": 5.0
            },
            "helpfulness": 1,
            "id": 96045877,
            "likes": {
                "disliked": null,
                "liked": null
            },
            "rating": 4.0,
            "stay_parameters": "Stayed February 2011, traveled with friends",
            "text": "stayed half board, food nothing special if you love fish you will be fine.",
            "title": "good value hotel",
            "user": "good-2-be-away"
        },
        {
            "date": "February 5, 2011",
            "detail_rating": {
                "business": null,
                "cleanliness": 5.0,
                "desk": null,
                "location": 5.0,
                "pool": null,
                "restaurant": null,
                "rooms": 5.0,
                "service": 4.0,
                "sleep": 5.0,
                "value": 5.0
            },
            "helpfulness": 3,
            "id": 95592388,
            "likes": {
                "disliked": null,
                "liked": null
            },
            "rating": 4.0,
            "stay_parameters": "Stayed February 2011, traveled with family",
            "text": "STAFF VERY RUDE.",
            "title": "great hotel and excellent value!",
            "user": "rainyday4"
        },
        {
            "date": "February 5, 2011",
            "detail_rating": {
                "business": null,
                "cleanliness": 4.0,
                "desk": null,
                "location": 4.0,
                "pool": null,
                "restaurant": null,
                "rooms": 3.0,
                "service": 3.0,
                "sleep": 3.0,
                "value": 4.0
            },
            "helpfulness": 6,
            "id": 95566834,
            "likes": {
                "disliked": null,
                "liked": null
            },
            "rating": 4.0,
            "stay_parameters": "Stayed January 2011, traveled solo",
            "text": "got bitten by mozzies everyday, hotel has a problem with them, cleaners carry a massive tin of spray around with them.",
            "title": "Very Good Value",
            "user": "jetsoff"
        },
        {
            "date": "May 21, 2011",
            "detail_rating": {
                "business": null,
                "cleanliness": 4.0,
                "desk": null,
                "location": 5.0,
                "pool": null,
                "restaurant": null,
                "rooms": 4.0,
                "service": 2.0,
                "sleep": 4.0,
                "value": 3.0
            },
            "helpfulness": null,
            "id": 109253210,
            "likes": {
                "disliked": null,
                "liked": null
            },
            "rating": 3.0,
            "stay_parameters": "Stayed November 2010, traveled solo",
            "text": "I was annoyed to say the least when I found out the check out was at 10am. For most of the hotels in the region it around 12 so when your flight back home is at 6pm that is a long time to be clicking your heels. That said the hotel was clean and smart with beautiful spacious gardens and plenty of pool space. The food was very fresh and tasty. The downside was the drinks service, out of 5 nights I was offered a drink only twice and even then on one occasion the drink did not materialize, it was not even busy. Still, a decent three star hotel in a very good location for the beach and bars etc. (Providing you are on an earlyish flight out!)",
            "title": "10 am check out, please note!",
            "user": "Gedski"
        },
        {
            "date": "May 19, 2011",
            "detail_rating": {
                "business": null,
                "cleanliness": 4.0,
                "desk": null,
                "location": 5.0,
                "pool": null,
                "restaurant": null,
                "rooms": 3.0,
                "service": 4.0,
                "sleep": 1.0,
                "value": 1.0
            },
            "helpfulness": 7,
            "id": 108945497,
            "likes": {
                "disliked": null,
                "liked": null
            },
            "rating": 1.0,
            "stay_parameters": "Stayed May 2011, traveled as a couple",
            "text": "We stay at this Hotel twice a year and we have never complained. This vacation turned out to be a nightmare which left my wife and I scarred for life.",
            "title": "5th Floor is very dangerous",
            "user": "denn_wanderer"
        },
        {
            "date": "May 15, 2011",
            "detail_rating": {
                "business": null,
                "cleanliness": 4.0,
                "desk": null,
                "location": 5.0,
                "pool": null,
                "restaurant": null,
                "rooms": 3.0,
                "service": 4.0,
                "sleep": 5.0,
                "value": 5.0
            },
            "helpfulness": null,
            "id": 108373075,
            "likes": {
                "disliked": null,
                "liked": null
            },
            "rating": 4.0,
            "stay_parameters": "Stayed May 2011, traveled as a couple",
            "text": "We booked in 7th May and departed 17th. We were allocated a roor room which was directly on the roof space opposite the giant neon which say`s Siroco.",
            "title": "good value.and great location",
            "user": "YorkshireJeanie60"
        },
        {
            "date": "April 23, 2011",
            "detail_rating": {
                "business": null,
                "cleanliness": 5.0,
                "desk": null,
                "location": 5.0,
                "pool": null,
                "restaurant": null,
                "rooms": 5.0,
                "service": 5.0,
                "sleep": 4.0,
                "value": 5.0
            },
            "helpfulness": 4,
            "id": 105192299,
            "likes": {
                "disliked": null,
                "liked": null
            },
            "rating": 5.0,
            "stay_parameters": "Stayed April 2011, traveled as a couple",
            "text": "I will not say what happened around 4 am in the early hours of Monday morning as one day you will find out.",
            "title": "Lovely Hotel, Great location",
            "user": "hayley070672"
        },
        {
            "date": "April 22, 2011",
            "detail_rating": {
                "business": null,
                "cleanliness": 4.0,
                "desk": null,
                "location": 2.0,
                "pool": null,
                "restaurant": null,
                "rooms": 3.0,
                "service": 1.0,
                "sleep": 4.0,
                "value": 1.0
            },
            "helpfulness": 2,
            "id": 104994721,
            "likes": {
                "disliked": null,
                "liked": null
            },
            "rating": 2.0,
            "stay_parameters": "Stayed April 2011, traveled as a couple",
            "text": "If you ever book a room in this hotel, make sure you do not occupy a room on the 5th floor. There are only 5 rooms in this location, all are dangerous.",
            "title": "Unwelcoming",
            "user": "Kayleigh086"
        },
        {
            "date": "March 22, 2011",
            "detail_rating": {
                "business": null,
                "cleanliness": 4.0,
                "desk": null,
                "location": 4.0,
                "pool": null,
                "restaurant": null,
                "rooms": 3.0,
                "service": 3.0,
                "sleep": 4.0,
                "value": 4.0
            },
            "helpfulness": null,
            "id": 101105158,
            "likes": {
                "disliked": null,
                "liked": null
            },
            "rating": 4.0,
            "stay_parameters": "Stayed March 2011, traveled as a couple",
            "text": "Just back from another March visit to Siroco.",
            "title": "Still great value Hotel. No frills. Good location.",
            "user": "the-gadgie"
        },
        {
            "date": "March 12, 2011",
            "detail_rating": {
                "business": null,
                "cleanliness": 5.0,
                "desk": null,
                "location": 4.0,
                "pool": null,
                "restaurant": null,
                "rooms": 5.0,
                "service": 5.0,
                "sleep": 5.0,
                "value": 4.0
            },
            "helpfulness": 1,
            "id": 99920936,
            "likes": {
                "disliked": null,
                "liked": null
            },
            "rating": 4.0,
            "stay_parameters": "Stayed February 2011, traveled as a couple",
            "text": "Nothing much changed. If anything slightly less choice at mealtimes although as always there was still plenty to go round. Quality still reasonable and that huge pig farm in Spain continues its endless supply of meat.",
            "title": "benalmadena just fantastic siroco grate",
            "user": "dececcy"
        },
        {
            "date": "March 4, 2011",
            "detail_rating": {
                "business": null,
                "cleanliness": 5.0,
                "desk": null,
                "location": 5.0,
                "pool": null,
                "restaurant": null,
                "rooms": 4.0,
                "service": 3.0,
                "sleep": 3.0,
                "value": 4.0
            },
            "helpfulness": 4,
            "id": 98906098,
            "likes": {
                "disliked": null,
                "liked": null
            },
            "rating": 4.0,
            "stay_parameters": "Stayed February 2011, traveled as a couple",
            "text": "I would say that hotel was busier than I've seen it in March in 5 years of visiting. Dining room got busy at times but never a problem getting a table.",
            "title": "Very enjoyable stay, had a great holiday",
            "user": "sopranos1969"
        },
        {
            "date": "February 27, 2011",
            "detail_rating": {
                "business": null,
                "cleanliness": 4.0,
                "desk": null,
                "location": 4.0,
                "pool": null,
                "restaurant": null,
                "rooms": 4.0,
                "service": 4.0,
                "sleep": 4.0,
                "value": 4.0
            },
            "helpfulness": null,
            "id": 98266083,
            "likes": {
                "disliked": null,
                "liked": null
            },
            "rating": 4.0,
            "stay_parameters": "Stayed February 2011, traveled as a couple",
            "text": "Poolside also very busy but again plenty loungers to go around. Still sunbathing weather at 6.00pm. Can't be bad.",
            "title": "Better inside than outside",
            "user": "roadrunnerMidlands"
        },
        {
            "date": "February 26, 2011",
            "detail_rating": {
                "business": null,
                "cleanliness": 4.0,
                "desk": null,
                "location": 4.0,
                "pool": null,
                "restaurant": null,
                "rooms": 4.0,
                "service": 4.0,
                "sleep": 4.0,
                "value": 5.0
            },
            "helpfulness": 1,
            "id": 98133539,
            "likes": {
                "disliked": null,
                "liked": null
            },
            "rating": 4.0,
            "stay_parameters": "Stayed February 2011, traveled with family",
            "text": "As usual, gave the entertainment a miss. Usual cheesy stuff - snake show, parrot show, magician, singer and Jose and his amazing organ.",
            "title": "Excellent value hotel for low season with good food. Hotel very clean if a little tired looking.",
            "user": "tellasitis"
        },
        {
            "date": "April 17, 2011",
            "detail_rating": {
                "business": null,
                "cleanliness": 4.0,
                "desk": null,
                "location": 3.0,
                "pool": null,
                "restaurant": null,
                "rooms": 3.0,
                "service": 2.0,
                "sleep": null,
                "value": 1.0
            },
            "helpfulness": 1,
            "id": 104375890,
            "likes": {
                "disliked": null,
                "liked": null
            },
            "rating": 1.0,
            "stay_parameters": "Stayed April 2011, traveled as a couple",
            "text": "Arrived to a nice welcome on the Thursday AM, room available and cleaned. Every thing you may need in the bathroom was supplied. Gardens are lovely, but beware of the mosquitos around the carp ponds and rooms above. Nice day Thursday and Friday, but on Saturday to our horror - a hundred and odd German students on a half break bender appeared.",
            "title": "Beware the mossies and the 18 - 30 german students in school holidays",
            "user": "pensionerat58"
        },
        {
            "date": "April 16, 2011",
            "detail_rating": {
                "business": null,
                "cleanliness": 5.0,
                "desk": null,
                "location": 4.0,
                "pool": null,
                "restaurant": null,
                "rooms": 4.0,
                "service": 5.0,
                "sleep": 5.0,
                "value": 4.0
            },
            "helpfulness": null,
            "id": 104244194,
            "likes": {
                "disliked": null,
                "liked": null
            },
            "rating": 5.0,
            "stay_parameters": "Stayed April 2011, traveled as a couple",
            "text": "Music, noise and drunkeness 24/7 from then on. 2 with megaphones all night - All staff then appeared to speak Spanish only so couldn't/wouldn't deal with complaints. Corridors and stairwells full of students bin the mornings fast asleep. pool no go area seems we holidayed with an 18 - 30 hotel.",
            "title": "Excellent customer service and good location.",
            "user": "eric23mitchell"
        },
        {
            "date": "April 16, 2011",
            "detail_rating": {
                "business": null,
                "cleanliness": 3.0,
                "desk": null,
                "location": 4.0,
                "pool": null,
                "restaurant": null,
                "rooms": 1.0,
                "service": 2.0,
                "sleep": 2.0,
                "value": 2.0
            },
            "helpfulness": 1,
            "id": 104219459,
            "likes": {
                "disliked": null,
                "liked": null
            },
            "rating": 2.0,
            "stay_parameters": "Stayed April 2011, traveled as a couple",
            "text": "Booked hotel via Booking.com we made a huge mistake by double booking this hotel. Could have been charged for a NO SHOW for 6 nights but the staff at the Siroco and the guys at booking.com helped us sort out the mess. They went further at the Siroco and upgraded our stay free of charge at the 4star Trinton with a fine sea view room. So thanks guys you made our holiday.",
            "title": "Worth 2 star rating for rooms",
            "user": "segway007"
        },
        {
            "date": "April 13, 2011",
            "detail_rating": {
                "business": null,
                "cleanliness": 3.0,
                "desk": null,
                "location": 4.0,
                "pool": null,
                "restaurant": null,
                "rooms": 2.0,
                "service": 2.0,
                "sleep": 1.0,
                "value": 2.0
            },
            "helpfulness": 2,
            "id": 103892136,
            "likes": {
                "disliked": null,
                "liked": null
            },
            "rating": 2.0,
            "stay_parameters": "Stayed April 2011, traveled as a couple",
            "text": "Great swimming pools, wonderful gardens. The room we were given at first faced a concrete wall & was over the laundry room- terrible noise from 7 am to 7 pm. After complaining we were moved to another room. The air con did not work, the shower was broken, the balcony door handle/ lock was just hanging down & the bathroom was so small you had to hang your legs in the bath to sit on the toilet! Pigeons mess on the balcony table & chairs was not cleaned off all week. No drawers to put clothes, etc. People at reception had little English. If you hire a car the hotel will charge you 6 euro a day for parking! The town itself was kept very clean",
            "title": "Mossie City",
            "user": "colleen"
        },
        {
            "date": "April 5, 2011",
            "detail_rating": {
                "business": null,
                "cleanliness": 5.0,
                "desk": null,
                "location": 4.0,
                "pool": null,
                "restaurant": null,
                "rooms": 4.0,
                "service": 4.0,
                "sleep": 4.0,
                "value": 5.0
            },
            "helpfulness": 3,
            "id": 102963218,
            "likes": {
                "disliked": null,
                "liked": null
            },
            "rating": 4.0,
            "stay_parameters": "Stayed March 2011, traveled with friends",
            "text": "I have just returned from this hotel and I am covered in Mossie bites. The hotel is full of them. We were out and about during the day and we did not encounter any mossies elsewhere but if you value your skin DO NOT STAY HERE. I have 27 lumps on my arms and legs and my husband has even more. ....",
            "title": "Good hotel for the price (but watch out for mosquitoes)",
            "user": "Deepthinker22"
        }
    ],
    "slim_ranking": 0.5,
    "stars": 3,
    "tripadvisor": {
        "VISITED": false,
        "country_name": null,
        "locality": null,
        "pic_link": null,
        "street_address": null
    },
    "user_rating": 3.5,
    "variance": {
        "average": 154,
        "excellent": 100,
        "poor": 70,
        "terrible": 47,
        "very good": 274
    }
}