{
    "aka": "Residence Inn White Plains Hotel White Plains",
    "description": null,
    "detail_rating": {
        "cleanliness": null,
        "location": null,
        "rooms": null,
        "service": null,
        "sleep": null,
        "value": null
    },
    "location": {
        "city": null,
        "continent": null,
        "country": "United States",
        "proposed_city": null,
        "province": null,
        "region": null
    },
    "name": "Residence Inn White Plains",
    "places": {
        "aka": [],
        "hotel_description": [],
        "hotel_name": []
    },
    "review_count": 106,
    "review_count_current": 20,
    "reviews": [
        {
            "date": "May 7, 2013",
            "detail_rating": {
                "business": null,
                "cleanliness": 5.0,
                "desk": null,
                "location": 5.0,
                "pool": null,
                "restaurant": null,
                "rooms": 5.0,
                "service": 5.0,
                "sleep": 5.0,
                "value": 5.0
            },
            "helpfulness": null,
            "id": 159942685,
            "likes": {
                "disliked": null,
                "liked": null
            },
            "rating": 5.0,
            "stay_parameters": "Stayed April 2013, traveled with family",
            "text": "My wife and I found the service at the Residence Inn in White Plains to be excellent. The room was a really good size and very clean. They have a buffet breakfast, where you can make your own waffles, all included in the room rate, as well on on site, free parking. Really convenient located if you want to do day trips to Manhattan.",
            "title": "Excellent value",
            "user": "silentgman"
        },
        {
            "date": "May 7, 2013",
            "detail_rating": {
                "business": null,
                "cleanliness": 5.0,
                "desk": null,
                "location": 5.0,
                "pool": null,
                "restaurant": null,
                "rooms": 4.0,
                "service": 5.0,
                "sleep": 4.0,
                "value": 5.0
            },
            "helpfulness": null,
            "id": 159920963,
            "likes": {
                "disliked": null,
                "liked": null
            },
            "rating": 4.0,
            "stay_parameters": "Stayed May 2013, traveled on business",
            "text": "I love this hotel. It's convenient for me when I'm doing business outside of NY. The staff is super friendly and the rooms are clean and roomy. You can't beat the fresh black and white cookies in the lobby everyday either. On site parking is a plus too and pretty reasonable for the price.",
            "title": "Great hotel",
            "user": "jamesonbeckwith"
        },
        {
            "date": "May 7, 2013",
            "detail_rating": {
                "business": null,
                "cleanliness": 4.0,
                "desk": null,
                "location": 5.0,
                "pool": null,
                "restaurant": null,
                "rooms": 5.0,
                "service": 4.0,
                "sleep": 4.0,
                "value": 5.0
            },
            "helpfulness": null,
            "id": 159904666,
            "likes": {
                "disliked": null,
                "liked": null
            },
            "rating": 4.0,
            "stay_parameters": "Stayed April 2013, traveled on business",
            "text": "Great value if you need to stay in White Plains.",
            "title": "Great Value.",
            "user": "flac247"
        },
        {
            "date": "May 7, 2013",
            "detail_rating": {
                "business": null,
                "cleanliness": 5.0,
                "desk": null,
                "location": 5.0,
                "pool": null,
                "restaurant": null,
                "rooms": 5.0,
                "service": 5.0,
                "sleep": 5.0,
                "value": 5.0
            },
            "helpfulness": null,
            "id": 159887419,
            "likes": {
                "disliked": null,
                "liked": null
            },
            "rating": 5.0,
            "stay_parameters": "Stayed April 2013, traveled with friends",
            "text": "Walking distance to everything in downtown. Ample parking. Large rooms. Clean rooms. Friendly service.",
            "title": "Wonderful staff and well kept property.",
            "user": "Sandy27028"
        },
        {
            "date": "May 6, 2013",
            "detail_rating": {
                "business": null,
                "cleanliness": 5.0,
                "desk": null,
                "location": 3.0,
                "pool": null,
                "restaurant": null,
                "rooms": 5.0,
                "service": 5.0,
                "sleep": 4.0,
                "value": 5.0
            },
            "helpfulness": null,
            "id": 159790297,
            "likes": {
                "disliked": null,
                "liked": null
            },
            "rating": 5.0,
            "stay_parameters": "Stayed May 2013, traveled with family",
            "text": "At this price point, you can't find a better stay in White Plains.",
            "title": "Absolutely loved this hotel!",
            "user": "Jackie M"
        },
        {
            "date": "July 2, 2013",
            "detail_rating": {
                "business": null,
                "cleanliness": 3.0,
                "desk": null,
                "location": 4.0,
                "pool": null,
                "restaurant": null,
                "rooms": 4.0,
                "service": 5.0,
                "sleep": 3.0,
                "value": 5.0
            },
            "helpfulness": null,
            "id": 166107075,
            "likes": {
                "disliked": null,
                "liked": null
            },
            "rating": 4.0,
            "stay_parameters": "Stayed June 2013, traveled with family",
            "text": "Stayed at Res. Inn White Plains on weekend of June 28 - July 1, 2013 (3 nights). We were a family of 5. The location is great (walk to everything), the rooms were very spacious (we got an executive suite but the regular suite would have been fine) and the service was amazing. All the staff (especially the front desk) were very nice and accommodating. I would have given the review a 5 star rating but there was no pool and the beds weren't the best. The beds were a bit firm for my liking. My kids would have enjoyed a pool but the extra space in the room sort of made up for the lack of pool. The warm buffet breakfast was good. The Res. Inn is not the Ritz (which is 2 blocks away). But if you want to pay double, have a much smaller room and no breakfast, then stay at the Ritz. Thank you to the front desk at the Res. Inn for this past weekend - sorry guys, I can't remember your names - Jason? and ? The next time I visit White Plains, I will come back to the Res. Inn.",
            "title": "Great Location, Lots of Space and Excellent Service",
            "user": "DanDi35766"
        },
        {
            "date": "June 26, 2013",
            "detail_rating": {
                "business": null,
                "cleanliness": 1.0,
                "desk": null,
                "location": 4.0,
                "pool": null,
                "restaurant": null,
                "rooms": 2.0,
                "service": 3.0,
                "sleep": null,
                "value": 3.0
            },
            "helpfulness": null,
            "id": 165303352,
            "likes": {
                "disliked": null,
                "liked": null
            },
            "rating": 2.0,
            "stay_parameters": "Stayed June 2013",
            "text": "I have stayed in nearly all the Marriott properties in the area and this was my first and last time here.",
            "title": "Old and in need of updating.",
            "user": "Travelerjj_12"
        },
        {
            "date": "June 24, 2013",
            "detail_rating": {
                "business": null,
                "cleanliness": 3.0,
                "desk": null,
                "location": 4.0,
                "pool": null,
                "restaurant": null,
                "rooms": 3.0,
                "service": 3.0,
                "sleep": 3.0,
                "value": 3.0
            },
            "helpfulness": null,
            "id": 165127453,
            "likes": {
                "disliked": null,
                "liked": null
            },
            "rating": 4.0,
            "stay_parameters": "Stayed June 2013, traveled on business",
            "text": "It is old and dirty and needs to be updated ( see just 2 examples with the pics I uploaded ).",
            "title": "Space to spread out",
            "user": "g s"
        },
        {
            "date": "June 2, 2013",
            "detail_rating": {
                "business": null,
                "cleanliness": null,
                "desk": null,
                "location": null,
                "pool": null,
                "restaurant": null,
                "rooms": null,
                "service": null,
                "sleep": null,
                "value": null
            },
            "helpfulness": null,
            "id": 162786928,
            "likes": {
                "disliked": null,
                "liked": null
            },
            "rating": 3.0,
            "stay_parameters": null,
            "text": "It was the most uncomfortable bed with cheap linens. The hallway was so hot as if the Air conditioner was not even working.",
            "title": "Okay, better than the Crowne Plaza...",
            "user": "cindy_weinmann"
        },
        {
            "date": "May 20, 2013",
            "detail_rating": {
                "business": null,
                "cleanliness": 4.0,
                "desk": null,
                "location": 5.0,
                "pool": null,
                "restaurant": null,
                "rooms": 5.0,
                "service": 5.0,
                "sleep": null,
                "value": 5.0
            },
            "helpfulness": null,
            "id": 161275899,
            "likes": {
                "disliked": null,
                "liked": null
            },
            "rating": 4.0,
            "stay_parameters": "Stayed May 2013",
            "text": "The only positive is the location right down town in White Plains. And for all the reviews saying it is such a great vaule and cheaper then the other hotels in the area , I need to say there is a reason why.",
            "title": "Nicest hotel staff anywhere.",
            "user": "karindale"
        },
        {
            "date": "May 3, 2013",
            "detail_rating": {
                "business": null,
                "cleanliness": 5.0,
                "desk": null,
                "location": 5.0,
                "pool": null,
                "restaurant": null,
                "rooms": 5.0,
                "service": 5.0,
                "sleep": 4.0,
                "value": 5.0
            },
            "helpfulness": null,
            "id": 159580739,
            "likes": {
                "disliked": null,
                "liked": null
            },
            "rating": 5.0,
            "stay_parameters": "Stayed April 2013, traveled with family",
            "text": "My husband and I stayed at this hotel for over 60 days while we were in temporary living after moving to this area from Minnesota. The staff was just great! They always said hello when they saw us walking by the front desk and even learned our names. Beverly always greeted us every morning when we came down for breakfast and asked us how we were doing, making sure everything was going well. Jason at the front desk was awesome! He even gave us a recommendation for a pediatrician since we are expecting our first child in a couple months.",
            "title": "Great place for temporary living of 60+ days!",
            "user": "Lauren D"
        },
        {
            "date": "April 24, 2013",
            "detail_rating": {
                "business": null,
                "cleanliness": 4.0,
                "desk": null,
                "location": 4.0,
                "pool": null,
                "restaurant": null,
                "rooms": 4.0,
                "service": 4.0,
                "sleep": 4.0,
                "value": 3.0
            },
            "helpfulness": null,
            "id": 158719071,
            "likes": {
                "disliked": null,
                "liked": null
            },
            "rating": 4.0,
            "stay_parameters": "Stayed April 2013, traveled on business",
            "text": "The location is great. It's within walking distance to lots of restaurants, a mall, Starbucks, the post office, etc. It's also really close to a super nice mall and close to several parkways and 287.We used their same day dry-cleaning service several times. The parking is very convenient. We also had our dog with us the whole time and they were so great with her. When we would call for service when it was convenient for us (with the dog) they would come right up. They also provide dinner every Monday-Thursday night which is nice when you get tired of eating out every night. The room we got was on a corner and very spacious. The rooms also have all the dishes/utensils you need to live for a couple months. We didn't make food in the room very often, but it was nice to have the option. There's also a dishwasher if you do use the dishes.",
            "title": "good location, friendly staff",
            "user": "notravelsurprises"
        },
        {
            "date": "April 22, 2013",
            "detail_rating": {
                "business": null,
                "cleanliness": 5.0,
                "desk": null,
                "location": 5.0,
                "pool": null,
                "restaurant": null,
                "rooms": 5.0,
                "service": 5.0,
                "sleep": 5.0,
                "value": 4.0
            },
            "helpfulness": null,
            "id": 158531786,
            "likes": {
                "disliked": null,
                "liked": null
            },
            "rating": 5.0,
            "stay_parameters": "Stayed April 2013, traveled on business",
            "text": "We would definitely recommend this hotel to others. The staff is really the best. We weren't looking forward to staying in a hotel for this long, but it hasn't even felt that long. We definitely didn't have this sort of experience in the last extended stay hotel we stayed at during our previous move and we're very thankful all they did to make us feel comfortable.",
            "title": "Nicely Refurbished Commons, Excellent Staff",
            "user": "DJG17"
        },
        {
            "date": "April 18, 2013",
            "detail_rating": {
                "business": null,
                "cleanliness": 4.0,
                "desk": null,
                "location": 5.0,
                "pool": null,
                "restaurant": null,
                "rooms": 4.0,
                "service": 4.0,
                "sleep": 4.0,
                "value": 4.0
            },
            "helpfulness": null,
            "id": 158152839,
            "likes": {
                "disliked": null,
                "liked": null
            },
            "rating": 4.0,
            "stay_parameters": "Stayed September 2012, traveled as a couple",
            "text": "Stayed here for 2 nights on business. Suite was very roomy with separate bedroom and living area. Comfey bed. Good work area, easy plugs for electronics, adjustable height desk chair. Wish the desk phone had a speaker.",
            "title": "Great alternative from staying in NYC",
            "user": "rycarse"
        },
        {
            "date": "April 11, 2013",
            "detail_rating": {
                "business": null,
                "cleanliness": 5.0,
                "desk": null,
                "location": 4.0,
                "pool": null,
                "restaurant": null,
                "rooms": 4.0,
                "service": 5.0,
                "sleep": 3.0,
                "value": 4.0
            },
            "helpfulness": null,
            "id": 157437574,
            "likes": {
                "disliked": null,
                "liked": null
            },
            "rating": 5.0,
            "stay_parameters": "Stayed March 2013, traveled on business",
            "text": "Nicely appointed rooms with some signs of aging, eg spots on sofa, minor damage on kitchen baseboard, but generally well kept and clean. Plenty of dishes,silverware, etc. Wish coffee cups were mug size instead of shot-glass size.",
            "title": "Super Friendly Staff",
            "user": "skyvoid"
        },
        {
            "date": "August 17, 2013",
            "detail_rating": {
                "business": null,
                "cleanliness": 4.0,
                "desk": null,
                "location": 5.0,
                "pool": null,
                "restaurant": null,
                "rooms": 4.0,
                "service": 4.0,
                "sleep": 5.0,
                "value": 4.0
            },
            "helpfulness": null,
            "id": 172672493,
            "likes": {
                "disliked": null,
                "liked": null
            },
            "rating": 4.0,
            "stay_parameters": "Stayed February 2013, traveled as a couple",
            "text": "Great one-night stay. The rooms are clean, quiet and large with separate bedroom and living, dining & kitchen areas. The staff is very friendly and helpful. The free breakfast is adequate, but they seemed to have difficulty keeping some things filled. The location is also great and within walking distance of many restaurants, theatre, etc. I would stay here again if I ever returned to White Plains.",
            "title": "Great Stay - Huge Rooms",
            "user": "kekeman"
        },
        {
            "date": "August 13, 2013",
            "detail_rating": {
                "business": null,
                "cleanliness": 5.0,
                "desk": null,
                "location": 5.0,
                "pool": null,
                "restaurant": null,
                "rooms": 5.0,
                "service": 5.0,
                "sleep": null,
                "value": 4.0
            },
            "helpfulness": 2,
            "id": 172143176,
            "likes": {
                "disliked": null,
                "liked": null
            },
            "rating": 5.0,
            "stay_parameters": "Stayed August 2013",
            "text": "I hadn't reserved this hotel but I was driving from Virginia to Boston with 2 small kids and got stuck in more traffic than usual. It was late, I was exhausted, so I called Marriott and asked if there was any way to cancel a night at the Marriott Boston I had booked, and find a hotel near White Plains. Within 5 minutes she'd found this Residence Inn for a good price, changed the other reservation, and I was on my way!",
            "title": "Modern, huge rooms and perfect customer service",
            "user": "JaneTraveler"
        },
        {
            "date": "August 2, 2013",
            "detail_rating": {
                "business": null,
                "cleanliness": 5.0,
                "desk": null,
                "location": 5.0,
                "pool": null,
                "restaurant": null,
                "rooms": 5.0,
                "service": 5.0,
                "sleep": 5.0,
                "value": 5.0
            },
            "helpfulness": null,
            "id": 170382782,
            "likes": {
                "disliked": null,
                "liked": null
            },
            "rating": 5.0,
            "stay_parameters": "Stayed July 2013, traveled on business",
            "text": "The staff here checked me in quickly and the man at the front desk - Robert - personally showed me how to get to the parking garage and gave my kids a bedtime snack. It was nice to feel so cared for after a long day! The room was huge with a separate living room and bedroom, it was modern and beautiful! I plan to stop there again.",
            "title": "A superb hotel",
            "user": "eladyt"
        },
        {
            "date": "August 1, 2013",
            "detail_rating": {
                "business": null,
                "cleanliness": 4.0,
                "desk": null,
                "location": 5.0,
                "pool": null,
                "restaurant": null,
                "rooms": 3.0,
                "service": 5.0,
                "sleep": null,
                "value": 4.0
            },
            "helpfulness": null,
            "id": 170285777,
            "likes": {
                "disliked": null,
                "liked": null
            },
            "rating": 4.0,
            "stay_parameters": "Stayed July 2013",
            "text": "The rooms were enormous. We had a bedroom and a large living room with a kitchenette and dining table. Easily fit 2 adults and 3 children.",
            "title": "Nice hotel, could use some upgrades",
            "user": "Verona60"
        },
        {
            "date": "July 17, 2013",
            "detail_rating": {
                "business": null,
                "cleanliness": 3.0,
                "desk": null,
                "location": 5.0,
                "pool": null,
                "restaurant": null,
                "rooms": 4.0,
                "service": 4.0,
                "sleep": 4.0,
                "value": 3.0
            },
            "helpfulness": null,
            "id": 167896204,
            "likes": {
                "disliked": null,
                "liked": null
            },
            "rating": 4.0,
            "stay_parameters": "Stayed July 2013, traveled on business",
            "text": "The staff are extremely helpful. Rarely have I met such nice staffers.",
            "title": "Spacious, Great Location, & Awesome Staff!",
            "user": "AM4SPEED"
        }
    ],
    "slim_ranking": 0.571428571429,
    "stars": 3,
    "tripadvisor": {
        "VISITED": false,
        "country_name": null,
        "locality": null,
        "pic_link": null,
        "street_address": null
    },
    "user_rating": 4.0,
    "variance": {
        "average": 20,
        "excellent": 37,
        "poor": 7,
        "terrible": 1,
        "very good": 41
    }
}