{
    "aka": "Intercontinental Nairobi Hotel Nairobi",
    "description": "InterContinental Nairobi has for years been an oasis of luxury for business travellers as well as those who want to experience the wonders of Africa. The Parliament buildings are a short stroll away, Kenyatta International Convention Centre is right next door and Nairobi National Park, Museum Hill and the Elephant Orphanage are within easy reach.",
    "detail_rating": {
        "cleanliness": 4.0,
        "location": 4.0,
        "rooms": 3.5,
        "service": 4.0,
        "sleep": 4.0,
        "value": 4.0
    },
    "location": {
        "city": null,
        "continent": "Africa",
        "country": "Kenya",
        "proposed_city": "Nairobi",
        "province": null,
        "region": null
    },
    "name": "InterContinental Nairobi",
    "places": {
        "aka": [
            "Nairobi"
        ],
        "hotel_description": [
            "Nairobi"
        ],
        "hotel_name": [
            "Nairobi"
        ]
    },
    "review_count": 440,
    "review_count_current": 40,
    "reviews": [
        {
            "date": "December 29, 2010",
            "detail_rating": {
                "business": null,
                "cleanliness": 4.0,
                "desk": null,
                "location": 4.0,
                "pool": null,
                "restaurant": null,
                "rooms": 4.0,
                "service": 4.0,
                "sleep": 4.0,
                "value": 2.0
            },
            "helpfulness": null,
            "id": 90989641,
            "likes": {
                "disliked": null,
                "liked": null
            },
            "rating": 4.0,
            "stay_parameters": "Stayed December 2010, traveled as a couple",
            "text": "This hotel is quite old but well maintaned so it has its standard. We liekd the buffet at the restaurant very much. it was on December 24th and we got our turkey there, quite good actually. The rooms is good but as always in Africa the price of the hotel is unacceptable for what you are getting. But then agian they are all in it togeather.",
            "title": "Fine but overpriced",
            "user": "OrriBjornsson"
        },
        {
            "date": "December 15, 2010",
            "detail_rating": {
                "business": null,
                "cleanliness": 3.0,
                "desk": null,
                "location": 4.0,
                "pool": null,
                "restaurant": null,
                "rooms": 3.0,
                "service": 4.0,
                "sleep": 4.0,
                "value": 4.0
            },
            "helpfulness": null,
            "id": 89960167,
            "likes": {
                "disliked": null,
                "liked": null
            },
            "rating": 3.0,
            "stay_parameters": "Stayed November 2010, traveled on business",
            "text": "Service was good and friendly an food prices are ok.",
            "title": "Needs to improve ASAP!!",
            "user": "Buquing"
        },
        {
            "date": "December 7, 2010",
            "detail_rating": {
                "business": null,
                "cleanliness": 3.0,
                "desk": null,
                "location": 3.0,
                "pool": null,
                "restaurant": null,
                "rooms": 2.0,
                "service": 2.0,
                "sleep": 2.0,
                "value": 2.0
            },
            "helpfulness": null,
            "id": 89214061,
            "likes": {
                "disliked": null,
                "liked": null
            },
            "rating": 3.0,
            "stay_parameters": "Stayed December 2010, traveled on business",
            "text": "Good option if you want to stay downtown Nairobi.",
            "title": "A busy conference hotel that badly needs a refurb",
            "user": "gwynethh"
        },
        {
            "date": "November 20, 2010",
            "detail_rating": {
                "business": null,
                "cleanliness": 5.0,
                "desk": null,
                "location": 5.0,
                "pool": null,
                "restaurant": null,
                "rooms": 4.0,
                "service": 3.0,
                "sleep": 5.0,
                "value": 4.0
            },
            "helpfulness": null,
            "id": 87646808,
            "likes": {
                "disliked": null,
                "liked": null
            },
            "rating": 4.0,
            "stay_parameters": "Stayed August 2010, traveled as a couple",
            "text": "Spent 6 nights...had to wait in line for more than 15 minutes to check-in...and this happened in the Priority Club desk...staff were friendly (esp. Restaurant and Kitchen staff..personnel at Front Desk looked weary)...Lobby area would look like what you'd expect from an InterContinental but once you get to your room, it's a whole different story...the size and cleanliness of room were no issue...furniture were quite old and needs to go..had torn curtains with duct tape to \"cover the holes?\"..the bathroom was shocking...it felt like a bathroom you'd find in a bad hostel..it had stains all over the wall, sink, bathtub, etc...to be honest, it was kinda nasty...housekeeping were friendly too but everytime I had a request (laundry, towels, etc) it would take them at least 2-3 hours that a couple of times I completely forgot I called them in the first place...I still don't understand how guesthouses include WiFi in your US$20 room yet the InterContinental still charges this service to their guests...location was the main reason we stayed here since it was a couple of blocks from Conference Center...not a place I'd stay if I were on a Leisure trip.",
            "title": "Nice location",
            "user": "Susmita_83"
        },
        {
            "date": "November 12, 2010",
            "detail_rating": {
                "business": null,
                "cleanliness": 1.0,
                "desk": null,
                "location": 3.0,
                "pool": null,
                "restaurant": null,
                "rooms": 1.0,
                "service": 1.0,
                "sleep": 1.0,
                "value": 1.0
            },
            "helpfulness": 1,
            "id": 86817538,
            "likes": {
                "disliked": null,
                "liked": null
            },
            "rating": 2.0,
            "stay_parameters": "Stayed October 2010, traveled with family",
            "text": "An over fullconference hotel..depiste booking six months ago people sin out groups till not getting their rooms. or then only after midnight whilst being cleaned. ITotall full an dservices suffer as a result. It seems top dollar pays over long term reservcations. As busy attracting conferences the poolsid e and garden is used as a venue so not possible to swim or lie./relax outdoors the week I was there unless surrounded by suited men.",
            "title": "a cheap and nasty two star hotel, not what was expected",
            "user": "annaleeadams1"
        },
        {
            "date": "January 28, 2011",
            "detail_rating": {
                "business": null,
                "cleanliness": 2.0,
                "desk": null,
                "location": 3.0,
                "pool": null,
                "restaurant": null,
                "rooms": 2.0,
                "service": 1.0,
                "sleep": 1.0,
                "value": 1.0
            },
            "helpfulness": 1,
            "id": 94717214,
            "likes": {
                "disliked": null,
                "liked": null
            },
            "rating": 1.0,
            "stay_parameters": "Stayed January 2011, traveled on business",
            "text": "unfortenatly some reviewers are very right",
            "title": "not good enough",
            "user": "STONNE"
        },
        {
            "date": "January 19, 2011",
            "detail_rating": {
                "business": null,
                "cleanliness": 2.0,
                "desk": null,
                "location": 4.0,
                "pool": null,
                "restaurant": null,
                "rooms": 1.0,
                "service": 4.0,
                "sleep": 2.0,
                "value": 1.0
            },
            "helpfulness": null,
            "id": 93805693,
            "likes": {
                "disliked": null,
                "liked": null
            },
            "rating": 1.0,
            "stay_parameters": "Stayed January 2011, traveled on business",
            "text": "i had a superior room , but the bathroon was like 3 square meters , last rufurnished in 1971 i think. plumbing is horrible , you heare all the bathroomnoises from the rooms next up and under you . staff is extremely unhappy , not seen one smile , checking in and out takes much to long . very safe though , but if i want to sleep in total security i would go to a police station , not to a hotel were the safety procedures are striker than in New york airport after 911 . expensive an bad breakfast . very good bed though . very expensive for the way they treat you . i dont believe they ever tried to understand the word hospitality. better try fairview , fairmont or hilton if you want this kind of hotels in the center.",
            "title": "Don't stay here!",
            "user": "achoo263"
        },
        {
            "date": "January 6, 2011",
            "detail_rating": {
                "business": null,
                "cleanliness": 5.0,
                "desk": null,
                "location": 5.0,
                "pool": null,
                "restaurant": null,
                "rooms": 3.0,
                "service": 2.0,
                "sleep": 4.0,
                "value": 4.0
            },
            "helpfulness": null,
            "id": 91982476,
            "likes": {
                "disliked": null,
                "liked": null
            },
            "rating": 3.0,
            "stay_parameters": "Stayed December 2010, traveled with friends",
            "text": "Whatever you do, DON'T STAY HERE! This hotel is incredibly old, falling apart, and not up to par with regular Intercontinental Hotel standards, surprising especially since I'm paying ~$250 USD per night before taxes. Things that went wrong:",
            "title": "Centrally Located Business Hotel",
            "user": "Gavin22y"
        },
        {
            "date": "January 6, 2011",
            "detail_rating": {
                "business": null,
                "cleanliness": 4.0,
                "desk": null,
                "location": 5.0,
                "pool": null,
                "restaurant": null,
                "rooms": 3.0,
                "service": 1.0,
                "sleep": 3.0,
                "value": null
            },
            "helpfulness": 1,
            "id": 91922016,
            "likes": {
                "disliked": null,
                "liked": null
            },
            "rating": 2.0,
            "stay_parameters": "Stayed January 2011, traveled with family",
            "text": "-Upon checking into the room, my internet (wired and wireless) wasn't working so they had to call an engineer here to take a couple of hours to fix it. Couldn't switch me to another room because they were full. Internet is NOT free either.",
            "title": "Don't go there if you have kids or if you would like to have a good sleep..",
            "user": "Bertouille"
        },
        {
            "date": "January 4, 2011",
            "detail_rating": {
                "business": null,
                "cleanliness": 5.0,
                "desk": null,
                "location": 5.0,
                "pool": null,
                "restaurant": null,
                "rooms": 4.0,
                "service": 5.0,
                "sleep": 3.0,
                "value": 5.0
            },
            "helpfulness": 1,
            "id": 91746297,
            "likes": {
                "disliked": null,
                "liked": null
            },
            "rating": 5.0,
            "stay_parameters": "Stayed December 2010, traveled solo",
            "text": "-Electric outlets randomly DO NOT WORK and cannot charge anything!",
            "title": "A home away from home, thanks to Nairobi's best concierge",
            "user": "ZmanWashington_DC"
        },
        {
            "date": "July 1, 2011",
            "detail_rating": {
                "business": null,
                "cleanliness": 1.0,
                "desk": null,
                "location": null,
                "pool": null,
                "restaurant": null,
                "rooms": null,
                "service": 4.0,
                "sleep": 3.0,
                "value": 2.0
            },
            "helpfulness": 3,
            "id": 114945677,
            "likes": {
                "disliked": null,
                "liked": null
            },
            "rating": 2.0,
            "stay_parameters": "Stayed June 2011, traveled as a couple",
            "text": "Stayed at the InterContinental before, during and after our safari. The first two stays, in different rooms, were horrible. The drapes, shears, and lamp shades were coated with dust, One room had greasy handprints on the bathroom door. The toilet in our first room had to be flushed five or six times before it got the job done. Our final two nights we paid extra to upgrade and finally got a clean room. The rooms at this hotel most certainly do not meet InterContinental standards. Rooms definitely need a major upgrade.",
            "title": "Filthy",
            "user": "Judytraveler13"
        },
        {
            "date": "July 1, 2011",
            "detail_rating": {
                "business": null,
                "cleanliness": 4.0,
                "desk": null,
                "location": null,
                "pool": null,
                "restaurant": null,
                "rooms": null,
                "service": 3.0,
                "sleep": 3.0,
                "value": 4.0
            },
            "helpfulness": 1,
            "id": 114925849,
            "likes": {
                "disliked": null,
                "liked": null
            },
            "rating": 4.0,
            "stay_parameters": "Stayed June 2011, traveled with family",
            "text": "We stayed here for a night before embarking on a safari. It was a pleasant stay. Our flight arrived at 6 am but the check in was smooth. The rooms were large and clean. Service was a little slow but it was not a big problem. The staff was smiling, helpful with directions and information and could communicate in good English.The swimming pool was supposed to be heated but we did not have the time to try it out. The Italian restaurant was good, so was the one that served buffet dinner and breakfast,(I forgot its name), did not try not the Indian one. The gift shop was expensive, the highway curio shops were a better bargain. There was a supermarket at a walking distance where we stacked up on snacks, water as well as buying a local sim card and internet connection.",
            "title": "Satisfactory",
            "user": "Isaacban"
        },
        {
            "date": "June 29, 2011",
            "detail_rating": {
                "business": null,
                "cleanliness": 4.0,
                "desk": null,
                "location": null,
                "pool": null,
                "restaurant": null,
                "rooms": null,
                "service": 3.0,
                "sleep": 4.0,
                "value": 4.0
            },
            "helpfulness": null,
            "id": 114872991,
            "likes": {
                "disliked": null,
                "liked": null
            },
            "rating": 4.0,
            "stay_parameters": "Stayed September 2010, traveled on business",
            "text": "Effecient and friendly check in process. For a hotel in this part of the world the security is a little light. It is there, its gated, there are security folks around, but it would be pretty easy to poke a hole in their security perimeter - if you could call it that.",
            "title": "Solid business class hotel",
            "user": "cira001"
        },
        {
            "date": "June 26, 2011",
            "detail_rating": {
                "business": null,
                "cleanliness": 4.0,
                "desk": null,
                "location": null,
                "pool": null,
                "restaurant": null,
                "rooms": null,
                "service": 3.0,
                "sleep": 3.0,
                "value": 3.0
            },
            "helpfulness": null,
            "id": 114751887,
            "likes": {
                "disliked": null,
                "liked": null
            },
            "rating": 3.0,
            "stay_parameters": "Stayed May 2011, traveled on business",
            "text": "Room was clean, if a little tired, furniture relatevely modern, TV and electronics are up to date. Bed was good quality, comfortable and the linens were nice. Not sure the threadcount:)",
            "title": "By far the best in Nairobi......",
            "user": "aakashshirodkar"
        },
        {
            "date": "June 22, 2011",
            "detail_rating": {
                "business": null,
                "cleanliness": 2.0,
                "desk": null,
                "location": null,
                "pool": null,
                "restaurant": null,
                "rooms": null,
                "service": 4.0,
                "sleep": 2.0,
                "value": 3.0
            },
            "helpfulness": null,
            "id": 114633513,
            "likes": {
                "disliked": null,
                "liked": null
            },
            "rating": 3.0,
            "stay_parameters": "Stayed June 2011, traveled on business",
            "text": "Intenet connectivity in the room was quite good. No problem with streaming video or downloading large files.",
            "title": "Good location and staff but in dire need of an upgrade",
            "user": "vman63"
        },
        {
            "date": "April 3, 2011",
            "detail_rating": {
                "business": null,
                "cleanliness": 3.0,
                "desk": null,
                "location": 3.0,
                "pool": null,
                "restaurant": null,
                "rooms": 3.0,
                "service": 4.0,
                "sleep": 3.0,
                "value": 3.0
            },
            "helpfulness": 1,
            "id": 102678962,
            "likes": {
                "disliked": null,
                "liked": null
            },
            "rating": 3.0,
            "stay_parameters": "Stayed March 2011, traveled as a couple",
            "text": "Stayed two nights in room #505. The hotel appears to have been grand once, but is now a little shoddy. The staff is great and the food is pretty good. A yummy breakfast buffet and good food by the bar/pool area. The area is safe for Nairobi, but to get around the staff recommend a cab \u2013 even for a ten-minute walk in daylight. The traffic to airport on a Friday night was the worst traffic I\u2019ve ever seen \u2013 makes Boston and NYC look tame. I didn\u2019t get to have a massage, but one tourmate did and she said it was really good \u2013 and cheap, too. Our room keys never worked. The front desk can do currency exchange or get you money back from your credit card.",
            "title": "Decent place, nice staff, good food",
            "user": "MaineIzzy"
        },
        {
            "date": "March 18, 2011",
            "detail_rating": {
                "business": null,
                "cleanliness": 5.0,
                "desk": null,
                "location": 5.0,
                "pool": null,
                "restaurant": null,
                "rooms": 5.0,
                "service": 4.0,
                "sleep": 5.0,
                "value": 4.0
            },
            "helpfulness": null,
            "id": 100621810,
            "likes": {
                "disliked": null,
                "liked": null
            },
            "rating": 4.0,
            "stay_parameters": "Stayed March 2011, traveled on business",
            "text": "Stayed here for business. the check in was a small problem that was due to lots of being trying to check in at the same time. we got free drinks for waiting. that was nice, it made a good impression on me. the room is great, the place is clean and the staff are all friendly and helpful.",
            "title": "Good business hotel",
            "user": "Moeblues"
        },
        {
            "date": "February 21, 2011",
            "detail_rating": {
                "business": null,
                "cleanliness": 5.0,
                "desk": null,
                "location": 5.0,
                "pool": null,
                "restaurant": null,
                "rooms": 5.0,
                "service": 5.0,
                "sleep": 5.0,
                "value": 5.0
            },
            "helpfulness": null,
            "id": 97408897,
            "likes": {
                "disliked": null,
                "liked": null
            },
            "rating": 5.0,
            "stay_parameters": "Stayed February 2011, traveled as a couple",
            "text": "good breakfast and nice indian resturant. if your in nairobi for business. this is a good place to stay.",
            "title": "An outsanding service",
            "user": "hchisty"
        },
        {
            "date": "February 14, 2011",
            "detail_rating": {
                "business": null,
                "cleanliness": 4.0,
                "desk": null,
                "location": 4.0,
                "pool": null,
                "restaurant": null,
                "rooms": 3.0,
                "service": 2.0,
                "sleep": 4.0,
                "value": 1.0
            },
            "helpfulness": 1,
            "id": 96578694,
            "likes": {
                "disliked": null,
                "liked": null
            },
            "rating": 2.0,
            "stay_parameters": "Stayed February 2011, traveled on business",
            "text": "I was staying at the Intercontinental Nairobi after my trip to Egypt was canceled due to the demonstration.The whole check in experience was excellent n we were received with quite hospitality of the highest magnitude;we were provided with glasses of juices and a warm towel and the actual check in just took 4 minutes.",
            "title": "Way too Expensive",
            "user": "Narthbor"
        },
        {
            "date": "February 6, 2011",
            "detail_rating": {
                "business": null,
                "cleanliness": 3.0,
                "desk": null,
                "location": 4.0,
                "pool": null,
                "restaurant": null,
                "rooms": 1.0,
                "service": 3.0,
                "sleep": 3.0,
                "value": 2.0
            },
            "helpfulness": null,
            "id": 95625811,
            "likes": {
                "disliked": null,
                "liked": null
            },
            "rating": 2.0,
            "stay_parameters": "Stayed January 2011, traveled as a couple",
            "text": "What amazed me a lot was the experience and knowledge of one of the porters a Mr Abgao Asad who's diverse experience of the facilities in and outside the hotel were amazing.",
            "title": "Surprised Intercontinental chain would associate with this hotel!",
            "user": "Amok2010"
        },
        {
            "date": "June 8, 2011",
            "detail_rating": {
                "business": null,
                "cleanliness": 4.0,
                "desk": null,
                "location": null,
                "pool": null,
                "restaurant": null,
                "rooms": null,
                "service": 4.0,
                "sleep": 5.0,
                "value": 5.0
            },
            "helpfulness": null,
            "id": 112157888,
            "likes": {
                "disliked": null,
                "liked": null
            },
            "rating": 4.0,
            "stay_parameters": "Stayed June 2011, traveled with family",
            "text": "We stayed at the Intercontinental on the 29th of May as well as on the 4th and 5th of June, 2001. The hotel is well located within the city and is walking distance from a mall as well as good eating joints. The coffee shop serves excellent buffet lunches and dinners and also has an authentic Indian restaurant. The hotel staff was helpful as we were travelling with two children and organised comfortable extra beds in the room.",
            "title": "Good Hotel, Comfortable rooms",
            "user": "aggro1"
        },
        {
            "date": "June 6, 2011",
            "detail_rating": {
                "business": null,
                "cleanliness": 5.0,
                "desk": null,
                "location": null,
                "pool": null,
                "restaurant": null,
                "rooms": null,
                "service": 5.0,
                "sleep": 5.0,
                "value": 5.0
            },
            "helpfulness": 1,
            "id": 111737900,
            "likes": {
                "disliked": null,
                "liked": null
            },
            "rating": 5.0,
            "stay_parameters": "Stayed June 2011, traveled on business",
            "text": "Overall a very comfortable stay",
            "title": "You know a 5 star hotel when you get into the lobby, and this one IS ...",
            "user": "Safariafficionado"
        },
        {
            "date": "June 3, 2011",
            "detail_rating": {
                "business": null,
                "cleanliness": 4.0,
                "desk": null,
                "location": null,
                "pool": null,
                "restaurant": null,
                "rooms": null,
                "service": 5.0,
                "sleep": 3.0,
                "value": 4.0
            },
            "helpfulness": null,
            "id": 111253558,
            "likes": {
                "disliked": null,
                "liked": null
            },
            "rating": 3.0,
            "stay_parameters": "Stayed March 2011, traveled as a couple",
            "text": "Upon a return from the Seychelles a week and a half ago I stayed my initial two nights at the Intercontinental Hotel before heading out on a short safari into the Rift Valley.",
            "title": "Standard Interconti with excellent breakfast",
            "user": "Florian254"
        },
        {
            "date": "June 3, 2011",
            "detail_rating": {
                "business": null,
                "cleanliness": 5.0,
                "desk": null,
                "location": null,
                "pool": null,
                "restaurant": null,
                "rooms": null,
                "service": 5.0,
                "sleep": 5.0,
                "value": 4.0
            },
            "helpfulness": 2,
            "id": 111241614,
            "likes": {
                "disliked": null,
                "liked": null
            },
            "rating": 5.0,
            "stay_parameters": "Stayed March 2011, traveled on business",
            "text": "The evening arrival at the front desk was no problem as my room had been held, even in case of a delayed flight, but as Kenya Airways was spot on time it was the Nairobi traffic which delayed me in reaching the hotel.",
            "title": "Very good hotel in good location",
            "user": "Jamsimsafc"
        },
        {
            "date": "April 27, 2011",
            "detail_rating": {
                "business": null,
                "cleanliness": 5.0,
                "desk": null,
                "location": 5.0,
                "pool": null,
                "restaurant": null,
                "rooms": 4.0,
                "service": 4.0,
                "sleep": 4.0,
                "value": 3.0
            },
            "helpfulness": 1,
            "id": 105788598,
            "likes": {
                "disliked": null,
                "liked": null
            },
            "rating": 4.0,
            "stay_parameters": "Stayed April 2011, traveled with friends",
            "text": "I had requested 'my' suite on the 7th floor and it was presenting itself again at its 'Sunday best', fruit basket, a welcome letter from management and the bathrooms equipped with amenities of the finest pedigree.",
            "title": "4* hotel in good location",
            "user": "Need_M0re_H0liday"
        },
        {
            "date": "August 2, 2011",
            "detail_rating": {
                "business": null,
                "cleanliness": null,
                "desk": null,
                "location": null,
                "pool": null,
                "restaurant": null,
                "rooms": null,
                "service": null,
                "sleep": null,
                "value": null
            },
            "helpfulness": 3,
            "id": 116177849,
            "likes": {
                "disliked": null,
                "liked": null
            },
            "rating": 2.0,
            "stay_parameters": null,
            "text": "Stayed here for one night as part of a group visiting the safaris in Kenya",
            "title": "So worn out.. not Intercontinental standard at all",
            "user": "kceesse"
        },
        {
            "date": "July 30, 2011",
            "detail_rating": {
                "business": null,
                "cleanliness": 4.0,
                "desk": null,
                "location": null,
                "pool": null,
                "restaurant": null,
                "rooms": null,
                "service": 4.0,
                "sleep": 3.0,
                "value": 5.0
            },
            "helpfulness": 2,
            "id": 116014955,
            "likes": {
                "disliked": null,
                "liked": null
            },
            "rating": 4.0,
            "stay_parameters": "Stayed July 2011, traveled as a couple",
            "text": "Pros",
            "title": "Good Spot, Decent food, and unbelievably slow internet.",
            "user": "thecameradude"
        },
        {
            "date": "July 28, 2011",
            "detail_rating": {
                "business": null,
                "cleanliness": 4.0,
                "desk": null,
                "location": null,
                "pool": null,
                "restaurant": null,
                "rooms": null,
                "service": 4.0,
                "sleep": 4.0,
                "value": 3.0
            },
            "helpfulness": 1,
            "id": 115909547,
            "likes": {
                "disliked": null,
                "liked": null
            },
            "rating": 3.0,
            "stay_parameters": "Stayed June 2011, traveled with friends",
            "text": "- One of the very few international large-scale chain hotels in Kenya (I believe the rest are Crowne Plaza, Hilton and this)",
            "title": "Decent hotel",
            "user": "ColoColo"
        },
        {
            "date": "July 28, 2011",
            "detail_rating": {
                "business": null,
                "cleanliness": 5.0,
                "desk": null,
                "location": null,
                "pool": null,
                "restaurant": null,
                "rooms": null,
                "service": 4.0,
                "sleep": 4.0,
                "value": 3.0
            },
            "helpfulness": 2,
            "id": 115894780,
            "likes": {
                "disliked": null,
                "liked": null
            },
            "rating": 4.0,
            "stay_parameters": "Stayed July 2011, traveled on business",
            "text": "- Close to city center and the parliament",
            "title": "Just as I remember it",
            "user": "CraigL1"
        },
        {
            "date": "July 20, 2011",
            "detail_rating": {
                "business": null,
                "cleanliness": null,
                "desk": null,
                "location": null,
                "pool": null,
                "restaurant": null,
                "rooms": null,
                "service": null,
                "sleep": null,
                "value": null
            },
            "helpfulness": 2,
            "id": 115574002,
            "likes": {
                "disliked": null,
                "liked": null
            },
            "rating": 4.0,
            "stay_parameters": null,
            "text": "- Service was friendly",
            "title": "Good hotel for business",
            "user": "mpk17"
        },
        {
            "date": "November 11, 2010",
            "detail_rating": {
                "business": null,
                "cleanliness": 5.0,
                "desk": null,
                "location": 3.0,
                "pool": null,
                "restaurant": null,
                "rooms": 4.0,
                "service": 5.0,
                "sleep": 4.0,
                "value": 4.0
            },
            "helpfulness": 1,
            "id": 86727753,
            "likes": {
                "disliked": null,
                "liked": null
            },
            "rating": 3.0,
            "stay_parameters": "Stayed February 2010, traveled on business",
            "text": "Like most Intercontinental, the InterCon in Nairobi was comfortable with large rooms and a stone's throw from Uhuru Park. The staff was exceptionally helpful and went out of their way to make sure that everything was fine. The hotel's has good conference facilities and several meeting rooms. The breakfast spread was large and great value for money. The hotel's security is also good which made one feel safe and comfortable.",
            "title": "Safe and comfortable",
            "user": "Carboncrystal"
        },
        {
            "date": "November 10, 2010",
            "detail_rating": {
                "business": null,
                "cleanliness": 4.0,
                "desk": null,
                "location": 4.0,
                "pool": null,
                "restaurant": null,
                "rooms": 2.0,
                "service": 1.0,
                "sleep": 3.0,
                "value": 2.0
            },
            "helpfulness": null,
            "id": 86642080,
            "likes": {
                "disliked": null,
                "liked": null
            },
            "rating": 2.0,
            "stay_parameters": "Stayed October 2010, traveled on business",
            "text": "As a business traveler, I have stayed at Intercontinental Nairobi on six different occasions. However my recent stay (Oct 2010) made it more obvious why I will not be staying at this hotel again:",
            "title": "Very slow service - Check in",
            "user": "Pamaluka"
        },
        {
            "date": "October 30, 2010",
            "detail_rating": {
                "business": null,
                "cleanliness": 3.0,
                "desk": null,
                "location": 4.0,
                "pool": null,
                "restaurant": null,
                "rooms": 3.0,
                "service": 2.0,
                "sleep": 3.0,
                "value": 3.0
            },
            "helpfulness": null,
            "id": 85347402,
            "likes": {
                "disliked": null,
                "liked": null
            },
            "rating": 3.0,
            "stay_parameters": "Stayed September 2010, traveled on business",
            "text": "Pros:",
            "title": "Getting tired, good down town location though",
            "user": "Tipptravellingman"
        },
        {
            "date": "October 17, 2010",
            "detail_rating": {
                "business": null,
                "cleanliness": 1.0,
                "desk": null,
                "location": 2.0,
                "pool": null,
                "restaurant": null,
                "rooms": 1.0,
                "service": 1.0,
                "sleep": 1.0,
                "value": 1.0
            },
            "helpfulness": null,
            "id": 83770462,
            "likes": {
                "disliked": null,
                "liked": null
            },
            "rating": 1.0,
            "stay_parameters": "Stayed September 2010, traveled as a couple",
            "text": "1. The waiting staff (waiters) at various restaurants throughout the hotel were great and made effort to ensure that one was well served",
            "title": "If you want to throw your money go to the City markets because at least you will get better service!",
            "user": "maddyl777"
        },
        {
            "date": "October 14, 2010",
            "detail_rating": {
                "business": null,
                "cleanliness": 3.0,
                "desk": null,
                "location": 3.0,
                "pool": null,
                "restaurant": null,
                "rooms": 3.0,
                "service": 3.0,
                "sleep": 4.0,
                "value": 3.0
            },
            "helpfulness": null,
            "id": 83508782,
            "likes": {
                "disliked": null,
                "liked": null
            },
            "rating": 3.0,
            "stay_parameters": "Stayed October 2010, traveled on business",
            "text": "2. Location",
            "title": "Better options in Nairobi",
            "user": "cajmere"
        },
        {
            "date": "June 18, 2011",
            "detail_rating": {
                "business": null,
                "cleanliness": 5.0,
                "desk": null,
                "location": null,
                "pool": null,
                "restaurant": null,
                "rooms": null,
                "service": 2.0,
                "sleep": 5.0,
                "value": 2.0
            },
            "helpfulness": null,
            "id": 114181731,
            "likes": {
                "disliked": null,
                "liked": null
            },
            "rating": 3.0,
            "stay_parameters": "Stayed March 2011, traveled on business",
            "text": "Conveniently located for business travellers, quite representative in the looby, rather poor in the rooms.",
            "title": "Decent, but lacks a good room service",
            "user": "7dust"
        },
        {
            "date": "June 17, 2011",
            "detail_rating": {
                "business": null,
                "cleanliness": 4.0,
                "desk": null,
                "location": null,
                "pool": null,
                "restaurant": null,
                "rooms": null,
                "service": 3.0,
                "sleep": 1.0,
                "value": 3.0
            },
            "helpfulness": 1,
            "id": 114055871,
            "likes": {
                "disliked": null,
                "liked": null
            },
            "rating": 3.0,
            "stay_parameters": "Stayed June 2011, traveled on business",
            "text": "Out of three restaurants I've tried two were bad and one was average (the Italian one).",
            "title": "Steamingly hot rooms",
            "user": "wildthing271"
        },
        {
            "date": "June 16, 2011",
            "detail_rating": {
                "business": null,
                "cleanliness": 4.0,
                "desk": null,
                "location": null,
                "pool": null,
                "restaurant": null,
                "rooms": null,
                "service": 5.0,
                "sleep": 3.0,
                "value": 1.0
            },
            "helpfulness": 1,
            "id": 113793746,
            "likes": {
                "disliked": null,
                "liked": null
            },
            "rating": 3.0,
            "stay_parameters": "Stayed June 2011, traveled on business",
            "text": "Hotel seems heavy guarded, but eventually you can bring whatever you want from the street.",
            "title": "Nice Amenities - Horrible Standard Rooms",
            "user": "cjharmon"
        },
        {
            "date": "June 13, 2011",
            "detail_rating": {
                "business": null,
                "cleanliness": 5.0,
                "desk": null,
                "location": null,
                "pool": null,
                "restaurant": null,
                "rooms": null,
                "service": 5.0,
                "sleep": 5.0,
                "value": 4.0
            },
            "helpfulness": null,
            "id": 113323635,
            "likes": {
                "disliked": null,
                "liked": null
            },
            "rating": 4.0,
            "stay_parameters": "Stayed October 2010, traveled on business",
            "text": "Reception staff is helpful but rather slow and English could be better. And you're paying a lot for it.",
            "title": "Just Right",
            "user": "pixiehermann"
        },
        {
            "date": "June 13, 2011",
            "detail_rating": {
                "business": null,
                "cleanliness": 5.0,
                "desk": null,
                "location": null,
                "pool": null,
                "restaurant": null,
                "rooms": null,
                "service": 5.0,
                "sleep": 5.0,
                "value": 5.0
            },
            "helpfulness": 1,
            "id": 113285835,
            "likes": {
                "disliked": null,
                "liked": null
            },
            "rating": 5.0,
            "stay_parameters": "Stayed May 2011, traveled as a couple",
            "text": "Room service was very slow. After first room cleaning there were no new towels left in the room. I've requested new ones and eventually got them after 2 hours, asking three times.",
            "title": "Great hotel...not so great location",
            "user": "BraidsL"
        }
    ],
    "slim_ranking": 0.306818181818,
    "stars": 5,
    "tripadvisor": {
        "VISITED": false,
        "country_name": null,
        "locality": null,
        "pic_link": null,
        "street_address": null
    },
    "user_rating": 3.5,
    "variance": {
        "average": 114,
        "excellent": 78,
        "poor": 50,
        "terrible": 26,
        "very good": 172
    }
}