{
    "aka": "Sol Jandia Mar Aparthotel Hotel",
    "description": "Sol Jand\u00eda Mar ApartHotel is situated about 150 meters to the nearest beach,Playa de Jand\u00eda,with fine white sand.Sol Jand\u00eda Mar offers 294 comfortable appartments overlooking the beach,the pool and the beautiful gardens arround the hotel.The complex offers Restaurant,Snack Pool Bar and Lounge Bar.The maritim avenue connects the aparthotel with the shopping area at Jand\u00eda and the fishing village, Morro del Jable.",
    "detail_rating": {
        "cleanliness": null,
        "location": null,
        "rooms": null,
        "service": null,
        "sleep": null,
        "value": null
    },
    "location": {
        "city": null,
        "continent": "Europe",
        "country": "Spain",
        "proposed_city": "Bar",
        "province": null,
        "region": null
    },
    "name": "Sol Jandia Mar Aparthotel",
    "places": {
        "aka": [],
        "hotel_description": [
            "Bar"
        ],
        "hotel_name": []
    },
    "review_count": 300,
    "review_count_current": 7,
    "reviews": [
        {
            "date": "December 31, 2008",
            "detail_rating": {
                "business": null,
                "cleanliness": 1.0,
                "desk": null,
                "front_desk": 3.0,
                "location": 3.0,
                "pool": null,
                "restaurant": null,
                "rooms": 2.0,
                "service": 1.0,
                "sleep": null,
                "value": 2.0
            },
            "helpfulness": 1,
            "id": 23134140,
            "likes": {
                "disliked": "\u2014 lack of cleanliness in apartment",
                "liked": "\u2014 location"
            },
            "rating": 2.0,
            "stay_parameters": "Stayed December 2008, traveled with family",
            "text": "We have stayed at these apartments five or six times over the last few years. We have always been happy to come back - until this time. The apartment we were given P242 was in the furthest block - it was right next to the main road to Morro Jable, which for a small place has traffic backward and forwards 24 hours a day! It sounded like being on the M1! The apartment balcony had absolutely no view whatsoever except for some tree branches. The bedrooms looked out onto the space that is used for the hotel's rubbish. This meant that if the bin wagon hadn't woken us up at 5.00 a.m. on it's regular visit, the workmen from the apartments refilling the rubbish bins from 7.30 would have - not the sound of their work but their very loud conversations outside the window as they stopped for a ciggie break. (why do the Spanish always have to shout at each other???) None of this made for a relaxing night's sleep. In addition, the room was not cleaned ONCE during our stay, neither were the sheets changed. Towels were placed in the room each day but were just left there (the dirty ones werent taken away!) so we were left with about 15 towels in the room by the end of the week!!!! The cooking utensils etc.. and general state of the room were grubby.",
            "title": "Our last visit to this place!",
            "user": "hesketh27"
        },
        {
            "date": "December 29, 2008",
            "detail_rating": {
                "business": 3.0,
                "cleanliness": 4.0,
                "desk": null,
                "front_desk": 4.0,
                "location": 4.0,
                "pool": null,
                "restaurant": null,
                "rooms": 4.0,
                "service": 4.0,
                "sleep": null,
                "value": 5.0
            },
            "helpfulness": 1,
            "id": 23068762,
            "likes": {
                "disliked": "\u2014 Entertainment - but didn't really experience it",
                "liked": "\u2014 Cleanliness and friendliness"
            },
            "rating": 4.0,
            "stay_parameters": "Stayed December 2008, traveled as a couple",
            "text": "After being happy previously, we are upset to see this place go downhill like this. Talk about the block of apartments that was forgotten! We can't even say that this treatment was reserved for the British because we had German & Scandinavian neighbours who got similalry poor treatment. A German customer satisfaction questionnaire had been left on our table from the previous week & the criticisms were damning (I speak Greman). When we first read it at the start of the holiday we thought it was hyper critical - by the end of the week we agreed with everything written. Jandia is a lovely relaxing resort, miles away from the awful 'British' resorts of the north of the island, so we will go back - not to the Sol Jandia Mar however. If you go and they tell you you are in P242 - tell them NO WAY JOSE!!!!!!",
            "title": "Great value, clean & friendly",
            "user": "Emma C"
        },
        {
            "date": "November 29, 2008",
            "detail_rating": {
                "business": 3.0,
                "cleanliness": 3.0,
                "desk": null,
                "front_desk": 5.0,
                "location": 5.0,
                "pool": null,
                "restaurant": null,
                "rooms": 3.0,
                "service": 3.0,
                "sleep": null,
                "value": 2.0
            },
            "helpfulness": null,
            "id": 22288614,
            "likes": {
                "disliked": "\u2014 diner",
                "liked": "\u2014 location"
            },
            "rating": 2.0,
            "stay_parameters": "Stayed November 2008, traveled with family",
            "text": "My boyfriend and I thoroughly enjoyed our stay at Sol Jandia Mar apartments. We received a warm welcome and found the all staff to be very friendly, as were the other guests. Our apartment was clean and less basic than we had expected for the price. It was great value! We only ate twice at the hotel. The breakfast was quite good value but not exceptional. The other meal was a BBQ by the pool which was tasty and good value. We enjoyed the variety of having meals out at some of the many cafes and restaurants in Jandia and Morro Jable.",
            "title": "price>kwalitie>ok",
            "user": "michelleHolland"
        },
        {
            "date": "July 22, 2008",
            "detail_rating": {
                "business": null,
                "cleanliness": null,
                "desk": null,
                "location": null,
                "pool": null,
                "restaurant": null,
                "rooms": null,
                "service": null,
                "sleep": null,
                "value": null
            },
            "helpfulness": 1,
            "id": 18138253,
            "likes": {
                "disliked": null,
                "liked": null
            },
            "rating": 5.0,
            "stay_parameters": null,
            "text": "We didn't experience any of the hotel entertainment and it didn't sound to be our cup of tea, but they did have a wide range on offer like bingo, a magician, a champagne night and a disco night. They also had a varied programme of sporting and exercise activities.",
            "title": "loved sol jandia mar",
            "user": "carebearStokeOnTrent"
        },
        {
            "date": "May 28, 2008",
            "detail_rating": {
                "business": 1.0,
                "cleanliness": 4.0,
                "desk": null,
                "front_desk": 3.0,
                "location": 3.0,
                "pool": null,
                "restaurant": null,
                "rooms": 3.0,
                "service": 3.0,
                "sleep": null,
                "value": 3.0
            },
            "helpfulness": 1,
            "id": 16465797,
            "likes": {
                "disliked": "\u2014 kitchen only had hob no grill/oven",
                "liked": "\u2014 clean"
            },
            "rating": 3.0,
            "stay_parameters": "Stayed May 2008, traveled with family",
            "text": "We're both mobile, but for those who aren't I'd recommend requesting a ground floor apartment as there don't seem to be any lifts. Even then there is one flight of steep steps to climb to get up to the level of the apartments. We had requested a sea view, so we had 3 flights of stairs to climb. Absolutely fine and worth it for us, but a point to note for those less mobile.",
            "title": "lovely & clean",
            "user": "kofu"
        },
        {
            "date": "May 25, 2008",
            "detail_rating": {
                "business": null,
                "cleanliness": 4.0,
                "desk": null,
                "front_desk": 5.0,
                "location": 4.0,
                "pool": null,
                "restaurant": null,
                "rooms": 3.0,
                "service": 4.0,
                "sleep": null,
                "value": 5.0
            },
            "helpfulness": null,
            "id": 16381717,
            "likes": {
                "disliked": "\u2014 nothing really",
                "liked": "\u2014 location"
            },
            "rating": 4.0,
            "stay_parameters": "Stayed May 2008, traveled as a couple",
            "text": "This was a last minute, well a week before the holiday started. Cost \u00a3390 for two of us flying direct from Edinburgh.",
            "title": "excellent value holiday",
            "user": "bigeckscot"
        },
        {
            "date": "May 18, 2008",
            "detail_rating": {
                "business": null,
                "cleanliness": 5.0,
                "desk": null,
                "front_desk": 5.0,
                "location": 5.0,
                "pool": null,
                "restaurant": null,
                "rooms": 5.0,
                "service": 5.0,
                "sleep": null,
                "value": 5.0
            },
            "helpfulness": null,
            "id": 16161652,
            "likes": {
                "disliked": "\u2014 No brush in the room to get rid of the day of sand!",
                "liked": "\u2014 Friendly staff and close to the beach"
            },
            "rating": 4.0,
            "stay_parameters": "Stayed May 2008, traveled as a couple",
            "text": "Flights were with Monarch and there is very little leg room. Waited 90 minutes for baggage on arrival and transfer to resort takes 90 mins.",
            "title": "Great and simple",
            "user": "Rob_Helen"
        }
    ],
    "slim_ranking": 0.363636363636,
    "stars": 3,
    "tripadvisor": {
        "VISITED": false,
        "country_name": null,
        "locality": null,
        "pic_link": null,
        "street_address": null
    },
    "user_rating": 3.5,
    "variance": {
        "average": 60,
        "excellent": 98,
        "poor": 29,
        "terrible": 21,
        "very good": 92
    }
}