{
    "aka": "Wakefield Residence Adelaide",
    "description": "Adabco Boutique Hotel (formerly Wakefield Residence) is set in one of Adelaide's significant and beautiful heritage buildings. It has 70 elegantly appointed rooms with modern furnishing, appliances and finishes. The spacious rooms are all equipped with a flat screen LCD TV, Foxtel, high speed broadband access and a large executive desk for the corporate traveller. Situated in the heart of the city, the hotel is within walking distance to the restaurant precincts of Hutt Street, North Terrace, the Convention Centre, Hindley Street, Chinatown, the Central Market, and the Rundle Mall shopping precinct. Adabco Boutique hotel is an independent hotel suited to the discerning traveller that requires a retreat from the pressures of travel and access to some of the city's major and most memorable attractions.",
    "detail_rating": {
        "cleanliness": 4.5,
        "location": 4.0,
        "rooms": 4.0,
        "service": 4.5,
        "sleep": 4.5,
        "value": 4.5
    },
    "location": {
        "city": null,
        "continent": "South Pacific",
        "country": "Australia",
        "proposed_city": "Adelaide",
        "province": null,
        "region": null
    },
    "name": "Adabco Boutique Hotel",
    "places": {
        "aka": [
            "Wakefield",
            "Adelaide"
        ],
        "hotel_description": [
            "Wakefield",
            "Adelaide",
            "Terrace",
            "Hindley",
            "Central"
        ],
        "hotel_name": []
    },
    "review_count": 473,
    "review_count_current": 20,
    "reviews": [
        {
            "date": "July 29, 2011",
            "detail_rating": {
                "business": null,
                "cleanliness": 5.0,
                "desk": null,
                "location": null,
                "pool": null,
                "restaurant": null,
                "rooms": null,
                "service": 5.0,
                "sleep": 5.0,
                "value": 5.0
            },
            "helpfulness": null,
            "id": 115958349,
            "likes": {
                "disliked": null,
                "liked": null
            },
            "rating": 5.0,
            "stay_parameters": "Stayed July 2011, traveled solo",
            "text": "I stayed at Adabco Boutique Hotel for 5 nights last week. It was calm, clean, pleasant and very comfortable. The staff were friendly and helpful, giving advice about transport, parking, local restaurants and trips to the Barossa. Staff at the desk described it as the maiden aunt end of the CBD which was a reference to the quietness of the area and the ease of parking at the front of the hotel, despite being in a main street. There is no off-street parking which I thought would be a problem but I was able to park in front of the hotel every night and it was perfectly safe. The breakfast which was included in the tariff was ordinary - 3 cereals, tinned fruit, 3 different breads, spreads, tea, coffee and fruit juice - but I normally have coffee and toast so there was no problem. There is a kitchen on each of the 3 floors so it is possible to cook your own meals if you want a full breakfast or to eat in at night. I would defintely stay here again. (The paintings on the wall were very boring, unlike the rest of the hotel)",
            "title": "What a pleasant place to stay",
            "user": "shutter51"
        },
        {
            "date": "July 24, 2011",
            "detail_rating": {
                "business": null,
                "cleanliness": 5.0,
                "desk": null,
                "location": null,
                "pool": null,
                "restaurant": null,
                "rooms": null,
                "service": 5.0,
                "sleep": 5.0,
                "value": 5.0
            },
            "helpfulness": 1,
            "id": 115710916,
            "likes": {
                "disliked": null,
                "liked": null
            },
            "rating": 5.0,
            "stay_parameters": "Stayed January 2011, traveled with friends",
            "text": "At first, we made the reservation for 2 nights...but we had to change for one night only, a call was enough to cancel the extra night.",
            "title": "spacious, clean...",
            "user": "Viliv"
        },
        {
            "date": "June 29, 2011",
            "detail_rating": {
                "business": null,
                "cleanliness": 5.0,
                "desk": null,
                "location": null,
                "pool": null,
                "restaurant": null,
                "rooms": null,
                "service": 5.0,
                "sleep": 5.0,
                "value": 4.0
            },
            "helpfulness": null,
            "id": 114889609,
            "likes": {
                "disliked": null,
                "liked": null
            },
            "rating": 5.0,
            "stay_parameters": "Stayed June 2011, traveled as a couple",
            "text": "The receptionist was nice and competent.",
            "title": "Good service, clean, close to the city",
            "user": "randwg"
        },
        {
            "date": "June 19, 2011",
            "detail_rating": {
                "business": null,
                "cleanliness": 4.0,
                "desk": null,
                "location": 3.0,
                "pool": null,
                "restaurant": null,
                "rooms": 4.0,
                "service": 3.0,
                "sleep": 3.0,
                "value": 4.0
            },
            "helpfulness": 2,
            "id": 114382793,
            "likes": {
                "disliked": null,
                "liked": null
            },
            "rating": 3.0,
            "stay_parameters": "Stayed May 2011, traveled as a couple",
            "text": "There's a lift for the 3 (or 4) levels.",
            "title": "Good value hotel",
            "user": "FrizBristol"
        },
        {
            "date": "June 18, 2011",
            "detail_rating": {
                "business": null,
                "cleanliness": 5.0,
                "desk": null,
                "location": null,
                "pool": null,
                "restaurant": null,
                "rooms": null,
                "service": 5.0,
                "sleep": 5.0,
                "value": 5.0
            },
            "helpfulness": null,
            "id": 114260711,
            "likes": {
                "disliked": null,
                "liked": null
            },
            "rating": 5.0,
            "stay_parameters": "Stayed June 2011, traveled solo",
            "text": "The double room we were given, was so spacious ! a king bed, a long chair, a desk and tv, a closet. No view but anyway, the room was so clean and the mattress was so comfy, that night was very restful.",
            "title": "Gorgeous - loved it. If only I had known how good it was going to be I would have stayed longer.",
            "user": "Smiley1Sydney"
        },
        {
            "date": "August 9, 2011",
            "detail_rating": {
                "business": null,
                "cleanliness": 4.0,
                "desk": null,
                "location": 3.0,
                "pool": null,
                "restaurant": null,
                "rooms": 4.0,
                "service": 3.0,
                "sleep": null,
                "value": 4.0
            },
            "helpfulness": 1,
            "id": 116456975,
            "likes": {
                "disliked": null,
                "liked": null
            },
            "rating": 4.0,
            "stay_parameters": "Stayed August 2011",
            "text": "A fairly decent, quiet hotel, located just a little too far from the CBD for my tastes. Secure, and with reasonable service",
            "title": "Alright, but not a stand-out",
            "user": "janek85"
        },
        {
            "date": "August 6, 2011",
            "detail_rating": {
                "business": null,
                "cleanliness": 5.0,
                "desk": null,
                "location": null,
                "pool": null,
                "restaurant": null,
                "rooms": null,
                "service": 5.0,
                "sleep": 5.0,
                "value": 5.0
            },
            "helpfulness": 1,
            "id": 116335500,
            "likes": {
                "disliked": null,
                "liked": null
            },
            "rating": 5.0,
            "stay_parameters": "Stayed July 2011, traveled with family",
            "text": "I would recommend this hotel very highly. beautiful surroundigns, excellent facilities and very helpful staff.",
            "title": "Brilliant hotel in Adelaide",
            "user": "Mcnamara1952"
        },
        {
            "date": "August 2, 2011",
            "detail_rating": {
                "business": null,
                "cleanliness": 5.0,
                "desk": null,
                "location": null,
                "pool": null,
                "restaurant": null,
                "rooms": null,
                "service": 4.0,
                "sleep": 5.0,
                "value": 5.0
            },
            "helpfulness": null,
            "id": 116185361,
            "likes": {
                "disliked": null,
                "liked": null
            },
            "rating": 5.0,
            "stay_parameters": "Stayed July 2011, traveled on business",
            "text": "Undoubtedly the best valyue in Adelaide,. Clean , spacious and quiet.",
            "title": "Excellent",
            "user": "sanseek"
        },
        {
            "date": "August 1, 2011",
            "detail_rating": {
                "business": null,
                "cleanliness": 5.0,
                "desk": null,
                "location": null,
                "pool": null,
                "restaurant": null,
                "rooms": null,
                "service": 5.0,
                "sleep": 5.0,
                "value": 5.0
            },
            "helpfulness": null,
            "id": 116098515,
            "likes": {
                "disliked": null,
                "liked": null
            },
            "rating": 5.0,
            "stay_parameters": "Stayed July 2011, traveled as a couple",
            "text": "We stayed here 2 nights & found the room to be well furnished, comfortable, clean & very comfortable bedding. It was very reasonable priced & a buffet continental breakfeast was included. The staff was friendly & helpful. We would be happy to stay here on our next viset to Adelaide.",
            "title": "Comfortable modern nice Boutique Hotel",
            "user": "EllenQBB_11"
        },
        {
            "date": "July 29, 2011",
            "detail_rating": {
                "business": null,
                "cleanliness": 4.0,
                "desk": null,
                "location": null,
                "pool": null,
                "restaurant": null,
                "rooms": null,
                "service": 5.0,
                "sleep": 4.0,
                "value": 5.0
            },
            "helpfulness": 1,
            "id": 115968869,
            "likes": {
                "disliked": null,
                "liked": null
            },
            "rating": 4.0,
            "stay_parameters": "Stayed June 2011, traveled as a couple",
            "text": "We went to Adelaide for the June long weekend. We paid about $300 for 3 nights including continental breakfast each morning (Wotif deal). The room was clean and pleasant. The service was friendly and helpful. The hotel had a basic business centre, which was free. The location is convenient to the city. The building is also nice.",
            "title": "Great value and friendly service",
            "user": "Dom03"
        },
        {
            "date": "June 15, 2011",
            "detail_rating": {
                "business": null,
                "cleanliness": 5.0,
                "desk": null,
                "location": null,
                "pool": null,
                "restaurant": null,
                "rooms": null,
                "service": 5.0,
                "sleep": 4.0,
                "value": 5.0
            },
            "helpfulness": null,
            "id": 113768954,
            "likes": {
                "disliked": null,
                "liked": null
            },
            "rating": 4.0,
            "stay_parameters": "Stayed June 2011, traveled as a couple",
            "text": "Clean quiet rooms with a touch of style, comfortable bed, friendly staff and a simple but nice and social breakfast all made for a good stay. While 10-15 mins walk from central Adelaide the Hutt St shopping strip is 2 minutes away and has a good selection of restaurants and a small well stocked supermarket, we particularly enjoyed our table with fishtank views at the House of Chow chinese restaurant",
            "title": "Lovely Place Great Value",
            "user": "SafariBeagle"
        },
        {
            "date": "June 11, 2011",
            "detail_rating": {
                "business": null,
                "cleanliness": 3.0,
                "desk": null,
                "location": null,
                "pool": null,
                "restaurant": null,
                "rooms": null,
                "service": 5.0,
                "sleep": 1.0,
                "value": 4.0
            },
            "helpfulness": 3,
            "id": 112721508,
            "likes": {
                "disliked": null,
                "liked": null
            },
            "rating": 2.0,
            "stay_parameters": "Stayed May 2011, traveled on business",
            "text": "This is a nice looking hotel from the outside, the rooms are very clean and modern. The front desk staff were exceptional to deal with - courteous, polite, knowledgeable and friendly.",
            "title": "Nice hotel, great staff.... But not quite sure about the building",
            "user": "DMMatlin"
        },
        {
            "date": "May 20, 2011",
            "detail_rating": {
                "business": null,
                "cleanliness": 5.0,
                "desk": null,
                "location": 4.0,
                "pool": null,
                "restaurant": null,
                "rooms": 5.0,
                "service": 5.0,
                "sleep": null,
                "value": 5.0
            },
            "helpfulness": null,
            "id": 109137679,
            "likes": {
                "disliked": null,
                "liked": null
            },
            "rating": 5.0,
            "stay_parameters": "Stayed May 2011",
            "text": "But I truly wonder about the actual building the hotel is in. My room had a constant noise of running water coming from the wall. This noise was unbelievably loud at times.",
            "title": "Could not have been nicer",
            "user": "lanib2"
        },
        {
            "date": "May 20, 2011",
            "detail_rating": {
                "business": null,
                "cleanliness": 5.0,
                "desk": null,
                "location": 5.0,
                "pool": null,
                "restaurant": null,
                "rooms": 5.0,
                "service": 5.0,
                "sleep": 5.0,
                "value": 5.0
            },
            "helpfulness": null,
            "id": 109024611,
            "likes": {
                "disliked": null,
                "liked": null
            },
            "rating": 5.0,
            "stay_parameters": "Stayed May 2011, traveled as a couple",
            "text": "Now if you check into a hotel to sleep... This might not be the place for you.",
            "title": "Home away from home",
            "user": "meandirene"
        },
        {
            "date": "May 12, 2011",
            "detail_rating": {
                "business": null,
                "cleanliness": 5.0,
                "desk": null,
                "location": 4.0,
                "pool": null,
                "restaurant": null,
                "rooms": 3.0,
                "service": 5.0,
                "sleep": 3.0,
                "value": 4.0
            },
            "helpfulness": 1,
            "id": 107907213,
            "likes": {
                "disliked": null,
                "liked": null
            },
            "rating": 4.0,
            "stay_parameters": "Stayed April 2011, traveled as a couple",
            "text": "I might have had bad luck with my room, but you might too.",
            "title": "Good value packed in a historical building",
            "user": "tmtexpress"
        },
        {
            "date": "August 21, 2011",
            "detail_rating": {
                "business": null,
                "cleanliness": 5.0,
                "desk": null,
                "location": null,
                "pool": null,
                "restaurant": null,
                "rooms": null,
                "service": 5.0,
                "sleep": 4.0,
                "value": 4.0
            },
            "helpfulness": null,
            "id": 117018315,
            "likes": {
                "disliked": null,
                "liked": null
            },
            "rating": 5.0,
            "stay_parameters": "Stayed August 2011, traveled as a couple",
            "text": "We stayed for 8 nights in August, and found Adabco to be perfect for our needs. It is very centrally located so we could walk to anywhere within the four terraces very easily, and it's also an easy walk to the zoo to see the pandas. I loved that it had a guest kitchen, as after all those wine tours during the day (with big lunches) we didn't always want a full dinner out every evening, so it was nice to be able to make some cheese on toast or kangaroo sausages/emu burgers some nights, but without having to book a more expensive hotel with private kitchen that wasn't needed every night. The breakfast was great - even though it was continental, I was pleased that they had 3 choices of bread for toast and two types of cereal (including a very delicious muesli) with fruit. There is a computer that you can use to check your email/Facebook etc, and I never had to wait for more than about 10 minutes to use it, so that was also appreciated. I'll most definitely stay there if I go back to Adelaide.",
            "title": "Really great hotel, highly recommended",
            "user": "ChilliCat16"
        },
        {
            "date": "August 20, 2011",
            "detail_rating": {
                "business": null,
                "cleanliness": 5.0,
                "desk": null,
                "location": null,
                "pool": null,
                "restaurant": null,
                "rooms": null,
                "service": 5.0,
                "sleep": 5.0,
                "value": 5.0
            },
            "helpfulness": null,
            "id": 116979816,
            "likes": {
                "disliked": null,
                "liked": null
            },
            "rating": 5.0,
            "stay_parameters": "Stayed July 2011, traveled as a couple",
            "text": "Excellent hotel with very comfortable beds. Continental breakfast is included. Has satellite tv very cenral to everything in Adelaide. Booked through Wotif website for the cheapest rate.",
            "title": "Excellent value",
            "user": "MozzaAdelaide"
        },
        {
            "date": "August 13, 2011",
            "detail_rating": {
                "business": null,
                "cleanliness": 5.0,
                "desk": null,
                "location": null,
                "pool": null,
                "restaurant": null,
                "rooms": null,
                "service": 5.0,
                "sleep": 5.0,
                "value": 5.0
            },
            "helpfulness": 1,
            "id": 116673870,
            "likes": {
                "disliked": null,
                "liked": null
            },
            "rating": 5.0,
            "stay_parameters": "Stayed August 2011, traveled as a couple",
            "text": "we followed the advise of other travellers &yes its right,a gr8 value,well located boutique hotel,,the staff were extra helpful,everything crisp & clean,will definitly be back",
            "title": "immaculate/well presented",
            "user": "50odd_aus"
        },
        {
            "date": "August 13, 2011",
            "detail_rating": {
                "business": null,
                "cleanliness": null,
                "desk": null,
                "location": null,
                "pool": null,
                "restaurant": null,
                "rooms": null,
                "service": null,
                "sleep": null,
                "value": null
            },
            "helpfulness": 1,
            "id": 116654577,
            "likes": {
                "disliked": null,
                "liked": null
            },
            "rating": 5.0,
            "stay_parameters": null,
            "text": "Excellent stay at Adabco Boutique Hotel. Clean rooms with nice Continental Breakfast and well appointed communal kitchens on each floor.",
            "title": "Nice Place to stay in Adelaide",
            "user": "JennyD52"
        },
        {
            "date": "August 10, 2011",
            "detail_rating": {
                "business": null,
                "cleanliness": 5.0,
                "desk": null,
                "location": null,
                "pool": null,
                "restaurant": null,
                "rooms": null,
                "service": 5.0,
                "sleep": 5.0,
                "value": 5.0
            },
            "helpfulness": 2,
            "id": 116537336,
            "likes": {
                "disliked": null,
                "liked": null
            },
            "rating": 5.0,
            "stay_parameters": "Stayed July 2011, traveled on business",
            "text": "This hotel was a beautiful historic building and had a tasteful modern interior that allowed for an ease of living(self service kitchen and surrounded by great restaurants) whilst working in Adelaide. The staff made the stay really enjoyable with their eagerness to help with any needs.",
            "title": "The place to stay in Adelaide",
            "user": "Nikki A"
        }
    ],
    "slim_ranking": 0.0909090909091,
    "stars": 3.5,
    "tripadvisor": {
        "VISITED": false,
        "country_name": null,
        "locality": null,
        "pic_link": null,
        "street_address": null
    },
    "user_rating": 4.0,
    "variance": {
        "average": 50,
        "excellent": 200,
        "poor": 8,
        "terrible": 9,
        "very good": 206
    }
}