{
    "aka": "Crown Hotel Doncaster",
    "description": "The four star Crown Hotel is located in chic and cosmopolitan Bawtry. The hotel has been transformed with a rustic and contemporary style, with 77 bedrooms including sumptuous executive bedrooms with mood lighting, photographic wallpaper and sunken beds. The Crown restaurant open all day offers a locally sourced menu including grills, fish, pasta and its famous sharing platters, whilst the bustling Crown bar also offers a fizz menu and has a great atmosphere with candle lit lanterns and music. Bawtry is also right on the hotel doorstep and is renowned for its independent boutique shopping, restaurants and wine bars. The Crown is the perfect location to stay while visiting Doncaster Racecourse, Keepmoat Stadium / Doncaster Rovers, Doncaster Dome or when flying from Robin Hood Airport just 3 miles away.",
    "detail_rating": {
        "cleanliness": null,
        "location": null,
        "rooms": null,
        "service": null,
        "sleep": null,
        "value": null
    },
    "location": {
        "city": null,
        "continent": "Europe",
        "country": "United Kingdom (UK)",
        "proposed_city": "Doncaster",
        "province": null,
        "region": null
    },
    "name": "The Crown Hotel",
    "places": {
        "aka": [
            "Doncaster"
        ],
        "hotel_description": [
            "Doncaster",
            "Dome"
        ],
        "hotel_name": []
    },
    "review_count": 125,
    "review_count_current": 20,
    "reviews": [
        {
            "date": "November 27, 2011",
            "detail_rating": {
                "business": null,
                "cleanliness": 5.0,
                "desk": null,
                "location": 4.0,
                "pool": null,
                "restaurant": null,
                "rooms": 4.0,
                "service": 4.0,
                "sleep": 4.0,
                "value": 3.0
            },
            "helpfulness": null,
            "id": 121092194,
            "likes": {
                "disliked": null,
                "liked": null
            },
            "rating": 4.0,
            "stay_parameters": "Stayed November 2011, traveled with friends",
            "text": "We stayed one night in an executive room at The Crown. I actually only booked a standard room & haggled them down to \u00a3105. When we checked in we were sent to an executive room. I don't know why we were upgraded but I was pleased. Our friends payed \u00a3165 for the same room which I'd say was a tad overpriced. The room was clean & cosy. The bathroom was fab with a jacuzzi bath. Not sure about the black loo paper but hey ho! My only 2 small gripes were the poor lighting in the bedroom, useless for putting your makeup on (but the bathroom was well lit) and although the bed was very comfortable, the pillows weren't so good. We got a complimentary food hamper with sweets & biscuits. Breakfast was really tasty. The reception area was well decorated & comfortable too.",
            "title": "Lovely, comfortable night at The Crown.",
            "user": "tulip"
        },
        {
            "date": "November 24, 2011",
            "detail_rating": {
                "business": null,
                "cleanliness": 5.0,
                "desk": null,
                "location": 5.0,
                "pool": null,
                "restaurant": null,
                "rooms": 5.0,
                "service": 5.0,
                "sleep": 5.0,
                "value": 5.0
            },
            "helpfulness": 1,
            "id": 120988268,
            "likes": {
                "disliked": null,
                "liked": null
            },
            "rating": 5.0,
            "stay_parameters": "Stayed November 2011, traveled as a couple",
            "text": "My wife and I live just three miles away and have stayed at the Crown a few times as a treat and always been impressed. But recentley stayed and everything seems to have improved if that was possible.",
            "title": "The Ritz of the north",
            "user": "AntonyB66"
        },
        {
            "date": "October 5, 2011",
            "detail_rating": {
                "business": null,
                "cleanliness": 4.0,
                "desk": null,
                "location": 4.0,
                "pool": null,
                "restaurant": null,
                "rooms": 4.0,
                "service": 4.0,
                "sleep": null,
                "value": 4.0
            },
            "helpfulness": null,
            "id": 118978948,
            "likes": {
                "disliked": null,
                "liked": null
            },
            "rating": 4.0,
            "stay_parameters": "Stayed September 2011",
            "text": "As soon as you enter the recption you know your in a special place. the reception staff where very proffesional and made you feel special even before you got to your room. We stayed in one of the executive rooms, 507, which has a wow factor as soon as you walk through the door.The decor is straight out of a designer magazine. Large bathroom with good size bath and double shower and well lit. The main room was a really good size with corner seating, raised bed with memory foam topper( if you just want to get away and sleep, this is the place to go), Large flat screen TV with good selection of free channels.",
            "title": "Hot room but apart from this it's fine!",
            "user": "TravelAgentCheshire"
        },
        {
            "date": "September 17, 2011",
            "detail_rating": {
                "business": null,
                "cleanliness": null,
                "desk": null,
                "location": 4.0,
                "pool": null,
                "restaurant": null,
                "rooms": 4.0,
                "service": 4.0,
                "sleep": null,
                "value": 2.0
            },
            "helpfulness": null,
            "id": 118244687,
            "likes": {
                "disliked": null,
                "liked": null
            },
            "rating": 4.0,
            "stay_parameters": "Stayed August 2011, traveled with friends",
            "text": "We booked a table for 7.00 and the new look restaurant area added a special feeling and mood to eating. The staff where very attentive but knew when to leave you alone and dont constantly ask \"is everything ok\" with each mouthfull. They where knowledgable about the food being served and like good staff you did not know they where there but everything was delt with perfectly, keeping good traditions of politeness and old fashioned etiquet alive.",
            "title": "great brekkie and comfy beds",
            "user": "becmeadz"
        },
        {
            "date": "July 27, 2011",
            "detail_rating": {
                "business": null,
                "cleanliness": 4.0,
                "desk": null,
                "location": null,
                "pool": null,
                "restaurant": null,
                "rooms": null,
                "service": 3.0,
                "sleep": 4.0,
                "value": 1.0
            },
            "helpfulness": null,
            "id": 115845265,
            "likes": {
                "disliked": null,
                "liked": null
            },
            "rating": 2.0,
            "stay_parameters": "Stayed July 2011, traveled on business",
            "text": "I really dont know where to start with the food. We shared a pate and onion chutney which was obviously home made and to die for. Then came the main course,I had the venison with root vegetable mash and my wife had belly pork and black pudding mash (wow wow WOW) we also ordered two side dishes and I dont know what has changed in the kitchen as the last time we stayed the food was good but this time a whole new level was reached. Even when we felt full we could not stop eating.",
            "title": "Not worthy of four star and doesn't warrant the price...",
            "user": "gormet1965"
        },
        {
            "date": "July 18, 2011",
            "detail_rating": {
                "business": null,
                "cleanliness": 5.0,
                "desk": null,
                "location": null,
                "pool": null,
                "restaurant": null,
                "rooms": null,
                "service": 5.0,
                "sleep": 5.0,
                "value": 5.0
            },
            "helpfulness": null,
            "id": 115504024,
            "likes": {
                "disliked": null,
                "liked": null
            },
            "rating": 5.0,
            "stay_parameters": "Stayed July 2011, traveled as a couple",
            "text": "We stayed here to celebrate our 25th Wedding Anniversary - wow - we had an executive suite - it was amazing!!!! room 507 - we also decided to eat in the restaurant - although there was a wedding taking place it certainly did not affect the service - the food is amazing here at the Crown and if you havent eaten here recently go back as they are launching a new menu!! We had the sharing camembert cheese with rosemary and garlic - it was so amazing - fantastic- very filling that I wish I hadnt ordered a main .... the portions are so generous - I then had seafood risotto and my husband had fillet steak - he could not believe the size and quality of the steak - YOU MUST GO !!!!",
            "title": "Absolutely fantastic",
            "user": "JackieT381"
        },
        {
            "date": "June 24, 2011",
            "detail_rating": {
                "business": null,
                "cleanliness": 3.0,
                "desk": null,
                "location": null,
                "pool": null,
                "restaurant": null,
                "rooms": null,
                "service": 1.0,
                "sleep": 3.0,
                "value": 1.0
            },
            "helpfulness": null,
            "id": 114719141,
            "likes": {
                "disliked": null,
                "liked": null
            },
            "rating": 2.0,
            "stay_parameters": "Stayed June 2011, traveled as a couple",
            "text": "The only downside is that in our room there was an air conditioning unit that was very loud and the whole building could do with airconditioning but please dont let that put you off",
            "title": "Worst customer service for a 4 star hotel i have ever encountered...",
            "user": "shelley636"
        },
        {
            "date": "June 15, 2011",
            "detail_rating": {
                "business": null,
                "cleanliness": null,
                "desk": null,
                "location": null,
                "pool": null,
                "restaurant": null,
                "rooms": null,
                "service": 1.0,
                "sleep": null,
                "value": 1.0
            },
            "helpfulness": 1,
            "id": 113600167,
            "likes": {
                "disliked": null,
                "liked": null
            },
            "rating": 1.0,
            "stay_parameters": "Stayed June 2011, traveled with family",
            "text": "Stayed overnight in a room not worthy of 4 star status, when i approached the Hotel Manager about certain issues i had he immediately became defensive, rude and very unapologetic. Certainly not a place i would consider staying in again. Obviously re training should be considered and maybe change in management.",
            "title": "Avoid",
            "user": "A902992"
        },
        {
            "date": "January 4, 2011",
            "detail_rating": {
                "business": null,
                "cleanliness": 4.0,
                "desk": null,
                "location": 4.0,
                "pool": null,
                "restaurant": null,
                "rooms": 2.0,
                "service": 3.0,
                "sleep": 1.0,
                "value": 2.0
            },
            "helpfulness": null,
            "id": 91709162,
            "likes": {
                "disliked": null,
                "liked": null
            },
            "rating": 3.0,
            "stay_parameters": "Stayed December 2010, traveled as a couple",
            "text": "Ate dinner here in an empty restaurant, one other table. Our waiter was young and inexperienced and couldn't open our wine, our table was not table checked and I literally had to wander round to find then ask someone and ask for some pepper. I could hear our waitresses laughing and chatting from the kitchen.",
            "title": "Not a 4 star hotel",
            "user": "nikkig12"
        },
        {
            "date": "October 16, 2010",
            "detail_rating": {
                "business": null,
                "cleanliness": 5.0,
                "desk": null,
                "location": 4.0,
                "pool": null,
                "restaurant": null,
                "rooms": 4.0,
                "service": 4.0,
                "sleep": 4.0,
                "value": 4.0
            },
            "helpfulness": null,
            "id": 83711785,
            "likes": {
                "disliked": null,
                "liked": null
            },
            "rating": 4.0,
            "stay_parameters": "Stayed May 2010, traveled as a couple",
            "text": "We were not offered desserts, coffee or the bill. For this we also had to leave our seats.",
            "title": "Good stay",
            "user": "rovers100"
        },
        {
            "date": "October 1, 2010",
            "detail_rating": {
                "business": null,
                "cleanliness": 4.0,
                "desk": null,
                "location": 2.0,
                "pool": null,
                "restaurant": null,
                "rooms": 1.0,
                "service": 4.0,
                "sleep": 1.0,
                "value": 1.0
            },
            "helpfulness": null,
            "id": 81765375,
            "likes": {
                "disliked": null,
                "liked": null
            },
            "rating": 1.0,
            "stay_parameters": "Stayed September 2010, traveled on business",
            "text": "Advertising is very good, downstairs the breakfast is very good and the staff very friendly. BUT the rooms are very bad. The hot water transport pipes go through all the rooms (we stayed in several). Put blankets to cover them and get temperature down. In most rooms the windows cannot be opened. The beds are no good either. Management should spend time and money in the product 'sleep' and not in PR.",
            "title": "Excellent website, kitchen and staff, bad rooms",
            "user": "jkbeers"
        },
        {
            "date": "September 27, 2010",
            "detail_rating": {
                "business": null,
                "cleanliness": 3.0,
                "desk": null,
                "location": 4.0,
                "pool": null,
                "restaurant": null,
                "rooms": 2.0,
                "service": 2.0,
                "sleep": 2.0,
                "value": 2.0
            },
            "helpfulness": null,
            "id": 81181151,
            "likes": {
                "disliked": null,
                "liked": null
            },
            "rating": 2.0,
            "stay_parameters": "Stayed August 2010, traveled on business",
            "text": "Again, kitchen very good and Bawtry is a lovely small town that deserved a good quality hotel!",
            "title": "Could be a lovely hotel",
            "user": "prettybritty"
        },
        {
            "date": "September 2, 2010",
            "detail_rating": {
                "business": null,
                "cleanliness": 3.0,
                "desk": null,
                "location": 4.0,
                "pool": null,
                "restaurant": null,
                "rooms": 3.0,
                "service": 4.0,
                "sleep": 4.0,
                "value": 3.0
            },
            "helpfulness": null,
            "id": 78052586,
            "likes": {
                "disliked": null,
                "liked": null
            },
            "rating": 3.0,
            "stay_parameters": "Stayed August 2010, traveled as a couple",
            "text": "Ah yes, and the wifi was for free and worked very well and each room has a modern flatscreen telly. For those who find this important ...",
            "title": "Best breakfast in a hotel for many years",
            "user": "PrincessRobbo"
        },
        {
            "date": "September 1, 2010",
            "detail_rating": {
                "business": null,
                "cleanliness": 2.0,
                "desk": null,
                "location": 3.0,
                "pool": null,
                "restaurant": null,
                "rooms": 1.0,
                "service": 3.0,
                "sleep": 1.0,
                "value": 1.0
            },
            "helpfulness": null,
            "id": 77802569,
            "likes": {
                "disliked": null,
                "liked": null
            },
            "rating": 2.0,
            "stay_parameters": "Stayed August 2010, traveled on business",
            "text": "The hotel has been refurbished & the public areas aswell as the bedrooms look like a luxurious boutique hotel BUT there are many things that are disappointing which the hotel could easily rectify :-.",
            "title": "Don't waste your money - not a 4 star hotel at all",
            "user": "globetrekker82"
        },
        {
            "date": "August 22, 2010",
            "detail_rating": {
                "business": null,
                "cleanliness": 5.0,
                "desk": null,
                "location": 5.0,
                "pool": null,
                "restaurant": null,
                "rooms": 5.0,
                "service": 3.0,
                "sleep": null,
                "value": 4.0
            },
            "helpfulness": null,
            "id": 76357104,
            "likes": {
                "disliked": null,
                "liked": null
            },
            "rating": 3.0,
            "stay_parameters": "Stayed August 2010",
            "text": "1 The rooms are very hot or freezing cold (radiators not in use)- it's pot luck which one you will get.",
            "title": "quality depend on which staff are on duty!",
            "user": "mrandmrsgrowler"
        },
        {
            "date": "June 24, 2010",
            "detail_rating": {
                "business": null,
                "cleanliness": 3.0,
                "desk": null,
                "location": 3.0,
                "pool": null,
                "restaurant": null,
                "rooms": 2.0,
                "service": 4.0,
                "sleep": 2.0,
                "value": 2.0
            },
            "helpfulness": 2,
            "id": 68565307,
            "likes": {
                "disliked": null,
                "liked": null
            },
            "rating": 3.0,
            "stay_parameters": "Stayed June 2010, traveled as a couple",
            "text": "Our \"executive room\" was smaller than our kitchen at home. Very dark. Situated by communal door to corridor, so was awoken by late night revellers on more than one occasion. Upon opening the curtains we were greeted with a view of some back alley of corrugated roofs. Couldn't watch TV as it was facing the wrong direction on dressing table. Bar area ridiculously small with not much seating. Dinner okay but expensive. Breakfast, which was mediocre, was served before we had finished our cereal. Staff were friendly and helpful, but they'd have to be to make up for the lack of everything else about this hotel. Family stayed at the Premier Inn for a fraction of the price. Apparently breakfast there was superb. Wish we had joined them!",
            "title": "Very disappointing",
            "user": "Websey3"
        },
        {
            "date": "June 13, 2010",
            "detail_rating": {
                "business": null,
                "cleanliness": null,
                "desk": null,
                "location": 4.0,
                "pool": null,
                "restaurant": null,
                "rooms": 3.0,
                "service": 3.0,
                "sleep": 1.0,
                "value": 1.0
            },
            "helpfulness": null,
            "id": 67328100,
            "likes": {
                "disliked": null,
                "liked": null
            },
            "rating": 2.0,
            "stay_parameters": "Stayed June 2010, traveled as a couple",
            "text": "We booked a two night stay as we were attending a function in Bawtry. The first night we were kept awake until very late by by people attending a function gathering noisily outside beneath our window. As a wedding was being held there the following day and people had come to watch England play in the World Cup we decided to check out early.",
            "title": "If you are elderly don't go",
            "user": "TyphoonMaidstone"
        },
        {
            "date": "April 17, 2010",
            "detail_rating": {
                "business": null,
                "cleanliness": 2.0,
                "desk": null,
                "location": 3.0,
                "pool": null,
                "restaurant": null,
                "rooms": 2.0,
                "service": 3.0,
                "sleep": 3.0,
                "value": 1.0
            },
            "helpfulness": 1,
            "id": 61768484,
            "likes": {
                "disliked": null,
                "liked": null
            },
            "rating": 3.0,
            "stay_parameters": "Stayed April 2010, traveled as a couple",
            "text": "Being elderly it was impossible to climb over the the side of the bath which was steep sided. Apart from the fact we could not lift our legs high enough there were no hand rails.",
            "title": "You do not get what you pay for.",
            "user": "superfly007"
        },
        {
            "date": "April 7, 2010",
            "detail_rating": {
                "business": null,
                "cleanliness": 5.0,
                "desk": null,
                "location": 5.0,
                "pool": null,
                "restaurant": null,
                "rooms": 5.0,
                "service": 5.0,
                "sleep": 3.0,
                "value": 4.0
            },
            "helpfulness": null,
            "id": 60642497,
            "likes": {
                "disliked": null,
                "liked": null
            },
            "rating": 5.0,
            "stay_parameters": "Stayed April 2010, traveled on business",
            "text": "All this for \u00a3110 per night!",
            "title": "Good hotel in a great location",
            "user": "kevinpool"
        },
        {
            "date": "April 3, 2010",
            "detail_rating": {
                "business": null,
                "cleanliness": 3.0,
                "desk": null,
                "location": 4.0,
                "pool": null,
                "restaurant": null,
                "rooms": 3.0,
                "service": 4.0,
                "sleep": 3.0,
                "value": 3.0
            },
            "helpfulness": null,
            "id": 60224099,
            "likes": {
                "disliked": null,
                "liked": null
            },
            "rating": 3.0,
            "stay_parameters": "Stayed March 2010, traveled with friends",
            "text": "I was invited to a wedding at this venue. The bride suggested that we stay here as it would be easy to come and go. She also told us she had negotiated the prices down. Well, we paid \u00a390.00 for a standard double, which was about \u00a315.00 off the regular rate. I was pretty shocked at that price- as I have stayed at many other establishements that were much cheaper and much more confortabale. For a starter, our shower had no water pressure. The lighting in the room was bad. The TV was only the standard channels(BBC 1&2, ITV and Channel 4) and the price for a movie was ridiculous. You had to pay for WIFI, which I was quite shocked by. Our room was very hot and stuffy. Luckily my partner is handy and could find a way to get the heat turned down himself. The bath room was small and the fixtures seemed tired. And, to top it all off we had to listen to a car auction for about 3 hours in the afternoon while trying to take a nap. The other problem was the hairdressers. Not the nicest thing to have to smell when walking back and forth to your room! The bar prices were high and the choices were poor to say the least.",
            "title": "Nice hotel, shame about the breakfast",
            "user": "andura"
        }
    ],
    "slim_ranking": 1.0,
    "stars": null,
    "tripadvisor": {
        "VISITED": false,
        "country_name": null,
        "locality": null,
        "pic_link": null,
        "street_address": null
    },
    "user_rating": 3.5,
    "variance": {
        "average": 28,
        "excellent": 38,
        "poor": 19,
        "terrible": 11,
        "very good": 29
    }
}