{
    "aka": "Casa Flamboyant Hotel Naguabo",
    "description": "Nestled in El Yunque...",
    "detail_rating": {
        "cleanliness": null,
        "location": null,
        "rooms": null,
        "service": null,
        "sleep": null,
        "value": null
    },
    "location": {
        "city": "Naguabo",
        "continent": null,
        "country": "Caribbean",
        "proposed_city": null,
        "province": null,
        "region": null
    },
    "name": "Casa Flamboyant",
    "places": {
        "aka": [],
        "hotel_description": [],
        "hotel_name": []
    },
    "review_count": 98,
    "review_count_current": 11,
    "reviews": [
        {
            "date": "April 3, 2007",
            "detail_rating": {
                "business": null,
                "cleanliness": 5.0,
                "desk": null,
                "front_desk": 5.0,
                "location": 5.0,
                "pool": null,
                "restaurant": null,
                "rooms": 5.0,
                "service": 5.0,
                "sleep": null,
                "value": 5.0
            },
            "helpfulness": null,
            "id": 7278931,
            "likes": {
                "disliked": "\u2014 lack of meal choices",
                "liked": "\u2014 The view"
            },
            "rating": 5.0,
            "stay_parameters": "Stayed March 2007, traveled as a couple",
            "text": "My girlfriend and I stayed in the Ginger Room. It had the most spectacular view. Shirley was a wonderful host and provided us not only with valuable information, but delicious breakfasts. We stayed two nights and we felt like we could have easily stayed two more. The room was modest, nicely decorated, clean, and comfortable. I feel",
            "title": "Wished we could have stayed longer",
            "user": "greegor22"
        },
        {
            "date": "March 25, 2007",
            "detail_rating": {
                "business": null,
                "cleanliness": null,
                "desk": null,
                "location": null,
                "pool": null,
                "restaurant": null,
                "rooms": null,
                "service": null,
                "sleep": null,
                "value": 5.0
            },
            "helpfulness": 1,
            "id": 7219326,
            "likes": {
                "disliked": null,
                "liked": null
            },
            "rating": 5.0,
            "stay_parameters": "Stayed March 2007",
            "text": "that this is the best place to stay in the rainforest (and we saw two",
            "title": "Casa Flamboyant is first rate!!!",
            "user": "su333an"
        },
        {
            "date": "February 25, 2007",
            "detail_rating": {
                "business": null,
                "cleanliness": 5.0,
                "desk": null,
                "front_desk": 5.0,
                "location": 5.0,
                "pool": null,
                "restaurant": null,
                "rooms": 5.0,
                "service": 5.0,
                "sleep": null,
                "value": null
            },
            "helpfulness": null,
            "id": 6839901,
            "likes": {
                "disliked": null,
                "liked": "\u2014 gorgeous scenery, relaxing atmosphere"
            },
            "rating": 5.0,
            "stay_parameters": "Stayed February 2007, traveled as a couple",
            "text": "other places while there). Not much for dinner choices, but the few that are there are very nice.",
            "title": "Perfect Getaway!",
            "user": "Washingtonwander"
        },
        {
            "date": "February 22, 2007",
            "detail_rating": {
                "business": 3.0,
                "cleanliness": 4.0,
                "desk": null,
                "front_desk": 4.0,
                "location": 4.0,
                "pool": null,
                "restaurant": null,
                "rooms": 4.0,
                "service": 4.0,
                "sleep": null,
                "value": 4.0
            },
            "helpfulness": null,
            "id": 6824691,
            "likes": {
                "disliked": "\u2014 drive up and down the mountain",
                "liked": "\u2014 peace and beauty"
            },
            "rating": 4.0,
            "stay_parameters": "Stayed January 2007, traveled as a couple",
            "text": "My husband and I spent the last four nights of our recent trip to Puerto Rico at Casa Flamboyant. Just to put this in some perspective, we'd spend the previous three nights at the posh Ritz Carlton in Isla Verde -- beautiful hotel, but Casa Flamboyant is closer to my heart's delight.",
            "title": "Beautiful!!!!!!!!",
            "user": "MarthaL."
        },
        {
            "date": "February 21, 2007",
            "detail_rating": {
                "business": null,
                "cleanliness": null,
                "desk": null,
                "location": null,
                "pool": null,
                "restaurant": null,
                "rooms": null,
                "service": null,
                "sleep": null,
                "value": null
            },
            "helpfulness": null,
            "id": 6820746,
            "likes": {
                "disliked": null,
                "liked": null
            },
            "rating": 5.0,
            "stay_parameters": null,
            "text": "It starts right at the entrance. A long, coral-colored wall topped with cascading flowers with a warm wooden door in the center greets you. That door opens into a lush garden and then the house with a view out over the large patio (complete with pool). You are drawn out to see the incredible vistas...two waterfalls, untouched rainforest and a view of the Caribbean in the distant. Our first activity was to take a walk down the property to the waterfall/stream with two of the resident dogs as capable guides.",
            "title": "Would Stay There Again",
            "user": "rizzm"
        },
        {
            "date": "March 21, 2006",
            "detail_rating": {
                "business": null,
                "cleanliness": null,
                "desk": null,
                "location": null,
                "pool": null,
                "restaurant": null,
                "rooms": null,
                "service": null,
                "sleep": null,
                "value": null
            },
            "helpfulness": 5,
            "id": 4723325,
            "likes": {
                "disliked": null,
                "liked": null
            },
            "rating": 5.0,
            "stay_parameters": null,
            "text": "Casa Flamboyant is a wonderful rain forest B & B getaway. We were able to relax and de-stress completely there. It is located on the South portion of El Yunque near the end of Hwy. 191, and offers wonderful hiking opportunities in the rain forest and along the Cubuy river. You can hike on your own or have the owner, Shirley, arrange for an English-speaking guide who lives close by.",
            "title": "Fabulous Getaway",
            "user": "RaleighLady"
        },
        {
            "date": "February 11, 2007",
            "detail_rating": {
                "business": null,
                "cleanliness": 4.0,
                "desk": null,
                "front_desk": 4.0,
                "location": 5.0,
                "pool": null,
                "restaurant": null,
                "rooms": 4.0,
                "service": 4.0,
                "sleep": null,
                "value": 4.0
            },
            "helpfulness": null,
            "id": 6780203,
            "likes": {
                "disliked": "\u2014 Nothing really - the house is an older house",
                "liked": "\u2014 Views"
            },
            "rating": 4.0,
            "stay_parameters": "Stayed December 2006, traveled as a couple",
            "text": "We stayed at Casa Flamboyant for 2 days at the beginning of our visit to Puerto Rico back in December. We had a great stay and it was the perfect start to the trip. The house is on the south side of El Yunque and nestled in the hills. We stayed in one of the rooms in the main floor of the house, the Forever and Ever room. The house itself is well kept and the views are just incredible, especially from the heated horizon pool.",
            "title": "Great Start to Our Trip",
            "user": "guest002"
        },
        {
            "date": "January 22, 2007",
            "detail_rating": {
                "business": 5.0,
                "cleanliness": 5.0,
                "desk": null,
                "front_desk": 5.0,
                "location": 5.0,
                "pool": null,
                "restaurant": null,
                "rooms": 5.0,
                "service": 5.0,
                "sleep": null,
                "value": 5.0
            },
            "helpfulness": null,
            "id": 6642842,
            "likes": {
                "disliked": "\u2014 none",
                "liked": "\u2014 the views"
            },
            "rating": 5.0,
            "stay_parameters": "Stayed January 2007, traveled as a couple",
            "text": "Shirley was warm and welcoming. She made many suggestions for the rest of our trip. The dinner at El Bohio for all the guests was simply delicious. One of the highlights of our trip was the hiking trip with Robin to the waterfall. Robin is friendly, laid back and very, very knowledgeable. We highly recommend the hike.",
            "title": "Greatest place on Earth",
            "user": "NatureLoverNewJersey"
        },
        {
            "date": "January 19, 2007",
            "detail_rating": {
                "business": null,
                "cleanliness": 5.0,
                "desk": null,
                "front_desk": 5.0,
                "location": 5.0,
                "pool": null,
                "restaurant": null,
                "rooms": 5.0,
                "service": 5.0,
                "sleep": null,
                "value": 5.0
            },
            "helpfulness": null,
            "id": 6623437,
            "likes": {
                "disliked": null,
                "liked": "\u2014 Setting and privacy"
            },
            "rating": 5.0,
            "stay_parameters": "Stayed January 2007, traveled as a couple",
            "text": "Overall, it was a great experience. We will definitely go back again.",
            "title": "Paradise found!",
            "user": "padame"
        },
        {
            "date": "January 15, 2007",
            "detail_rating": {
                "business": 5.0,
                "cleanliness": 5.0,
                "desk": null,
                "front_desk": 5.0,
                "location": 5.0,
                "pool": null,
                "restaurant": null,
                "rooms": 5.0,
                "service": 5.0,
                "sleep": null,
                "value": 5.0
            },
            "helpfulness": null,
            "id": 6599124,
            "likes": {
                "disliked": "\u2014 that I had to leave",
                "liked": "\u2014 the views"
            },
            "rating": 5.0,
            "stay_parameters": "Stayed January 2007, traveled as a couple",
            "text": "We go every year to Casa Flamboyant in order to \"recharge our batteries\". We have stayed there for at least for a few days every year. The location is excelelent and Shirley is a great host. She always makes our stay memorable. It is a tour of the senses: Be sure to smell the water lily in the front Garden. We love to watch the night sky from Shirley's heated pool. Somehow we see so many stars, way more than we could ever see even on a clear night in New Jersey. Here the fruits are as fresh as one can get them and be sure to fill your lungs with the clean air. Fall asleep with the sounds of the coquis and wake up to sounds of waterfall. A fantastic place to stay in the middle of nature.",
            "title": "This is where you need to stay in Puerto Rico",
            "user": "jmalmee"
        },
        {
            "date": "October 18, 2006",
            "detail_rating": {
                "business": null,
                "cleanliness": 5.0,
                "desk": null,
                "front_desk": 5.0,
                "location": 4.0,
                "pool": null,
                "restaurant": null,
                "rooms": 4.0,
                "service": 5.0,
                "sleep": null,
                "value": 4.0
            },
            "helpfulness": 2,
            "id": 5968611,
            "likes": {
                "disliked": "\u2014 driving up the mountain and lack of dining options",
                "liked": "\u2014 views"
            },
            "rating": 5.0,
            "stay_parameters": "Stayed October 2006, traveled as a couple",
            "text": "BEAUTIFUL AND MAGICAL!!! We just returned from a 4-day stay at Casa Flamboyant with our friends. They recommended the getaway as they go every year, and we are THRILLED that we took the recommendation!! This B&B is nestled in a mountain top location in the El Yunque rainforest in Puerto Rico. You are literally surrounded by tropical foilage, waterfalls, and fabulous rainbows after the rain. Banana, papaya, mango, lemons and so much more grow wild and we ate the seasonal fruit every morning. The owner, Shirley Mooney, is a wonderful host. The inn is set up perfectly with a large patio and wonderful heated pool. The rooms were all beautiful and unique with private bath and comfortable settings. I highly recommend the Rainbow Room where we stayed. You have a nicely sized room with sitting area, and your own private balcony looking out at the mountain, valley, with a fantastic view of the island of Vieques. Shirley provided a delicious breakfast every morning...pancakes, french toast, eggs, bacon. A different menu daily...and of course fresh fruit. She also booked a lovely dinner at El Bohio down the road....very good and a fun setting...private and nice. She will also arrange for guided rainforest tours and other types of excursions. Shirley has 3 beautiful dogs they were great!! The evenings were magical with the sounds of the Coqui, and the gentle rainfall. All was amazing! Plus we were only a short drive to the beautiful beaches of Fajardo and Humacao. We cannot wait to go back to this magical setting. Thank you Shirley!!!",
            "title": "A treasure in the rainforest",
            "user": "caribchakita"
        }
    ],
    "slim_ranking": 0.25,
    "stars": null,
    "tripadvisor": {
        "VISITED": false,
        "country_name": null,
        "locality": null,
        "pic_link": null,
        "street_address": null
    },
    "user_rating": 5.0,
    "variance": {
        "average": 1,
        "excellent": 88,
        "poor": 1,
        "terrible": 0,
        "very good": 8
    }
}