{
    "aka": "Hotel Le d Avaugour",
    "description": "Hotel Logis d\u2019Avaugour is in the heart of Dinan, in a historic stone townhouse set on the town ramparts. It offers charming rooms and suites fitted with all modern comforts.",
    "detail_rating": {
        "cleanliness": null,
        "location": null,
        "rooms": null,
        "service": null,
        "sleep": null,
        "value": null
    },
    "location": {
        "city": null,
        "continent": "Europe",
        "country": "France",
        "proposed_city": null,
        "province": null,
        "region": "Brittany"
    },
    "name": "Hotel Le d'Avaugour",
    "places": {
        "aka": [],
        "hotel_description": [],
        "hotel_name": []
    },
    "review_count": 81,
    "review_count_current": 20,
    "reviews": [
        {
            "date": "August 30, 2006",
            "detail_rating": {
                "business": null,
                "cleanliness": 4.0,
                "desk": null,
                "front_desk": 4.0,
                "location": 4.0,
                "pool": null,
                "restaurant": null,
                "rooms": 4.0,
                "service": 4.0,
                "sleep": null,
                "value": 4.0
            },
            "helpfulness": 3,
            "id": 5728309,
            "likes": {
                "disliked": null,
                "liked": null
            },
            "rating": 4.0,
            "stay_parameters": "Stayed August 2006, traveled as a couple",
            "text": "We normally travel to France outwith high season and therefor can pick and choose our accommodation. On this occasion, work committments meant we had to book high season at short notice and therefor choice was more limited.",
            "title": "Charming, would definitely stay again",
            "user": "rreid"
        },
        {
            "date": "May 31, 2006",
            "detail_rating": {
                "business": null,
                "cleanliness": 3.0,
                "desk": null,
                "location": null,
                "pool": null,
                "restaurant": null,
                "rooms": 3.0,
                "service": 5.0,
                "sleep": null,
                "value": 3.0
            },
            "helpfulness": null,
            "id": 5288189,
            "likes": {
                "disliked": null,
                "liked": null
            },
            "rating": 4.0,
            "stay_parameters": "Stayed May 2006",
            "text": "I would certainly choose this hotel again for another trip, the location was ideal for wandering around the lovely centre of Dinan and choosing a restaurant for our meal. Our room was overlooking the gardens and ramparts and was nicely decorated with a good sized bathroom. We had spent the previous night in Bournemouth before catching the ferry from Poole to Cherbourg and this hotel was much better value for money compared with the limited choice we had there.",
            "title": "Mixed Feelings About This Hotel",
            "user": "BETH V"
        },
        {
            "date": "October 12, 2005",
            "detail_rating": {
                "business": null,
                "cleanliness": 4.0,
                "desk": null,
                "location": null,
                "pool": null,
                "restaurant": null,
                "rooms": 3.0,
                "service": 4.0,
                "sleep": null,
                "value": 3.0
            },
            "helpfulness": 5,
            "id": 4017266,
            "likes": {
                "disliked": null,
                "liked": null
            },
            "rating": 3.0,
            "stay_parameters": "Stayed July 2005",
            "text": "Breakfast offered a good buffet compared with many of the french hotels which offer \"only\" juice, coffee and croissants (although often excellent quality)",
            "title": "Hotel with fantastic views & location",
            "user": "northcardiffian"
        },
        {
            "date": "November 10, 2004",
            "detail_rating": {
                "business": null,
                "cleanliness": null,
                "desk": null,
                "location": null,
                "pool": null,
                "restaurant": null,
                "rooms": null,
                "service": null,
                "sleep": null,
                "value": null
            },
            "helpfulness": 3,
            "id": 2817425,
            "likes": {
                "disliked": null,
                "liked": null
            },
            "rating": 3.0,
            "stay_parameters": null,
            "text": "The staff were particularly pleasant and helpful.",
            "title": "Not as charming as it appears",
            "user": "A TripAdvisor user"
        },
        {
            "date": "September 16, 2004",
            "detail_rating": {
                "business": null,
                "cleanliness": null,
                "desk": null,
                "location": null,
                "pool": null,
                "restaurant": null,
                "rooms": null,
                "service": null,
                "sleep": null,
                "value": null
            },
            "helpfulness": 6,
            "id": 2578861,
            "likes": {
                "disliked": null,
                "liked": null
            },
            "rating": 4.0,
            "stay_parameters": null,
            "text": "We stayed for 2 nights in Dinan, which is a wonderful and charming town. Hotel d'Avaugour disappointed, as our rooms looked nothing like the pictures on its website. Instead of charming floral prints, our rooms were obviously decorated back in the 70's. However, the bathrooms were nice, as was the breakfast. I was really shocked to find out that the heater in our room didn't work and asked to be moved to another room. We were then told that none of the radiator heaters in the rooms worked. Now, I understand that if one is not staying in a luxury hotel, air conditioning cannot be expected in Europe; however, I can't say I've ever heard of a hotel room without heat! To be fair, the staff did give us a portable heater for one room, and the staff is really what made our stay so pleasant. Both the girls working at reception were really wonderful.",
            "title": "Be ready to rise and shine at 0500",
            "user": "cmcfong"
        },
        {
            "date": "June 16, 2010",
            "detail_rating": {
                "business": null,
                "cleanliness": null,
                "desk": null,
                "location": null,
                "pool": null,
                "restaurant": null,
                "rooms": null,
                "service": null,
                "sleep": null,
                "value": null
            },
            "helpfulness": null,
            "id": 67739689,
            "likes": {
                "disliked": null,
                "liked": null
            },
            "rating": 4.0,
            "stay_parameters": null,
            "text": "Lovely spot: convenient, charming, beautiful remodeled public areas, bar, drop-dead-gorgeous gardens, and wonderful, charming, sweet staff. Public parking is across the street and you have to remember to run out in the morning and feed the meter. Walking is very convenient into the lovely walled city. Bathroom was large and well--equipped. The room's decor was traditional and not new. I'd suggest that the old desks removed from the hall so it is not so cluttered and that the lights allow the area to remain lit for more than 5 seconds. Otherwise, I loved our stay there.",
            "title": "Warm, friendly atmosphere",
            "user": "beekay458"
        },
        {
            "date": "May 29, 2010",
            "detail_rating": {
                "business": null,
                "cleanliness": null,
                "desk": null,
                "location": null,
                "pool": null,
                "restaurant": null,
                "rooms": null,
                "service": null,
                "sleep": null,
                "value": null
            },
            "helpfulness": null,
            "id": 65680534,
            "likes": {
                "disliked": null,
                "liked": null
            },
            "rating": 5.0,
            "stay_parameters": null,
            "text": "We spent 3 nights here, the rooms overlooked the main square and were well furnished with excellent bathrooms. The ground floor reception, bar, lounge & breakfast room were completed renovated in the winter of 09-10 and are lovely. The staff were welcoming, polite and very helpful, even stopping the traffic for us to drive away when we left. The garden, overlooking the ramparts, is a lovely place to sit and have a drink. We hope to return to Dinan and this hotel.",
            "title": "Lovely hotel with excellent staff",
            "user": "Janmon"
        },
        {
            "date": "September 20, 2009",
            "detail_rating": {
                "business": null,
                "cleanliness": null,
                "desk": null,
                "location": null,
                "pool": null,
                "restaurant": null,
                "rooms": null,
                "service": null,
                "sleep": null,
                "value": null
            },
            "helpfulness": null,
            "id": 43054057,
            "likes": {
                "disliked": null,
                "liked": null
            },
            "rating": 4.0,
            "stay_parameters": null,
            "text": "Just returned from 2 nights at the Hotel. First I will say that it is perfectly located in town with good parking across the street. The women at the front desk were most helpful (I needed a doctor's visit) and polite with perfect English (much needed in this case) The garden out back where we had breakfast every morning was very nice and made for lovely photos. However, I defy anyone to come up with rooms that are as charming as the lovely room on their website with the red checked bedspread, flowers and tea. I looked in no less than 10 rooms on 2 floors while the maids were cleaning. They are all plain ordinary rooms, which would be just fine if I hadn't been lead to believe the rooms would have a modicum of charm. So go on the website and find the plainest looking room and know that that will be what your will look like and you won't be disappointed. Also, be sure to book a garden view room and not a street view.",
            "title": "Situated perfectly but a plain room",
            "user": "goodtrips01"
        },
        {
            "date": "September 17, 2009",
            "detail_rating": {
                "business": null,
                "cleanliness": null,
                "desk": null,
                "location": null,
                "pool": null,
                "restaurant": null,
                "rooms": null,
                "service": null,
                "sleep": null,
                "value": null
            },
            "helpfulness": null,
            "id": 42429363,
            "likes": {
                "disliked": null,
                "liked": null
            },
            "rating": 5.0,
            "stay_parameters": null,
            "text": "Have you ever read a Hemingway novel and noticed that the type of hotel mentioned within the pages seems so vastly different from what one experiences now? Do you ever notice that you feel depressed when you stay at a 4-Star Intercontinental Business hotel, with slick young \"Hotel Management\" graduates at the helm? If the answer is \"yes\", then you have to come to Dinan and stay in this Hotel. The owner, Nicholas is extremely friendly and accommodating, obviously knowledgeable about the area, and very invested in his guests experiencing the best of what Brittany has to offer. The hotel is charming, and everything is done well (even the coffee is fantastic).",
            "title": "A triumph of charm and service in the traditional style",
            "user": "SitcomSerf"
        },
        {
            "date": "August 10, 2009",
            "detail_rating": {
                "business": null,
                "cleanliness": null,
                "desk": null,
                "location": null,
                "pool": null,
                "restaurant": null,
                "rooms": null,
                "service": null,
                "sleep": null,
                "value": null
            },
            "helpfulness": null,
            "id": 37316607,
            "likes": {
                "disliked": null,
                "liked": null
            },
            "rating": 4.0,
            "stay_parameters": null,
            "text": "Dinan itself is a medieval town, completely spared by the bombs of WWII, and probably the most beautiful place I have ever visited. The restaurants are all top-notch, on par if not better than your average upscale Manhattan Bistro. There are breathtaking bicycle trips available from the front door of the hotel (Nicholas has free bicycles to lend), and the town has beautiful preserved ramparts and street walks. The back garden of the hotel is actually mounted on one of the old ramparts, a vast space, 50 feet high, perched on a tower with 270 degree views of the valley and river below.",
            "title": "Lovely hotel, fabulous staff in charming town",
            "user": "TorontoEh"
        },
        {
            "date": "April 18, 2009",
            "detail_rating": {
                "business": null,
                "cleanliness": null,
                "desk": null,
                "location": null,
                "pool": null,
                "restaurant": null,
                "rooms": null,
                "service": null,
                "sleep": null,
                "value": null
            },
            "helpfulness": null,
            "id": 28265715,
            "likes": {
                "disliked": null,
                "liked": null
            },
            "rating": 4.0,
            "stay_parameters": null,
            "text": "Stayed here with my daughter for the Fete des Remparts. As always the staff were charming and very helpful. The garden is beautiful and a haven from the Fete. We had a great view of the cavalcade from our window but the double glazing meant that she wasn't disturbed as the celebrations carried on into the night. This was our third stay. The rooms have been re-decorated over that time but the warm welcome remains the same. We'll be going back in three weeks time. Quite expensive during the Fete but given its perfect position that's to be expected.",
            "title": "Perfect position",
            "user": "tigergill"
        },
        {
            "date": "July 11, 2008",
            "detail_rating": {
                "business": null,
                "cleanliness": null,
                "desk": null,
                "location": null,
                "pool": null,
                "restaurant": null,
                "rooms": null,
                "service": null,
                "sleep": null,
                "value": null
            },
            "helpfulness": null,
            "id": 17794151,
            "likes": {
                "disliked": null,
                "liked": null
            },
            "rating": 5.0,
            "stay_parameters": null,
            "text": "This is a wonderful hotel with a wonderful location in a wonderful town. The hotel is located right on the main square, actually inside the ramparts of the old town. There are two large parking lots across the street, but you will have to pay during the day (9:00-12:00 and 14:00-18:00); also there is a market there on Thursdays, so you will have to find alternate parking on Wednesday night.",
            "title": "Wonderful Hotel",
            "user": "TheCactus"
        },
        {
            "date": "July 10, 2008",
            "detail_rating": {
                "business": null,
                "cleanliness": null,
                "desk": null,
                "location": null,
                "pool": null,
                "restaurant": null,
                "rooms": null,
                "service": null,
                "sleep": null,
                "value": null
            },
            "helpfulness": null,
            "id": 17749230,
            "likes": {
                "disliked": null,
                "liked": null
            },
            "rating": 5.0,
            "stay_parameters": null,
            "text": "Our room was large and very nicely furnished, and we had a view of the lovely garden behind the hotel. The breakfast was above average, with a good selection of breads & pastries, fruit, yogurt, cereal, and boiled eggs. The staff was very friendly and helpful, and they gave us good suggestions for restaurants and things to see in the old city.",
            "title": "HOTEL LE D'AVAUGOUR: Excellent Hotel and Great Staff!",
            "user": "Phil16"
        },
        {
            "date": "June 10, 2008",
            "detail_rating": {
                "business": null,
                "cleanliness": null,
                "desk": null,
                "location": null,
                "pool": null,
                "restaurant": null,
                "rooms": null,
                "service": null,
                "sleep": null,
                "value": null
            },
            "helpfulness": null,
            "id": 16832448,
            "likes": {
                "disliked": null,
                "liked": null
            },
            "rating": 4.0,
            "stay_parameters": null,
            "text": "My wife and I stayed at HOTEL LE D'AVAUGOUR in Dinan for two nights in late June.",
            "title": "Great location",
            "user": "BHpedi"
        },
        {
            "date": "June 4, 2008",
            "detail_rating": {
                "business": null,
                "cleanliness": null,
                "desk": null,
                "location": null,
                "pool": null,
                "restaurant": null,
                "rooms": null,
                "service": null,
                "sleep": null,
                "value": null
            },
            "helpfulness": null,
            "id": 16674220,
            "likes": {
                "disliked": null,
                "liked": null
            },
            "rating": 4.0,
            "stay_parameters": null,
            "text": "The facility is very nice...good room and great bathroom set up.",
            "title": "Great Hotel",
            "user": "gmcnally"
        },
        {
            "date": "August 23, 2007",
            "detail_rating": {
                "business": 5.0,
                "cleanliness": 5.0,
                "desk": null,
                "front_desk": 5.0,
                "location": 5.0,
                "pool": null,
                "restaurant": null,
                "rooms": 4.0,
                "service": 5.0,
                "sleep": null,
                "value": 4.0
            },
            "helpfulness": 6,
            "id": 8484469,
            "likes": {
                "disliked": null,
                "liked": "\u2014 typically french"
            },
            "rating": 5.0,
            "stay_parameters": "Stayed August 2007, traveled with friends",
            "text": "We stayed here on 12th & 13th August. A taxi was arranged by the hotel to collect us when we arrived.",
            "title": "Highy Recommended",
            "user": "planetqueen"
        },
        {
            "date": "July 19, 2007",
            "detail_rating": {
                "business": null,
                "cleanliness": 5.0,
                "desk": null,
                "front_desk": 5.0,
                "location": 5.0,
                "pool": null,
                "restaurant": null,
                "rooms": 5.0,
                "service": 5.0,
                "sleep": null,
                "value": 5.0
            },
            "helpfulness": 4,
            "id": 8192187,
            "likes": {
                "disliked": null,
                "liked": "\u2014 The large rooms and the hotel garden. Plus it was in a great location."
            },
            "rating": 5.0,
            "stay_parameters": "Stayed June 2007, traveled as a couple",
            "text": "Very comfortable hotel, good central location, rooms average size and very clean. Bathrooms look just redone in pretty tiles and solid granite: separate toilet (useful!), shower in good size bath, great hairdryer, lots of towels, loads of hot water.",
            "title": "Great Hotel in Dinan",
            "user": "ShowMeState"
        },
        {
            "date": "July 11, 2007",
            "detail_rating": {
                "business": null,
                "cleanliness": 5.0,
                "desk": null,
                "front_desk": 5.0,
                "location": 5.0,
                "pool": null,
                "restaurant": null,
                "rooms": 5.0,
                "service": 5.0,
                "sleep": null,
                "value": 5.0
            },
            "helpfulness": 4,
            "id": 8098093,
            "likes": {
                "disliked": null,
                "liked": "\u2014 Great bathroom"
            },
            "rating": 5.0,
            "stay_parameters": "Stayed June 2006, traveled with friends",
            "text": "Lovely breakfast room, lounge & garden. Drinks available just about 24hrs a day. Staff were faultless, very friendly and helpful.",
            "title": "Great location...great town!",
            "user": "PVDGA"
        },
        {
            "date": "October 6, 2006",
            "detail_rating": {
                "business": null,
                "cleanliness": 3.0,
                "desk": null,
                "front_desk": 5.0,
                "location": 5.0,
                "pool": null,
                "restaurant": null,
                "rooms": 2.0,
                "service": 3.0,
                "sleep": null,
                "value": 1.0
            },
            "helpfulness": 5,
            "id": 5921323,
            "likes": {
                "disliked": "\u2014 the bedroom",
                "liked": "\u2014 moving out"
            },
            "rating": 2.0,
            "stay_parameters": "Stayed September 2006, traveled with family",
            "text": "Due to bad weather we had to stay an extra night but we were booked back into our rooms that had just been cleaned throughout without any problem.",
            "title": "The website is better than the experience",
            "user": "Loved-Dinan"
        },
        {
            "date": "September 4, 2006",
            "detail_rating": {
                "business": null,
                "cleanliness": 5.0,
                "desk": null,
                "front_desk": 5.0,
                "location": 5.0,
                "pool": null,
                "restaurant": null,
                "rooms": 5.0,
                "service": 5.0,
                "sleep": null,
                "value": 5.0
            },
            "helpfulness": 1,
            "id": 5767337,
            "likes": {
                "disliked": "\u2014 No problems",
                "liked": "\u2014 Location and staff"
            },
            "rating": 5.0,
            "stay_parameters": "Stayed August 2006, traveled solo",
            "text": "We spent one night at the Hotel d'Avaugour in Dinan, and hated to leave the next day. We were on a two-week driving trip in France, and this was the nicest hotel we stayed in. We had a large room facing the back garden. It was so peaceful. The bird were chirping, and the garden area was lovely. This place is great.",
            "title": "Terrific Location, Charming Helpful Staff",
            "user": "garuda55"
        }
    ],
    "slim_ranking": 0.3125,
    "stars": 3,
    "tripadvisor": {
        "VISITED": false,
        "country_name": null,
        "locality": null,
        "pic_link": null,
        "street_address": null
    },
    "user_rating": 4.5,
    "variance": {
        "average": 11,
        "excellent": 40,
        "poor": 2,
        "terrible": 1,
        "very good": 27
    }
}