{
    "aka": "Ah Agora Caceres c\u00e1ceres",
    "description": null,
    "detail_rating": {
        "cleanliness": null,
        "location": null,
        "rooms": null,
        "service": null,
        "sleep": null,
        "value": null
    },
    "location": {
        "city": null,
        "continent": "Europe",
        "country": "Spain",
        "proposed_city": null,
        "province": null,
        "region": "Extremadura"
    },
    "name": "AH Agora Caceres",
    "places": {
        "aka": [],
        "hotel_description": [],
        "hotel_name": []
    },
    "review_count": 90,
    "review_count_current": 2,
    "reviews": [
        {
            "date": "July 11, 2007",
            "detail_rating": {
                "business": null,
                "cleanliness": null,
                "desk": null,
                "location": null,
                "pool": null,
                "restaurant": null,
                "rooms": null,
                "service": null,
                "sleep": null,
                "value": null
            },
            "helpfulness": 2,
            "id": 8103669,
            "likes": {
                "disliked": null,
                "liked": null
            },
            "rating": 5.0,
            "stay_parameters": null,
            "text": "I agree completely with the other reviewers of this hotel: new, clean, well-equipped, well-located. Nobody mentioned the interesting parking lot which uses a car elevator: drive the car in, hit \"minus 2\", elevator descends to underground, door opens, drive out. You can even use rear hotel service elevator to bring your baggage to your car. This hotel is clean, modern and has a nice lobby with a big-screen tv. Breakfast was just so-so and could have been a bit fresher and better attended.",
            "title": "Great value",
            "user": "beekay458"
        },
        {
            "date": "December 26, 2006",
            "detail_rating": {
                "business": null,
                "cleanliness": 5.0,
                "desk": null,
                "front_desk": 4.0,
                "location": 5.0,
                "pool": null,
                "restaurant": null,
                "rooms": 4.0,
                "service": 4.0,
                "sleep": null,
                "value": 4.0
            },
            "helpfulness": 1,
            "id": 6500130,
            "likes": {
                "disliked": "\u2014 Regular price might make it expensive",
                "liked": "\u2014 Best location, Brand new hotel, Good deals"
            },
            "rating": 4.0,
            "stay_parameters": "Stayed December 2006, traveled as a couple",
            "text": "I loved watching the storks in Caceres. Definitely check out the archaeological museum.",
            "title": "Very nice place right in the city center, and sometimes very well priced",
            "user": "DDGM"
        }
    ],
    "slim_ranking": 0.333333333333,
    "stars": 4,
    "tripadvisor": {
        "VISITED": false,
        "country_name": null,
        "locality": null,
        "pic_link": null,
        "street_address": null
    },
    "user_rating": 3.5,
    "variance": {
        "average": 37,
        "excellent": 13,
        "poor": 4,
        "terrible": 3,
        "very good": 33
    }
}