{
    "aka": "Manotel Royal Geneva",
    "description": "The contrasting combination of heritage and innovation distinguish this traditional hotel. Inspired by a neoclassical architectural style the Hotel Royal offers a cocoon of homely warmth, voluptuous comfort and accessible luxury. City centre, between the lake and the United Nations. 202 rooms and suites. 2 business corners, WiFi and Internet connection, free of charge. Restaurant Le Duo and cosy bar with fireplace.",
    "detail_rating": {
        "cleanliness": 4.5,
        "location": 4.0,
        "rooms": 4.0,
        "service": 4.0,
        "sleep": 4.0,
        "value": 4.0
    },
    "location": {
        "city": null,
        "continent": "Europe",
        "country": "Switzerland",
        "proposed_city": "Geneva",
        "province": null,
        "region": null
    },
    "name": "Hotel Royal - Manotel Geneva",
    "places": {
        "aka": [
            "Geneva"
        ],
        "hotel_description": [],
        "hotel_name": [
            "Geneva"
        ]
    },
    "review_count": 403,
    "review_count_current": 1,
    "reviews": [
        {
            "date": "March 23, 2007",
            "detail_rating": {
                "business": 4.0,
                "cleanliness": 5.0,
                "desk": null,
                "front_desk": 5.0,
                "location": 5.0,
                "pool": null,
                "restaurant": null,
                "rooms": 5.0,
                "service": 5.0,
                "sleep": null,
                "value": 4.0
            },
            "helpfulness": 12,
            "id": 7209808,
            "likes": {
                "disliked": "\u2014 Smoking permited in the Brasserie",
                "liked": "\u2014 Well appointed room"
            },
            "rating": 5.0,
            "stay_parameters": "Stayed March 2007, traveled on business",
            "text": "We stayed 4 nights at the Royal (booked through Hotel Connect at a very reasonable rate) and found it to be an excellent choice, based on the room, cleanliness and location.",
            "title": "Excellent experience",
            "user": "dgordsmith"
        }
    ],
    "slim_ranking": 0.298076923077,
    "stars": 4.5,
    "tripadvisor": {
        "VISITED": false,
        "country_name": null,
        "locality": null,
        "pic_link": null,
        "street_address": null
    },
    "user_rating": 4.0,
    "variance": {
        "average": 81,
        "excellent": 104,
        "poor": 20,
        "terrible": 7,
        "very good": 191
    }
}