{
    "aka": null,
    "description": "Conveniently located in the Raymond Terrace CBD, 5 min from the Pacific Highway and 15 min from Newcastle (Williamtown) Airport, the Colonial Terrace Motor Inn is a great place to stay, work, rest and dine. Our Restaurant is open 7 days a week for Breakfast and Monday - Thursday for Dinner.",
    "detail_rating": {
        "cleanliness": null,
        "location": null,
        "rooms": null,
        "service": null,
        "sleep": null,
        "value": null
    },
    "location": {
        "city": null,
        "continent": "South Pacific",
        "country": "Australia",
        "proposed_city": "Terrace",
        "province": null,
        "region": null
    },
    "name": "Colonial Terrace Motor Inn",
    "places": {
        "aka": [],
        "hotel_description": [
            "Terrace",
            "Newcastle"
        ],
        "hotel_name": [
            "Terrace"
        ]
    },
    "review_count": 18,
    "review_count_current": 2,
    "reviews": [
        {
            "date": "October 7, 2011",
            "detail_rating": {
                "business": null,
                "cleanliness": 3.0,
                "desk": null,
                "location": 3.0,
                "pool": null,
                "restaurant": null,
                "rooms": 2.0,
                "service": 4.0,
                "sleep": 2.0,
                "value": 2.0
            },
            "helpfulness": 2,
            "id": 119022196,
            "likes": {
                "disliked": null,
                "liked": null
            },
            "rating": 3.0,
            "stay_parameters": "Stayed October 2011, traveled as a couple",
            "text": "making an unplanned trip so us at 7.00 pm in Raymond Terrace looking for a bed. reception was welcoming but only had family rooms left. Room was large double bed in front section then bathroom & 3 single beds in rear section. Offered to keep restaruant opened but we had already eaten. Breakfast was ample for cost.",
            "title": "A place to stay",
            "user": "wiskey"
        },
        {
            "date": "May 11, 2011",
            "detail_rating": {
                "business": null,
                "cleanliness": 4.0,
                "desk": null,
                "location": 4.0,
                "pool": null,
                "restaurant": null,
                "rooms": 4.0,
                "service": 5.0,
                "sleep": 4.0,
                "value": 5.0
            },
            "helpfulness": 6,
            "id": 107870262,
            "likes": {
                "disliked": null,
                "liked": null
            },
            "rating": 4.0,
            "stay_parameters": "Stayed January 2011, traveled as a couple",
            "text": "Air conditioner was in rear section so had to work hard to warm front section while rear was way to hot. a/c fan also became very noisy after running for a while & had to be turned off. shower head sprayed water everywhere. while the room was ok for 2 if a family of 5 stayed it would a line up for showers & toilet.",
            "title": "Good Value for Overnight Stay",
            "user": "EWCanberra"
        }
    ],
    "slim_ranking": 0.666666666667,
    "stars": null,
    "tripadvisor": {
        "VISITED": false,
        "country_name": null,
        "locality": null,
        "pic_link": null,
        "street_address": null
    },
    "user_rating": 4.5,
    "variance": {
        "average": 1,
        "excellent": 11,
        "poor": 0,
        "terrible": 0,
        "very good": 6
    }
}