{
    "aka": "Hilton Galveston Island Hotel Galveston",
    "description": "Unwind at Hilton Galveston Island Resort and enjoy a premier oceanfront location overlooking the Gulf of Mexico. Situated on the historic Seawall Boulevard at the 32-acre San Luis Resort, this Galveston hotel is within close walking distance of the beach, fishing piers, shopping and restaurants. Relax in a cozy guest room with elegant, ocean-inspired decor and marvel at breathtaking sea views form a private balcony, or choose a suite with separate living space.",
    "detail_rating": {
        "cleanliness": 4.0,
        "location": 4.5,
        "rooms": 4.0,
        "service": 4.0,
        "sleep": 4.0,
        "value": 4.0
    },
    "location": {
        "city": null,
        "continent": null,
        "country": "United States",
        "proposed_city": "Galveston",
        "province": null,
        "region": null
    },
    "name": "Hilton Galveston Island Resort",
    "places": {
        "aka": [
            "Galveston"
        ],
        "hotel_description": [
            "Galveston",
            "San"
        ],
        "hotel_name": [
            "Galveston"
        ]
    },
    "review_count": 612,
    "review_count_current": 20,
    "reviews": [
        {
            "date": "March 21, 2013",
            "detail_rating": {
                "business": null,
                "cleanliness": 5.0,
                "desk": null,
                "location": 4.0,
                "pool": null,
                "restaurant": null,
                "rooms": 4.0,
                "service": 5.0,
                "sleep": 4.0,
                "value": 4.0
            },
            "helpfulness": 2,
            "id": 155261146,
            "likes": {
                "disliked": null,
                "liked": null
            },
            "rating": 5.0,
            "stay_parameters": "Stayed March 2013, traveled with family",
            "text": "After reading some of the reviews, I was a little leery of booking this hotel. I am a hotel aficionado...and very hard to please. I don't have one single bad thing to say. The rooms were clean and very nice. The bathroom had good lighting and was very clean. (Even the balcony, chairs and table were clean!) The staff is truly amazing. Someone had broken a beer bottle in the hallway by the stairs. We told one of the housekeepers and she immediately stopped what she was doing and went and cleaned it up. I don't think I saw one staff member that wasn't smiling. The lobby is nice and inviting. The bartender at the swim up bar on Thursday was great. She was quick and very pleasant to talk to. (Wednesday's bartender was a little slow...but very nice.) We had great appetizers by the pool and enjoyed ourselves immensely. Parking, pool towels, waiters and waitresses, drinks, and help were readily available anytime we needed anything. Very impressed. We will be staying there again. Definitely.",
            "title": "No complaints from a complainer!",
            "user": "GirlsNightsOut"
        },
        {
            "date": "March 16, 2013",
            "detail_rating": {
                "business": null,
                "cleanliness": 4.0,
                "desk": null,
                "location": 5.0,
                "pool": null,
                "restaurant": null,
                "rooms": 5.0,
                "service": 5.0,
                "sleep": 5.0,
                "value": 4.0
            },
            "helpfulness": null,
            "id": 154792247,
            "likes": {
                "disliked": null,
                "liked": null
            },
            "rating": 5.0,
            "stay_parameters": "Stayed March 2013, traveled with family",
            "text": "We stayed during the spring break \"madness\" and the staff managed to do a great job at keeping the hotel, lobby, and pool area very clean and the service at times was slower but the entire staff was working very hard and super friendly. Our room was your average hotel room you would expect from a Hilton...nice and clean. What really made our stay however was the staff...everyone from the front desk, bar tender, bellman, waiters and restaurant staff really took the time to make sure everything was perfect and they were always fast, friendly, and attentive. They not only treated us that way..but I saw how they treated our 12 year old son while I was sitting in the lobby and he went up to ask for a soda at the lobby bar and for some brochures at the front desk....the staff gave him the same greeting and service that they would to an arriving dignitary. Its great to stay at a place where everyone treats you so well and the hotel and amenities are clean and all functioning. Also...the location is excellent...right on the seawall and near some great places to eat and the price we paid for our stay was a bargain for the quality of the experience.",
            "title": "service is outstanding from everyone on staff",
            "user": "makerr30196"
        },
        {
            "date": "March 16, 2013",
            "detail_rating": {
                "business": null,
                "cleanliness": 3.0,
                "desk": null,
                "location": 4.0,
                "pool": null,
                "restaurant": null,
                "rooms": 3.0,
                "service": 4.0,
                "sleep": 3.0,
                "value": 3.0
            },
            "helpfulness": null,
            "id": 154784250,
            "likes": {
                "disliked": null,
                "liked": null
            },
            "rating": 3.0,
            "stay_parameters": "Stayed March 2013, traveled as a couple",
            "text": "We stayed in this hotel prior to departing for a cruise out of Galveston. The location is directly across from the beach. The day we stayed, Sat. March 2, 2013 if was very cold and windy so did not walk on the beach. Although we did not take advantage of the beautiful pool, I understand from other guests that is was a heated pool and very pleasant.",
            "title": "Great Pre-Cruise Hotel",
            "user": "Chris M"
        },
        {
            "date": "March 15, 2013",
            "detail_rating": {
                "business": null,
                "cleanliness": 3.0,
                "desk": null,
                "location": 4.0,
                "pool": null,
                "restaurant": null,
                "rooms": 3.0,
                "service": 3.0,
                "sleep": 3.0,
                "value": 3.0
            },
            "helpfulness": null,
            "id": 154686155,
            "likes": {
                "disliked": null,
                "liked": null
            },
            "rating": 3.0,
            "stay_parameters": "Stayed August 2012, traveled as a couple",
            "text": "We stayed in a King Balcony room that was comfortable. The only complaint is that the sliding door had a leaky seal and the wind noise was very annoying. My husband, being very handy, figured out how to block the wind around the door. Otherwise it would have been a very sleepless night.",
            "title": "Weekend Getaway",
            "user": "SLSimon"
        },
        {
            "date": "March 15, 2013",
            "detail_rating": {
                "business": null,
                "cleanliness": 5.0,
                "desk": null,
                "location": 4.0,
                "pool": null,
                "restaurant": null,
                "rooms": 3.0,
                "service": 3.0,
                "sleep": 2.0,
                "value": 2.0
            },
            "helpfulness": null,
            "id": 154627767,
            "likes": {
                "disliked": null,
                "liked": null
            },
            "rating": 3.0,
            "stay_parameters": "Stayed February 2013, traveled with family",
            "text": "The front desk staff and bellmen were excellent. Friendly, courteous and helpful with advice on getting the shuttle to the cruise port. The shuttle staff were very organized and efficient at loading the shuttle and getting us to the port in record time. The hotel provides free transport to the cruiseship. Although we did not bring our vehicle, I understand you could park in their longterm lot for no extra fee, while you were on the cruise.",
            "title": "just o.k. hotel",
            "user": "Cathy2195"
        },
        {
            "date": "March 31, 2013",
            "detail_rating": {
                "business": null,
                "cleanliness": 5.0,
                "desk": null,
                "location": 5.0,
                "pool": null,
                "restaurant": null,
                "rooms": 5.0,
                "service": 5.0,
                "sleep": null,
                "value": 5.0
            },
            "helpfulness": null,
            "id": 156158791,
            "likes": {
                "disliked": null,
                "liked": null
            },
            "rating": 5.0,
            "stay_parameters": "Stayed March 2013",
            "text": "We loved our spacious room, the service was great and they have a free shuttle to the Cruise Port. Rainforest cafe next door had a free shuttle to Pleasure Pier. The Hotel even shuttled us to Moody Gardens for free ( just don't forget to tip the friendly helpful driver!)",
            "title": "Great place to stay pre-cruise",
            "user": "PurpleSeah0rse"
        },
        {
            "date": "March 29, 2013",
            "detail_rating": {
                "business": null,
                "cleanliness": 4.0,
                "desk": null,
                "location": 4.0,
                "pool": null,
                "restaurant": null,
                "rooms": 3.0,
                "service": 3.0,
                "sleep": 3.0,
                "value": 3.0
            },
            "helpfulness": null,
            "id": 155971944,
            "likes": {
                "disliked": null,
                "liked": null
            },
            "rating": 3.0,
            "stay_parameters": "Stayed March 2013, traveled as a couple",
            "text": "Hotel in good location, clean, service OK. There is nothing special about the hotel.",
            "title": "Hotel OK, Clean, Service OK Nothing Special",
            "user": "dewTexas"
        },
        {
            "date": "March 29, 2013",
            "detail_rating": {
                "business": null,
                "cleanliness": 3.0,
                "desk": null,
                "location": 4.0,
                "pool": null,
                "restaurant": null,
                "rooms": 3.0,
                "service": 3.0,
                "sleep": 3.0,
                "value": 3.0
            },
            "helpfulness": null,
            "id": 155950876,
            "likes": {
                "disliked": null,
                "liked": null
            },
            "rating": 3.0,
            "stay_parameters": "Stayed March 2013, traveled on business",
            "text": "Breakfast buffet is OK but below average as far as buffet service. Eggs were awful.",
            "title": "Good Location - Average Amenities",
            "user": "twillis600"
        },
        {
            "date": "March 27, 2013",
            "detail_rating": {
                "business": null,
                "cleanliness": 3.0,
                "desk": null,
                "location": 3.0,
                "pool": null,
                "restaurant": null,
                "rooms": 2.0,
                "service": 3.0,
                "sleep": 3.0,
                "value": 3.0
            },
            "helpfulness": null,
            "id": 155853330,
            "likes": {
                "disliked": null,
                "liked": null
            },
            "rating": 3.0,
            "stay_parameters": "Stayed March 2013, traveled on business",
            "text": "Also children were running around screaming and hotel management did nothing to",
            "title": "Faux Pas at check in",
            "user": "bgregoryWichitaKs"
        },
        {
            "date": "March 26, 2013",
            "detail_rating": {
                "business": null,
                "cleanliness": 5.0,
                "desk": null,
                "location": 5.0,
                "pool": null,
                "restaurant": null,
                "rooms": 5.0,
                "service": 5.0,
                "sleep": 5.0,
                "value": 5.0
            },
            "helpfulness": null,
            "id": 155710419,
            "likes": {
                "disliked": null,
                "liked": null
            },
            "rating": 5.0,
            "stay_parameters": "Stayed March 2013, traveled with family",
            "text": "Stop this action. This kept up the entire time of my visit to the restaurant. Room was fine.",
            "title": "Great hotel",
            "user": "Betweet"
        },
        {
            "date": "April 8, 2013",
            "detail_rating": {
                "business": null,
                "cleanliness": 1.0,
                "desk": null,
                "location": 4.0,
                "pool": null,
                "restaurant": null,
                "rooms": 1.0,
                "service": 4.0,
                "sleep": 1.0,
                "value": 1.0
            },
            "helpfulness": null,
            "id": 156996460,
            "likes": {
                "disliked": null,
                "liked": null
            },
            "rating": 2.0,
            "stay_parameters": "Stayed October 2012, traveled with family",
            "text": "I took my daughter and her friends to the galveston for her birthday. When we entered the girls room the floor was soaking wet. They brought heavy fans and carpet cleaners up to the room. This was very inconveinent. When we were leaving I told the girls to shake the sheets to make sure we did not leave anything. A cherry tomato fell out of the sheets. We had not eaten in the room. Not a pleasant experience. The customer service is very good. The pool is very nice. The hotel needs to improve its standard of cleanliness.",
            "title": "Tomato in bed sheets",
            "user": "texasnice"
        },
        {
            "date": "April 7, 2013",
            "detail_rating": {
                "business": null,
                "cleanliness": null,
                "desk": null,
                "location": null,
                "pool": null,
                "restaurant": null,
                "rooms": null,
                "service": null,
                "sleep": null,
                "value": null
            },
            "helpfulness": null,
            "id": 170170072,
            "likes": {
                "disliked": null,
                "liked": null
            },
            "rating": 5.0,
            "stay_parameters": null,
            "text": "This is the best staff I have ever encountered in my travels in the U.S. They were all so helpful. They all were smiling and were extremely kind to my sister who needed extra patience and help. Everyone from the person who checked us in to the lady who cleaned the room asked if there was anything they could help us with. I loved that about this hotel.",
            "title": "Outstanding staff",
            "user": "A TripAdvisor user"
        },
        {
            "date": "April 5, 2013",
            "detail_rating": {
                "business": null,
                "cleanliness": 5.0,
                "desk": null,
                "location": 5.0,
                "pool": null,
                "restaurant": null,
                "rooms": 4.0,
                "service": 4.0,
                "sleep": 5.0,
                "value": 4.0
            },
            "helpfulness": null,
            "id": 156657609,
            "likes": {
                "disliked": null,
                "liked": null
            },
            "rating": 4.0,
            "stay_parameters": "Stayed May 2012, traveled on business",
            "text": "Hilton is a great place to have conference, to spend vacation and where i like to go back there.",
            "title": "Great location",
            "user": "Sleiman121"
        },
        {
            "date": "April 3, 2013",
            "detail_rating": {
                "business": null,
                "cleanliness": 4.0,
                "desk": null,
                "location": 5.0,
                "pool": null,
                "restaurant": null,
                "rooms": 4.0,
                "service": 4.0,
                "sleep": 3.0,
                "value": 3.0
            },
            "helpfulness": null,
            "id": 170168253,
            "likes": {
                "disliked": null,
                "liked": null
            },
            "rating": 4.0,
            "stay_parameters": "Stayed March 2013, traveled with family",
            "text": "I would recommend this hotel and would stay again when we get back down .",
            "title": "Good Spring Break spot",
            "user": "Stephen B"
        },
        {
            "date": "March 31, 2013",
            "detail_rating": {
                "business": null,
                "cleanliness": 5.0,
                "desk": null,
                "location": 5.0,
                "pool": null,
                "restaurant": null,
                "rooms": 5.0,
                "service": 4.0,
                "sleep": 5.0,
                "value": 4.0
            },
            "helpfulness": null,
            "id": 156200168,
            "likes": {
                "disliked": null,
                "liked": null
            },
            "rating": 5.0,
            "stay_parameters": "Stayed March 2013, traveled as a couple",
            "text": "The hotel is in a very good location. Easy access to the beach, resteraunts and sights. We were in walking distance to quite a bit. Since it was a bit chilly and windy the beaches were not crowded. We had a very good time dispite the weather. The hotel was quiet, clean and comfortable. Missed having access to internet",
            "title": "Very clean and comfortable. Easy access to beach and island amentities.",
            "user": "Joy R"
        },
        {
            "date": "March 26, 2013",
            "detail_rating": {
                "business": null,
                "cleanliness": 4.0,
                "desk": null,
                "location": 5.0,
                "pool": null,
                "restaurant": null,
                "rooms": 4.0,
                "service": 4.0,
                "sleep": null,
                "value": 4.0
            },
            "helpfulness": null,
            "id": 155668800,
            "likes": {
                "disliked": null,
                "liked": null
            },
            "rating": 4.0,
            "stay_parameters": "Stayed February 2013",
            "text": "We stayed one night before taking a Disney Cruise to Bahamas.",
            "title": "Good option for cruise travelers",
            "user": "radavidson"
        },
        {
            "date": "March 25, 2013",
            "detail_rating": {
                "business": null,
                "cleanliness": 5.0,
                "desk": null,
                "location": 5.0,
                "pool": null,
                "restaurant": null,
                "rooms": 3.0,
                "service": 3.0,
                "sleep": 5.0,
                "value": 3.0
            },
            "helpfulness": 1,
            "id": 155651375,
            "likes": {
                "disliked": null,
                "liked": null
            },
            "rating": 3.0,
            "stay_parameters": "Stayed March 2013, traveled with family",
            "text": "Clean rooms, service is very good. The concierge at the door excelled at his job. He would go the extra mile to accommodate your needs. He would offer you bottled iced water or cookies for the kids. Always ready to give you a good tip or tell you where the shops were or where is the best place for dinner.",
            "title": "Average service, high dollar price tag",
            "user": "Krysse"
        },
        {
            "date": "March 24, 2013",
            "detail_rating": {
                "business": null,
                "cleanliness": null,
                "desk": null,
                "location": null,
                "pool": null,
                "restaurant": null,
                "rooms": null,
                "service": null,
                "sleep": null,
                "value": null
            },
            "helpfulness": null,
            "id": 155490670,
            "likes": {
                "disliked": null,
                "liked": null
            },
            "rating": 4.0,
            "stay_parameters": null,
            "text": "The hotel is next to a Rainforest Cafe and even though it is not the cheapest option to have dinner before you go on your cruise, the hotel had coupons for free meals for the kids with the purchase of an entree.",
            "title": "Excellent",
            "user": "All-Fifty-2013"
        },
        {
            "date": "March 23, 2013",
            "detail_rating": {
                "business": null,
                "cleanliness": 5.0,
                "desk": null,
                "location": 5.0,
                "pool": null,
                "restaurant": null,
                "rooms": 5.0,
                "service": 5.0,
                "sleep": 5.0,
                "value": 4.0
            },
            "helpfulness": null,
            "id": 155438408,
            "likes": {
                "disliked": null,
                "liked": null
            },
            "rating": 4.0,
            "stay_parameters": "Stayed March 2013, traveled as a couple",
            "text": "Walmart is located 2 long blocks away if you have to buy the last minute thing. It was a 7 minute walk. If walking is not an option for you, then you're looking at $10 minimum for the 2 minute cab ride. You also have a grocery store that sells alcohol next door ( we opted for Walmart though).",
            "title": "Great Place to Stay",
            "user": "upexplorer2011"
        },
        {
            "date": "March 23, 2013",
            "detail_rating": {
                "business": null,
                "cleanliness": 4.0,
                "desk": null,
                "location": 5.0,
                "pool": null,
                "restaurant": null,
                "rooms": 5.0,
                "service": 5.0,
                "sleep": null,
                "value": 4.0
            },
            "helpfulness": null,
            "id": 155426818,
            "likes": {
                "disliked": null,
                "liked": null
            },
            "rating": 5.0,
            "stay_parameters": "Stayed March 2013",
            "text": "If you're looking for a middle of the road, clean and well kept hotel option for a night or two if your taking a cruise you an go wrong at the Hilton in Galveston.",
            "title": "Great location and nice rooms, but eat somewhere else.",
            "user": "BoneSquatch"
        }
    ],
    "slim_ranking": 0.229166666667,
    "stars": 3.5,
    "tripadvisor": {
        "VISITED": false,
        "country_name": null,
        "locality": null,
        "pic_link": null,
        "street_address": null
    },
    "user_rating": 4.0,
    "variance": {
        "average": 120,
        "excellent": 193,
        "poor": 52,
        "terrible": 38,
        "very good": 209
    }
}