{
    "aka": "Comfort Inn Downtown Hotel",
    "description": "High rise w/outdoor rooftop pool, covered parking, fitness centre - Downtown.",
    "detail_rating": {
        "cleanliness": null,
        "location": null,
        "rooms": null,
        "service": null,
        "sleep": null,
        "value": null
    },
    "location": {
        "city": "Memphis",
        "continent": null,
        "country": "United States",
        "proposed_city": null,
        "province": null,
        "region": null
    },
    "name": "Comfort Inn Downtown",
    "places": {
        "aka": [],
        "hotel_description": [],
        "hotel_name": []
    },
    "review_count": 436,
    "review_count_current": 20,
    "reviews": [
        {
            "date": "April 6, 2010",
            "detail_rating": {
                "business": null,
                "cleanliness": 5.0,
                "desk": null,
                "location": 4.0,
                "pool": null,
                "restaurant": null,
                "rooms": 5.0,
                "service": 5.0,
                "sleep": 5.0,
                "value": 5.0
            },
            "helpfulness": null,
            "id": 60599589,
            "likes": {
                "disliked": null,
                "liked": null
            },
            "rating": 5.0,
            "stay_parameters": "Stayed March 2010, traveled with family",
            "text": "We booked a king with a city view and ended up with a nice corner view on a high floor that faced the Pyramid and a bit of the river. The room was really large with a very comfortable bed, lots of floor space, walk-in closet area and a fridge. The AAA rate, booked through the hotel was $108 each weekend night but this included breakfast. Breakfast was awesome - biscuits and gravy, waffles, and boiled eggs, along with the usual continental breakfast fare. Attendants kept it well-stocked and clean, even though there was a high school band staying there one day (and teens can eat!!). Parking is $6 daily in a lot under the hotel. Just a couple blocks from the trolley, but you can walk downtown (though even on Saturday night it was a bit isolated, which made me nervous). Pool and roofdeck on 8th floor with great view would be great in summer!",
            "title": "Good Value and Very Clean",
            "user": "lizzieillinois"
        },
        {
            "date": "April 6, 2010",
            "detail_rating": {
                "business": null,
                "cleanliness": 5.0,
                "desk": null,
                "location": 4.0,
                "pool": null,
                "restaurant": null,
                "rooms": 5.0,
                "service": 5.0,
                "sleep": 5.0,
                "value": 5.0
            },
            "helpfulness": 1,
            "id": 60597373,
            "likes": {
                "disliked": null,
                "liked": null
            },
            "rating": 4.0,
            "stay_parameters": "Stayed March 2010, traveled with family",
            "text": "Mother and 13-year-old daughter stayed 3 days at end of March. Used our car less than half the time. DO stay downtown so you can walk or take the trolley to most major attractions. Great zoo ( Giant Panda stole my heart), Graceland is very well run (get the platinum ticket that inclueds his cars and customized planes). National Civil Rights Museum, Sun Studio (a great tour), a ride in a Cinderella carriage, and a Mojo Music Bus Tour were also on our agenda, along with sampling soul food at Fourway and ribs at Rendezvous. I would do all of them again. We are not blues fans, and knew very little of the music or musicians Memphis is famous for, but this was a great orientation. Food here is reasonably-priced and it's a very casual city.",
            "title": "there's plenty to do!",
            "user": "lizzieillinois"
        },
        {
            "date": "April 2, 2010",
            "detail_rating": {
                "business": null,
                "cleanliness": 4.0,
                "desk": null,
                "location": 5.0,
                "pool": null,
                "restaurant": null,
                "rooms": 4.0,
                "service": 4.0,
                "sleep": 5.0,
                "value": 5.0
            },
            "helpfulness": 1,
            "id": 60202629,
            "likes": {
                "disliked": null,
                "liked": null
            },
            "rating": 4.0,
            "stay_parameters": "Stayed January 2010, traveled as a couple",
            "text": "Stayed at Comfort Inn. Great breakfast, clean, $6 daily parking, clean rooms, good price.",
            "title": "Perfect location to take advantage of the famous Memphis nightlife",
            "user": "Righttime"
        },
        {
            "date": "March 25, 2010",
            "detail_rating": {
                "business": null,
                "cleanliness": 4.0,
                "desk": null,
                "location": 3.0,
                "pool": null,
                "restaurant": null,
                "rooms": 3.0,
                "service": 5.0,
                "sleep": 4.0,
                "value": 4.0
            },
            "helpfulness": null,
            "id": 59508513,
            "likes": {
                "disliked": null,
                "liked": null
            },
            "rating": 4.0,
            "stay_parameters": "Stayed March 2010, traveled as a couple",
            "text": "TIP: there are panhandlers downtown, but not threatening. Just put a couple of singles in your pocket so you don't have to open your purse on the street.",
            "title": "Great for the rate!",
            "user": "Buckeye02"
        },
        {
            "date": "March 22, 2010",
            "detail_rating": {
                "business": null,
                "cleanliness": 1.0,
                "desk": null,
                "location": 4.0,
                "pool": null,
                "restaurant": null,
                "rooms": 1.0,
                "service": 1.0,
                "sleep": 2.0,
                "value": 1.0
            },
            "helpfulness": 3,
            "id": 59289888,
            "likes": {
                "disliked": null,
                "liked": null
            },
            "rating": 1.0,
            "stay_parameters": "Stayed March 2010",
            "text": "TIP: kids are allowed in the blues bars that don't allow smoking.",
            "title": "Bed Bugs!!!!!",
            "user": "jstoy"
        },
        {
            "date": "May 24, 2010",
            "detail_rating": {
                "business": null,
                "cleanliness": 4.0,
                "desk": null,
                "location": 5.0,
                "pool": null,
                "restaurant": null,
                "rooms": 4.0,
                "service": 5.0,
                "sleep": 4.0,
                "value": 4.0
            },
            "helpfulness": null,
            "id": 65191594,
            "likes": {
                "disliked": null,
                "liked": null
            },
            "rating": 4.0,
            "stay_parameters": "Stayed May 2010",
            "text": "My daughter and I finally made our first Elvis trek and chose the Comfort Inn Downtown Memphis for our 4-night stay. We are DELIGHTED we chose this hotel! The staff is courteous, friendly, and helpful. Our room was clean with ample space (2 double beds.) We chose not to rent a car and were extremely happy with that decision. Parking is a problem and many, many attractions are within walking distance. When walking is not for you, the free shuttle is closeby as are the trolley cars for only $1 per ride or multiple day passes for a few more dollars. The breakfast provided by the hotel is not your ordinary continental breakfast! I had freshly made waffles every morning! Eggs, biscuits and gravy, juice, coffee, toast, bagels, danish pastries, cereal, and other items are also available. When we return to Memphis (and we will) we will definitely stay here again - real Southern hospitality!",
            "title": "Location, Location, Location!",
            "user": "PatPiebaker"
        },
        {
            "date": "May 23, 2010",
            "detail_rating": {
                "business": null,
                "cleanliness": 3.0,
                "desk": null,
                "location": 5.0,
                "pool": null,
                "restaurant": null,
                "rooms": 3.0,
                "service": 3.0,
                "sleep": 3.0,
                "value": 3.0
            },
            "helpfulness": 1,
            "id": 65092855,
            "likes": {
                "disliked": null,
                "liked": null
            },
            "rating": 3.0,
            "stay_parameters": "Stayed April 2010, traveled as a couple",
            "text": "We managed to get a room overlooking the Mississippi, a great view. Also a shortish walk from Beale Street. Acccommodation comfortable and clean. Breakfast good. The hotel has basement parking (charged). However, the decor of the hotel is looking a little tired, and could do with refreshing. Reception staff competent, but not overly enthusiastic. Overall, good value.",
            "title": "Great Location, decor just a little tired.",
            "user": "Browns38"
        },
        {
            "date": "May 3, 2010",
            "detail_rating": {
                "business": null,
                "cleanliness": 4.0,
                "desk": null,
                "location": 4.0,
                "pool": null,
                "restaurant": null,
                "rooms": 5.0,
                "service": 4.0,
                "sleep": 4.0,
                "value": 5.0
            },
            "helpfulness": null,
            "id": 63118061,
            "likes": {
                "disliked": null,
                "liked": null
            },
            "rating": 4.0,
            "stay_parameters": "Stayed April 2010, traveled as a couple",
            "text": "Nice, good value for money hotel. Located about 10 minutes from Beale Street but far enough away to avoid the noise & bustle of downtown. When we stayed the pool was being renovated so it's worth asking for a room away from the pool whilst this is going on. Complimentary breakfast was very good.",
            "title": "Good value, good location",
            "user": "stevaliere"
        },
        {
            "date": "April 22, 2010",
            "detail_rating": {
                "business": null,
                "cleanliness": 5.0,
                "desk": null,
                "location": 5.0,
                "pool": null,
                "restaurant": null,
                "rooms": 5.0,
                "service": 5.0,
                "sleep": 5.0,
                "value": 5.0
            },
            "helpfulness": null,
            "id": 62179709,
            "likes": {
                "disliked": null,
                "liked": null
            },
            "rating": 5.0,
            "stay_parameters": "Stayed April 2010, traveled as a couple",
            "text": "Great hotel. Very large,clean and comfortable room. A few blocks from Beal Street.",
            "title": "Great Hotel",
            "user": "billb55"
        },
        {
            "date": "April 10, 2010",
            "detail_rating": {
                "business": null,
                "cleanliness": 4.0,
                "desk": null,
                "location": 5.0,
                "pool": null,
                "restaurant": null,
                "rooms": 4.0,
                "service": null,
                "sleep": 5.0,
                "value": 4.0
            },
            "helpfulness": null,
            "id": 60943256,
            "likes": {
                "disliked": null,
                "liked": null
            },
            "rating": 4.0,
            "stay_parameters": "Stayed April 2010, traveled as a couple",
            "text": "We were pleased with this hotel - it's about 1/2 mile to Beale Street and directly across from Mudd Island and the visitor's center. Unfortunately Mudd Island doesn't open til the middle of April so we missed that attraction. But we were able to walk to dinner and then Beale Street afterwards so that was a plus. The room was quite large and comfortable and had a river view but there is a charge for parking (but that seemed to be standard for the hotels we checked in Memphis). Although we were pleased with the hotel, we would probably stay at a hotel with a more central location next time.",
            "title": "Good location downtown - river view",
            "user": "DilNJ"
        },
        {
            "date": "July 6, 2010",
            "detail_rating": {
                "business": null,
                "cleanliness": 5.0,
                "desk": null,
                "location": 5.0,
                "pool": null,
                "restaurant": null,
                "rooms": 5.0,
                "service": 5.0,
                "sleep": 5.0,
                "value": 5.0
            },
            "helpfulness": 1,
            "id": 69947446,
            "likes": {
                "disliked": null,
                "liked": null
            },
            "rating": 5.0,
            "stay_parameters": "Stayed July 2010, traveled as a couple",
            "text": "Great Clean Hotel!! The Staff was very nice and helpful.... I was afraid of being to far to walk to and from Beale Street, but we took the trolley and it worked out GREAT!!! They had elevator problems one day and they had a repair man quick and resolved the issue!!! The price was less than the hotels closer to Beale, but we are always looking for a bargain and this was a GREAT BARGAIN!!! Thanks again Comfort Inn, you made my 1st experence to Memphis a great one!",
            "title": "Great Place",
            "user": "JuliannaKansas"
        },
        {
            "date": "July 4, 2010",
            "detail_rating": {
                "business": null,
                "cleanliness": 5.0,
                "desk": null,
                "location": 5.0,
                "pool": null,
                "restaurant": null,
                "rooms": 5.0,
                "service": 5.0,
                "sleep": 5.0,
                "value": 5.0
            },
            "helpfulness": null,
            "id": 69678085,
            "likes": {
                "disliked": null,
                "liked": null
            },
            "rating": 5.0,
            "stay_parameters": "Stayed June 2010, traveled with family",
            "text": "My 11 year old daughter and I stayed here in June, we really liked it a lot! We were able to get a river view room for the price of a city view room. The river view was wonderful. We were on the 15th floor facing the river, it was a nice view! The rooms were clean and the breakfast was good, the pool was fun too! The hotel is very convenient to the trolley which you can ride to Beale St., National Civil Rights Museum, etc. Everyone was really friendly, we didn't have any problems with our stay, other than the elevators as someone else posted. Our 1st night they were fine, but the 2nd night, one was out of order, made for a long wait for the elevator sometimes, but it wasn't too much of a problem. Had a problem with the internet in our room on the first night, called the front desk, they connected me to the internet people and it was up and running in no time and worked the rest of our stay.",
            "title": "We enjoyed our stay at Comfort Inn Downtown",
            "user": "fawismom"
        },
        {
            "date": "June 30, 2010",
            "detail_rating": {
                "business": null,
                "cleanliness": 4.0,
                "desk": null,
                "location": 4.0,
                "pool": null,
                "restaurant": null,
                "rooms": 4.0,
                "service": 5.0,
                "sleep": 5.0,
                "value": 5.0
            },
            "helpfulness": null,
            "id": 69208142,
            "likes": {
                "disliked": null,
                "liked": null
            },
            "rating": 4.0,
            "stay_parameters": "Stayed June 2010, traveled solo",
            "text": "We'd stay again!",
            "title": "Great View",
            "user": "ElvisBowtie"
        },
        {
            "date": "June 25, 2010",
            "detail_rating": {
                "business": null,
                "cleanliness": 5.0,
                "desk": null,
                "location": 5.0,
                "pool": null,
                "restaurant": null,
                "rooms": 5.0,
                "service": 5.0,
                "sleep": 5.0,
                "value": 5.0
            },
            "helpfulness": null,
            "id": 68641151,
            "likes": {
                "disliked": null,
                "liked": null
            },
            "rating": 5.0,
            "stay_parameters": "Stayed September 2009, traveled as a couple",
            "text": "Very pleasantly surprised after my last visit. It had been years since I stayed there, and they have improved.",
            "title": "Great Staff!!",
            "user": "msubobcats"
        },
        {
            "date": "June 14, 2010",
            "detail_rating": {
                "business": null,
                "cleanliness": 4.0,
                "desk": null,
                "location": 5.0,
                "pool": null,
                "restaurant": null,
                "rooms": 4.0,
                "service": 5.0,
                "sleep": 5.0,
                "value": 5.0
            },
            "helpfulness": 6,
            "id": 67511066,
            "likes": {
                "disliked": null,
                "liked": null
            },
            "rating": 5.0,
            "stay_parameters": "Stayed June 2010, traveled as a couple",
            "text": "Breakfast area was great. Waffles, eggs, various breads, fruits, etc. Nice set up. Very enjoyable.",
            "title": "Location, Value, & COMFORT!",
            "user": "manque"
        },
        {
            "date": "September 1, 2010",
            "detail_rating": {
                "business": null,
                "cleanliness": 2.0,
                "desk": null,
                "location": 3.0,
                "pool": null,
                "restaurant": null,
                "rooms": 2.0,
                "service": 2.0,
                "sleep": 2.0,
                "value": 3.0
            },
            "helpfulness": 1,
            "id": 77901725,
            "likes": {
                "disliked": null,
                "liked": null
            },
            "rating": 2.0,
            "stay_parameters": "Stayed February 2010, traveled as a couple",
            "text": "Location is good, but this place needs ALOT of work. The common areas seemed rundown and in desperate need of a scrubbing. The parking underneath the building is dark, cramped and creepy..... very low ceiling.... You really have to watch where you're walking. I almost hit my head and I'm only 5'4\".",
            "title": "Needs work.",
            "user": "KarenSMichigan"
        },
        {
            "date": "August 17, 2010",
            "detail_rating": {
                "business": null,
                "cleanliness": 5.0,
                "desk": null,
                "location": 4.0,
                "pool": null,
                "restaurant": null,
                "rooms": 4.0,
                "service": 5.0,
                "sleep": 5.0,
                "value": 5.0
            },
            "helpfulness": null,
            "id": 75614979,
            "likes": {
                "disliked": null,
                "liked": null
            },
            "rating": 4.0,
            "stay_parameters": "Stayed July 2010, traveled as a couple",
            "text": "Our room was huge, but was just ok. The bathtub had some spots that appeared to be patched with spackle or something. We were on the first floor and the sidewalk and street were directly outside our window..... Never had a room so close to traffic.... I was happy that noise wasn't a problem. It was very cold in Memphis when we were there and the tile on the bathroom floor was sooooo cold..... sort of like walking on ice cubes. We put towels down and sort of slid around on those. The breakfast was ok. We had planned to stay two nights.... but.... with the hotel such as it was, in addition to the cold weather, we stayed one night and decided to grab some bbq for lunch the next day and hit the road.",
            "title": "friendly hotel, nice pool",
            "user": "frome99"
        },
        {
            "date": "July 19, 2010",
            "detail_rating": {
                "business": null,
                "cleanliness": 3.0,
                "desk": null,
                "location": 3.0,
                "pool": null,
                "restaurant": null,
                "rooms": 3.0,
                "service": 2.0,
                "sleep": 3.0,
                "value": 3.0
            },
            "helpfulness": null,
            "id": 71507136,
            "likes": {
                "disliked": null,
                "liked": null
            },
            "rating": 3.0,
            "stay_parameters": "Stayed June 2010, traveled solo",
            "text": "I stayed at the Comfort Inn Downtown in Memphis with my husband for two nights in July. From the hotel it's just a short walk to restaurant and bars on fabulous Beale Street. Other hotels might be closer still, but the Comfort Inn offers a lovely rooftop pool with a beautiful view of the Mississippi. Rooms are spacious, clean and quiet (ask for room with river view) , staff is friendly, efficient and helpful. Good value for money.",
            "title": "Average hotel with rude nightstaff",
            "user": "IrishTraveller0"
        },
        {
            "date": "July 15, 2010",
            "detail_rating": {
                "business": null,
                "cleanliness": null,
                "desk": null,
                "location": null,
                "pool": null,
                "restaurant": null,
                "rooms": null,
                "service": null,
                "sleep": null,
                "value": null
            },
            "helpfulness": null,
            "id": 71010075,
            "likes": {
                "disliked": null,
                "liked": null
            },
            "rating": 3.0,
            "stay_parameters": null,
            "text": "I stayed here for 3 nights in early June and it's an average hotel, nothing special. Good sized rooms and decent breakfast (continental). The girl on reception the night I arrived hardly acknowledged me as she was chatting on the phone, when I tried to ask a question about the Graceland package, she told me to read the brochure! She was on duty the second night aswell and was still chatting on the phone!!! The reception staff during the day were excellant and very knowledgeable and helpful. The hotel is a few blocks from the centre and the area is very very quiet at night, but most of downtown seems to be extremely quiet (eerily so) apart from Beale Street.",
            "title": "basic, acceptable, sort of dumpy and slightly shabby",
            "user": "shmamy"
        },
        {
            "date": "July 7, 2010",
            "detail_rating": {
                "business": null,
                "cleanliness": 4.0,
                "desk": null,
                "location": 5.0,
                "pool": null,
                "restaurant": null,
                "rooms": 4.0,
                "service": 4.0,
                "sleep": 4.0,
                "value": 4.0
            },
            "helpfulness": null,
            "id": 70042804,
            "likes": {
                "disliked": null,
                "liked": null
            },
            "rating": 4.0,
            "stay_parameters": "Stayed July 2010, traveled with family",
            "text": "I would recommend staying just one night in Memphis - a trip to Graceland (highlight of the trip for me and I'm not an Elvis fan!!!) on day one and on day two a tour of the motel (on the main street) where Martin Luther King was assassinated and a tour of Sunset Studios covers everything. There is a free bus to Graceland and Sunset Studios leaving every hour from the Rock and Roll museum (not very interesting unless you are a major rock and roll fan) on the half hour - do not pay for an organised tourbus from your hotel!",
            "title": "Great Value, Location, Breakfast and More",
            "user": "HaveKidsWillTravelTX"
        }
    ],
    "slim_ranking": 0.0962962962963,
    "stars": 2.5,
    "tripadvisor": {
        "VISITED": false,
        "country_name": null,
        "locality": null,
        "pic_link": null,
        "street_address": null
    },
    "user_rating": 4.0,
    "variance": {
        "average": 43,
        "excellent": 170,
        "poor": 11,
        "terrible": 4,
        "very good": 208
    }
}