{
    "aka": "Ramada Plaza Marco Polo Beach Hotel North Miami Beach",
    "description": null,
    "detail_rating": {
        "cleanliness": 3.0,
        "location": 4.0,
        "rooms": 3.0,
        "service": 3.0,
        "sleep": 3.5,
        "value": 3.0
    },
    "location": {
        "city": "Sunny Isles Beach",
        "continent": null,
        "country": "United States",
        "proposed_city": "Ramada",
        "province": null,
        "region": null
    },
    "name": "Ramada Plaza Marco Polo Beach Resort",
    "places": {
        "aka": [
            "Ramada",
            "Miami"
        ],
        "hotel_description": [],
        "hotel_name": [
            "Ramada"
        ]
    },
    "review_count": 898,
    "review_count_current": 20,
    "reviews": [
        {
            "date": "March 26, 2012",
            "detail_rating": {
                "business": null,
                "cleanliness": 4.0,
                "desk": null,
                "location": 5.0,
                "pool": null,
                "restaurant": null,
                "rooms": 5.0,
                "service": null,
                "sleep": 5.0,
                "value": 5.0
            },
            "helpfulness": 1,
            "id": 126714949,
            "likes": {
                "disliked": null,
                "liked": null
            },
            "rating": 4.0,
            "stay_parameters": "Stayed March 2012, traveled with friends",
            "text": "This hotel is not nearly as bad as the reviews. They really had us scared. Our room was nice and clean. The bathroom tub needed to be renovated and the hot water didn't last through all 4 of us. The closets were not renovated yet, but we didn't care. The prices for the amenities are the same as any Miami beach resort. We had a room with tile which is better than carpet for a beach resort. We were pleased and we would stay there again.",
            "title": "It was not bad....",
            "user": "queenbuc"
        },
        {
            "date": "March 26, 2012",
            "detail_rating": {
                "business": null,
                "cleanliness": 3.0,
                "desk": null,
                "location": 2.0,
                "pool": null,
                "restaurant": null,
                "rooms": 3.0,
                "service": 4.0,
                "sleep": 4.0,
                "value": 3.0
            },
            "helpfulness": null,
            "id": 126701404,
            "likes": {
                "disliked": null,
                "liked": null
            },
            "rating": 3.0,
            "stay_parameters": "Stayed March 2012, traveled as a couple",
            "text": "the location is sort of in no-man's land -- close to nothing so you have to drive just to get decent food -- and you'll have to use the hotel's valet parking which is always a pain -- on the other hand, it's right on the beach! we loved that convenience, being able to take a dip whenever the mood hit -- the concierge was so nice (pro) but wasn't terribly knowledgeable about some common-sense stuff (con), like high waves cancelling snorkel boat trips -- staff and service was actually pretty good (pro) but tacking on an extra $10 a day \"resort fee\" is just that -- tacky! (con) -- this in addition to $18 a day for parking (and tipping every time they go get your car) is some serious gouging, we thought -- all in all, can't recommend it",
            "title": "pros & cons",
            "user": "asce"
        },
        {
            "date": "March 24, 2012",
            "detail_rating": {
                "business": null,
                "cleanliness": 5.0,
                "desk": null,
                "location": 4.0,
                "pool": null,
                "restaurant": null,
                "rooms": 3.0,
                "service": 5.0,
                "sleep": 2.0,
                "value": 2.0
            },
            "helpfulness": 1,
            "id": 126581586,
            "likes": {
                "disliked": null,
                "liked": null
            },
            "rating": 3.0,
            "stay_parameters": "Stayed February 2012, traveled with family",
            "text": "The Ramada in north miami beach is a bit expensive and you have to pay for a lounge on the beach. $30 per day for 2 lounges and an umbrella. Also, the valet parking is a hassle. I found the staff to be extremely friendly. Everyday we saw Mary cleaning the floors and the bathrooms on our way to the pool. She's always smiling and the place was very clean. Edweena worked as a housekeeper on our floor. She was always chipper and also works incredible hard. As for the pool staff, Kelly always takes good care of the guests...He's also very kind and friendly. The only problem w/ the pool is security. The townspeople seem to always use the pool and they are not guests. it is a real problem. Why not have a gate that locks. When you come back from the beach, you can use your room key to open the gate. I've never been to a hotel that allows riff raff and kids to just come in an use the pool. Also, non guests valet park for $8 and come use the pool for the day. A lot of work for staff for no reason!",
            "title": "Friendly staff -terrible pool security.",
            "user": "Marcia W"
        },
        {
            "date": "March 21, 2012",
            "detail_rating": {
                "business": null,
                "cleanliness": 1.0,
                "desk": null,
                "location": 2.0,
                "pool": null,
                "restaurant": null,
                "rooms": 1.0,
                "service": 2.0,
                "sleep": 1.0,
                "value": 1.0
            },
            "helpfulness": 3,
            "id": 126455740,
            "likes": {
                "disliked": null,
                "liked": null
            },
            "rating": 1.0,
            "stay_parameters": "Stayed November 2011, traveled as a couple",
            "text": "My fianc\u00e9 and I stayed here a couple of months ago as our \"last vacation\" before our wedding. We should have booked somewhere else after reading all of the terrible reviews, but since we have had luck two other times on this website, we decided to stay here anyways. I cringe every time I think about the hotel. Our room was HORRIBLE! There were bugs on the night stand on several occasions, and hair all over the bathroom upon arrival!!!! The balcony door didn't open or close properly and we couldn't leave it open at night because it rattled so hard we thought the glass was going to fall out. I was so grossed out by everything that I couldn't sleep. Talk about a NON-relaxing vacation! The hallways reeked of marijuana and cigarettes on several occasions, and the kitchenette including the refrigerator was really old and all rusty so I refused to keep anything in it. I wouldn't even walk on the carpet without sandals on because it was so gross, moldy and squishy. On top of there being bugs, the room was so old and dingy that I had to keep everything packed in my suitcase and set on the table over the course of 4 days when we were there because I was scared of bed bugs coming home with me in my garments! On top of this, the continental breakfast was disgusting. Talk about NO variety and BLAND! This vacation was a joke. It was more stressful getting through the nights than if I would have stayed home and worked! Oh, and be careful, if you can do without a car, DO IT! It is VERY pricey to park your car there overnight. I was really disappointed in this experience and we WILL NOT be returning here\u2026not even if someone paid me.",
            "title": "HORRIBLE...BUGS!",
            "user": "Rachel C"
        },
        {
            "date": "March 18, 2012",
            "detail_rating": {
                "business": null,
                "cleanliness": null,
                "desk": null,
                "location": 5.0,
                "pool": null,
                "restaurant": null,
                "rooms": null,
                "service": 5.0,
                "sleep": null,
                "value": 5.0
            },
            "helpfulness": 1,
            "id": 126307585,
            "likes": {
                "disliked": null,
                "liked": null
            },
            "rating": 5.0,
            "stay_parameters": "Stayed March 2012, traveled solo",
            "text": "I'm from NY and stayed at the Marco Polo Hotel for 9 days and had the best experience. Every night I had a drink at the bar in the Hotel and Marcelo made the best martinis. The martinis were better then all the NY bars and nightclubs. Marcello was very experienced, professional and made me feel very comfortable traveling alone. The bar was very clean and Marcelo the bartender was very friendly. Every night I had a different drink and would highly recommend visiting him at the Marco Polo lobby bar. Ask for the Best Apple Martini!",
            "title": "Best Bartender - Marcelo - TNT Bar",
            "user": "Susan L"
        },
        {
            "date": "March 15, 2012",
            "detail_rating": {
                "business": null,
                "cleanliness": 3.0,
                "desk": null,
                "location": 4.0,
                "pool": null,
                "restaurant": null,
                "rooms": 3.0,
                "service": 4.0,
                "sleep": null,
                "value": 3.0
            },
            "helpfulness": 1,
            "id": 126134042,
            "likes": {
                "disliked": null,
                "liked": null
            },
            "rating": 3.0,
            "stay_parameters": "Stayed March 2012",
            "text": "Keep looking of you expect a real resort.",
            "title": "A good value In an expensive location but don't expect a resort. Large rooms with kitchenette were a pleasant surprise but thing",
            "user": "lobsterbacks"
        },
        {
            "date": "March 14, 2012",
            "detail_rating": {
                "business": null,
                "cleanliness": 3.0,
                "desk": null,
                "location": 4.0,
                "pool": null,
                "restaurant": null,
                "rooms": 4.0,
                "service": 1.0,
                "sleep": 3.0,
                "value": 4.0
            },
            "helpfulness": 4,
            "id": 126111762,
            "likes": {
                "disliked": null,
                "liked": null
            },
            "rating": 1.0,
            "stay_parameters": "Stayed March 2012, traveled with friends",
            "text": "Of you want a good price In a reasonable room I think its fine.",
            "title": "Front Desk Manager Yelling... Service doesn't get worse than this!!!",
            "user": "FacesTradings"
        },
        {
            "date": "March 4, 2012",
            "detail_rating": {
                "business": null,
                "cleanliness": 4.0,
                "desk": null,
                "location": 4.0,
                "pool": null,
                "restaurant": null,
                "rooms": 3.0,
                "service": 4.0,
                "sleep": 4.0,
                "value": 4.0
            },
            "helpfulness": 2,
            "id": 125627068,
            "likes": {
                "disliked": null,
                "liked": null
            },
            "rating": 4.0,
            "stay_parameters": "Stayed February 2012, traveled as a couple",
            "text": "What a horrible experience! there are so many more hotels in Miami and they do not understand customer service.",
            "title": "Nice, short get-away",
            "user": "Kathy W"
        },
        {
            "date": "March 2, 2012",
            "detail_rating": {
                "business": null,
                "cleanliness": 2.0,
                "desk": null,
                "location": 3.0,
                "pool": null,
                "restaurant": null,
                "rooms": 1.0,
                "service": 2.0,
                "sleep": 1.0,
                "value": 1.0
            },
            "helpfulness": 2,
            "id": 125513388,
            "likes": {
                "disliked": null,
                "liked": null
            },
            "rating": 2.0,
            "stay_parameters": "Stayed February 2012, traveled with family",
            "text": "I hadn't even been in this hotel for more than 5 minutes when Ms Front Desk Manager started yelling at a guest while I was waiting on line to check in.",
            "title": "Needs a facelift",
            "user": "Nisi_12"
        },
        {
            "date": "March 2, 2012",
            "detail_rating": {
                "business": null,
                "cleanliness": 5.0,
                "desk": null,
                "location": 5.0,
                "pool": null,
                "restaurant": null,
                "rooms": 1.0,
                "service": 5.0,
                "sleep": 1.0,
                "value": 1.0
            },
            "helpfulness": 1,
            "id": 125501091,
            "likes": {
                "disliked": null,
                "liked": null
            },
            "rating": 1.0,
            "stay_parameters": "Stayed February 2012, traveled solo",
            "text": "Her behaviour was appalling, is this the first impression that they want their guests to have?",
            "title": "Don't Book",
            "user": "OldChick61"
        },
        {
            "date": "February 14, 2012",
            "detail_rating": {
                "business": null,
                "cleanliness": 1.0,
                "desk": null,
                "location": 3.0,
                "pool": null,
                "restaurant": null,
                "rooms": 1.0,
                "service": 3.0,
                "sleep": 1.0,
                "value": 2.0
            },
            "helpfulness": 2,
            "id": 124600776,
            "likes": {
                "disliked": null,
                "liked": null
            },
            "rating": 2.0,
            "stay_parameters": "Stayed February 2012, traveled with family",
            "text": "We chose this hotel because it was located on the beach and was available at a reasonable price. Well...I don't know if I am too pickey or what but:",
            "title": "Think twice",
            "user": "KatCiaccioAnd"
        },
        {
            "date": "February 8, 2012",
            "detail_rating": {
                "business": null,
                "cleanliness": 1.0,
                "desk": null,
                "location": 4.0,
                "pool": null,
                "restaurant": null,
                "rooms": 1.0,
                "service": 2.0,
                "sleep": 2.0,
                "value": 1.0
            },
            "helpfulness": 1,
            "id": 124305501,
            "likes": {
                "disliked": null,
                "liked": null
            },
            "rating": 2.0,
            "stay_parameters": "Stayed February 2012, traveled as a couple",
            "text": "1. Our room was so damp, there was a large amount of condensation on the windows, so much that it was difficult to see the outside beach/ocean view;",
            "title": "Run down hotel with poor services",
            "user": "Krzysztof L"
        },
        {
            "date": "February 7, 2012",
            "detail_rating": {
                "business": null,
                "cleanliness": 1.0,
                "desk": null,
                "location": 3.0,
                "pool": null,
                "restaurant": null,
                "rooms": 2.0,
                "service": 1.0,
                "sleep": 2.0,
                "value": 1.0
            },
            "helpfulness": 1,
            "id": 124273363,
            "likes": {
                "disliked": null,
                "liked": null
            },
            "rating": 2.0,
            "stay_parameters": "Stayed February 2012, traveled on business",
            "text": "2. The room smelled musty, moldy, so did our clothes when we got home.",
            "title": "I would not go back again if I had other choices",
            "user": "Eric L"
        },
        {
            "date": "February 6, 2012",
            "detail_rating": {
                "business": null,
                "cleanliness": 2.0,
                "desk": null,
                "location": 4.0,
                "pool": null,
                "restaurant": null,
                "rooms": 2.0,
                "service": 2.0,
                "sleep": 3.0,
                "value": 2.0
            },
            "helpfulness": null,
            "id": 124181908,
            "likes": {
                "disliked": null,
                "liked": null
            },
            "rating": 1.0,
            "stay_parameters": "Stayed February 2012, traveled on business",
            "text": "3. My daughter has allergies to dust mites and mold and when she woke up in the morning after our first night, she could barely breathe.",
            "title": "Terrible eperience paid too much for parking, a fly was in my food.",
            "user": "Chevy R"
        },
        {
            "date": "February 5, 2012",
            "detail_rating": {
                "business": null,
                "cleanliness": 4.0,
                "desk": null,
                "location": 4.0,
                "pool": null,
                "restaurant": null,
                "rooms": 3.0,
                "service": 3.0,
                "sleep": null,
                "value": 3.0
            },
            "helpfulness": null,
            "id": 124159404,
            "likes": {
                "disliked": null,
                "liked": null
            },
            "rating": 3.0,
            "stay_parameters": "Stayed February 2012",
            "text": "4. There was a large garbage barrell spattered with paint that sat in the hallway near our room for three days collecting water from a leaky ceiling.",
            "title": "Enjoyed my stay!",
            "user": "SMR86"
        },
        {
            "date": "February 29, 2012",
            "detail_rating": {
                "business": null,
                "cleanliness": 3.0,
                "desk": null,
                "location": 5.0,
                "pool": null,
                "restaurant": null,
                "rooms": 3.0,
                "service": 5.0,
                "sleep": 4.0,
                "value": 4.0
            },
            "helpfulness": 2,
            "id": 125406320,
            "likes": {
                "disliked": null,
                "liked": null
            },
            "rating": 4.0,
            "stay_parameters": "Stayed February 2012, traveled solo",
            "text": "I've been staying for 4 days at the Ramada. The stay was really nice and so are the staff, in the end I was almost sorry to leave.",
            "title": "Love the place!",
            "user": "new g"
        },
        {
            "date": "February 26, 2012",
            "detail_rating": {
                "business": null,
                "cleanliness": 2.0,
                "desk": null,
                "location": 3.0,
                "pool": null,
                "restaurant": null,
                "rooms": 3.0,
                "service": 3.0,
                "sleep": 4.0,
                "value": 3.0
            },
            "helpfulness": 3,
            "id": 125246399,
            "likes": {
                "disliked": null,
                "liked": null
            },
            "rating": 3.0,
            "stay_parameters": "Stayed February 2012, traveled with family",
            "text": "Upon arriving I found myself in a valley of smiles from the very first person I met Mr Milton Vargas (concierge). He explained everything I had available and gave me a list of restaurants and places to shop.",
            "title": "Friendly staff",
            "user": "Travelmomwith2"
        },
        {
            "date": "February 20, 2012",
            "detail_rating": {
                "business": null,
                "cleanliness": 2.0,
                "desk": null,
                "location": 2.0,
                "pool": null,
                "restaurant": null,
                "rooms": 2.0,
                "service": 3.0,
                "sleep": null,
                "value": 3.0
            },
            "helpfulness": 1,
            "id": 124896622,
            "likes": {
                "disliked": null,
                "liked": null
            },
            "rating": 2.0,
            "stay_parameters": "Stayed February 2012",
            "text": "Entering the room, it was clean and quiet (couldn't hear a noise).",
            "title": "This hotel is old musty and awful to stay in",
            "user": "ARCOttawa"
        },
        {
            "date": "February 18, 2012",
            "detail_rating": {
                "business": null,
                "cleanliness": 2.0,
                "desk": null,
                "location": 5.0,
                "pool": null,
                "restaurant": null,
                "rooms": 3.0,
                "service": 1.0,
                "sleep": null,
                "value": 1.0
            },
            "helpfulness": 2,
            "id": 124784659,
            "likes": {
                "disliked": null,
                "liked": null
            },
            "rating": 2.0,
            "stay_parameters": "Stayed February 2012",
            "text": "The bed was one thing that if I could take him home, I would have done. Hard in the right places and comfortable....",
            "title": "Expensive for a crappy resort!",
            "user": "Felicka85"
        },
        {
            "date": "February 18, 2012",
            "detail_rating": {
                "business": null,
                "cleanliness": null,
                "desk": null,
                "location": null,
                "pool": null,
                "restaurant": null,
                "rooms": null,
                "service": null,
                "sleep": null,
                "value": null
            },
            "helpfulness": 3,
            "id": 124759221,
            "likes": {
                "disliked": null,
                "liked": null
            },
            "rating": 5.0,
            "stay_parameters": null,
            "text": "Love the pool, and the beach right there.",
            "title": "Happy Hour at Pool Bar",
            "user": "travel3983"
        }
    ],
    "slim_ranking": 0.75,
    "stars": 3,
    "tripadvisor": {
        "VISITED": false,
        "country_name": null,
        "locality": null,
        "pic_link": null,
        "street_address": null
    },
    "user_rating": 3.0,
    "variance": {
        "average": 212,
        "excellent": 145,
        "poor": 144,
        "terrible": 200,
        "very good": 197
    }
}