{
    "aka": "Hotel q",
    "description": null,
    "detail_rating": {
        "cleanliness": null,
        "location": null,
        "rooms": null,
        "service": null,
        "sleep": null,
        "value": null
    },
    "location": {
        "city": null,
        "continent": "Europe",
        "country": "Germany",
        "proposed_city": null,
        "province": null,
        "region": null
    },
    "name": "Hotel Q!",
    "places": {
        "aka": [],
        "hotel_description": [],
        "hotel_name": []
    },
    "review_count": 535,
    "review_count_current": 20,
    "reviews": [
        {
            "date": "March 26, 2008",
            "detail_rating": {
                "business": 2.0,
                "cleanliness": 5.0,
                "desk": null,
                "front_desk": 2.0,
                "location": 4.0,
                "pool": null,
                "restaurant": null,
                "rooms": 4.0,
                "service": 3.0,
                "sleep": null,
                "value": 4.0
            },
            "helpfulness": null,
            "id": 14559440,
            "likes": {
                "disliked": "\u2014 A bad first encounter with a very arrogant front desk person",
                "liked": "\u2014 The funky rooms. The loungy style."
            },
            "rating": 5.0,
            "stay_parameters": "Stayed August 2006, traveled as a couple",
            "text": "A very stylish design hotel with a lot to offer and not too far from city centre!",
            "title": "Great design hotel experience",
            "user": "Hammerstein"
        },
        {
            "date": "December 19, 2007",
            "detail_rating": {
                "business": 4.0,
                "cleanliness": 5.0,
                "desk": null,
                "front_desk": 5.0,
                "location": 5.0,
                "pool": null,
                "restaurant": null,
                "rooms": 3.0,
                "service": 4.0,
                "sleep": null,
                "value": 5.0
            },
            "helpfulness": 1,
            "id": 11693211,
            "likes": {
                "disliked": "\u2014 German TV",
                "liked": "\u2014 The style and design."
            },
            "rating": 4.0,
            "stay_parameters": "Stayed October 2007, traveled on business",
            "text": "+ We absolutely loved the funky rooms! The fantastic breakfast. The cosy lounge in the evening.",
            "title": "Good style!",
            "user": "Th0masN0rway"
        },
        {
            "date": "December 7, 2007",
            "detail_rating": {
                "business": null,
                "cleanliness": 4.0,
                "desk": null,
                "front_desk": 4.0,
                "location": 5.0,
                "pool": null,
                "restaurant": null,
                "rooms": 4.0,
                "service": 4.0,
                "sleep": null,
                "value": 5.0
            },
            "helpfulness": 1,
            "id": 11292588,
            "likes": {
                "disliked": "\u2014 Small room size.",
                "liked": "\u2014 It was fun and very unusual, some parts sexy and seedy and other parts innocent and pure."
            },
            "rating": 5.0,
            "stay_parameters": "Stayed April 2007, traveled with friends",
            "text": "+ We liked the location and the fair price.",
            "title": "Great visit",
            "user": "jellyfish11"
        },
        {
            "date": "October 6, 2007",
            "detail_rating": {
                "business": 2.0,
                "cleanliness": 3.0,
                "desk": null,
                "front_desk": 1.0,
                "location": 3.0,
                "pool": null,
                "restaurant": null,
                "rooms": 3.0,
                "service": 1.0,
                "sleep": null,
                "value": 2.0
            },
            "helpfulness": 2,
            "id": 10045347,
            "likes": {
                "disliked": "\u2014 Disrespectful staff...",
                "liked": "\u2014 Nothing really..."
            },
            "rating": 2.0,
            "stay_parameters": "Stayed October 2007, traveled on business",
            "text": "- We would have liked a not so arrogant service at the front desk the first time we visited the hotel. (We arrived at the hotel after having travelled from Austria by car in really warm weather, so we didn't really look as trendy as some of the other guests in the reception)",
            "title": "I would have expected something better...",
            "user": "GeorgeDunlop"
        },
        {
            "date": "July 6, 2007",
            "detail_rating": {
                "business": 5.0,
                "cleanliness": 5.0,
                "desk": null,
                "front_desk": 5.0,
                "location": 4.0,
                "pool": null,
                "restaurant": null,
                "rooms": 4.0,
                "service": 5.0,
                "sleep": null,
                "value": 5.0
            },
            "helpfulness": null,
            "id": 8066944,
            "likes": {
                "disliked": "\u2014 no privacy for showering",
                "liked": "\u2014 friendly staff, very clean and comfortable, good location"
            },
            "rating": 5.0,
            "stay_parameters": "Stayed July 2007, traveled with friends",
            "text": "Location is good in Berlin as I now and at check-in a small problem since I did order over internet. The staff is very polite and effective. I did choose this hotel because of the design and it was not so bad. I did get the feeling of a brothel when I go out of the elevator and to the rooms, and this is only because they have red lights in the hallway. Dont they have like this on brothels?;) Anyway, the place have good style, plays some Budda Bar music in hallways, have a very good bar and all over very cool design that you not often see at hotels.",
            "title": "Great Hotel - Friendly Staff",
            "user": "phillysadie"
        },
        {
            "date": "June 16, 2007",
            "detail_rating": {
                "business": null,
                "cleanliness": 5.0,
                "desk": null,
                "front_desk": 4.0,
                "location": 3.0,
                "pool": null,
                "restaurant": null,
                "rooms": 3.0,
                "service": 3.0,
                "sleep": null,
                "value": 3.0
            },
            "helpfulness": 5,
            "id": 7858600,
            "likes": {
                "disliked": "\u2014 Tacky / Construction",
                "liked": "\u2014 Hot Tub"
            },
            "rating": 3.0,
            "stay_parameters": "Stayed October 2005, traveled as a couple",
            "text": "Hotel Q! seemed to be one of the different places we would be staying at during our European tour. It was correct at not having a sign out front. Parking was difficult as almost all spots in the adjacent garage were taken.",
            "title": "Beware of the construction",
            "user": "ClarkRB"
        },
        {
            "date": "May 18, 2007",
            "detail_rating": {
                "business": null,
                "cleanliness": null,
                "desk": null,
                "location": null,
                "pool": null,
                "restaurant": null,
                "rooms": null,
                "service": null,
                "sleep": null,
                "value": null
            },
            "helpfulness": 7,
            "id": 7638286,
            "likes": {
                "disliked": null,
                "liked": null
            },
            "rating": 1.0,
            "stay_parameters": null,
            "text": "The hotel was a bit tacky for my taste, and seemed to resemble more of a hotel geared for erotica. Shag carpeting and a cheesy wand to open your door. Neat room; unlike some reviewers we did have the hot tub next to the bed.",
            "title": "what a scam!!!!!!!!!!!!!!!!!!!!!!!!!!!!!!!!!!!!!",
            "user": "whattohell"
        },
        {
            "date": "May 1, 2007",
            "detail_rating": {
                "business": 4.0,
                "cleanliness": 5.0,
                "desk": null,
                "front_desk": 4.0,
                "location": 4.0,
                "pool": null,
                "restaurant": null,
                "rooms": 5.0,
                "service": 5.0,
                "sleep": null,
                "value": 5.0
            },
            "helpfulness": 6,
            "id": 7491692,
            "likes": {
                "disliked": null,
                "liked": "\u2014 Modern design of the rooms"
            },
            "rating": 4.0,
            "stay_parameters": "Stayed April 2007, traveled as a couple",
            "text": "Hotel had loud bar downstairs, mainly frequented by older men and younger women. The younger women are eyeing the mens money. The men are ogling the women.",
            "title": "Modern boutique",
            "user": "bel80"
        },
        {
            "date": "March 25, 2007",
            "detail_rating": {
                "business": null,
                "cleanliness": 5.0,
                "desk": null,
                "front_desk": 2.0,
                "location": 5.0,
                "pool": null,
                "restaurant": null,
                "rooms": 2.0,
                "service": 1.0,
                "sleep": null,
                "value": 2.0
            },
            "helpfulness": 8,
            "id": 7218454,
            "likes": {
                "disliked": null,
                "liked": null
            },
            "rating": 2.0,
            "stay_parameters": "Stayed March 2007, traveled solo",
            "text": "The construction of the adjacent building the next day started exactly at 0800L. No way one could sleep though that. No warning was given for this, even though this appears to be an ongoing project.",
            "title": "Extremely dissapointing",
            "user": "dahendrixmaster"
        },
        {
            "date": "October 16, 2006",
            "detail_rating": {
                "business": 4.0,
                "cleanliness": 5.0,
                "desk": null,
                "front_desk": 5.0,
                "location": 5.0,
                "pool": null,
                "restaurant": null,
                "rooms": 5.0,
                "service": 5.0,
                "sleep": null,
                "value": 5.0
            },
            "helpfulness": 8,
            "id": 5959904,
            "likes": {
                "disliked": "\u2014 Cost of breakfast",
                "liked": "\u2014 Design"
            },
            "rating": 5.0,
            "stay_parameters": "Stayed October 2006, traveled as a couple",
            "text": "Overall the hotel was OK. Inquire about construction next door prior to getting the reservation.",
            "title": "Fantastic design hotel",
            "user": "SouthYorkshire"
        },
        {
            "date": "July 6, 2006",
            "detail_rating": {
                "business": null,
                "cleanliness": 4.0,
                "desk": null,
                "location": null,
                "pool": null,
                "restaurant": null,
                "rooms": 5.0,
                "service": 4.0,
                "sleep": null,
                "value": 5.0
            },
            "helpfulness": 1,
            "id": 5432189,
            "likes": {
                "disliked": null,
                "liked": null
            },
            "rating": 5.0,
            "stay_parameters": "Stayed June 2006, traveled on business",
            "text": "A great hotel. After being on the road in Germany for several weeks and usually staying in boring business hotels I decided to try Q when I had a couple of days off in Berlin. Great service in the reception and in the bar, a nice clean room that is very different from the normal business-rooms I usually stay inn and a fantastic spa-area in the basement. The location is perfect in a nice part of Berlin with a lot of restaurants, cafes and shopping. I would recommend this hotel to anyone. Great desing, friendly staff and not very expensive.",
            "title": "Great location and a different experience",
            "user": "solskjaer"
        },
        {
            "date": "June 3, 2006",
            "detail_rating": {
                "business": null,
                "cleanliness": 5.0,
                "desk": null,
                "location": null,
                "pool": null,
                "restaurant": null,
                "rooms": 4.0,
                "service": 4.0,
                "sleep": null,
                "value": 3.0
            },
            "helpfulness": 3,
            "id": 5295602,
            "likes": {
                "disliked": null,
                "liked": null
            },
            "rating": 4.0,
            "stay_parameters": "Stayed May 2006",
            "text": "We stayed for 3 nights as a birthday treat. The hotel is as unique as mentioned in all the previous reviews.",
            "title": "Loved the sand room!",
            "user": "Liz1"
        },
        {
            "date": "May 3, 2006",
            "detail_rating": {
                "business": null,
                "cleanliness": 4.0,
                "desk": null,
                "location": null,
                "pool": null,
                "restaurant": null,
                "rooms": 4.0,
                "service": 3.0,
                "sleep": null,
                "value": 3.0
            },
            "helpfulness": 2,
            "id": 5031551,
            "likes": {
                "disliked": null,
                "liked": null
            },
            "rating": 3.0,
            "stay_parameters": "Stayed August 2005",
            "text": "Just to add to the previous reviews..",
            "title": "Cool design and good location, but no attention to detail",
            "user": "Massivechange"
        },
        {
            "date": "March 21, 2006",
            "detail_rating": {
                "business": null,
                "cleanliness": null,
                "desk": null,
                "location": null,
                "pool": null,
                "restaurant": null,
                "rooms": null,
                "service": null,
                "sleep": null,
                "value": null
            },
            "helpfulness": null,
            "id": 4722550,
            "likes": {
                "disliked": null,
                "liked": null
            },
            "rating": 4.0,
            "stay_parameters": null,
            "text": "We had plenty of toilet roll! No problems.",
            "title": "A hotel for couples",
            "user": "A TripAdvisor user"
        },
        {
            "date": "February 14, 2006",
            "detail_rating": {
                "business": null,
                "cleanliness": 5.0,
                "desk": null,
                "location": null,
                "pool": null,
                "restaurant": null,
                "rooms": 4.0,
                "service": 4.0,
                "sleep": null,
                "value": 2.0
            },
            "helpfulness": 2,
            "id": 4458831,
            "likes": {
                "disliked": null,
                "liked": null
            },
            "rating": 4.0,
            "stay_parameters": "Stayed February 2006",
            "text": "We were shown to our room by the hotel staff and shown the location of hairdyers etc.",
            "title": "Tourist hotel with funky design",
            "user": "Zwenn"
        },
        {
            "date": "September 25, 2006",
            "detail_rating": {
                "business": null,
                "cleanliness": null,
                "desk": null,
                "location": null,
                "pool": null,
                "restaurant": null,
                "rooms": null,
                "service": null,
                "sleep": null,
                "value": null
            },
            "helpfulness": 12,
            "id": 5834851,
            "likes": {
                "disliked": null,
                "liked": null
            },
            "rating": 1.0,
            "stay_parameters": null,
            "text": "We flew to Berlin for one night as a romantic anniversary break.",
            "title": "more reservation problems",
            "user": "blacksheep1"
        },
        {
            "date": "September 4, 2006",
            "detail_rating": {
                "business": 3.0,
                "cleanliness": 5.0,
                "desk": null,
                "front_desk": 5.0,
                "location": 5.0,
                "pool": null,
                "restaurant": null,
                "rooms": 5.0,
                "service": 5.0,
                "sleep": null,
                "value": 5.0
            },
            "helpfulness": 5,
            "id": 5766401,
            "likes": {
                "disliked": null,
                "liked": "\u2014 The room!"
            },
            "rating": 5.0,
            "stay_parameters": "Stayed August 2006, traveled as a couple",
            "text": "The hotel was booked a month in advance and the confirmation email states an allocated check in time of 3pm.",
            "title": "Love Hotel Q!",
            "user": "JETraveler"
        },
        {
            "date": "August 18, 2006",
            "detail_rating": {
                "business": 3.0,
                "cleanliness": 4.0,
                "desk": null,
                "front_desk": 5.0,
                "location": 4.0,
                "pool": null,
                "restaurant": null,
                "rooms": 4.0,
                "service": 4.0,
                "sleep": null,
                "value": 5.0
            },
            "helpfulness": 1,
            "id": 5623484,
            "likes": {
                "disliked": "\u2014 No comfortable seats in rooms",
                "liked": "\u2014 Atmosphre, Staff, Location, Bar"
            },
            "rating": 4.0,
            "stay_parameters": "Stayed July 2006, traveled with family",
            "text": "On arrival at 3:30pm we were told that there had been a mistake in the booking and we would have to stay at a similar hotel in close proximity for the same price \u20ac180. This was upsetting and obviously had a negative impact on our stay.",
            "title": "Very cool Boutique Hotel",
            "user": "tomtom333"
        },
        {
            "date": "July 23, 2006",
            "detail_rating": {
                "business": null,
                "cleanliness": null,
                "desk": null,
                "location": null,
                "pool": null,
                "restaurant": null,
                "rooms": null,
                "service": 1.0,
                "sleep": null,
                "value": 1.0
            },
            "helpfulness": 2,
            "id": 5499053,
            "likes": {
                "disliked": null,
                "liked": null
            },
            "rating": 1.0,
            "stay_parameters": "Stayed June 2006",
            "text": "The 'similar' hotel was a chain hotel in the main tourist area 10 minutes away. There was no comparison in style or location.",
            "title": "Awful problems with reservation",
            "user": "Tomme"
        },
        {
            "date": "July 11, 2006",
            "detail_rating": {
                "business": null,
                "cleanliness": 5.0,
                "desk": null,
                "location": null,
                "pool": null,
                "restaurant": null,
                "rooms": 5.0,
                "service": 5.0,
                "sleep": null,
                "value": 5.0
            },
            "helpfulness": null,
            "id": 5456861,
            "likes": {
                "disliked": null,
                "liked": null
            },
            "rating": 5.0,
            "stay_parameters": "Stayed June 2006",
            "text": "There was no discount given for being moved and although the room was suggested as an upgrade to the room we had been allocated in hotel q I wonder why we had been allocated such a poor room in the first place ?",
            "title": "Modern wonder!",
            "user": "greendream"
        }
    ],
    "slim_ranking": 0.0614692653673,
    "stars": 4,
    "tripadvisor": {
        "VISITED": false,
        "country_name": null,
        "locality": null,
        "pic_link": null,
        "street_address": null
    },
    "user_rating": 4.5,
    "variance": {
        "average": 47,
        "excellent": 292,
        "poor": 13,
        "terrible": 15,
        "very good": 168
    }
}