{
    "aka": "Residence Inn Miami Aventura Mall Hotel",
    "description": null,
    "detail_rating": {
        "cleanliness": null,
        "location": null,
        "rooms": null,
        "service": null,
        "sleep": null,
        "value": null
    },
    "location": {
        "city": "Aventura",
        "continent": null,
        "country": "United States",
        "proposed_city": null,
        "province": null,
        "region": null
    },
    "name": "Residence Inn Miami Aventura Mall",
    "places": {
        "aka": [
            "Miami",
            "Aventura"
        ],
        "hotel_description": [],
        "hotel_name": [
            "Miami",
            "Aventura"
        ]
    },
    "review_count": 211,
    "review_count_current": 13,
    "reviews": [
        {
            "date": "March 10, 2005",
            "detail_rating": {
                "business": null,
                "cleanliness": 1.0,
                "desk": null,
                "location": null,
                "pool": null,
                "restaurant": null,
                "rooms": 4.0,
                "service": 1.0,
                "sleep": null,
                "value": 3.0
            },
            "helpfulness": 5,
            "id": 3263909,
            "likes": {
                "disliked": null,
                "liked": null
            },
            "rating": 2.0,
            "stay_parameters": "Stayed May 2005, traveled on business",
            "text": "Although the hotel and location was nice I was very disappointed in both the housekeeping and service. When I checked into my room there was a pair of used hosiery in one of the vanity drawers (yuck) and the closet was full of the previous guest's shopping bags. I apparently only warranted one washcloth per day and although they were more than happy to take the used bathroom towels they didn't want to leave clean ones to replace them. The housekeeper could only occassionally be bothered to empty the garbage in the kitchenette. The food on the complimentary breakfast was marginal at best. I'm not quite sure how someone ruins oatmeal, but they managed to do it. To top everything off they discharged my hotel keys more than once (I kept them in completely separate places so that if one demagnetized I'd still have one that worked so I know it was them and not me).",
            "title": "Poor housekeeping and service",
            "user": "Suzannechitown"
        },
        {
            "date": "September 12, 2004",
            "detail_rating": {
                "business": null,
                "cleanliness": null,
                "desk": null,
                "location": null,
                "pool": null,
                "restaurant": null,
                "rooms": null,
                "service": null,
                "sleep": null,
                "value": null
            },
            "helpfulness": 1,
            "id": 2525663,
            "likes": {
                "disliked": null,
                "liked": null
            },
            "rating": 5.0,
            "stay_parameters": null,
            "text": "We were very lucky to get a last minute (due to hurricane evacuation) reservation at this lovely property. They are pet friendly, VERY clean, accomodating and professional staff. The rooms were extremely spacious with full sized refrigerator, etc. Perfect location close to both mall and beach. Excellent complimentary breakfast. We intend on going back even if we do not have to evacuate for the next hurricane!! Highly recommend this property!",
            "title": "Perfect",
            "user": "andrea"
        },
        {
            "date": "January 15, 2004",
            "detail_rating": {
                "business": null,
                "cleanliness": null,
                "desk": null,
                "location": null,
                "pool": null,
                "restaurant": null,
                "rooms": null,
                "service": null,
                "sleep": null,
                "value": null
            },
            "helpfulness": 3,
            "id": 1552690,
            "likes": {
                "disliked": null,
                "liked": null
            },
            "rating": 5.0,
            "stay_parameters": null,
            "text": "We stayed in a 2-bedroom suite in November 2003 for 3 nights. The hotel seems to be pretty new and the location is right beside the Aventura Mall. Staff was very friendly, specially the Spanish speaking people.",
            "title": "Great place if you like some space...",
            "user": "bowmore"
        },
        {
            "date": "July 25, 2007",
            "detail_rating": {
                "business": null,
                "cleanliness": 4.0,
                "desk": null,
                "front_desk": 5.0,
                "location": 4.0,
                "pool": null,
                "restaurant": null,
                "rooms": 4.0,
                "service": 4.0,
                "sleep": null,
                "value": 4.0
            },
            "helpfulness": 9,
            "id": 8234582,
            "likes": {
                "disliked": "\u2014 A total of $5 to do a load of laundry is highway robbery!",
                "liked": "\u2014 Clean, nice staff, fairly quiet, shopping nearby"
            },
            "rating": 4.0,
            "stay_parameters": "Stayed July 2007, traveled on business",
            "text": "Spent a few nights at this Residence Inn-Aventura. The 9 story hotel has studio, one and two bedroom suites. As the one bedroom was the same price as a studio, that is what I selected.",
            "title": "Good location, nice staff, great choice",
            "user": "cruisermeg"
        },
        {
            "date": "July 25, 2007",
            "detail_rating": {
                "business": 5.0,
                "cleanliness": 5.0,
                "desk": null,
                "front_desk": 5.0,
                "location": 5.0,
                "pool": null,
                "restaurant": null,
                "rooms": 5.0,
                "service": 5.0,
                "sleep": null,
                "value": 5.0
            },
            "helpfulness": 4,
            "id": 8232175,
            "likes": {
                "disliked": "\u2014 Nothing",
                "liked": "\u2014 Location"
            },
            "rating": 5.0,
            "stay_parameters": "Stayed July 2007, traveled with family",
            "text": "My room on the 6th floor had a 2-burner cooktop, full-size fridge, microwave, dishwsaher, coffee maker, toaster and pots, pans and dishes. There is a desk & chair for working, plus a small dining table with 2 chairs.",
            "title": "Superior Hotel",
            "user": "Dallas1552"
        },
        {
            "date": "January 23, 2006",
            "detail_rating": {
                "business": null,
                "cleanliness": null,
                "desk": null,
                "location": null,
                "pool": null,
                "restaurant": null,
                "rooms": null,
                "service": null,
                "sleep": null,
                "value": null
            },
            "helpfulness": 8,
            "id": 4371566,
            "likes": {
                "disliked": null,
                "liked": null
            },
            "rating": 5.0,
            "stay_parameters": null,
            "text": "Seating was a love-seat sized couch (sofa bed) or an armchair. Also in the living area were an end table, a coffee table and a 25-27 inch TV with LOTS of cable channels. If they don't have the channel you want then you have too much free time!",
            "title": "Far About Average and Such a Quiet Locatiion. A Winner!",
            "user": "A TripAdvisor user"
        },
        {
            "date": "August 24, 2005",
            "detail_rating": {
                "business": null,
                "cleanliness": 4.0,
                "desk": null,
                "location": null,
                "pool": null,
                "restaurant": null,
                "rooms": 3.0,
                "service": 3.0,
                "sleep": null,
                "value": 4.0
            },
            "helpfulness": 2,
            "id": 3805206,
            "likes": {
                "disliked": null,
                "liked": null
            },
            "rating": 4.0,
            "stay_parameters": "Stayed August 2005",
            "text": "The bedroom had a queen sized bed, smaller TV, nice sized closet and sink and vanity. The toilet/tub were in a separate room. All in all-a nicely sized room. Very clean as well.",
            "title": "I'm baaack!!!",
            "user": "pllegends"
        },
        {
            "date": "April 7, 2005",
            "detail_rating": {
                "business": null,
                "cleanliness": null,
                "desk": null,
                "location": null,
                "pool": null,
                "restaurant": null,
                "rooms": null,
                "service": null,
                "sleep": null,
                "value": null
            },
            "helpfulness": 3,
            "id": 3342252,
            "likes": {
                "disliked": null,
                "liked": null
            },
            "rating": 1.0,
            "stay_parameters": null,
            "text": "The hotel has free internet in rooms or kiosks off the lobby with a fee of 20 cents per minute. Also, there are a couple laundry rooms but this is where I have a big problem. Laundry is $5.00 per load! (Meaning, 2 dollars each to wash and dry and 1 dollar for detergent!) That's outrageous! I bought a travel sized bottle of Tide at CVS for 2 bucks (and it will do a few loads-you can get it at Target for a buck but I didn't feel like getting on the town shuttle to target!). Did the wash, but hung the clothes up to dry. No laundromats in the phone book. Most of the housing is condos so they would all have laundry facilities.",
            "title": "Stay away",
            "user": "A TripAdvisor user"
        },
        {
            "date": "May 24, 2008",
            "detail_rating": {
                "business": 3.0,
                "cleanliness": 3.0,
                "desk": null,
                "front_desk": 4.0,
                "location": 5.0,
                "pool": null,
                "restaurant": null,
                "rooms": 4.0,
                "service": 4.0,
                "sleep": null,
                "value": null
            },
            "helpfulness": 2,
            "id": 16367762,
            "likes": {
                "disliked": "\u2014 Slow Internet access",
                "liked": "\u2014 Excellent location"
            },
            "rating": 4.0,
            "stay_parameters": "Stayed May 2008, traveled on business",
            "text": "There is nothing that I could find lacking about this hotel. I am Marriott Platinum Elite and have stayed at many, many Marriott properties. This hotel is great, and has all that I need for a business trip (with a litle fun on the side):",
            "title": "A Very Nice Hotel - More Than I Expected",
            "user": "Criticaltraveller"
        },
        {
            "date": "May 13, 2008",
            "detail_rating": {
                "business": null,
                "cleanliness": null,
                "desk": null,
                "front_desk": 4.0,
                "location": 4.0,
                "pool": null,
                "restaurant": null,
                "rooms": 2.0,
                "service": 3.0,
                "sleep": null,
                "value": 3.0
            },
            "helpfulness": 3,
            "id": 15991151,
            "likes": {
                "disliked": null,
                "liked": null
            },
            "rating": 2.0,
            "stay_parameters": "Stayed May 2008",
            "text": "- Excellent location: not far from major highways, gas stations, a major shopping mall, moderately priced restaurants and supermarkets",
            "title": "Good Location, But Needs TLC ...",
            "user": "090909"
        },
        {
            "date": "March 18, 2008",
            "detail_rating": {
                "business": 5.0,
                "cleanliness": 4.0,
                "desk": null,
                "front_desk": 5.0,
                "location": 3.0,
                "pool": null,
                "restaurant": null,
                "rooms": 4.0,
                "service": 5.0,
                "sleep": null,
                "value": 4.0
            },
            "helpfulness": 1,
            "id": 14374380,
            "likes": {
                "disliked": null,
                "liked": null
            },
            "rating": 4.0,
            "stay_parameters": "Stayed March 2008, traveled with family",
            "text": "- An exercise walking path is literally outside the door",
            "title": "Good Stay! Would recommend!",
            "user": "MaxandLola"
        },
        {
            "date": "December 12, 2007",
            "detail_rating": {
                "business": 5.0,
                "cleanliness": 5.0,
                "desk": null,
                "front_desk": 2.0,
                "location": 3.0,
                "pool": null,
                "restaurant": null,
                "rooms": 4.0,
                "service": 4.0,
                "sleep": null,
                "value": 4.0
            },
            "helpfulness": 4,
            "id": 11506907,
            "likes": {
                "disliked": "\u2014 The front desk staff are somewhat indifferent",
                "liked": "\u2014 The cleanliness"
            },
            "rating": 4.0,
            "stay_parameters": "Stayed December 2007, traveled with family",
            "text": "- Pool",
            "title": "Highly recommend it",
            "user": "ashah7"
        },
        {
            "date": "December 12, 2007",
            "detail_rating": {
                "business": 4.0,
                "cleanliness": 5.0,
                "desk": null,
                "front_desk": 5.0,
                "location": 4.0,
                "pool": null,
                "restaurant": null,
                "rooms": 5.0,
                "service": 5.0,
                "sleep": null,
                "value": 5.0
            },
            "helpfulness": 1,
            "id": 11503895,
            "likes": {
                "disliked": null,
                "liked": "\u2014 great little kitchen, lots of light....really cheerful...oh, and the two televisions"
            },
            "rating": 5.0,
            "stay_parameters": "Stayed November 2007, traveled on business",
            "text": "-Friendly and accomodating staff",
            "title": "The BEST Residence Inn Ever",
            "user": "AlohaKavika"
        }
    ],
    "slim_ranking": 0.428571428571,
    "stars": 3,
    "tripadvisor": {
        "VISITED": false,
        "country_name": null,
        "locality": null,
        "pic_link": null,
        "street_address": null
    },
    "user_rating": 4.0,
    "variance": {
        "average": 25,
        "excellent": 84,
        "poor": 8,
        "terrible": 8,
        "very good": 86
    }
}