{
  "id": "025",
  "title": "hotel for scuba diving in egypt",
  "description": "The hotel with relevant reviews should offer the opportunity of scuba diving and must be located in Egypt.",
  "narrative": "The hotel of a relevant review has to offer scuba diving and must be located in Egypt.",
  "relevances": [
    {
      "hotelId": 644030875,
      "reviewId": 8102822,
      "isRelevant": 0
    },
    {
      "hotelId": 644030875,
      "reviewId": 7378623,
      "isRelevant": 0
    },
    {
      "hotelId": 644030875,
      "reviewId": 6027786,
      "isRelevant": 0
    },
    {
      "hotelId": 644030875,
      "reviewId": 11718696,
      "isRelevant": 0
    },
    {
      "hotelId": 644030875,
      "reviewId": 8080818,
      "isRelevant": 0
    },
    {
      "hotelId": 644030875,
      "reviewId": 5286921,
      "isRelevant": 0
    },
    {
      "hotelId": 644030875,
      "reviewId": 8025831,
      "isRelevant": 0
    },
    {
      "hotelId": 644030875,
      "reviewId": 4306195,
      "isRelevant": 0
    },
    {
      "hotelId": 644030875,
      "reviewId": 11250717,
      "isRelevant": 0
    },
    {
      "hotelId": 213216415,
      "reviewId": 6504076,
      "isRelevant": 0
    },
    {
      "hotelId": 213216415,
      "reviewId": 11579780,
      "isRelevant": 0
    },
    {
      "hotelId": -319012897,
      "reviewId": 7724787,
      "isRelevant": 0
    },
    {
      "hotelId": -319012897,
      "reviewId": 7226440,
      "isRelevant": 0
    },
    {
      "hotelId": -319012897,
      "reviewId": 6812059,
      "isRelevant": 0
    },
    {
      "hotelId": -319012897,
      "reviewId": 7225179,
      "isRelevant": 0
    },
    {
      "hotelId": -319012897,
      "reviewId": 6764706,
      "isRelevant": 0
    },
    {
      "hotelId": -319012897,
      "reviewId": 7757592,
      "isRelevant": 0
    },
    {
      "hotelId": -319012897,
      "reviewId": 7871044,
      "isRelevant": 0
    },
    {
      "hotelId": -319012897,
      "reviewId": 7958998,
      "isRelevant": 0
    },
    {
      "hotelId": -1021331413,
      "reviewId": 121094088,
      "isRelevant": 0
    },
    {
      "hotelId": -1021331413,
      "reviewId": 118685626,
      "isRelevant": 0
    },
    {
      "hotelId": -1021331413,
      "reviewId": 116188484,
      "isRelevant": 0
    },
    {
      "hotelId": -1021331413,
      "reviewId": 116038044,
      "isRelevant": 0
    },
    {
      "hotelId": 277540178,
      "reviewId": 155926125,
      "isRelevant": 1
    },
    {
      "hotelId": 277540178,
      "reviewId": 167876116,
      "isRelevant": 1
    },
    {
      "hotelId": 277540178,
      "reviewId": 157658974,
      "isRelevant": 1
    },
    {
      "hotelId": 277540178,
      "reviewId": 52478647,
      "isRelevant": 1
    },
    {
      "hotelId": 277540178,
      "reviewId": 43022911,
      "isRelevant": 1
    },
    {
      "hotelId": 277540178,
      "reviewId": 159786983,
      "isRelevant": 1
    },
    {
      "hotelId": 277540178,
      "reviewId": 154851989,
      "isRelevant": 1
    },
    {
      "hotelId": 277540178,
      "reviewId": 48784365,
      "isRelevant": 1
    },
    {
      "hotelId": 277540178,
      "reviewId": 51461546,
      "isRelevant": 1
    },
    {
      "hotelId": 277540178,
      "reviewId": 145580135,
      "isRelevant": 1
    },
    {
      "hotelId": 1981557194,
      "reviewId": 105828801,
      "isRelevant": 1
    },
    {
      "hotelId": 1981557194,
      "reviewId": 115299628,
      "isRelevant": 1
    },
    {
      "hotelId": 1981557194,
      "reviewId": 52066390,
      "isRelevant": 1
    },
    {
      "hotelId": 1981557194,
      "reviewId": 80441133,
      "isRelevant": 1
    },
    {
      "hotelId": 1981557194,
      "reviewId": 52298609,
      "isRelevant": 1
    },
    {
      "hotelId": 1981557194,
      "reviewId": 104882482,
      "isRelevant": 1
    },
    {
      "hotelId": 1981557194,
      "reviewId": 30598072,
      "isRelevant": 1
    },
    {
      "hotelId": 1981557194,
      "reviewId": 32222035,
      "isRelevant": 1
    },
    {
      "hotelId": 1981557194,
      "reviewId": 116552773,
      "isRelevant": 1
    },
    {
      "hotelId": 1981557194,
      "reviewId": 104607462,
      "isRelevant": 1
    },
    {
      "hotelId": 1135385954,
      "reviewId": 15323859,
      "isRelevant": 0
    },
    {
      "hotelId": 1135385954,
      "reviewId": 48794820,
      "isRelevant": 0
    },
    {
      "hotelId": 1135385954,
      "reviewId": 49301329,
      "isRelevant": 0
    },
    {
      "hotelId": 1135385954,
      "reviewId": 16049930,
      "isRelevant": 0
    },
    {
      "hotelId": 1135385954,
      "reviewId": 17290742,
      "isRelevant": 0
    },
    {
      "hotelId": 1135385954,
      "reviewId": 17325735,
      "isRelevant": 0
    },
    {
      "hotelId": 1135385954,
      "reviewId": 14987308,
      "isRelevant": 0
    },
    {
      "hotelId": 1135385954,
      "reviewId": 49594720,
      "isRelevant": 0
    },
    {
      "hotelId": 1135385954,
      "reviewId": 48964477,
      "isRelevant": 0
    },
    {
      "hotelId": 1135385954,
      "reviewId": 17110893,
      "isRelevant": 0
    },
    {
      "hotelId": -2022185869,
      "reviewId": 6623324,
      "isRelevant": 0
    },
    {
      "hotelId": -2022185869,
      "reviewId": 5967621,
      "isRelevant": 0
    },
    {
      "hotelId": -2022185869,
      "reviewId": 6551695,
      "isRelevant": 0
    },
    {
      "hotelId": -2022185869,
      "reviewId": 6856951,
      "isRelevant": 0
    },
    {
      "hotelId": -2022185869,
      "reviewId": 6567008,
      "isRelevant": 0
    },
    {
      "hotelId": -2022185869,
      "reviewId": 6534398,
      "isRelevant": 0
    },
    {
      "hotelId": 730873145,
      "reviewId": 120132213,
      "isRelevant": 0
    },
    {
      "hotelId": 730873145,
      "reviewId": 103813568,
      "isRelevant": 0
    },
    {
      "hotelId": 730873145,
      "reviewId": 72732690,
      "isRelevant": 0
    },
    {
      "hotelId": 730873145,
      "reviewId": 123172293,
      "isRelevant": 0
    },
    {
      "hotelId": 730873145,
      "reviewId": 104520866,
      "isRelevant": 0
    },
    {
      "hotelId": 730873145,
      "reviewId": 103953242,
      "isRelevant": 0
    },
    {
      "hotelId": 730873145,
      "reviewId": 61272595,
      "isRelevant": 0
    },
    {
      "hotelId": 178150940,
      "reviewId": 125266712,
      "isRelevant": 0
    },
    {
      "hotelId": 178150940,
      "reviewId": 40411723,
      "isRelevant": 0
    },
    {
      "hotelId": 178150940,
      "reviewId": 125225378,
      "isRelevant": 0
    },
    {
      "hotelId": 178150940,
      "reviewId": 17079049,
      "isRelevant": 0
    },
    {
      "hotelId": 178150940,
      "reviewId": 51348921,
      "isRelevant": 0
    },
    {
      "hotelId": 178150940,
      "reviewId": 23304134,
      "isRelevant": 0
    },
    {
      "hotelId": 178150940,
      "reviewId": 23151919,
      "isRelevant": 0
    },
    {
      "hotelId": 178150940,
      "reviewId": 41787516,
      "isRelevant": 0
    },
    {
      "hotelId": 178150940,
      "reviewId": 23093637,
      "isRelevant": 0
    },
    {
      "hotelId": 178150940,
      "reviewId": 125090011,
      "isRelevant": 0
    }
  ]
}