{
    "aka": "Allegra Hotel Kloten",
    "description": "The Allegra hotel is situated in a central yet quiet location, close to the Zurich airport, next to the Kloten train station. It offers you a free airport shuttle and free internet in all rooms.You enjoy free access to Kloten's public swimming pool and you will find a complimentary bottle of water on your room upon arrival.You can park your car for free on site during your stay. At an additional cost you can also leave your car at the hotel's parking lot during your business trip or vacation.Only 5 minutes away from Zurich Airport and 15 minutes from the center of Z\u00fcrich, the Allegra hotel is a convenient place to stay.",
    "detail_rating": {
        "cleanliness": 4.5,
        "location": 4.5,
        "rooms": 4.5,
        "service": 4.0,
        "sleep": 4.0,
        "value": 4.0
    },
    "location": {
        "city": null,
        "continent": "Europe",
        "country": "Switzerland",
        "proposed_city": "Kloten",
        "province": null,
        "region": null
    },
    "name": "Hotel Allegra",
    "places": {
        "aka": [
            "Kloten"
        ],
        "hotel_description": [
            "Kloten"
        ],
        "hotel_name": []
    },
    "review_count": 354,
    "review_count_current": 20,
    "reviews": [
        {
            "date": "February 2, 2013",
            "detail_rating": {
                "business": null,
                "cleanliness": 5.0,
                "desk": null,
                "location": 5.0,
                "pool": null,
                "restaurant": null,
                "rooms": 4.0,
                "service": 4.0,
                "sleep": 5.0,
                "value": 4.0
            },
            "helpfulness": 1,
            "id": 151233746,
            "likes": {
                "disliked": null,
                "liked": null
            },
            "rating": 4.0,
            "stay_parameters": "Stayed January 2013, traveled on business",
            "text": "Hotel Allegra is a great airport hotel located about 10 mins from the Zurich Airport. The Kloten train station is literally right next to the hotel and you can take a 15 min train ride to Zurich HB, the center of the city. Kloten is a rather quiet part of the city, but if you take the underpass to the other side of the train station, you'll find a variety of restaurants and shops to pass the day. There is also a convenient supermarket right across the street from the hotel. Hotel staff were friendly, rooms were clean and full of amenities, and it was great value for 100 CHF (considering that most other hotels go for 150 CHF+).",
            "title": "Great value",
            "user": "ymseller"
        },
        {
            "date": "February 1, 2013",
            "detail_rating": {
                "business": null,
                "cleanliness": 4.0,
                "desk": null,
                "location": 4.0,
                "pool": null,
                "restaurant": null,
                "rooms": 4.0,
                "service": 3.0,
                "sleep": 4.0,
                "value": 3.0
            },
            "helpfulness": null,
            "id": 151154264,
            "likes": {
                "disliked": null,
                "liked": null
            },
            "rating": 4.0,
            "stay_parameters": "Stayed January 2013, traveled on business",
            "text": "The only downside is that housekeeping barged into my room 3 times in a day without knocking. This was a bit awkward as one of the times, I had just gotten out of the shower. For the sake of future guests, please knock and announce yourself before swinging the door open!",
            "title": "Just as described; great for airport connection",
            "user": "OmoJege"
        },
        {
            "date": "January 28, 2013",
            "detail_rating": {
                "business": null,
                "cleanliness": 4.0,
                "desk": null,
                "location": 3.0,
                "pool": null,
                "restaurant": null,
                "rooms": 3.0,
                "service": 3.0,
                "sleep": 4.0,
                "value": 3.0
            },
            "helpfulness": 1,
            "id": 150798316,
            "likes": {
                "disliked": null,
                "liked": null
            },
            "rating": 3.0,
            "stay_parameters": "Stayed January 2013, traveled with family",
            "text": "All in all, great value hotel and perfect layover option.",
            "title": "Good airport Hotel",
            "user": "LarKir"
        },
        {
            "date": "January 22, 2013",
            "detail_rating": {
                "business": null,
                "cleanliness": 4.0,
                "desk": null,
                "location": 4.0,
                "pool": null,
                "restaurant": null,
                "rooms": 4.0,
                "service": 3.0,
                "sleep": null,
                "value": 4.0
            },
            "helpfulness": null,
            "id": 150261583,
            "likes": {
                "disliked": null,
                "liked": null
            },
            "rating": 4.0,
            "stay_parameters": "Stayed February 2012",
            "text": "The hotel is very good if you have to get to the airport early and conveniently. Checked-in mid afternoon and had to wait until 6pm to order a meal via room service. There is a Spar (convenience store) across the road though so easy to pick up a snack. Rooms were clean and comfortable. Had a very early start so can't comment on the breakfast.",
            "title": "its a great location to reach airport",
            "user": "johnykjose"
        },
        {
            "date": "January 22, 2013",
            "detail_rating": {
                "business": null,
                "cleanliness": 5.0,
                "desk": null,
                "location": 3.0,
                "pool": null,
                "restaurant": null,
                "rooms": 4.0,
                "service": 5.0,
                "sleep": 5.0,
                "value": 4.0
            },
            "helpfulness": null,
            "id": 150241604,
            "likes": {
                "disliked": null,
                "liked": null
            },
            "rating": 4.0,
            "stay_parameters": "Stayed January 2013, traveled on business",
            "text": "Stayed one night after a recent ski trip due to early flight out of Zurich. All worked well. Efficient check in. Pleasant restaurant with good food and good choice of wines by the glass. Rooms very comfortable and a good size. Decor not to my taste but that's a personal view. They were clean and well maintained. Airport transfers efficient. So it does exactly what you want from an airport hotel.",
            "title": "Very nice Hotel near the Airport zurich",
            "user": "tekal"
        },
        {
            "date": "March 19, 2013",
            "detail_rating": {
                "business": null,
                "cleanliness": 5.0,
                "desk": null,
                "location": 3.0,
                "pool": null,
                "restaurant": null,
                "rooms": 5.0,
                "service": 3.0,
                "sleep": 5.0,
                "value": 4.0
            },
            "helpfulness": null,
            "id": 155036453,
            "likes": {
                "disliked": null,
                "liked": null
            },
            "rating": 5.0,
            "stay_parameters": "Stayed December 2012, traveled with friends",
            "text": "Nice hotel with friendly staff. The hotel is not in the city center, but the train right outside takes you there. And doesn't make noise outside the hotel. Typically a business hotel for the closeness to the airport, but still a warm and friendly hotel for non-business travelers. I didn't have the breakfast since it was not included in the room price (that annoys me). But, there is a Spar just across the street, so I bought my breakfast there.",
            "title": "Spacious and nice room - train as neighbour",
            "user": "lassh"
        },
        {
            "date": "March 19, 2013",
            "detail_rating": {
                "business": null,
                "cleanliness": 3.0,
                "desk": null,
                "location": 4.0,
                "pool": null,
                "restaurant": null,
                "rooms": 3.0,
                "service": 2.0,
                "sleep": 3.0,
                "value": 3.0
            },
            "helpfulness": null,
            "id": 155031928,
            "likes": {
                "disliked": null,
                "liked": null
            },
            "rating": 2.0,
            "stay_parameters": "Stayed March 2013, traveled on business",
            "text": "If you need internet service I suggest you go elsewhere. I travel about 100 days a year, and, as many of us, need a good internet service, which this place does definitely not offer. The breakfast has 2 options, check them out and make your choice. Neither one is particularly exiting.",
            "title": "Very poor internet service",
            "user": "bonvin5"
        },
        {
            "date": "March 9, 2013",
            "detail_rating": {
                "business": null,
                "cleanliness": 2.0,
                "desk": null,
                "location": 4.0,
                "pool": null,
                "restaurant": null,
                "rooms": 2.0,
                "service": 3.0,
                "sleep": null,
                "value": 2.0
            },
            "helpfulness": 1,
            "id": 154116469,
            "likes": {
                "disliked": null,
                "liked": null
            },
            "rating": 2.0,
            "stay_parameters": "Stayed March 2013",
            "text": "Kind of a grimy room. Hairs on the bed that def didn't belong to my husband or myself. Carpet had stains all over it which made me desperately wish I had slippers or something walk in. No fridge. Did have a hot water kettle though. It's only redeeming quality- it is a less than 10 minute shuttle to the airport. Husband and I stayed for 2 nights knowing our flight was leaving at 9 am so we needed to be as close as possible. It accomplished that but not much else. Other positives- a supermarket across the street to grab fruits/bread for breakfast. Overall, I wouldn't call it awful but I would also say know what you're getting for this price/location.",
            "title": "Near to airport, not much else",
            "user": "JaTravella"
        },
        {
            "date": "March 3, 2013",
            "detail_rating": {
                "business": null,
                "cleanliness": 4.0,
                "desk": null,
                "location": 4.0,
                "pool": null,
                "restaurant": null,
                "rooms": 4.0,
                "service": 4.0,
                "sleep": 4.0,
                "value": 4.0
            },
            "helpfulness": null,
            "id": 153584580,
            "likes": {
                "disliked": null,
                "liked": null
            },
            "rating": 4.0,
            "stay_parameters": "Stayed February 2013, traveled with family",
            "text": "This is a bit further from downtown Zurich, but close to train station. The hotel is nice: clearn room, well maintained facility, mordern style room & building. We're from Korea and arrived hotel late at night. But the front desk was kind and provided us well service. With small walking, there was good cafe, and small shopping center. Nice place to stay.",
            "title": "Good place to stay at Zurich",
            "user": "Jinwoo K"
        },
        {
            "date": "February 26, 2013",
            "detail_rating": {
                "business": null,
                "cleanliness": 5.0,
                "desk": null,
                "location": 3.0,
                "pool": null,
                "restaurant": null,
                "rooms": 5.0,
                "service": 5.0,
                "sleep": 5.0,
                "value": 5.0
            },
            "helpfulness": null,
            "id": 153250672,
            "likes": {
                "disliked": null,
                "liked": null
            },
            "rating": 5.0,
            "stay_parameters": "Stayed May 2012, traveled with family",
            "text": "It was my first visit to this hotel and I was traveling with my family, plus me it was 5 of us. We got our reservations done prior and whilst doing that, they were very helpful and for the first time in my traveling history have I received a room with five single beds. Even after that, there was still enough space for us to move around. The surrounding is very quiet and there is a grocery store closeby (walking distance) which was great because when you don't want to eat the hotel's food, you have other options available. The Kloten train station is literally right next to the hotel and I could see it from my room. It was a total value for money! Don't doubt it, just go for it!",
            "title": "Overall It Was AWESOME!",
            "user": "ree_23"
        },
        {
            "date": "February 24, 2013",
            "detail_rating": {
                "business": null,
                "cleanliness": 4.0,
                "desk": null,
                "location": 3.0,
                "pool": null,
                "restaurant": null,
                "rooms": 4.0,
                "service": 4.0,
                "sleep": 4.0,
                "value": 5.0
            },
            "helpfulness": null,
            "id": 152954232,
            "likes": {
                "disliked": null,
                "liked": null
            },
            "rating": 4.0,
            "stay_parameters": "Stayed October 2012, traveled with family",
            "text": "We chose the Hotel due to its proximity to the Zurich airport.",
            "title": "Typical Swiss efficiency",
            "user": "najmudin s"
        },
        {
            "date": "February 18, 2013",
            "detail_rating": {
                "business": null,
                "cleanliness": 5.0,
                "desk": null,
                "location": 5.0,
                "pool": null,
                "restaurant": null,
                "rooms": 4.0,
                "service": 5.0,
                "sleep": 5.0,
                "value": 5.0
            },
            "helpfulness": 2,
            "id": 152477248,
            "likes": {
                "disliked": null,
                "liked": null
            },
            "rating": 5.0,
            "stay_parameters": "Stayed February 2013, traveled with friends",
            "text": "Quite efficient and to the point. The staffs handled our checkin and check out professionally.",
            "title": "Great Service",
            "user": "BennyBumpkins"
        },
        {
            "date": "February 16, 2013",
            "detail_rating": {
                "business": null,
                "cleanliness": 3.0,
                "desk": null,
                "location": 4.0,
                "pool": null,
                "restaurant": null,
                "rooms": 4.0,
                "service": 1.0,
                "sleep": 3.0,
                "value": 3.0
            },
            "helpfulness": null,
            "id": 152285764,
            "likes": {
                "disliked": null,
                "liked": null
            },
            "rating": 3.0,
            "stay_parameters": "Stayed February 2013, traveled on business",
            "text": "Ample parking spaces for our car.",
            "title": "Well-situated hotel near airport: bad managment policies though...",
            "user": "luciegirl_2000"
        },
        {
            "date": "February 12, 2013",
            "detail_rating": {
                "business": null,
                "cleanliness": 5.0,
                "desk": null,
                "location": 5.0,
                "pool": null,
                "restaurant": null,
                "rooms": 5.0,
                "service": 4.0,
                "sleep": 5.0,
                "value": 5.0
            },
            "helpfulness": null,
            "id": 151939723,
            "likes": {
                "disliked": null,
                "liked": null
            },
            "rating": 4.0,
            "stay_parameters": "Stayed February 2013, traveled on business",
            "text": "The station was very close to the hotel.",
            "title": "Great business traveler hotel",
            "user": "Russ C"
        },
        {
            "date": "February 6, 2013",
            "detail_rating": {
                "business": null,
                "cleanliness": 5.0,
                "desk": null,
                "location": 4.0,
                "pool": null,
                "restaurant": null,
                "rooms": 4.0,
                "service": 3.0,
                "sleep": 4.0,
                "value": 4.0
            },
            "helpfulness": null,
            "id": 151515480,
            "likes": {
                "disliked": null,
                "liked": null
            },
            "rating": 4.0,
            "stay_parameters": "Stayed October 2012, traveled on business",
            "text": "The room was neat and huge, with four comfortable beds and nice bathroom.",
            "title": "Great value for an overnight stay",
            "user": "nzphotog"
        },
        {
            "date": "January 19, 2013",
            "detail_rating": {
                "business": null,
                "cleanliness": 4.0,
                "desk": null,
                "location": 4.0,
                "pool": null,
                "restaurant": null,
                "rooms": 3.0,
                "service": 3.0,
                "sleep": 4.0,
                "value": 3.0
            },
            "helpfulness": null,
            "id": 150020587,
            "likes": {
                "disliked": null,
                "liked": null
            },
            "rating": 3.0,
            "stay_parameters": "Stayed December 2012, traveled solo",
            "text": "The hotel is near the airport of Z\u00fcrich and offers a punctual shuttle service free of charge. The rooms are clean and colorful, and this gives a good mood. It is also close to the railway station that allows you to quickly go to Zurich.",
            "title": "Non male",
            "user": "SLD_70"
        },
        {
            "date": "January 15, 2013",
            "detail_rating": {
                "business": null,
                "cleanliness": 5.0,
                "desk": null,
                "location": 4.0,
                "pool": null,
                "restaurant": null,
                "rooms": 4.0,
                "service": 4.0,
                "sleep": 2.0,
                "value": 3.0
            },
            "helpfulness": null,
            "id": 149735325,
            "likes": {
                "disliked": null,
                "liked": null
            },
            "rating": 4.0,
            "stay_parameters": "Stayed January 2013, traveled with family",
            "text": "The restaurant is within the average.",
            "title": "Good Airport Hotel",
            "user": "Johneva1982"
        },
        {
            "date": "January 15, 2013",
            "detail_rating": {
                "business": null,
                "cleanliness": 4.0,
                "desk": null,
                "location": 5.0,
                "pool": null,
                "restaurant": null,
                "rooms": 4.0,
                "service": 5.0,
                "sleep": 4.0,
                "value": 4.0
            },
            "helpfulness": null,
            "id": 149704070,
            "likes": {
                "disliked": null,
                "liked": null
            },
            "rating": 4.0,
            "stay_parameters": "Stayed March 2012, traveled with friends",
            "text": "The Hotel is very Modern, and minimalist design",
            "title": "Comfortable and very convenient",
            "user": "AidahT"
        },
        {
            "date": "January 9, 2013",
            "detail_rating": {
                "business": null,
                "cleanliness": null,
                "desk": null,
                "location": null,
                "pool": null,
                "restaurant": null,
                "rooms": null,
                "service": null,
                "sleep": null,
                "value": null
            },
            "helpfulness": null,
            "id": 149238501,
            "likes": {
                "disliked": null,
                "liked": null
            },
            "rating": 5.0,
            "stay_parameters": null,
            "text": "The standard is fine, there is only a shower. There is a cattle for boiling water and the Triple room I had ( 250 ) was very spacious",
            "title": "Handy Airport hotel",
            "user": "yamtakrai"
        },
        {
            "date": "January 2, 2013",
            "detail_rating": {
                "business": null,
                "cleanliness": 5.0,
                "desk": null,
                "location": 5.0,
                "pool": null,
                "restaurant": null,
                "rooms": 4.0,
                "service": 4.0,
                "sleep": 3.0,
                "value": 3.0
            },
            "helpfulness": null,
            "id": 148651259,
            "likes": {
                "disliked": null,
                "liked": null
            },
            "rating": 4.0,
            "stay_parameters": "Stayed November 2012, traveled as a couple",
            "text": "The airport is next to a railway but the noise of the few trains was not a problem, there was no trains in the night anyway.",
            "title": "Superb Location \u2013 Acceptable Accommodations",
            "user": "Caesar1pup"
        }
    ],
    "slim_ranking": 0.333333333333,
    "stars": 4,
    "tripadvisor": {
        "VISITED": false,
        "country_name": null,
        "locality": null,
        "pic_link": null,
        "street_address": null
    },
    "user_rating": 4.0,
    "variance": {
        "average": 35,
        "excellent": 125,
        "poor": 9,
        "terrible": 5,
        "very good": 180
    }
}