{
    "aka": "Mantra Broadbeach On The Park Hotel",
    "description": "Overlooking Victoria Park and directly opposite Conrad Jupiters Casino, Mantra Broadbeach on the Park is centrally located in the heart of Broadbeach, with restaurants, cafes, shopping and the beach right at its doorstep. With the Gold Coast Convention Centre just minutes away, Mantra Broadbeach on the Park offers a wide range of facilities well suited to a business stay or family holiday. Mantra Broadbeach on the Park provides a range of accommodation with a variety of self contained one, two and three bedroom air conditioned apartments, offering views of the park, Broadbeach city or the surrounding Gold Coast Hinterland. If you're looking for more 3 bedroom apartments or 2 bedroom Gold Coast holiday apartments, Mantra has an abundance of options available. Whatever activity draws you, Broadbeach and the Gold Coast has it all, and Mantra Broadbeach on the Park is the perfect base to explore them from. Location Features \u25a0200m to the Broadbeach beach \u25a0200m to Kurrawa Surf Life Saving Club \u25a018km to Coolangatta Airport \u25a0Right in the heart of Broadbeach\u2019s cafe and restaurant precinct \u25a0200m from Gold Coast Convention and Exhibition Centre \u25a0200m from Jupiters Casino \u25a050m to the Oasis Shopping Centre \u25a0Short walk to Pacific Fair Shopping Centre.",
    "detail_rating": {
        "cleanliness": null,
        "location": null,
        "rooms": null,
        "service": null,
        "sleep": null,
        "value": null
    },
    "location": {
        "city": null,
        "continent": "South Pacific",
        "country": "Australia",
        "proposed_city": "Victoria",
        "province": null,
        "region": null
    },
    "name": "Mantra Broadbeach on the Park",
    "places": {
        "aka": [],
        "hotel_description": [
            "Victoria"
        ],
        "hotel_name": []
    },
    "review_count": 131,
    "review_count_current": 12,
    "reviews": [
        {
            "date": "September 19, 2005",
            "detail_rating": {
                "business": null,
                "cleanliness": 5.0,
                "desk": null,
                "location": null,
                "pool": null,
                "restaurant": null,
                "rooms": 5.0,
                "service": 4.0,
                "sleep": null,
                "value": 3.0
            },
            "helpfulness": 8,
            "id": 3924457,
            "likes": {
                "disliked": null,
                "liked": null
            },
            "rating": 5.0,
            "stay_parameters": "Stayed February 2005",
            "text": "My husband, 2 year old son and I went to Broadbeach for a holiday with my husbands parents. We initially stayed at a small apartment block and due to the constant noise (multistorey building being built 2 metres away from our balcony) and having a son that still needs naps we chose to move on.",
            "title": "Good location, very modern spacious apartments",
            "user": "bittenbythetravelbug"
        },
        {
            "date": "November 24, 2004",
            "detail_rating": {
                "business": null,
                "cleanliness": null,
                "desk": null,
                "location": null,
                "pool": null,
                "restaurant": null,
                "rooms": null,
                "service": null,
                "sleep": null,
                "value": null
            },
            "helpfulness": 17,
            "id": 2844409,
            "likes": {
                "disliked": null,
                "liked": null
            },
            "rating": 5.0,
            "stay_parameters": null,
            "text": "We decided to check out the rates and availability for Broadbeach on the Park. Having already seeing the price on the internet I thought it was a little overpriced for us. Fortunately for us we were given a standby rate and were even fortunate enough to get a 1 bedroom apartment and 2 bedroom apartment with only a hall wall in between. The apartments are quite roomy, the 2 bedroom apartment would be liveable as it had a bedroom and seperate bathroom at one end a large kitchen and living area in the middle and a decent size main bedroom with a bathroom with a spa at the other end. the decor is very modern (it is a new apartment). Because we got the rooms on the day we ended up with the ground floor apartments, this has a plus side as well as the downside. The negative is that we were on the same level as the main rubbish shute, ok in the apartments, but an unpleasant smell in the hallways. We were also next to the gym and sauna - which could be annoying for some, but was easy access for us. we didn't have a balcony but we had a large patio area that was three times the size of the balconies, there was also a direct gate to the pool. For a family with a child this was brilliant.",
            "title": "loved broadbeach",
            "user": "A TripAdvisor user"
        },
        {
            "date": "March 6, 2007",
            "detail_rating": {
                "business": 3.0,
                "cleanliness": 4.0,
                "desk": null,
                "front_desk": 2.0,
                "location": 4.0,
                "pool": null,
                "restaurant": null,
                "rooms": 4.0,
                "service": 2.0,
                "sleep": null,
                "value": 4.0
            },
            "helpfulness": 1,
            "id": 6925138,
            "likes": {
                "disliked": "\u2014 Uncomfortable bed and couch, and limited recption hours",
                "liked": "\u2014 The central location"
            },
            "rating": 4.0,
            "stay_parameters": "Stayed February 2007, traveled with family",
            "text": "We (2 adults and 2 children aged 2 and 8 mths) stayed in a 2 bedroom apartment for 6 nights and found the overall stay to be great. The location was excellent, 5 minute walk to Pacific Fair shopping, directly across the road from the casino and convention centre, access either via a short monrail journey or about a 10 minute walk (as there is a waterway between the road and casino so you have to walk around - but it is no drama). Supermarket and Bakers Delight in a mall across the road, and plenty of restaurant slection a short stroll away (2 mins).",
            "title": "Great Modern Apartments",
            "user": "Moogles"
        },
        {
            "date": "December 3, 2006",
            "detail_rating": {
                "business": null,
                "cleanliness": 5.0,
                "desk": null,
                "front_desk": 3.0,
                "location": 4.0,
                "pool": null,
                "restaurant": null,
                "rooms": 5.0,
                "service": 4.0,
                "sleep": null,
                "value": 5.0
            },
            "helpfulness": 4,
            "id": 6320433,
            "likes": {
                "disliked": "\u2014 nothing really",
                "liked": "\u2014 The room and pool."
            },
            "rating": 4.0,
            "stay_parameters": "Stayed September 2006, traveled with family",
            "text": "We stayed on the 7th floor and overlooked the park. Admitedly there was a bit of traffic noise, but this was mainly on Fri/Sat night, had all but died down by midnight. Could not hear any construction noise at all, as I had been a bit worried about it from other peoples comments. The park comes alive everynight just after dark with birds flocking to the trees, and is the most amazing sight and sound - it is really quite loud but this lasts less than a couple of hours.",
            "title": "Great for families.",
            "user": "darcoops"
        },
        {
            "date": "October 16, 2006",
            "detail_rating": {
                "business": 3.0,
                "cleanliness": 4.0,
                "desk": null,
                "front_desk": 3.0,
                "location": 3.0,
                "pool": null,
                "restaurant": null,
                "rooms": 3.0,
                "service": 3.0,
                "sleep": null,
                "value": 3.0
            },
            "helpfulness": 10,
            "id": 5962537,
            "likes": {
                "disliked": "\u2014 Apartment on corner of building with tiny balcony and closed in feeling",
                "liked": "\u2014 Clean"
            },
            "rating": 3.0,
            "stay_parameters": "Stayed October 2006, traveled on business",
            "text": "The room facilities were acceptable, although we found the couch and beds to be a bit uncomfortable and if you wanted to cook your main meals in the room there is limited (but sufficient) utentils. We tried to use our dishwasher, but it did not seem to be working, and the manual was not in the draw with all the others. The toaster was a 2 slice and was very small. The microwave, washer and dryer were all great, but did not have cause to use the oven, so cannot comment, although this was very clean (which I am guessing is because it has barely been used). There is a clothes rack to hang clothes on but is quite small so either you need to do washing everyday or use the dryer. The bathrooms were clean and having a seperate shower was a nice change from many other accommodation places.",
            "title": "Disappointing",
            "user": "JC&DP"
        },
        {
            "date": "August 13, 2006",
            "detail_rating": {
                "business": 5.0,
                "cleanliness": 5.0,
                "desk": null,
                "front_desk": 5.0,
                "location": 5.0,
                "pool": null,
                "restaurant": null,
                "rooms": 5.0,
                "service": 5.0,
                "sleep": null,
                "value": 5.0
            },
            "helpfulness": 7,
            "id": 5604811,
            "likes": {
                "disliked": "\u2014 Pool was clean and nice to look at, but if you're after a huge pool then you'll be disappointed",
                "liked": "\u2014 Location, atmosphere and the quality of the rooms and property"
            },
            "rating": 5.0,
            "stay_parameters": "Stayed July 2006, traveled with family",
            "text": "We made use of the apartment recommended babysitting service twice, a lovely young mum of two, and we were more than satisfied.",
            "title": "Highly reccommended -awesome property! Will stay again",
            "user": "mcfatkat"
        },
        {
            "date": "January 25, 2006",
            "detail_rating": {
                "business": null,
                "cleanliness": null,
                "desk": null,
                "location": null,
                "pool": null,
                "restaurant": null,
                "rooms": null,
                "service": null,
                "sleep": null,
                "value": null
            },
            "helpfulness": 5,
            "id": 4388477,
            "likes": {
                "disliked": null,
                "liked": null
            },
            "rating": 4.0,
            "stay_parameters": null,
            "text": "A negative is that with being an apartment the reception hours are only 8.30pm - 6pm, so when we came to check in we had to follow a phone voice instruction to get our keys but this was fine - but when we wanted assitance booking babysitting and tours, they were reluctant to help and encouraged us to use our room phone ($1 per call), but after having no luck with this (still do not know why) they eventually phoned thru for us. Having the secure underground parking was great, and is very safely guarded having to use an electronic tag to enter and exit - same as accessing the lifts. We did not use the pool at all but could see it over our balcony (balcony was a good size), and it did look rahter small (adjoining lap pool), but with the beach so close this was not a problem for us. Surfers Paradise is about 5 mins drive away, a bit too far to walk, but public transport seemed to be frequent.. All in all would recomment the apartment, and would stay again if visiting. 4 star accommodation.",
            "title": "Great location",
            "user": "A TripAdvisor user"
        },
        {
            "date": "April 1, 2008",
            "detail_rating": {
                "business": 3.0,
                "cleanliness": 4.0,
                "desk": null,
                "front_desk": 3.0,
                "location": 4.0,
                "pool": null,
                "restaurant": null,
                "rooms": 2.0,
                "service": 2.0,
                "sleep": null,
                "value": 3.0
            },
            "helpfulness": 4,
            "id": 14700438,
            "likes": {
                "disliked": "\u2014 small rooms",
                "liked": "\u2014 security"
            },
            "rating": 3.0,
            "stay_parameters": "Stayed March 2008, traveled with family",
            "text": "We stayed for 4 nights the property is nice with good security in a good location for shopping with the biggest shopping centre nearby(pacific fairs- be warned everything closes @ 5.30) & the casino nearby (drive or shuttle train).The beach is not so close & the pool is very small for such a large complex. Be careful though we had what had been a one bedroom apartment with a portion of the lounge separted by wooden shutters to create a second bedroom making the lounge very small with a dining table between the sofa & TV! & unuseable when anybody is sleeping in the 2nd bedroom. Our friends also had a two bedroom that was originally a 2 bedroom & was 50% bigger for the same price(although I was told some of these units have had the dining areas also converted to bedrooms to make a 3 bedroom. The apartments with the 07 suffix i.e. 207, 307 if 2 bedroom are better not 05 suffix i.e. 205 , 305 etc which are really 2 bathroom 1 bedroom. 06 siffix are the real 3 bedrooms.",
            "title": "little disappointed",
            "user": "familymanHongKong"
        },
        {
            "date": "January 27, 2008",
            "detail_rating": {
                "business": 4.0,
                "cleanliness": 5.0,
                "desk": null,
                "front_desk": 5.0,
                "location": 5.0,
                "pool": null,
                "restaurant": null,
                "rooms": 5.0,
                "service": 5.0,
                "sleep": null,
                "value": 4.0
            },
            "helpfulness": 2,
            "id": 13027121,
            "likes": {
                "disliked": null,
                "liked": null
            },
            "rating": 5.0,
            "stay_parameters": "Stayed May 2007, traveled on business",
            "text": "Excellent position.",
            "title": "Couldn't ask for more",
            "user": "Manoja"
        },
        {
            "date": "December 14, 2007",
            "detail_rating": {
                "business": null,
                "cleanliness": 5.0,
                "desk": null,
                "front_desk": 5.0,
                "location": 5.0,
                "pool": null,
                "restaurant": null,
                "rooms": 5.0,
                "service": 5.0,
                "sleep": null,
                "value": 5.0
            },
            "helpfulness": 3,
            "id": 11560550,
            "likes": {
                "disliked": "\u2014 i liked everything",
                "liked": "\u2014 comfort and location"
            },
            "rating": 5.0,
            "stay_parameters": "Stayed December 2007, traveled with family",
            "text": "Beautiful view",
            "title": "a little piece of paradise mantra on the park",
            "user": "aotearoanewzealand"
        },
        {
            "date": "September 24, 2007",
            "detail_rating": {
                "business": 3.0,
                "cleanliness": 4.0,
                "desk": null,
                "front_desk": 3.0,
                "location": 4.0,
                "pool": null,
                "restaurant": null,
                "rooms": 4.0,
                "service": 3.0,
                "sleep": null,
                "value": 4.0
            },
            "helpfulness": 3,
            "id": 8874875,
            "likes": {
                "disliked": "\u2014 Nothing!",
                "liked": "\u2014 Location and cleaniness"
            },
            "rating": 5.0,
            "stay_parameters": "Stayed September 2007, traveled as a couple",
            "text": "Quality apartment.",
            "title": "Great Central Broadbeach Location",
            "user": "Constant_Travellers"
        },
        {
            "date": "March 28, 2007",
            "detail_rating": {
                "business": null,
                "cleanliness": 4.0,
                "desk": null,
                "front_desk": 5.0,
                "location": 5.0,
                "pool": null,
                "restaurant": null,
                "rooms": 5.0,
                "service": null,
                "sleep": null,
                "value": 5.0
            },
            "helpfulness": 2,
            "id": 7237377,
            "likes": {
                "disliked": "\u2014 Lounge Suite",
                "liked": "\u2014 Location apartment standard & views"
            },
            "rating": 5.0,
            "stay_parameters": "Stayed March 2007, traveled with family",
            "text": "Close to shops and beach",
            "title": "Beautiful apt fantastic views",
            "user": "Peggysue45"
        }
    ],
    "slim_ranking": 0.318181818182,
    "stars": 4.5,
    "tripadvisor": {
        "VISITED": false,
        "country_name": null,
        "locality": null,
        "pic_link": null,
        "street_address": null
    },
    "user_rating": 4.5,
    "variance": {
        "average": 10,
        "excellent": 68,
        "poor": 5,
        "terrible": 3,
        "very good": 45
    }
}