{
    "aka": "Holiday Inn Brussels - Schuman Hotel",
    "description": "Stay in the heart of the EU district at the intimate Holiday Inn Brussels-Schuman hotel. With just 59 rooms our modern hotel, 12km from Brussels Airport, offers you personalised service and a friendly home-from-home. The hotel's bright blue facade stands out among Brussels' gleaming European Commission buildings, and our marble Lobby is hung with vibrant Picasso prints. Metro services speed you around the city from Metro Schuman, 500 metres from Holiday Inn Brussels-Schuman.Invite up to 8 people to an informal catch-up in Holiday Inn Brussels-Schuman's naturally lit meeting room and feel free to use the PC in the Lobby. It's a short stroll to meetings in the numerous European Parliament institutions surrounding the hotel.It's just 8 minutes from nearby Metro Schuman to Brussels city centre and sights like historic Grand-Place square. Ask our helpful staff about Brussels' Villo bike rental scheme if you'd prefer to explore the city on 2 wheels. Jubelpark's Autoworld museum, housing an impressive collection of classic cars, is a short walk from the hotel.Hot American breakfasts and light meals are served in garden-facing Pablo's Restaurant at Holiday Inn Brussels-Schuman. Cool off with complimentary soft drinks after a leisurely workout in our MiniGym, and sample local fruit beers in open-plan Pablo's Bar. Wireless Internet in your Guest room keeps you connected.",
    "detail_rating": {
        "cleanliness": null,
        "location": null,
        "rooms": null,
        "service": null,
        "sleep": null,
        "value": null
    },
    "location": {
        "city": null,
        "continent": "Europe",
        "country": "Belgium",
        "proposed_city": "Brussels",
        "province": null,
        "region": null
    },
    "name": "Holiday Inn Brussels Schuman",
    "places": {
        "aka": [
            "Holiday",
            "Brussels"
        ],
        "hotel_description": [
            "Holiday",
            "Brussels",
            "Metro",
            "Bar"
        ],
        "hotel_name": [
            "Holiday",
            "Brussels"
        ]
    },
    "review_count": 215,
    "review_count_current": 20,
    "reviews": [
        {
            "date": "April 2, 2012",
            "detail_rating": {
                "business": null,
                "cleanliness": 5.0,
                "desk": null,
                "location": 5.0,
                "pool": null,
                "restaurant": null,
                "rooms": 5.0,
                "service": 5.0,
                "sleep": null,
                "value": 5.0
            },
            "helpfulness": null,
            "id": 127132379,
            "likes": {
                "disliked": null,
                "liked": null
            },
            "rating": 5.0,
            "stay_parameters": "Stayed March 2012",
            "text": "The bathroom was so new and clean. on the other side of big park near by there is a small shopping district i would recommend. breakfast was good selection.",
            "title": "One if the best holiday inns",
            "user": "Ergul"
        },
        {
            "date": "March 29, 2012",
            "detail_rating": {
                "business": null,
                "cleanliness": 4.0,
                "desk": null,
                "location": 3.0,
                "pool": null,
                "restaurant": null,
                "rooms": 4.0,
                "service": 5.0,
                "sleep": 4.0,
                "value": 5.0
            },
            "helpfulness": null,
            "id": 126896865,
            "likes": {
                "disliked": null,
                "liked": null
            },
            "rating": 4.0,
            "stay_parameters": "Stayed March 2012, traveled with friends",
            "text": "I had a wedding to attend in Brussels and I based myself at this hotel which is very convenient to Bus and Metro. I arrived late on a Friday night and the direct airport bus took me very close to the hotel. I had pre-booked and got a fantastic weekend rate. The room was spacious very clean and the bed was comfortable with a choice of hard or soft pillows. I had asked for a quiet room on my booking and was not disappointed. The staff were courteous and very helpful. Breakfast was worth the \u20ac22 extra per head as the buffet had a good choice and the food quality was good. All in all it was pleasant stay for two nights and I would stay there again on my next visit to Brussels.",
            "title": "Very comfortable and pleasant",
            "user": "RJCN8"
        },
        {
            "date": "March 27, 2012",
            "detail_rating": {
                "business": null,
                "cleanliness": 5.0,
                "desk": null,
                "location": 4.0,
                "pool": null,
                "restaurant": null,
                "rooms": 5.0,
                "service": 5.0,
                "sleep": 4.0,
                "value": 5.0
            },
            "helpfulness": null,
            "id": 126778215,
            "likes": {
                "disliked": null,
                "liked": null
            },
            "rating": 5.0,
            "stay_parameters": "Stayed March 2012, traveled as a couple",
            "text": "We booked this hotel for a long weekend in Brussels and weren't disappointed.",
            "title": "Great location, friendly service",
            "user": "zebedee77"
        },
        {
            "date": "March 13, 2012",
            "detail_rating": {
                "business": null,
                "cleanliness": 5.0,
                "desk": null,
                "location": 5.0,
                "pool": null,
                "restaurant": null,
                "rooms": 5.0,
                "service": 5.0,
                "sleep": 5.0,
                "value": 5.0
            },
            "helpfulness": null,
            "id": 126056260,
            "likes": {
                "disliked": null,
                "liked": null
            },
            "rating": 5.0,
            "stay_parameters": "Stayed March 2012, traveled with family",
            "text": "The hotel is within 2 minutes walk of Schuman metro station. The metro station itself is rather grim looking but once above ground, the area is fine. We had got a bargain price (Euros 135 for three nights room only for two people, as opposed to Euros 450 per night room only during the week, when the politicians and EC visitors arrive! For this price, I was expecting us to be put in a tiny, very basic room but it was a decent size, light, warm, spotlessly clean and had everything we could need in it.",
            "title": "Just what you need",
            "user": "Skrivans"
        },
        {
            "date": "February 15, 2012",
            "detail_rating": {
                "business": null,
                "cleanliness": 5.0,
                "desk": null,
                "location": 5.0,
                "pool": null,
                "restaurant": null,
                "rooms": 4.0,
                "service": 3.0,
                "sleep": 4.0,
                "value": 3.0
            },
            "helpfulness": 1,
            "id": 124610820,
            "likes": {
                "disliked": null,
                "liked": null
            },
            "rating": 3.0,
            "stay_parameters": "Stayed January 2012, traveled solo",
            "text": "Special mention has to go to the reception staff, who were very friendly and helpful, finding out some information we needed without even being asked to. All spoke Flemish, French and English, and I daresay other languages too. We were able to leave our suitcases on the final day for a few hours after check out to allow us to spend more time in the immediate area, exploring Jubilee and Leopold Parks. Nothing seemed any trouble to the staff.",
            "title": "Well located for airport access and EC business",
            "user": "SwissFella"
        },
        {
            "date": "January 13, 2012",
            "detail_rating": {
                "business": null,
                "cleanliness": 4.0,
                "desk": null,
                "location": 4.0,
                "pool": null,
                "restaurant": null,
                "rooms": 3.0,
                "service": 4.0,
                "sleep": null,
                "value": 4.0
            },
            "helpfulness": 1,
            "id": 123012501,
            "likes": {
                "disliked": null,
                "liked": null
            },
            "rating": 4.0,
            "stay_parameters": "Stayed January 2012",
            "text": "Stayed here for two nights on a business trip. Check in at midday no problem, room and hotel in good location just off the main road.",
            "title": "Decent accommodation within a sort walk of Parliament and the Commission",
            "user": "pds_oxfordshire"
        },
        {
            "date": "January 4, 2012",
            "detail_rating": {
                "business": null,
                "cleanliness": 3.0,
                "desk": null,
                "location": 2.0,
                "pool": null,
                "restaurant": null,
                "rooms": 4.0,
                "service": 3.0,
                "sleep": 4.0,
                "value": 4.0
            },
            "helpfulness": 1,
            "id": 122521555,
            "likes": {
                "disliked": null,
                "liked": null
            },
            "rating": 4.0,
            "stay_parameters": "Stayed December 2011, traveled as a couple",
            "text": "Room had satellite TV, tea and coffee, decent bed with labelled \"soft\" and \"firm\" pillows, plus all the usual stuff in the bathroom and a well stocked minibar.",
            "title": "Nice hotel and price",
            "user": "HendryD"
        },
        {
            "date": "December 18, 2011",
            "detail_rating": {
                "business": null,
                "cleanliness": 4.0,
                "desk": null,
                "location": 4.0,
                "pool": null,
                "restaurant": null,
                "rooms": 4.0,
                "service": 3.0,
                "sleep": 4.0,
                "value": 3.0
            },
            "helpfulness": null,
            "id": 121863818,
            "likes": {
                "disliked": null,
                "liked": null
            },
            "rating": 4.0,
            "stay_parameters": "Stayed December 2011, traveled on business",
            "text": "Breakfast good too, with both continental and English breakfast.",
            "title": "Good if you can get a decent price",
            "user": "Chasse13"
        },
        {
            "date": "December 11, 2011",
            "detail_rating": {
                "business": null,
                "cleanliness": 3.0,
                "desk": null,
                "location": 3.0,
                "pool": null,
                "restaurant": null,
                "rooms": 3.0,
                "service": 3.0,
                "sleep": 3.0,
                "value": 3.0
            },
            "helpfulness": null,
            "id": 121630752,
            "likes": {
                "disliked": null,
                "liked": null
            },
            "rating": 3.0,
            "stay_parameters": "Stayed December 2011, traveled as a couple",
            "text": "All in all a decent hotel.",
            "title": "Decent hotel situated at the EU offices area",
            "user": "sengkangboy"
        },
        {
            "date": "November 13, 2011",
            "detail_rating": {
                "business": null,
                "cleanliness": 4.0,
                "desk": null,
                "location": 4.0,
                "pool": null,
                "restaurant": null,
                "rooms": 4.0,
                "service": 4.0,
                "sleep": 4.0,
                "value": 4.0
            },
            "helpfulness": null,
            "id": 120544892,
            "likes": {
                "disliked": null,
                "liked": null
            },
            "rating": 3.0,
            "stay_parameters": "Stayed November 2011, traveled on business",
            "text": "This hotel located a little bit far from the city center but there is a near metro station to the hotel. The front office is so helpful and nice to us,, we ask for everything about brussels for the first timer come and she can tell us the most of the city. My disappointment is when we got into the room,, our room not yet been clean so she give us another room. Other than that the hotel is quite good and the room is spacious for couple. Just dont ever try the pay tv,, its a rip off..",
            "title": "Good hotel, but PLEASE do not log in on wifi with your credit card, 3rd party wifi provider will steal your number!!",
            "user": "Mario V"
        },
        {
            "date": "May 15, 2012",
            "detail_rating": {
                "business": null,
                "cleanliness": 4.0,
                "desk": null,
                "location": 5.0,
                "pool": null,
                "restaurant": null,
                "rooms": 4.0,
                "service": 5.0,
                "sleep": 3.0,
                "value": 5.0
            },
            "helpfulness": 1,
            "id": 130005176,
            "likes": {
                "disliked": null,
                "liked": null
            },
            "rating": 4.0,
            "stay_parameters": "Stayed May 2012, traveled on business",
            "text": "I had to go to Brussels for a business event on short notice. All the hotels in the surrounding area, including Holiday Inn appeared to be fully booked in booking web sites. Nevertheless, I got a promotional newsletter for Exclusive Prepaid Rates in UK... but the same site was giving the option to book in Brussels in an unsurpassed rate ( 113 EUR/night ). This was one of the times that being a member of a loyalty scheme and get all these bulk promotional emails, did pay-off. Hotel was clean and reception was very efficient. I got (as per my priority club profile for preferences) a high-floor non-smoking room at the last floor (8th). They explained to me that although my Gold status has expired they would give a club room, but they were fully booked. Still I enjoyed a welcome free drink and internet access voucher. These small details make the difference in branded hotel chains. Especially next morning when I realised that I forgot my razor, the smilley receptionist literally run to their storage cabinets to give me a new one. Imagine the hassle in such a situation if I had booked in small a family-run hotel ... Queen size double bed, TFT TV, soft & firm pillows to choose. Shower only and not the usual full size bathtub. The only reason that I don't give a full 5* rating is due to the noisy fan in the bathroom. Not only it went on and on, even after lights were switched off, but it had a squicky noise. Additionally, the room next to mine was used as office facility by hotel personnel and doors were slammed early morning. Since the noisy bathroom fan affected \"sleep quality\" which to me is the factor of highest importance in a hotel stay, one star is deducted from top marks. Hotel is just 50 meters away from the Schuman metro station, therefore easy access to city center for dinner after a long tiresome day. All in all, hotel is highly recommended and I will stay there again if I have to be in Brussels for business or sight-seeing",
            "title": "Very good value for money and close to Schuman metro station",
            "user": "Enoikos"
        },
        {
            "date": "May 2, 2012",
            "detail_rating": {
                "business": null,
                "cleanliness": 5.0,
                "desk": null,
                "location": 4.0,
                "pool": null,
                "restaurant": null,
                "rooms": 4.0,
                "service": 4.0,
                "sleep": 5.0,
                "value": 3.0
            },
            "helpfulness": null,
            "id": 129214208,
            "likes": {
                "disliked": null,
                "liked": null
            },
            "rating": 4.0,
            "stay_parameters": "Stayed April 2012, traveled as a couple",
            "text": "four metro stop from the Central Station is the Holiday Inn Schuman. Very nice hotel, very nice area. Very near a huge park called \" Parc Cinquantinnaire\". You can find a lot of restaurants of all type of cuisine, mostly authentic Belgian cuisine. Two of them actually became my favorite. The L\"Esprit du Sel\" and \"Cafe du L\"Epice Brasserie. these two great restaurants were recommended by the night shift front desk gentleman named \"Lefhi\". very helpful and accommodating guy. Staff are friendly, rooms are quiet, clean with all the amenities. wifi is not free though, \u20ac9 for 24 hrs.",
            "title": "A nice, quiet hotel away from the touristic area!",
            "user": "Longchamp61"
        },
        {
            "date": "April 7, 2012",
            "detail_rating": {
                "business": null,
                "cleanliness": 4.0,
                "desk": null,
                "location": 5.0,
                "pool": null,
                "restaurant": null,
                "rooms": 4.0,
                "service": 4.0,
                "sleep": 5.0,
                "value": 4.0
            },
            "helpfulness": null,
            "id": 127404866,
            "likes": {
                "disliked": null,
                "liked": null
            },
            "rating": 4.0,
            "stay_parameters": "Stayed March 2012, traveled with friends",
            "text": "Location",
            "title": "Convenient location, value for money",
            "user": "Julie G"
        },
        {
            "date": "April 5, 2012",
            "detail_rating": {
                "business": null,
                "cleanliness": 5.0,
                "desk": null,
                "location": 4.0,
                "pool": null,
                "restaurant": null,
                "rooms": 4.0,
                "service": 5.0,
                "sleep": 5.0,
                "value": 4.0
            },
            "helpfulness": 1,
            "id": 127287482,
            "likes": {
                "disliked": null,
                "liked": null
            },
            "rating": 4.0,
            "stay_parameters": "Stayed March 2012, traveled with friends",
            "text": "An extremely nice location: proximity to Brussels Airport (bus stop with a ticket vending machine one block away, as well as metro station Schuman - takes less than 10 minutes to get to the city centre), many EU institutions around, several parks and museums (e.g. Autoworld), quiet at night.",
            "title": "Friendly service, nice location",
            "user": "G H"
        },
        {
            "date": "April 4, 2012",
            "detail_rating": {
                "business": null,
                "cleanliness": 5.0,
                "desk": null,
                "location": 5.0,
                "pool": null,
                "restaurant": null,
                "rooms": 5.0,
                "service": 3.0,
                "sleep": 5.0,
                "value": 4.0
            },
            "helpfulness": null,
            "id": 127260608,
            "likes": {
                "disliked": null,
                "liked": null
            },
            "rating": 4.0,
            "stay_parameters": "Stayed March 2012, traveled solo",
            "text": "Amenities",
            "title": "Pleasant one night stay after short break with old friends in Ardennes",
            "user": "oliverdavid"
        },
        {
            "date": "February 12, 2012",
            "detail_rating": {
                "business": null,
                "cleanliness": 5.0,
                "desk": null,
                "location": 4.0,
                "pool": null,
                "restaurant": null,
                "rooms": 5.0,
                "service": 4.0,
                "sleep": 5.0,
                "value": 5.0
            },
            "helpfulness": null,
            "id": 124487583,
            "likes": {
                "disliked": null,
                "liked": null
            },
            "rating": 4.0,
            "stay_parameters": "Stayed January 2012, traveled solo",
            "text": "This Holiday Inn is a convenient location sitting right in the heart of Euro Quarter in Brussels. A good direct bus that goes from the Brussels Airport to Schuman roundabout, which is about 5 mins walk to the hotel and with Jubelpark another 5 mins further down the road. Isn't a problem going to the Central/Grand Place, the metro station is just around the corner. However, it isn't that convenient, if Train is your mode of transport in/out of Brussels.",
            "title": "Fantastic location deep in the heart of Euro Quarter.",
            "user": "Ryurouden"
        },
        {
            "date": "February 8, 2012",
            "detail_rating": {
                "business": null,
                "cleanliness": 3.0,
                "desk": null,
                "location": 4.0,
                "pool": null,
                "restaurant": null,
                "rooms": 4.0,
                "service": 4.0,
                "sleep": 4.0,
                "value": 3.0
            },
            "helpfulness": null,
            "id": 124292146,
            "likes": {
                "disliked": null,
                "liked": null
            },
            "rating": 4.0,
            "stay_parameters": "Stayed January 2012, traveled on business",
            "text": "Really good value for money if you are just gonna be in Brussels for the weekend. Room and toilet is real clean, firm mattress and there selection (six) of pillows for you to choose. Only a couple of English tv channel though, but for EUR 50 a night I would not expect much. Staffs are generally helpful but the breakfast is abit of the pricey side. EUR 22 for a limited selection of cold and hot food isn't quite worth it.",
            "title": "Excellent home during the week",
            "user": "Luc J"
        },
        {
            "date": "February 5, 2012",
            "detail_rating": {
                "business": null,
                "cleanliness": 1.0,
                "desk": null,
                "location": 3.0,
                "pool": null,
                "restaurant": null,
                "rooms": 4.0,
                "service": 3.0,
                "sleep": 3.0,
                "value": 4.0
            },
            "helpfulness": null,
            "id": 124173409,
            "likes": {
                "disliked": null,
                "liked": null
            },
            "rating": 3.0,
            "stay_parameters": "Stayed November 2011, traveled solo",
            "text": "Would definitely stay again if I fly into Brussels.",
            "title": "reasonable budget hotel",
            "user": "Jens T"
        },
        {
            "date": "January 30, 2012",
            "detail_rating": {
                "business": null,
                "cleanliness": 5.0,
                "desk": null,
                "location": 5.0,
                "pool": null,
                "restaurant": null,
                "rooms": 5.0,
                "service": 5.0,
                "sleep": 5.0,
                "value": 5.0
            },
            "helpfulness": 1,
            "id": 123860875,
            "likes": {
                "disliked": null,
                "liked": null
            },
            "rating": 5.0,
            "stay_parameters": "Stayed January 2012, traveled as a couple",
            "text": "I stay in this hotel weekly for more than a year now, so this hotel is like a second home to me. The staff is very friendly and helpful. Breakfast is good with a wide variety of food and drinks. Internet is working fine and relatively fast. Unfortunately, the Wifi-key can only be used on one device, so you have to choose wisely on what device you want to create an internet connection (or buy multiple vouchers...).",
            "title": "BARGAIN IN BRUSSELS",
            "user": "benebyers"
        },
        {
            "date": "January 17, 2012",
            "detail_rating": {
                "business": null,
                "cleanliness": 5.0,
                "desk": null,
                "location": 5.0,
                "pool": null,
                "restaurant": null,
                "rooms": 4.0,
                "service": 4.0,
                "sleep": 4.0,
                "value": 5.0
            },
            "helpfulness": 1,
            "id": 123203667,
            "likes": {
                "disliked": null,
                "liked": null
            },
            "rating": 4.0,
            "stay_parameters": "Stayed January 2012, traveled on business",
            "text": "The room I stay in is a Business room with a very nice spacious bathroom with both a bath and a walk-in shower.",
            "title": "Regiostar 2012 jury presentation",
            "user": "parkskov"
        }
    ],
    "slim_ranking": 0.373056994819,
    "stars": 3,
    "tripadvisor": {
        "VISITED": false,
        "country_name": null,
        "locality": null,
        "pic_link": null,
        "street_address": null
    },
    "user_rating": 4.0,
    "variance": {
        "average": 40,
        "excellent": 45,
        "poor": 14,
        "terrible": 8,
        "very good": 108
    }
}