{
    "aka": "Marques De Vallejo Logro\u00f1o",
    "description": null,
    "detail_rating": {
        "cleanliness": 4.0,
        "location": 5.0,
        "rooms": 4.0,
        "service": 4.0,
        "sleep": 4.0,
        "value": 4.0
    },
    "location": {
        "city": "Logrono",
        "continent": "Europe",
        "country": "Spain",
        "proposed_city": "Vallejo",
        "province": null,
        "region": "La Rioja"
    },
    "name": "Hotel Marques de Vallejo",
    "places": {
        "aka": [
            "Vallejo",
            "Logro\u00f1o"
        ],
        "hotel_description": [],
        "hotel_name": [
            "Vallejo"
        ]
    },
    "review_count": 166,
    "review_count_current": 4,
    "reviews": [
        {
            "date": "April 10, 2009",
            "detail_rating": {
                "business": null,
                "cleanliness": 5.0,
                "desk": null,
                "location": 5.0,
                "pool": null,
                "restaurant": null,
                "rooms": 5.0,
                "service": 5.0,
                "sleep": null,
                "value": 5.0
            },
            "helpfulness": null,
            "id": 27743359,
            "likes": {
                "disliked": null,
                "liked": null
            },
            "rating": 5.0,
            "stay_parameters": "Stayed April 2009, traveled with friends",
            "text": "My friend and I stayed at this excellent hotel for one night in April 2009. I wish we'd stayed longer. For the 50 euros we paid, we got a modern, clean, room, the most comfortable bed I have ever slept in, the most relaxing bathtub I have ever bathed, free internet, and the most charming, gracious and accomodating staff I've seen in quite some time. The hotel is quite old but was recently refurbished, apparently with a trip to IKEA, and is now decorated in cream and brown with orange and red accents. There is a lounge and bar area and the rooms are located upstairs. The bathtub is amazing - there is even a place to rest your elbows while you are reading!!!",
            "title": "Unbeatable value, Fanatstic bed and bathtub, perfect location, incredible staff",
            "user": "PT1976"
        },
        {
            "date": "April 9, 2009",
            "detail_rating": {
                "business": null,
                "cleanliness": 5.0,
                "desk": null,
                "location": 5.0,
                "pool": null,
                "restaurant": null,
                "rooms": 3.0,
                "service": 3.0,
                "sleep": null,
                "value": 4.0
            },
            "helpfulness": null,
            "id": 27689274,
            "likes": {
                "disliked": null,
                "liked": null
            },
            "rating": 4.0,
            "stay_parameters": "Stayed April 2009, traveled solo",
            "text": "The hotel is located right by the Plaza Espolon, which is the town center, and by Calle Laurel, where all the tapas bars are located. It's a 7 euro cab ride or a 25 minute walk from the train station and a 20 minute walk from the bus station. For food, you can't go wrong with Calle Laurel/San Agustin area and for breakfast, check out the exquisite pastires at Cafe Viena in the Plaza Espolon.",
            "title": "Good value",
            "user": "ArtProperty"
        },
        {
            "date": "January 7, 2009",
            "detail_rating": {
                "business": 4.0,
                "cleanliness": 5.0,
                "desk": null,
                "front_desk": 4.0,
                "location": 5.0,
                "pool": null,
                "restaurant": null,
                "rooms": 5.0,
                "service": 4.0,
                "sleep": null,
                "value": 5.0
            },
            "helpfulness": 1,
            "id": 23355200,
            "likes": {
                "disliked": null,
                "liked": "\u2014 location, modern, price"
            },
            "rating": 4.0,
            "stay_parameters": "Stayed December 2008, traveled as a couple",
            "text": "All this would have easily qualified for 5 stars, but what really pushed this place over the top was the incredible staff - who were cheerful at all times of the day and night and went out of ther way to help you - directions, map, advice, etc. After I found out my train was full, they agreed to allow me to keep my bags there if I chose to return to the city after spending a night in another town - I didn't end up doing this, but the fact that they agreed to help me like that out was amazing. I'd return to Logrono again just to stay at this gem of a place.",
            "title": "Great modern hotel",
            "user": "ktmae55"
        },
        {
            "date": "March 30, 2008",
            "detail_rating": {
                "business": 4.0,
                "cleanliness": 4.0,
                "desk": null,
                "front_desk": 5.0,
                "location": 4.0,
                "pool": null,
                "restaurant": null,
                "rooms": 4.0,
                "service": 5.0,
                "sleep": null,
                "value": 5.0
            },
            "helpfulness": 2,
            "id": 14662063,
            "likes": {
                "disliked": null,
                "liked": "\u2014 location, quality of facilities, helpful staff"
            },
            "rating": 5.0,
            "stay_parameters": "Stayed October 2007, traveled solo",
            "text": "I had terribel pain in my feet from the trek I had just done on the Camino and needed a bath to soak my feet in. I followed hotel signs around the streets and when I walked in front of this place, I could tell this was where I wanted to be. Entrance is cool, designer, and inviting. No fuss check-in led to room which was very \"hotelish\" (glasses all marked stterilised and 6 TV channels on old TV) but fine: clean, functional, and everything worked. Bathtub was not big so if you like a good bathtub ask for one in case they have one and couples should make sure bed is set up as a double as my was two singles but as I was alone this was OK. Copious brekfast and you are very well located for restuarants, bars, etc. there is an English newstand some 400 metres away that carries economist and Herald Tribune and teh main square and market nearby.",
            "title": "Likely the best breakfast on the Camino",
            "user": "elmstrasse"
        }
    ],
    "slim_ranking": 0.235294117647,
    "stars": 3,
    "tripadvisor": {
        "VISITED": false,
        "country_name": null,
        "locality": null,
        "pic_link": null,
        "street_address": null
    },
    "user_rating": 4.0,
    "variance": {
        "average": 19,
        "excellent": 46,
        "poor": 5,
        "terrible": 4,
        "very good": 92
    }
}