{
    "aka": "Garden Island Hotel Lihue",
    "description": "The Garden Island Inn is a quaint, affordable boutique hotel by the lovely Kalapaki Beach and Bay, the Kauai Marriott and Lagoons and the Nawiliwili Harbor. Kalapaki Beach offers safe surfing, stand up paddle boarding, canoing, kayaking, sailing for beginners to intermediate, fishing or just plain relaxing and sunning.This is Kauai's center for shopping, live music and dining with a choice of 10 of Kauai's finest restaurants all within a short leisurely walking distance from the Garden Island Inn Hotel.The Garden Island Inn has quick and easy access from the Lihue Airport and to all the sights and activities Kauai has to offer. Let us be your home away from home while you discover Kauai!",
    "detail_rating": {
        "cleanliness": 4.5,
        "location": 4.5,
        "rooms": 4.5,
        "service": 5.0,
        "sleep": 4.0,
        "value": 5.0
    },
    "location": {
        "city": null,
        "continent": null,
        "country": "United States",
        "proposed_city": "Bay",
        "province": null,
        "region": null
    },
    "name": "Garden Island Inn",
    "places": {
        "aka": [],
        "hotel_description": [
            "Bay"
        ],
        "hotel_name": []
    },
    "review_count": 325,
    "review_count_current": 6,
    "reviews": [
        {
            "date": "February 27, 2005",
            "detail_rating": {
                "business": null,
                "cleanliness": 4.0,
                "desk": null,
                "location": null,
                "pool": null,
                "restaurant": null,
                "rooms": 4.0,
                "service": 4.0,
                "sleep": null,
                "value": 5.0
            },
            "helpfulness": 8,
            "id": 3233117,
            "likes": {
                "disliked": null,
                "liked": null
            },
            "rating": 3.0,
            "stay_parameters": "Stayed February 2005",
            "text": "We stayed 4 nights in a second floor room with a/c. The price was great, the location perfect and the extras provided by the hotel (beach mats/chairs, coolers, snorkelin gear, etc) terrific. We stayed in February, and I would say that you definitely want a/c for maximum comfort. We did not find the tile floors to be exceedingly warm as did a previous reviewer. The room was very large and had a queen bed and two twin beds (we put them together for a double bed). It also had a dining table and chairs, a spacious counter area with sink, coffee pot (and Kona coffee!), microwave and refrigerator. It was definitely large enough for the four of us and would be ideal for parents with two children. The room was slightly dated, but very clean.",
            "title": "Good price, nice extras",
            "user": "H2Opia"
        },
        {
            "date": "November 6, 2004",
            "detail_rating": {
                "business": null,
                "cleanliness": null,
                "desk": null,
                "location": null,
                "pool": null,
                "restaurant": null,
                "rooms": null,
                "service": null,
                "sleep": null,
                "value": null
            },
            "helpfulness": 14,
            "id": 2809631,
            "likes": {
                "disliked": null,
                "liked": null
            },
            "rating": 3.0,
            "stay_parameters": null,
            "text": "The location is great for exploring the island. Nearby, there is a shopping center and Kalapaki Beach. There is also a park on the ocean with swings and picnic tables with grills. We ended up cooking dinner in the park a couple of nights which saved a lot of money and tasted terrific!",
            "title": "Good and Bad - read on and you decide",
            "user": "Anneliesa"
        },
        {
            "date": "April 2, 2004",
            "detail_rating": {
                "business": null,
                "cleanliness": null,
                "desk": null,
                "location": null,
                "pool": null,
                "restaurant": null,
                "rooms": null,
                "service": null,
                "sleep": null,
                "value": null
            },
            "helpfulness": 7,
            "id": 1761006,
            "likes": {
                "disliked": null,
                "liked": null
            },
            "rating": 5.0,
            "stay_parameters": null,
            "text": "The gear provide by the hotel was fantastic--they even loaned us a flashlight!",
            "title": "Friendly, Family owned, Beautiful View",
            "user": "A TripAdvisor user"
        },
        {
            "date": "March 24, 2003",
            "detail_rating": {
                "business": null,
                "cleanliness": null,
                "desk": null,
                "location": null,
                "pool": null,
                "restaurant": null,
                "rooms": null,
                "service": null,
                "sleep": null,
                "value": null
            },
            "helpfulness": 4,
            "id": 923334,
            "likes": {
                "disliked": null,
                "liked": null
            },
            "rating": 4.0,
            "stay_parameters": null,
            "text": "The staff was friendly, the location perfect and the price affordable. What more can you ask!?!",
            "title": "Wonderful motel 2 minutes from beach",
            "user": "Joe_Scarf"
        },
        {
            "date": "February 27, 2003",
            "detail_rating": {
                "business": null,
                "cleanliness": null,
                "desk": null,
                "location": null,
                "pool": null,
                "restaurant": null,
                "rooms": null,
                "service": null,
                "sleep": null,
                "value": null
            },
            "helpfulness": 4,
            "id": 861848,
            "likes": {
                "disliked": null,
                "liked": null
            },
            "rating": 4.0,
            "stay_parameters": null,
            "text": "Based on the amenities, this place deserves an above average rating, but the room experience is such a detraction I thought it fair to give an average rating.",
            "title": "Garden Island Gem",
            "user": "A TripAdvisor user"
        },
        {
            "date": "December 12, 2002",
            "detail_rating": {
                "business": null,
                "cleanliness": null,
                "desk": null,
                "location": null,
                "pool": null,
                "restaurant": null,
                "rooms": null,
                "service": null,
                "sleep": null,
                "value": null
            },
            "helpfulness": 13,
            "id": 823211,
            "likes": {
                "disliked": null,
                "liked": null
            },
            "rating": 1.0,
            "stay_parameters": null,
            "text": "We stayed at the Garden Inn as a \"last minute\" when we were on Kauai for a wedding, in July, and wanted to extend our time on this beautiful island. The place we were at, Kuhio Shores (no A/C), did not have room when our stay was up (Don't stay there in the summer-you'll be sorry!). The first room at the Garden Inn, downstairs, was pretty awful. Old, worn-out, etc. Just plain BAD. We got an \"upgrade\" to an upstairs room that was larger, a little nicer looking, and had AC! (It was humid!) But, we found evidence of roaches. So, unless your desparate for AC and want a really low price, $75.00, stay there; otherwise, find something else.",
            "title": "Garden Inn sounds nice, but...",
            "user": "Smiths"
        }
    ],
    "slim_ranking": 0.111111111111,
    "stars": 2.5,
    "tripadvisor": {
        "VISITED": false,
        "country_name": null,
        "locality": null,
        "pic_link": null,
        "street_address": null
    },
    "user_rating": 4.5,
    "variance": {
        "average": 34,
        "excellent": 206,
        "poor": 4,
        "terrible": 5,
        "very good": 76
    }
}