{
    "aka": "Great Fosters Hotel",
    "description": "Probably built as a Royal Hunting lodge and very much a stately home since the 16th century, Great Fosters is now a prestigious hotel. Set amongst 50 acres of gardens and parkland, the hotel is a Grade One listed building blessed with the grandeur of 16th century England and luxurious modern facilities. Its past is evident in the mullioned windows, tall chimneys, fireplaces and brick finials, while the Saxon moat, crossed by a Japanese bridge, surrounds three sides of the formal garden. All the suites and bedrooms are individually decorated. The bedrooms in the Main House are adorned with tapestries and antiques, whilst the bedrooms in The Cloisters are more contemporary in style. The Coach House, refurbished in 2008, offers luxurious accommodation with the latest plasma screens, i-pod docking stations and fabulous bathrooms. The hotel offers a choice of two restaurants, The Estate Grill and The Tudor Room at Great Fosters. The Estate Grill is less formal and serves a simple and seasonal menu with many of the dishes cooked on a Josper grill. The Tudor Room at Great Fosters is an intimate, more sophisticated dining experience with just 24 covers set in a lavishly decorated dining room.",
    "detail_rating": {
        "cleanliness": null,
        "location": null,
        "rooms": null,
        "service": null,
        "sleep": null,
        "value": null
    },
    "location": {
        "city": null,
        "continent": "Europe",
        "country": "United Kingdom (UK)",
        "proposed_city": null,
        "province": null,
        "region": null
    },
    "name": "Great Fosters",
    "places": {
        "aka": [],
        "hotel_description": [],
        "hotel_name": []
    },
    "review_count": 399,
    "review_count_current": 20,
    "reviews": [
        {
            "date": "October 18, 2012",
            "detail_rating": {
                "business": null,
                "cleanliness": 5.0,
                "desk": null,
                "location": 5.0,
                "pool": null,
                "restaurant": null,
                "rooms": 5.0,
                "service": 5.0,
                "sleep": 5.0,
                "value": 5.0
            },
            "helpfulness": null,
            "id": 143120503,
            "likes": {
                "disliked": null,
                "liked": null
            },
            "rating": 5.0,
            "stay_parameters": "Stayed October 2012, traveled on business",
            "text": "I recently booked an event at The Great Fosters. The conference facilities were second to none, very modern and catered for all our needs, whereas the hotel bedrooms are like stepping back in time (in a good way). Very oldy worldy and each room special in its' own right. The food and the service was the best i remember in a hotel in a long time.....very attentive without being too overbearing. All in all a fantastic few days and would definitely recommend.",
            "title": "Fantastic in all areas",
            "user": "griff34"
        },
        {
            "date": "October 16, 2012",
            "detail_rating": {
                "business": null,
                "cleanliness": 5.0,
                "desk": null,
                "location": 5.0,
                "pool": null,
                "restaurant": null,
                "rooms": 5.0,
                "service": 5.0,
                "sleep": 5.0,
                "value": 5.0
            },
            "helpfulness": 1,
            "id": 142948798,
            "likes": {
                "disliked": null,
                "liked": null
            },
            "rating": 5.0,
            "stay_parameters": "Stayed October 2012, traveled as a couple",
            "text": "We stayed at Great Fosters for 1 night having booked through Small Luxury Hotels. We were upgraded to a Cloisters Suite with a glass of champagne on arrival and a welcome gift. The hotel is truly outstanding. The welcome we received on reception from Darren was excellent, very friendly and professional. After being shown to our room we explored the hotel. I have to say it was immaculate in every way. Spotlessly clean and in very very good condition. The modern & contemporary cloisters suites work very the history of the Grand building itself. The gardens obviously receive a great deal of attention, there is not a leaf our of place.",
            "title": "Fantastic Hotel, with Outstanding service",
            "user": "chcukles"
        },
        {
            "date": "October 12, 2012",
            "detail_rating": {
                "business": null,
                "cleanliness": 5.0,
                "desk": null,
                "location": 5.0,
                "pool": null,
                "restaurant": null,
                "rooms": 5.0,
                "service": 5.0,
                "sleep": 5.0,
                "value": 5.0
            },
            "helpfulness": null,
            "id": 142634953,
            "likes": {
                "disliked": null,
                "liked": null
            },
            "rating": 5.0,
            "stay_parameters": "Stayed October 2012, traveled as a couple",
            "text": "Breakfast was outstanding, all cooked to order with a fantastic buffet of cereals, croissant, yoghurt, etc etc. Very good indeed.",
            "title": "short break",
            "user": "beth94Bedford"
        },
        {
            "date": "October 12, 2012",
            "detail_rating": {
                "business": null,
                "cleanliness": 4.0,
                "desk": null,
                "location": 3.0,
                "pool": null,
                "restaurant": null,
                "rooms": 5.0,
                "service": 5.0,
                "sleep": 4.0,
                "value": 4.0
            },
            "helpfulness": null,
            "id": 142633044,
            "likes": {
                "disliked": null,
                "liked": null
            },
            "rating": 4.0,
            "stay_parameters": "Stayed September 2012, traveled as a couple",
            "text": "The true credit however must go to the staff who made our stay extremely comfortable and welcoming. Every single person we met was polite, friendly and professional.",
            "title": "amazing room",
            "user": "chris c"
        },
        {
            "date": "October 11, 2012",
            "detail_rating": {
                "business": null,
                "cleanliness": 5.0,
                "desk": null,
                "location": 3.0,
                "pool": null,
                "restaurant": null,
                "rooms": 4.0,
                "service": 4.0,
                "sleep": 5.0,
                "value": 3.0
            },
            "helpfulness": null,
            "id": 142562422,
            "likes": {
                "disliked": null,
                "liked": null
            },
            "rating": 3.0,
            "stay_parameters": "Stayed October 2012, traveled on business",
            "text": "Thank you for a memorable stay. It was great to return after 19 years, when I worked at GF as a hotel porter!!! The hotel really is wonderful.",
            "title": "Fabulous place for a wedding, but less so for business",
            "user": "letsmakeadeal"
        },
        {
            "date": "October 23, 2012",
            "detail_rating": {
                "business": null,
                "cleanliness": 5.0,
                "desk": null,
                "location": 5.0,
                "pool": null,
                "restaurant": null,
                "rooms": null,
                "service": 5.0,
                "sleep": null,
                "value": 5.0
            },
            "helpfulness": null,
            "id": 143549323,
            "likes": {
                "disliked": null,
                "liked": null
            },
            "rating": 5.0,
            "stay_parameters": "Stayed October 2012, traveled with family",
            "text": "I have visited three times since I last reviewed Great Fosters back in January but have not got around to reviewing so will do all 3 visits in one fell swoop! Not difficult as couldn't fault it in any way. In fact I get a warm fuzzy feeling whenever I think of Great Fosters as my memories of it are so happy, always with family, always a wonderful experience. Came in June with my son who is at Royal Holloway, had the most beautiful meal sitting outside overlooking the water and all the blossoms were out. Then came again in July to the Taste of Summer day with my eldest son as a 21st birthday treat for him. First time I had been to one of their events and it was magical, despite the unpredictability of the weather and my son loved it too. The sun came out eventually and we got to swim in the pool which I had always yearned to do, and tickle the piglets!! The whole day was so special for both of us, all the staff were so wonderful. The third visit was last week for lunch when my sister was over from France and again, the food and service were superb. As to the comments I made in my previous review about the portion sizes, that appears to have been addressed, portion sizes have been fine on every visit since. I am so looking forward to the Christmas event which was recommended to me by people I met at the Taste of Summer day, I can't imagine a place that would be more festive and I am bringing my friends along this time. Well done to all the staff at Great Fosters, who really do justice to this truly remarkable place . Can't wait to return!",
            "title": "Totally enchanted!",
            "user": "juliam59"
        },
        {
            "date": "October 22, 2012",
            "detail_rating": {
                "business": null,
                "cleanliness": 5.0,
                "desk": null,
                "location": 5.0,
                "pool": null,
                "restaurant": null,
                "rooms": 5.0,
                "service": 5.0,
                "sleep": 5.0,
                "value": 5.0
            },
            "helpfulness": null,
            "id": 143423122,
            "likes": {
                "disliked": null,
                "liked": null
            },
            "rating": 5.0,
            "stay_parameters": "Stayed October 2012, traveled as a couple",
            "text": "We stayed for one evening, Sat 20th October. We were attending a friends wedding in London and they had their wedding reception at the hotel. The staff were brilliant, nothing was to much for them. From the purchase of a couple of good cigars to the food and wine selection, everything was superb. The hotel is easy to find, it has beutiful gardens. The interior is fantastic. The only negative was that we couldnt stay a while longer!!!",
            "title": "Fabulous Stay.",
            "user": "BazmanYorkshire"
        },
        {
            "date": "October 21, 2012",
            "detail_rating": {
                "business": null,
                "cleanliness": 5.0,
                "desk": null,
                "location": 5.0,
                "pool": null,
                "restaurant": null,
                "rooms": 5.0,
                "service": 5.0,
                "sleep": 5.0,
                "value": 5.0
            },
            "helpfulness": 2,
            "id": 143404831,
            "likes": {
                "disliked": null,
                "liked": null
            },
            "rating": 5.0,
            "stay_parameters": "Stayed October 2012, traveled as a couple",
            "text": "Barry & Michelle",
            "title": "Very impressive, no matter how you slice it!",
            "user": "WildWilliam"
        },
        {
            "date": "October 19, 2012",
            "detail_rating": {
                "business": null,
                "cleanliness": 5.0,
                "desk": null,
                "location": 5.0,
                "pool": null,
                "restaurant": null,
                "rooms": 5.0,
                "service": 5.0,
                "sleep": 5.0,
                "value": 5.0
            },
            "helpfulness": null,
            "id": 143209759,
            "likes": {
                "disliked": null,
                "liked": null
            },
            "rating": 5.0,
            "stay_parameters": "Stayed October 2012, traveled on business",
            "text": "Not sure how I stumbled across this English gem on the Internet, but it was truly more than I expected - so much more! Last night in England and Heathrow was only 7 miles away. Yet it felt like an enormous step back in time. Originally \"built as a hunting lodge in 1550\", it could very easily pass for something off a movie set. Our very clean, well furnished contemporary room, the \"Barouche #335, located in one of the renovated \"wings\", was very spacious and well equipped with amenities you would expect for the level of luxury. (As a side note, the room's windows opened, which is no big deal, but they appeared to be leaded glass panes with very simple wrought iron frames and latch, and they weren't \"double-glazed\".) The room had a very comfortable queen size bed, where as our single friend's room, the \"Hansom\", had a full size bed in an unexpectedly cramped area - she would have gladly paid the difference for a double. We did not eat dinner in their restaurant, but did experience their breakfast. Seek it on the Net if you want an out of the ordinary (pinch me, I must be dreaming) experience.",
            "title": "Excellent!",
            "user": "AndieH"
        },
        {
            "date": "October 18, 2012",
            "detail_rating": {
                "business": null,
                "cleanliness": 5.0,
                "desk": null,
                "location": 5.0,
                "pool": null,
                "restaurant": null,
                "rooms": 5.0,
                "service": 5.0,
                "sleep": 5.0,
                "value": 4.0
            },
            "helpfulness": null,
            "id": 143147760,
            "likes": {
                "disliked": null,
                "liked": null
            },
            "rating": 5.0,
            "stay_parameters": "Stayed October 2012, traveled as a couple",
            "text": "I recommended Great Fosters as a meeting/overnight venue to a client I was going to work with there (no I'm not on any commission!). I had last visited the hotel 16 years ago when my sister held her wedding reception there so a re-visit was definitely overdue!",
            "title": "Truly Great place",
            "user": "Cas01"
        },
        {
            "date": "November 2, 2012",
            "detail_rating": {
                "business": null,
                "cleanliness": 5.0,
                "desk": null,
                "location": 5.0,
                "pool": null,
                "restaurant": null,
                "rooms": 4.0,
                "service": 5.0,
                "sleep": 3.0,
                "value": 4.0
            },
            "helpfulness": null,
            "id": 144290329,
            "likes": {
                "disliked": null,
                "liked": null
            },
            "rating": 4.0,
            "stay_parameters": "Stayed November 2012, traveled as a couple",
            "text": "Great welcome and good service. Restaurant food was excellent and the Sommelier was fantastic. Beautiful gardens and grounds.",
            "title": "Romantic Relaxing Break",
            "user": "Palendromedary"
        },
        {
            "date": "October 30, 2012",
            "detail_rating": {
                "business": null,
                "cleanliness": 5.0,
                "desk": null,
                "location": 5.0,
                "pool": null,
                "restaurant": null,
                "rooms": 5.0,
                "service": 5.0,
                "sleep": 5.0,
                "value": 5.0
            },
            "helpfulness": null,
            "id": 144108647,
            "likes": {
                "disliked": null,
                "liked": null
            },
            "rating": 5.0,
            "stay_parameters": "Stayed October 2012, traveled on business",
            "text": "The only down side was our superior double room was two single beds pushed together (but that's just a pet hate of mine) but the room was decorated lovely and had great furnishings and toiletries.",
            "title": "Elegant Event .......",
            "user": "AA747"
        },
        {
            "date": "October 29, 2012",
            "detail_rating": {
                "business": null,
                "cleanliness": 5.0,
                "desk": null,
                "location": 4.0,
                "pool": null,
                "restaurant": null,
                "rooms": 5.0,
                "service": 5.0,
                "sleep": 5.0,
                "value": 4.0
            },
            "helpfulness": null,
            "id": 143973613,
            "likes": {
                "disliked": null,
                "liked": null
            },
            "rating": 5.0,
            "stay_parameters": "Stayed October 2012, traveled with friends",
            "text": "Room service breakfast is a treat not to be missed :-)",
            "title": "WOW",
            "user": "alexellie"
        },
        {
            "date": "October 28, 2012",
            "detail_rating": {
                "business": null,
                "cleanliness": 5.0,
                "desk": null,
                "location": 5.0,
                "pool": null,
                "restaurant": null,
                "rooms": 5.0,
                "service": 5.0,
                "sleep": 5.0,
                "value": 5.0
            },
            "helpfulness": null,
            "id": 143921457,
            "likes": {
                "disliked": null,
                "liked": null
            },
            "rating": 5.0,
            "stay_parameters": "Stayed October 2012, traveled with family",
            "text": "I recently hosted a large charity event at the hotel .",
            "title": "Amazing and Enchanting",
            "user": "missybrown"
        },
        {
            "date": "October 27, 2012",
            "detail_rating": {
                "business": null,
                "cleanliness": 5.0,
                "desk": null,
                "location": null,
                "pool": null,
                "restaurant": null,
                "rooms": null,
                "service": 5.0,
                "sleep": null,
                "value": 4.0
            },
            "helpfulness": 1,
            "id": 143874904,
            "likes": {
                "disliked": null,
                "liked": null
            },
            "rating": 5.0,
            "stay_parameters": "Stayed September 2012, traveled with family",
            "text": "Every detail was taken care of by the banquetting team (David and John), so I had a delightful stress free evening, in the beautiful Orangery, which had the perfect ambience for our party.",
            "title": "Afternoon Tea",
            "user": "kangaray"
        },
        {
            "date": "November 7, 2012",
            "detail_rating": {
                "business": null,
                "cleanliness": 5.0,
                "desk": null,
                "location": 5.0,
                "pool": null,
                "restaurant": null,
                "rooms": 5.0,
                "service": 5.0,
                "sleep": 5.0,
                "value": 4.0
            },
            "helpfulness": 1,
            "id": 144823914,
            "likes": {
                "disliked": null,
                "liked": null
            },
            "rating": 5.0,
            "stay_parameters": "Stayed November 2012, traveled with family",
            "text": "Stayed at Great Fosters for two nights as my best friend held her wedding there. Have to say before anything else that the staff here are amazing and that our stay was faultless. It is expensive to stay here but worth it.",
            "title": "Luxurious & cosy",
            "user": "kathrynjc"
        },
        {
            "date": "November 6, 2012",
            "detail_rating": {
                "business": null,
                "cleanliness": 5.0,
                "desk": null,
                "location": 4.0,
                "pool": null,
                "restaurant": null,
                "rooms": 5.0,
                "service": 5.0,
                "sleep": 4.0,
                "value": 4.0
            },
            "helpfulness": 1,
            "id": 144720324,
            "likes": {
                "disliked": null,
                "liked": null
            },
            "rating": 5.0,
            "stay_parameters": "Stayed November 2012, traveled as a couple",
            "text": "On our first night me, the bride, two other bridesmaids and a bridesman stayed in the Tapestry Room. This is easily the biggest hotel room I have ever seen, let alone stayed in. I don't think my flat is small but this room was about the consolidated size of it. The staff were absolutely on-point and had no trouble at adding three camp beds to accommodate us all. There was more than enough space for all five of us and the bathroom was very convenient: one main room with hand-basins and roll-top bath with seperate shower room and toilet of it. This was most convenient when we were all readying ourselves for the wedding the next day as several things could go on at once without us getting on top of each other.",
            "title": "Amazing!",
            "user": "Anonymous86170"
        },
        {
            "date": "November 2, 2012",
            "detail_rating": {
                "business": null,
                "cleanliness": 5.0,
                "desk": null,
                "location": 5.0,
                "pool": null,
                "restaurant": null,
                "rooms": 5.0,
                "service": 5.0,
                "sleep": 5.0,
                "value": 5.0
            },
            "helpfulness": null,
            "id": 144335284,
            "likes": {
                "disliked": null,
                "liked": null
            },
            "rating": 5.0,
            "stay_parameters": "Stayed October 2012, traveled as a couple",
            "text": "We made use of the complimentary hospitality tray (as some rooms don't come with tea/coffee making facilities but the hotel is more than happy to supply these if required) and ordered room service which arrived quickly and was delicious. Add the Molton Brown miniature toiletries and it was a pretty blissful night.",
            "title": "Best anniversary yet!",
            "user": "DaniMF24"
        },
        {
            "date": "November 2, 2012",
            "detail_rating": {
                "business": null,
                "cleanliness": 5.0,
                "desk": null,
                "location": 5.0,
                "pool": null,
                "restaurant": null,
                "rooms": 5.0,
                "service": 5.0,
                "sleep": 5.0,
                "value": 4.0
            },
            "helpfulness": null,
            "id": 144328943,
            "likes": {
                "disliked": null,
                "liked": null
            },
            "rating": 5.0,
            "stay_parameters": "Stayed November 2012, traveled on business",
            "text": "We took breakfast the next day in the Oak Room restaurant (after an early-morning wonder round the grounds which is a must) and while it is not an 'all-you-can-eat', over-flowing continental buffet selection it was nonetheless tasty and very filling. The staff were then exceptional in assisting the bride with the last preparations and there were at least two people on hand at any one time making sure the wedding party was where we needed to be. Their organisation was faultless and the wedding breakfast and reception afterwards was wonderful. Highly recommended as a wedding venue.",
            "title": "A Real Treat",
            "user": "BobbyBShropshire"
        },
        {
            "date": "November 2, 2012",
            "detail_rating": {
                "business": null,
                "cleanliness": null,
                "desk": null,
                "location": 5.0,
                "pool": null,
                "restaurant": null,
                "rooms": null,
                "service": 3.0,
                "sleep": null,
                "value": 4.0
            },
            "helpfulness": null,
            "id": 144292620,
            "likes": {
                "disliked": null,
                "liked": null
            },
            "rating": 5.0,
            "stay_parameters": "Stayed August 2012, traveled with family",
            "text": "For the second night me and my husband stayed in the Waterloo Room which was simply lovely. The room consisted of three seperate areas, one a bedroom with bed (obviously), armchairs, TV etc., a small dressing area with a wardrobe and table and chair with mirror, and a spacious bathroom. The rate was \u00a3175 for the night including breakfast which I feel is enough to pay but with complimentary water, slippers and robes, it really was luxurious.",
            "title": "Afternoon tea delight",
            "user": "Old_Deers"
        }
    ],
    "slim_ranking": 0.333333333333,
    "stars": 4,
    "tripadvisor": {
        "VISITED": false,
        "country_name": null,
        "locality": null,
        "pic_link": null,
        "street_address": null
    },
    "user_rating": 4.5,
    "variance": {
        "average": 27,
        "excellent": 274,
        "poor": 16,
        "terrible": 5,
        "very good": 77
    }
}