{
    "aka": null,
    "description": "The Majestic! The premier Hotel in the historic town of Ocean Grove, NJ and among the top rated hotels along the NJ shoreline. Built in 1870, with additional sumptuous and spacious accommodations added in 2007; luxurious surroundings and a gracious staff offer a 5-Star experience delivered with a personal touch. At Bia, a European bistro, guests indulge in offerings elegantly crafted by our Executive Chef.",
    "detail_rating": {
        "cleanliness": null,
        "location": null,
        "rooms": null,
        "service": null,
        "sleep": null,
        "value": null
    },
    "location": {
        "city": null,
        "continent": null,
        "country": "United States",
        "proposed_city": "Grove",
        "province": null,
        "region": null
    },
    "name": "The Majestic Hotel",
    "places": {
        "aka": [],
        "hotel_description": [
            "Grove"
        ],
        "hotel_name": []
    },
    "review_count": 76,
    "review_count_current": 20,
    "reviews": [
        {
            "date": "April 1, 2012",
            "detail_rating": {
                "business": null,
                "cleanliness": 5.0,
                "desk": null,
                "location": 5.0,
                "pool": null,
                "restaurant": null,
                "rooms": 5.0,
                "service": 5.0,
                "sleep": 5.0,
                "value": 5.0
            },
            "helpfulness": 3,
            "id": 127079770,
            "likes": {
                "disliked": null,
                "liked": null
            },
            "rating": 5.0,
            "stay_parameters": "Stayed April 2012, traveled as a couple",
            "text": "What a great place, can't wait to go back. Everything is so beautiful - the building itself, the rooms, the view from the porch, even the lobby area is outstanding. The room we had was large and came with two double beds, a gorgeous bathroom and a kitchenette. With the groupon package we had, upon arrival into the room, we were delighted to find a bottle of delicious champagne chilling in a bucket, cheese (including brie), crackers and fruit, and great soft music playing on the cd player.",
            "title": "Fantastic Stay",
            "user": "ChampagnePrincess"
        },
        {
            "date": "September 7, 2010",
            "detail_rating": {
                "business": null,
                "cleanliness": 4.0,
                "desk": null,
                "location": 5.0,
                "pool": null,
                "restaurant": null,
                "rooms": 4.0,
                "service": 5.0,
                "sleep": 4.0,
                "value": 5.0
            },
            "helpfulness": 3,
            "id": 78625516,
            "likes": {
                "disliked": null,
                "liked": null
            },
            "rating": 4.0,
            "stay_parameters": "Stayed September 2010, traveled as a couple",
            "text": "We took a cab to Langosta for dinner (we could have just walked there from the boardwalk if the weather had cooperated). The food was terrific and it had a great crowd - highly recommended. Then we just walked across the street from the restaurant and went to the Stone Pony to listen to a Bruce Springstein cover band - fun night.",
            "title": "Lovely...",
            "user": "bonvoyagenj"
        },
        {
            "date": "August 21, 2010",
            "detail_rating": {
                "business": null,
                "cleanliness": 5.0,
                "desk": null,
                "location": 4.0,
                "pool": null,
                "restaurant": null,
                "rooms": 3.0,
                "service": 4.0,
                "sleep": 3.0,
                "value": 4.0
            },
            "helpfulness": 2,
            "id": 76241011,
            "likes": {
                "disliked": null,
                "liked": null
            },
            "rating": 3.0,
            "stay_parameters": "Stayed August 2010, traveled with family",
            "text": "The boardwalk and beach are steps away from the property (less than half a block). Perfect location.",
            "title": "Small Quaint Beach Town!!!",
            "user": "Yoli77"
        },
        {
            "date": "July 24, 2010",
            "detail_rating": {
                "business": null,
                "cleanliness": 4.0,
                "desk": null,
                "location": 5.0,
                "pool": null,
                "restaurant": null,
                "rooms": 4.0,
                "service": 5.0,
                "sleep": 4.0,
                "value": 3.0
            },
            "helpfulness": 2,
            "id": 72176584,
            "likes": {
                "disliked": null,
                "liked": null
            },
            "rating": 4.0,
            "stay_parameters": "Stayed July 2010, traveled as a couple",
            "text": "Breakfast was pretty simple, but okay to start the day. The owners are very friendly and have lots of good restaurant suggestions. This really is a first class property and anyone lucky enough to experience it will always want to visit it again and again.",
            "title": "Great",
            "user": "arh1969"
        },
        {
            "date": "April 11, 2010",
            "detail_rating": {
                "business": null,
                "cleanliness": 5.0,
                "desk": null,
                "location": 5.0,
                "pool": null,
                "restaurant": null,
                "rooms": 5.0,
                "service": 5.0,
                "sleep": 5.0,
                "value": 5.0
            },
            "helpfulness": 1,
            "id": 61044513,
            "likes": {
                "disliked": null,
                "liked": null
            },
            "rating": 5.0,
            "stay_parameters": "Stayed April 2010",
            "text": "As much travelling as I've done, I've never stayed in a bed and breakfast before. In addition, I've never visited Ocean Grove, NJ...which is ironic since I'm a Jerseyean who only lives a half hour away! Both new experiences were pleasantly surprising. The Majestic was warm and cozy...great service and the feeling of truly getting away without really \"going away\" was wonderful. Perfectly located...steps away from the beautiful beach and in the other direction a quaint little town with shops and little eateries (go to Nagles for any meal and especially the ice cream!). A short walk up the boardwalk, and you're in booming Asbury Park! Staying here, you can't lose. Will definitely be booking again...perhaps even a fall trip!",
            "title": "An Inn With Class and Charm",
            "user": "travellinghopefully"
        },
        {
            "date": "November 24, 2009",
            "detail_rating": {
                "business": null,
                "cleanliness": 3.0,
                "desk": null,
                "location": 5.0,
                "pool": null,
                "restaurant": null,
                "rooms": 3.0,
                "service": 4.0,
                "sleep": null,
                "value": 2.0
            },
            "helpfulness": 2,
            "id": 49973022,
            "likes": {
                "disliked": null,
                "liked": null
            },
            "rating": 3.0,
            "stay_parameters": "Stayed November 2009, traveled as a couple",
            "text": "In short, you're paying for location. One block from a beautiful beach and the boardwalk. If, as we were, you're staying in November, it's not such a big benefit. The room was average size, in average shape, with average amenities. Breakfast was, you guessed it, average. Service was terrific. Everyone was very nice and extremely helpful. Would we stay again? Not at these prices.",
            "title": "Absolutely fine",
            "user": "fred_moose"
        },
        {
            "date": "October 21, 2009",
            "detail_rating": {
                "business": null,
                "cleanliness": 3.0,
                "desk": null,
                "location": 3.0,
                "pool": null,
                "restaurant": null,
                "rooms": 1.0,
                "service": 3.0,
                "sleep": null,
                "value": 3.0
            },
            "helpfulness": 5,
            "id": 47448561,
            "likes": {
                "disliked": null,
                "liked": null
            },
            "rating": 3.0,
            "stay_parameters": "Stayed August 2009, traveled as a couple",
            "text": "After reading mostly positive reviews, we booked a room for two nights in August. We chose the \"older\" rooms (based on the reservation clerk's advice since she suggested that they were larger than the newer rooms. We were not impressed.",
            "title": "Underwhelmed",
            "user": "dbrown46"
        },
        {
            "date": "August 27, 2009",
            "detail_rating": {
                "business": null,
                "cleanliness": 2.0,
                "desk": null,
                "location": 5.0,
                "pool": null,
                "restaurant": null,
                "rooms": 4.0,
                "service": 3.0,
                "sleep": null,
                "value": 4.0
            },
            "helpfulness": 1,
            "id": 38967602,
            "likes": {
                "disliked": null,
                "liked": null
            },
            "rating": 3.0,
            "stay_parameters": "Stayed August 2009, traveled as a couple",
            "text": "Our problems were all related to the maintenance (or lack thereof) of the room. Let me also preface this by stating that we were contacted by the Manager to offer a cash adjustment after our stay but after 6 weeks and numerous emails left unanswered, we assume he has withdrawn his offer.",
            "title": "Nice room, great dining room...",
            "user": "Thia2"
        },
        {
            "date": "August 19, 2009",
            "detail_rating": {
                "business": null,
                "cleanliness": 5.0,
                "desk": null,
                "location": 5.0,
                "pool": null,
                "restaurant": null,
                "rooms": 5.0,
                "service": 5.0,
                "sleep": null,
                "value": 5.0
            },
            "helpfulness": 1,
            "id": 38189242,
            "likes": {
                "disliked": null,
                "liked": null
            },
            "rating": 5.0,
            "stay_parameters": "Stayed August 2009, traveled on business",
            "text": "The armoire in the room had no handle and we had to pry it open. Once we opened it, we could not close it and the door swung open. We finally jammed it shut and lived out of our suitcases since there was no other place for our clothes. The toilet \"ran\" the entire time we were there. Each time we used it, we had to lift the top and adjust the chain. The switchplate on the wall did not have a cover (so we did not use it) and the reading light mechanism came loose each time we tried to turn it on. There was a huge swatch of wallpaper border missing from the corner. There was no wand on the blinds so we were never able to let in light unless we lifted them up completely (and the view was exhaust fans and another building very close). You might wonder why we put up with all of this during our stay...we just wanted to use the room and did not want our access compromised by maintenance people servicing these many repairs. The rest of the rooms were booked so we could not switch rooms either.",
            "title": "Elegant and Comfortable",
            "user": "kerrycollie"
        },
        {
            "date": "August 13, 2009",
            "detail_rating": {
                "business": null,
                "cleanliness": 5.0,
                "desk": null,
                "location": 5.0,
                "pool": null,
                "restaurant": null,
                "rooms": 5.0,
                "service": 5.0,
                "sleep": null,
                "value": 5.0
            },
            "helpfulness": null,
            "id": 37532422,
            "likes": {
                "disliked": null,
                "liked": null
            },
            "rating": 5.0,
            "stay_parameters": "Stayed August 2009, traveled on business",
            "text": "We assumed a boutique hotel would check these features prior to announcing that the room was ready.",
            "title": "Fortune 500 Company rates the Majestic experience as EXCEPTIONAL",
            "user": "ChimaW"
        },
        {
            "date": "August 5, 2009",
            "detail_rating": {
                "business": null,
                "cleanliness": 4.0,
                "desk": null,
                "location": 4.0,
                "pool": null,
                "restaurant": null,
                "rooms": 4.0,
                "service": 4.0,
                "sleep": null,
                "value": 4.0
            },
            "helpfulness": null,
            "id": 36840388,
            "likes": {
                "disliked": null,
                "liked": null
            },
            "rating": 4.0,
            "stay_parameters": "Stayed July 2009, traveled as a couple",
            "text": "The accommodations were upscale. The staff was friendly and accommodating. Includes a nice restaurant for lunch and dinner (summer). we would definitely return.",
            "title": "nice ambiance",
            "user": "raeOcalaFl"
        },
        {
            "date": "August 4, 2009",
            "detail_rating": {
                "business": null,
                "cleanliness": 1.0,
                "desk": null,
                "location": 5.0,
                "pool": null,
                "restaurant": null,
                "rooms": 1.0,
                "service": 1.0,
                "sleep": null,
                "value": 1.0
            },
            "helpfulness": 3,
            "id": 36716986,
            "likes": {
                "disliked": null,
                "liked": null
            },
            "rating": 2.0,
            "stay_parameters": "Stayed August 2009, traveled with family",
            "text": "Sadly, the general manager informed me that they do not want my money, even though the hotel is not completely booked, because they \"do not have facilities\" for underage children.",
            "title": "No KIDS allowed",
            "user": "prometheamoth"
        },
        {
            "date": "August 4, 2009",
            "detail_rating": {
                "business": null,
                "cleanliness": 5.0,
                "desk": null,
                "location": 5.0,
                "pool": null,
                "restaurant": null,
                "rooms": 5.0,
                "service": 5.0,
                "sleep": null,
                "value": 5.0
            },
            "helpfulness": null,
            "id": 36682240,
            "likes": {
                "disliked": null,
                "liked": null
            },
            "rating": 5.0,
            "stay_parameters": "Stayed July 2009, traveled as a couple",
            "text": "Not that we *need* any facilities besides the beach...?? We bring our own porta-crib for our very well-behaved 2 yr old. Sadly, we now have to stay outside of Ocean Grove and give our money to a CHAIN HOTEL even though we don't want to.",
            "title": "Definitely worth staying at the Majestic",
            "user": "LeoandScorpio"
        },
        {
            "date": "July 17, 2009",
            "detail_rating": {
                "business": null,
                "cleanliness": 5.0,
                "desk": null,
                "location": 5.0,
                "pool": null,
                "restaurant": null,
                "rooms": 5.0,
                "service": 5.0,
                "sleep": null,
                "value": 5.0
            },
            "helpfulness": null,
            "id": 35031153,
            "likes": {
                "disliked": null,
                "liked": null
            },
            "rating": 5.0,
            "stay_parameters": "Stayed June 2009, traveled as a couple",
            "text": "We were fortunate enough to have chosen to stay at the Majestic Hotel in July, 2009. Our experience was absolutley wonderful; the staff was more than accomodating and the restaurant in the hotel was excellent. I would recommend this hotel to anyone, especially to a couple looking to for a special place to spend quality time together.",
            "title": "Outstanding Inn And Off The Charts Service - Read This.",
            "user": "almarc44"
        },
        {
            "date": "June 29, 2009",
            "detail_rating": {
                "business": null,
                "cleanliness": 5.0,
                "desk": null,
                "location": 5.0,
                "pool": null,
                "restaurant": null,
                "rooms": 5.0,
                "service": 5.0,
                "sleep": null,
                "value": 5.0
            },
            "helpfulness": null,
            "id": 33436032,
            "likes": {
                "disliked": null,
                "liked": null
            },
            "rating": 5.0,
            "stay_parameters": "Stayed June 2009, traveled on business",
            "text": "My wife and I stayed at the Majestic for our 5 year anniversary and can not say enough great things about our experience at the Majestic. So here's the scoop: beautiful accomodations... right near the water... quiet street... friendly staff... room was spanking new and very modern... inn is very charming... food was delicious... price was right. The cons? None. Room with a view? Check. Spacious porch to sit on on while staring at the ocean? Check. Friendly staff? Check. Oh - and how about this: I just called them up to say my sister and brother in law were staying there this weekend for their anniversary and I asked if they could do something special for them. They offered to send a bottle of wine and a wonderful dessert to their room. I said great, how much? The reply: it's on the house because you were kind enough to refer business to us. Get any better than that? Didn't think so. Call and book your next stay with them now.",
            "title": "A true Gem",
            "user": "gotnone"
        },
        {
            "date": "June 5, 2009",
            "detail_rating": {
                "business": null,
                "cleanliness": 5.0,
                "desk": null,
                "location": 5.0,
                "pool": null,
                "restaurant": null,
                "rooms": 5.0,
                "service": 5.0,
                "sleep": null,
                "value": 4.0
            },
            "helpfulness": null,
            "id": 31668056,
            "likes": {
                "disliked": null,
                "liked": null
            },
            "rating": 5.0,
            "stay_parameters": "Stayed May 2009, traveled on business",
            "text": "This was my second stay at the Majestic - a year apart. Both times I was impressed by the high quality of the furnishings & the rooms. The personal yet unobtrusive service is a real pleasure to experience. The Majestic Hotel is within walking distance of the shore (you can hear the ocean if you open the windows !!!) & it is a real pleasure to stay there.",
            "title": "Boutique Hotel with excellent personal service",
            "user": "Pip91"
        },
        {
            "date": "May 20, 2009",
            "detail_rating": {
                "business": null,
                "cleanliness": 5.0,
                "desk": null,
                "location": 5.0,
                "pool": null,
                "restaurant": null,
                "rooms": 5.0,
                "service": 5.0,
                "sleep": null,
                "value": 5.0
            },
            "helpfulness": null,
            "id": 30405529,
            "likes": {
                "disliked": null,
                "liked": null
            },
            "rating": 5.0,
            "stay_parameters": "Stayed April 2009, traveled as a couple",
            "text": "I will be back again & again !!!",
            "title": "An outstanding B & B",
            "user": "lennymoon"
        },
        {
            "date": "May 1, 2009",
            "detail_rating": {
                "business": null,
                "cleanliness": 5.0,
                "desk": null,
                "location": 4.0,
                "pool": null,
                "restaurant": null,
                "rooms": 5.0,
                "service": 5.0,
                "sleep": null,
                "value": 4.0
            },
            "helpfulness": null,
            "id": 29157326,
            "likes": {
                "disliked": null,
                "liked": null
            },
            "rating": 5.0,
            "stay_parameters": "Stayed April 2009, traveled as a couple",
            "text": "My wife and I spent a night as a get away from the house and kids. The room couldn't have been more beautiful and we had a great ocean view.",
            "title": "Perfect weekend beach getaway",
            "user": "sunshine44Nj"
        },
        {
            "date": "April 14, 2009",
            "detail_rating": {
                "business": null,
                "cleanliness": 5.0,
                "desk": null,
                "location": 5.0,
                "pool": null,
                "restaurant": null,
                "rooms": 3.0,
                "service": 5.0,
                "sleep": null,
                "value": 5.0
            },
            "helpfulness": 1,
            "id": 28046906,
            "likes": {
                "disliked": null,
                "liked": null
            },
            "rating": 5.0,
            "stay_parameters": "Stayed March 2009, traveled with friends",
            "text": "Dinner downstairs was fantastic ( I highly recommend the lamb shank) and you can't beat the location.",
            "title": "This was a fantastic spot with fabulous service",
            "user": "awestchu"
        },
        {
            "date": "April 3, 2009",
            "detail_rating": {
                "business": null,
                "cleanliness": 5.0,
                "desk": null,
                "location": 5.0,
                "pool": null,
                "restaurant": null,
                "rooms": 5.0,
                "service": 5.0,
                "sleep": null,
                "value": 5.0
            },
            "helpfulness": null,
            "id": 27350748,
            "likes": {
                "disliked": null,
                "liked": null
            },
            "rating": 5.0,
            "stay_parameters": "Stayed March 2009, traveled on business",
            "text": "If you want to stay at the Jersey shore, The Majestic is the place to go.",
            "title": "Excellent Service & Setting at the Majectic Hotel, Ocean Grove, NJ",
            "user": "Jadedanseur"
        }
    ],
    "slim_ranking": 0.571428571429,
    "stars": 3,
    "tripadvisor": {
        "VISITED": false,
        "country_name": null,
        "locality": null,
        "pic_link": null,
        "street_address": null
    },
    "user_rating": 4.5,
    "variance": {
        "average": 13,
        "excellent": 43,
        "poor": 4,
        "terrible": 0,
        "very good": 16
    }
}