{
    "aka": "City Hotel Leeds",
    "description": "Our new Leeds hotel is part of the revitalised Granary Wharf area, next to Leeds station and the canal. All 333 of our bedrooms are styled with absolute consideration for your comfort and feature our award winning multimedia iMac computer, complimentary wi-fi and Sky in every room. Dine in the sophisticated surroundings of City Caf\u00e9 restaurant or dine alfresco on our south facing, canalside terrace. 13th Floor Skylounge where you will find a breath taking view of the city.",
    "detail_rating": {
        "cleanliness": 4.5,
        "location": 4.5,
        "rooms": 4.5,
        "service": 4.5,
        "sleep": 4.5,
        "value": 4.5
    },
    "location": {
        "city": null,
        "continent": "Europe",
        "country": "United Kingdom (UK)",
        "proposed_city": "Leeds",
        "province": null,
        "region": null
    },
    "name": "Doubletree by Hilton Hotel Leeds City Centre",
    "places": {
        "aka": [
            "Leeds"
        ],
        "hotel_description": [
            "Leeds"
        ],
        "hotel_name": [
            "Leeds"
        ]
    },
    "review_count": 1571,
    "review_count_current": 20,
    "reviews": [
        {
            "date": "April 30, 2010",
            "detail_rating": {
                "business": null,
                "cleanliness": 5.0,
                "desk": null,
                "location": 4.0,
                "pool": null,
                "restaurant": null,
                "rooms": 4.0,
                "service": 4.0,
                "sleep": 4.0,
                "value": 4.0
            },
            "helpfulness": null,
            "id": 62835682,
            "likes": {
                "disliked": null,
                "liked": null
            },
            "rating": 4.0,
            "stay_parameters": "Stayed February 2010, traveled as a couple",
            "text": "Stayed here for one night and had a really comfortable stay. The room was compact but perfectly formed! Everything is very modern, clean and sparce. I liked the applemac replacement for a TV and we made use of the DVD library at reception - this is free to guests and they had quite a good selection.",
            "title": "Modern clean hotel",
            "user": "barney"
        },
        {
            "date": "April 28, 2010",
            "detail_rating": {
                "business": null,
                "cleanliness": 5.0,
                "desk": null,
                "location": 4.0,
                "pool": null,
                "restaurant": null,
                "rooms": 5.0,
                "service": 4.0,
                "sleep": 5.0,
                "value": 5.0
            },
            "helpfulness": null,
            "id": 62695207,
            "likes": {
                "disliked": null,
                "liked": null
            },
            "rating": 5.0,
            "stay_parameters": "Stayed April 2010, traveled as a couple",
            "text": "We had a cocktail in the Skybar, although it was very windy and wet outside, so we didn't get to go outside.",
            "title": "Great hotel - Great service",
            "user": "ntigah"
        },
        {
            "date": "April 27, 2010",
            "detail_rating": {
                "business": null,
                "cleanliness": null,
                "desk": null,
                "location": null,
                "pool": null,
                "restaurant": null,
                "rooms": null,
                "service": null,
                "sleep": null,
                "value": null
            },
            "helpfulness": null,
            "id": 62574950,
            "likes": {
                "disliked": null,
                "liked": null
            },
            "rating": 4.0,
            "stay_parameters": null,
            "text": "Breakfast was included and was very tasty. Made to order rather than a buffet which I prefer.",
            "title": "Recommended.....but!",
            "user": "Davidob"
        },
        {
            "date": "April 26, 2010",
            "detail_rating": {
                "business": null,
                "cleanliness": 5.0,
                "desk": null,
                "location": 4.0,
                "pool": null,
                "restaurant": null,
                "rooms": 4.0,
                "service": 4.0,
                "sleep": 5.0,
                "value": 4.0
            },
            "helpfulness": null,
            "id": 62501383,
            "likes": {
                "disliked": null,
                "liked": null
            },
            "rating": 5.0,
            "stay_parameters": "Stayed April 2010, traveled as a couple",
            "text": "Would stay here again, but I usually like to try different hotels each time.",
            "title": "Very impressed!",
            "user": "cltc"
        },
        {
            "date": "April 24, 2010",
            "detail_rating": {
                "business": null,
                "cleanliness": 5.0,
                "desk": null,
                "location": 5.0,
                "pool": null,
                "restaurant": null,
                "rooms": 5.0,
                "service": 5.0,
                "sleep": 5.0,
                "value": 5.0
            },
            "helpfulness": null,
            "id": 62299727,
            "likes": {
                "disliked": null,
                "liked": null
            },
            "rating": 5.0,
            "stay_parameters": "Stayed April 2010, traveled as a couple",
            "text": "Stayed at City Inn Leeds on Saturday night. The check in staff were extremely friendly and we were upgraded to a Junior Suite. Room was lovely, very modern and large and particularly loved the floor to ceiling windows that made up much of the wall space.",
            "title": "Fantastic Service",
            "user": "SteveLichfield"
        },
        {
            "date": "May 13, 2010",
            "detail_rating": {
                "business": null,
                "cleanliness": 5.0,
                "desk": null,
                "location": 5.0,
                "pool": null,
                "restaurant": null,
                "rooms": 5.0,
                "service": 2.0,
                "sleep": 3.0,
                "value": 5.0
            },
            "helpfulness": null,
            "id": 64028715,
            "likes": {
                "disliked": null,
                "liked": null
            },
            "rating": 3.0,
            "stay_parameters": "Stayed May 2010, traveled on business",
            "text": "I'm a frequent visitor to the City Inn and have become absolutely fed up with the poor service at breakfast, which is served undercooked (raw eggs) and cold and usually when colleagues have finished theirs! Many times items have been forgotten and they struggle to do the simplest things - e.g. bring eggs and toast over together (the toast came 30 mins after eggs, even after chasing twice!!) The concierge pays no attention to the customers, but rushes about ineffectively.",
            "title": "Please sort out the breakfast!",
            "user": "sn01"
        },
        {
            "date": "May 6, 2010",
            "detail_rating": {
                "business": null,
                "cleanliness": 5.0,
                "desk": null,
                "location": 5.0,
                "pool": null,
                "restaurant": null,
                "rooms": 4.0,
                "service": 5.0,
                "sleep": 5.0,
                "value": 4.0
            },
            "helpfulness": null,
            "id": 63421933,
            "likes": {
                "disliked": null,
                "liked": null
            },
            "rating": 5.0,
            "stay_parameters": "Stayed May 2010, traveled with family",
            "text": "The rooms are great, nice and clean, please City Inn sort out your breakfasts!!",
            "title": "A great hotel, with good location",
            "user": "FamilyJ0nes"
        },
        {
            "date": "May 3, 2010",
            "detail_rating": {
                "business": null,
                "cleanliness": 5.0,
                "desk": null,
                "location": 5.0,
                "pool": null,
                "restaurant": null,
                "rooms": 5.0,
                "service": 5.0,
                "sleep": 5.0,
                "value": 5.0
            },
            "helpfulness": 1,
            "id": 63140861,
            "likes": {
                "disliked": null,
                "liked": null
            },
            "rating": 5.0,
            "stay_parameters": "Stayed April 2010, traveled with friends",
            "text": "Have stayed in the hotel twice now, excellent service with spacious and modern rooms. Like the Apple Macs in the rooms and the wireless internet. Great location near to the station and within minutes of the shops. Only complaints are that the air-conditioning is extremely noisy and largely ineffective and the parking is \u00a312 a night and in limited supply, however the parking staff are very helpful and attentive.",
            "title": "Great location and great staff",
            "user": "LotusOxfordshire_UK"
        },
        {
            "date": "April 30, 2010",
            "detail_rating": {
                "business": null,
                "cleanliness": 5.0,
                "desk": null,
                "location": 5.0,
                "pool": null,
                "restaurant": null,
                "rooms": 5.0,
                "service": 3.0,
                "sleep": 5.0,
                "value": 5.0
            },
            "helpfulness": null,
            "id": 62902290,
            "likes": {
                "disliked": null,
                "liked": null
            },
            "rating": 5.0,
            "stay_parameters": "Stayed April 2010, traveled as a couple",
            "text": "After staying at the City Inn at Westminster last year we decided to try the Leeds version when we visited last weekend. We were not disappointed.",
            "title": "Excellent stay and great value for money",
            "user": "FigNewton86"
        },
        {
            "date": "April 30, 2010",
            "detail_rating": {
                "business": null,
                "cleanliness": 5.0,
                "desk": null,
                "location": 4.0,
                "pool": null,
                "restaurant": null,
                "rooms": 5.0,
                "service": 4.0,
                "sleep": 4.0,
                "value": 5.0
            },
            "helpfulness": 1,
            "id": 62841393,
            "likes": {
                "disliked": null,
                "liked": null
            },
            "rating": 5.0,
            "stay_parameters": "Stayed April 2010, traveled as a couple",
            "text": "I think what makes the City Inn brand better than most other hotels is the friendly and helpful nature of all of the staff. The rooms are good and the location is excellent.",
            "title": "Lush!",
            "user": "OxfordTravelady"
        },
        {
            "date": "May 26, 2010",
            "detail_rating": {
                "business": null,
                "cleanliness": 5.0,
                "desk": null,
                "location": 5.0,
                "pool": null,
                "restaurant": null,
                "rooms": 5.0,
                "service": 5.0,
                "sleep": 5.0,
                "value": 5.0
            },
            "helpfulness": 1,
            "id": 65405519,
            "likes": {
                "disliked": null,
                "liked": null
            },
            "rating": 5.0,
            "stay_parameters": "Stayed May 2010, traveled on business",
            "text": "Room - very comfortable, has Apple desktop with internet access AND wireless, great bed and shower, big fluffy towels etc, good workspace;",
            "title": "Perfect",
            "user": "AllanBLondon"
        },
        {
            "date": "May 23, 2010",
            "detail_rating": {
                "business": null,
                "cleanliness": 5.0,
                "desk": null,
                "location": 5.0,
                "pool": null,
                "restaurant": null,
                "rooms": 5.0,
                "service": 3.0,
                "sleep": 5.0,
                "value": 4.0
            },
            "helpfulness": 1,
            "id": 65069319,
            "likes": {
                "disliked": null,
                "liked": null
            },
            "rating": 4.0,
            "stay_parameters": "Stayed May 2010, traveled as a couple",
            "text": "Hotel - really nice design;",
            "title": "Great Horel - Great Location!",
            "user": "SB1Epworth"
        },
        {
            "date": "May 18, 2010",
            "detail_rating": {
                "business": null,
                "cleanliness": null,
                "desk": null,
                "location": null,
                "pool": null,
                "restaurant": null,
                "rooms": null,
                "service": null,
                "sleep": null,
                "value": null
            },
            "helpfulness": null,
            "id": 64480637,
            "likes": {
                "disliked": null,
                "liked": null
            },
            "rating": 5.0,
            "stay_parameters": null,
            "text": "Service - with a smile;",
            "title": "Great staff,great location and great city.",
            "user": "ilmors"
        },
        {
            "date": "May 15, 2010",
            "detail_rating": {
                "business": null,
                "cleanliness": 5.0,
                "desk": null,
                "location": 5.0,
                "pool": null,
                "restaurant": null,
                "rooms": 5.0,
                "service": 5.0,
                "sleep": 5.0,
                "value": 5.0
            },
            "helpfulness": null,
            "id": 64236826,
            "likes": {
                "disliked": null,
                "liked": null
            },
            "rating": 5.0,
            "stay_parameters": "Stayed May 2010, traveled as a couple",
            "text": "Restaurant - fantastic breakfast with loads of choice and hot food served at table. Evening snack very nice;",
            "title": "Fantastic staff",
            "user": "KLPLeeds"
        },
        {
            "date": "May 14, 2010",
            "detail_rating": {
                "business": null,
                "cleanliness": 5.0,
                "desk": null,
                "location": 4.0,
                "pool": null,
                "restaurant": null,
                "rooms": 5.0,
                "service": 4.0,
                "sleep": 4.0,
                "value": 5.0
            },
            "helpfulness": null,
            "id": 64152592,
            "likes": {
                "disliked": null,
                "liked": null
            },
            "rating": 5.0,
            "stay_parameters": "Stayed March 2010, traveled solo",
            "text": "Location - very central but in a newly developed canal area so perfect.",
            "title": "brilliant for the price and location",
            "user": "LondonHobnob"
        },
        {
            "date": "April 23, 2010",
            "detail_rating": {
                "business": null,
                "cleanliness": 5.0,
                "desk": null,
                "location": 5.0,
                "pool": null,
                "restaurant": null,
                "rooms": 5.0,
                "service": 5.0,
                "sleep": 5.0,
                "value": 5.0
            },
            "helpfulness": 2,
            "id": 62213128,
            "likes": {
                "disliked": null,
                "liked": null
            },
            "rating": 5.0,
            "stay_parameters": "Stayed August 2009, traveled with friends",
            "text": "Stayed at this hotel after a night out in Leeds with friends. A small problem finding the car park for the hotel but when we phoned lost in Leeds City centre the hotel sent a member of staff out into the city to find us and guide me to the car park. The room was very modern and impressive and small touches like a bowl of fresh fruit in the room was appreciated and a treat. the bar on the roof top was also a fantastic feature and they stayed open longer just for us. Breakfast in the morning was top class and the staff were very helpful throughout. Would definitely recommend and as a travel agent will be sending many more customers to this hotel.",
            "title": "Super Modern Hotel With 5 Star Service",
            "user": "dcorbridge"
        },
        {
            "date": "April 20, 2010",
            "detail_rating": {
                "business": null,
                "cleanliness": 5.0,
                "desk": null,
                "location": 5.0,
                "pool": null,
                "restaurant": null,
                "rooms": 5.0,
                "service": 4.0,
                "sleep": 5.0,
                "value": 5.0
            },
            "helpfulness": 1,
            "id": 62006983,
            "likes": {
                "disliked": null,
                "liked": null
            },
            "rating": 5.0,
            "stay_parameters": "Stayed April 2010, traveled as a couple",
            "text": "We stayed at the City Inn for 3 nights over the Easter Weekend and I am totally impressed with this great all round hotel.",
            "title": "Not hard to see why it's number 1 hotel in Leeds!",
            "user": "monty69Edinburgh"
        },
        {
            "date": "April 19, 2010",
            "detail_rating": {
                "business": null,
                "cleanliness": 5.0,
                "desk": null,
                "location": 5.0,
                "pool": null,
                "restaurant": null,
                "rooms": 5.0,
                "service": 5.0,
                "sleep": 5.0,
                "value": 5.0
            },
            "helpfulness": 1,
            "id": 61933864,
            "likes": {
                "disliked": null,
                "liked": null
            },
            "rating": 5.0,
            "stay_parameters": "Stayed March 2010, traveled on business",
            "text": "The price is amazing for such a great hotel, representing great value for money. I was slightly concerned about the car parking, but we parked in the NCP car park on Boar Lane, which is about a 5 min walk from the hotel. The reception staff can give you a special pass that reduces the 24 hour stay in this car park from \u00a313 to \u00a35. The hotel is located in an area that's clearly undergone a lot of regeneration lately. On the approaching drive you go through a pretty run down industrial area, but the canalside area is lovely. It's about a ten minute walk to shops and bars, which was ideal.",
            "title": "Absolutely outstanding hotel",
            "user": "js0754"
        },
        {
            "date": "April 18, 2010",
            "detail_rating": {
                "business": null,
                "cleanliness": 5.0,
                "desk": null,
                "location": 5.0,
                "pool": null,
                "restaurant": null,
                "rooms": 5.0,
                "service": 5.0,
                "sleep": 5.0,
                "value": 5.0
            },
            "helpfulness": null,
            "id": 61833423,
            "likes": {
                "disliked": null,
                "liked": null
            },
            "rating": 5.0,
            "stay_parameters": "Stayed April 2010, traveled as a couple",
            "text": "The reception staff were very helpful when we checked in after a long drive from Edinburgh, and gave us a thorough run through of the hotel and facilities and took care of our bags for the rest of the day until we got back mid-afternoon. There was an interesting art exhibition in the foyer, which was an unusual touch, and there were a lot of press cuttings on the wall by the lifts giving rave reviews of the hotel, bars and restaurant.",
            "title": "Fantastic hotel, great Skylounge, central location, great value and service",
            "user": "SuzanneVega"
        },
        {
            "date": "April 12, 2010",
            "detail_rating": {
                "business": null,
                "cleanliness": 5.0,
                "desk": null,
                "location": 5.0,
                "pool": null,
                "restaurant": null,
                "rooms": 4.0,
                "service": 5.0,
                "sleep": 5.0,
                "value": 5.0
            },
            "helpfulness": null,
            "id": 61072775,
            "likes": {
                "disliked": null,
                "liked": null
            },
            "rating": 5.0,
            "stay_parameters": "Stayed April 2010, traveled with friends",
            "text": "The room was on the 9th floor and had beautiful views over the canal and Leeds. When we arrived the room was very clean, fresh and modern. The pics I had seen on the internet made it look a bit like a student hall of residence, but it wasn't like that at all. The bathroom was beautiful with a large high pressure shower and trendy style sink. The white company toiletries were a nice touch, but its a shame they top up the fixed handwash and shower gel with water to make the bottles look full all the time.",
            "title": "sunday lunch here is the best ever",
            "user": "dulais"
        }
    ],
    "slim_ranking": 0.0869565217391,
    "stars": 4,
    "tripadvisor": {
        "VISITED": false,
        "country_name": null,
        "locality": null,
        "pic_link": null,
        "street_address": null
    },
    "user_rating": 4.5,
    "variance": {
        "average": 139,
        "excellent": 828,
        "poor": 40,
        "terrible": 28,
        "very good": 536
    }
}