{
    "aka": "Makati Shangri-La Manila Hotel",
    "description": "Makati Shangri-La, Manila is located at the center of Manila's most prestigious business, shopping and entertainment district. Just 20 minutes away from the international airport, this award-winning hotel offers exquisite comfort and world class luxury. From its exceptionally spacious and beautifully appointed rooms to its lavish restaurants and exciting bars, its high-speed internet access to its full-service Spa and Fitness Center, Makati Shangri-La lives up to its reputation as Manilas leading hotel.",
    "detail_rating": {
        "cleanliness": 4.5,
        "location": 5.0,
        "rooms": 4.5,
        "service": 4.5,
        "sleep": 4.5,
        "value": 4.5
    },
    "location": {
        "city": null,
        "continent": "Asia",
        "country": "Philippines",
        "proposed_city": null,
        "province": null,
        "region": null
    },
    "name": "Makati Shangri-La Manila",
    "places": {
        "aka": [
            "Makati",
            "Shangri-La",
            "Manila"
        ],
        "hotel_description": [
            "Makati",
            "Shangri-La",
            "Manila"
        ],
        "hotel_name": [
            "Makati",
            "Shangri-La",
            "Manila"
        ]
    },
    "review_count": 980,
    "review_count_current": 20,
    "reviews": [
        {
            "date": "May 20, 2008",
            "detail_rating": {
                "business": 5.0,
                "cleanliness": 5.0,
                "desk": null,
                "front_desk": 5.0,
                "location": 5.0,
                "pool": null,
                "restaurant": null,
                "rooms": 5.0,
                "service": 5.0,
                "sleep": null,
                "value": 5.0
            },
            "helpfulness": 1,
            "id": 16262838,
            "likes": {
                "disliked": "\u2014 There is nothing to dislike",
                "liked": "\u2014 Everything - this is a very classy hotel at a reasonable price"
            },
            "rating": 5.0,
            "stay_parameters": "Stayed May 2008, traveled with family",
            "text": "This is a very short review because this is quite simply the best hotel in the World. I have stayed in good hotels over my 40 years travelling and this is the first place I have stayed where I don't have a single complaint, even a minute one.",
            "title": "Simply the best there is",
            "user": "CTCTraveller"
        },
        {
            "date": "May 19, 2008",
            "detail_rating": {
                "business": 5.0,
                "cleanliness": 5.0,
                "desk": null,
                "front_desk": 5.0,
                "location": 5.0,
                "pool": null,
                "restaurant": null,
                "rooms": 5.0,
                "service": 5.0,
                "sleep": null,
                "value": 4.0
            },
            "helpfulness": 1,
            "id": 16222812,
            "likes": {
                "disliked": "\u2014 Traffic around the hotel",
                "liked": "\u2014 Afternoon tea at the Horizon Club"
            },
            "rating": 5.0,
            "stay_parameters": "Stayed November 2007, traveled on business",
            "text": "If you are travelling to Manila and you don't stay here, you are missing an experience.",
            "title": "Incredible",
            "user": "4MileSurfer"
        },
        {
            "date": "May 5, 2008",
            "detail_rating": {
                "business": 5.0,
                "cleanliness": 5.0,
                "desk": null,
                "front_desk": 5.0,
                "location": 5.0,
                "pool": null,
                "restaurant": null,
                "rooms": 5.0,
                "service": 5.0,
                "sleep": null,
                "value": 4.0
            },
            "helpfulness": 1,
            "id": 15676795,
            "likes": {
                "disliked": null,
                "liked": null
            },
            "rating": 5.0,
            "stay_parameters": "Stayed April 2008, traveled on business",
            "text": "What a place! Everything from the moment you walk through the front doors is perfection. I'm not usually into staying in such fancy hotels, but this place was incredible. Definitely the best hotel in the Philippines.",
            "title": "#1 for good reason! Love the Shang!",
            "user": "dm713"
        },
        {
            "date": "April 30, 2008",
            "detail_rating": {
                "business": null,
                "cleanliness": 4.0,
                "desk": null,
                "front_desk": 5.0,
                "location": 5.0,
                "pool": null,
                "restaurant": null,
                "rooms": 5.0,
                "service": 5.0,
                "sleep": null,
                "value": 5.0
            },
            "helpfulness": 4,
            "id": 15497280,
            "likes": {
                "disliked": "\u2014 Nothing",
                "liked": "\u2014 Rooms, location, services and F&B!"
            },
            "rating": 5.0,
            "stay_parameters": "Stayed April 2008, traveled on business",
            "text": "The Shangri-La is #1 for a reason. It's absolutely the best hotel in Manila. Location is fantastic, right in the center of Makati with a wide range of shopping and restaurants right outside the door.",
            "title": "Wonderful Stay @ Makati Shangri-La",
            "user": "EanNee L"
        },
        {
            "date": "March 28, 2008",
            "detail_rating": {
                "business": 5.0,
                "cleanliness": 5.0,
                "desk": null,
                "front_desk": 5.0,
                "location": 5.0,
                "pool": null,
                "restaurant": null,
                "rooms": 5.0,
                "service": 5.0,
                "sleep": null,
                "value": 5.0
            },
            "helpfulness": 5,
            "id": 14608546,
            "likes": {
                "disliked": "\u2014 Some inconsistencies with food on weekend breakfast or dinner buffet",
                "liked": "\u2014 Professional staff, great breakfast, great gym, close to shopping areas"
            },
            "rating": 5.0,
            "stay_parameters": "Stayed March 2008, traveled on business",
            "text": "Even though the room decor hasn't changed in several years, it's so well-maintained that you'd think they just updated it. Service is tops, they're so attentive and welcoming. Restaurants inside the hotel are great too, be sure to check out Circles buffet breakfast...yum!",
            "title": "Oh, alright - pamper me!",
            "user": "mrtourne"
        },
        {
            "date": "October 2, 2008",
            "detail_rating": {
                "business": 5.0,
                "cleanliness": 5.0,
                "desk": null,
                "front_desk": 5.0,
                "location": 5.0,
                "pool": null,
                "restaurant": null,
                "rooms": 4.0,
                "service": 5.0,
                "sleep": null,
                "value": 4.0
            },
            "helpfulness": 1,
            "id": 20557238,
            "likes": {
                "disliked": "\u2014 The rooms need bringing up to date,; they're a little tired!",
                "liked": "\u2014 Comfortable with all that you could want to hand."
            },
            "rating": 5.0,
            "stay_parameters": "Stayed September 2008, traveled on business",
            "text": "I checked-in to the Shangri-La after checking out of the Hyatt Casino in Malate (see my review of that hotel elsewhere).",
            "title": "A Great Location for Business and Night Life!",
            "user": "OldVillain"
        },
        {
            "date": "October 2, 2008",
            "detail_rating": {
                "business": 5.0,
                "cleanliness": 5.0,
                "desk": null,
                "front_desk": 5.0,
                "location": 5.0,
                "pool": null,
                "restaurant": null,
                "rooms": 5.0,
                "service": 5.0,
                "sleep": null,
                "value": 5.0
            },
            "helpfulness": 2,
            "id": 20547232,
            "likes": {
                "disliked": "\u2014 Nothing",
                "liked": "\u2014 The room was spotless and felt warm and friendly, the wood panelling and curved walls are so much nicer than some of the very modern hotels with a minimal look"
            },
            "rating": 5.0,
            "stay_parameters": "Stayed September 2008, traveled as a couple",
            "text": "Once you have picked up your jaw from the luxurious pile of the circular carpet in the most amazing lobby, you head towards the check-in desks on the right. The image that you are greeted with is five-start opulence.!",
            "title": "simply The Best",
            "user": "QueenslandDudes"
        },
        {
            "date": "September 30, 2008",
            "detail_rating": {
                "business": 2.0,
                "cleanliness": 5.0,
                "desk": null,
                "front_desk": 4.0,
                "location": 5.0,
                "pool": null,
                "restaurant": null,
                "rooms": 4.0,
                "service": 5.0,
                "sleep": null,
                "value": 4.0
            },
            "helpfulness": 2,
            "id": 20508873,
            "likes": {
                "disliked": "\u2014 Having to say good bye.",
                "liked": "\u2014 The entire experience."
            },
            "rating": 5.0,
            "stay_parameters": "Stayed June 2008, traveled on business",
            "text": "The staff are impeccable dressed in their smart uniforms, everyone is so polite. Walk in through the front doors and they are opened with a \u2018Good afternoon sir!\u2019 Immediately walk out again and they say \u2018Good afternoon sir \u2013 have a nice day!\u2019 Then turn a walk in again and you are greeted with another \u2018Good afternoon sir!\u2019",
            "title": "Awesome",
            "user": "purplepanthar"
        },
        {
            "date": "September 28, 2008",
            "detail_rating": {
                "business": 1.0,
                "cleanliness": 3.0,
                "desk": null,
                "front_desk": 3.0,
                "location": 2.0,
                "pool": null,
                "restaurant": null,
                "rooms": 4.0,
                "service": 2.0,
                "sleep": null,
                "value": 4.0
            },
            "helpfulness": 3,
            "id": 20446581,
            "likes": {
                "disliked": null,
                "liked": null
            },
            "rating": 2.0,
            "stay_parameters": "Stayed August 2008, traveled on business",
            "text": "Once you are shown into the luxurious lifts (elevators) you choose your floor and steal yourself for the experience of your room.",
            "title": "Beware of the nocturnal activities",
            "user": "sparkshamilton"
        },
        {
            "date": "September 27, 2008",
            "detail_rating": {
                "business": null,
                "cleanliness": 5.0,
                "desk": null,
                "front_desk": 5.0,
                "location": 5.0,
                "pool": null,
                "restaurant": null,
                "rooms": 5.0,
                "service": 5.0,
                "sleep": null,
                "value": 5.0
            },
            "helpfulness": 2,
            "id": 20432921,
            "likes": {
                "disliked": "\u2014 maybe a bit too decadent, but if you can get over your guilt...",
                "liked": "\u2014 great rooms, great staff, great facilities..."
            },
            "rating": 5.0,
            "stay_parameters": "Stayed January 2004",
            "text": "It's a bit of an anti-climax!",
            "title": "Wow...",
            "user": "castorpollux01"
        },
        {
            "date": "July 15, 2008",
            "detail_rating": {
                "business": 5.0,
                "cleanliness": 5.0,
                "desk": null,
                "front_desk": 5.0,
                "location": 5.0,
                "pool": null,
                "restaurant": null,
                "rooms": 5.0,
                "service": 5.0,
                "sleep": null,
                "value": 5.0
            },
            "helpfulness": 2,
            "id": 17905718,
            "likes": {
                "disliked": "\u2014 security (military) detail",
                "liked": "\u2014 Location, service"
            },
            "rating": 5.0,
            "stay_parameters": "Stayed July 2007, traveled on business",
            "text": "I stayed in the Shangri La Makati for 2 nights from July 7 thru July 9. I must say that this is an excellent hotel with great amenities and excellent service from the front desk to housekeeping. I can't say enough how friendly the staff is. Even the Security (military I think) while attending to their serious duties took every opportunity to smile and greet all guests at the lobby (maybe to deflect their presence). Felt very secure but wondered why there was so much security in the first place. I greatly enjoyed the breakfast buffet although I couldn't partake in all the different kinds of cuisine! I wish I could stay all day and taste everything! Some of the bathroom fixtures were a little worn and dated but it did not deter the enjoyment of my stay there. The room is well-appointed and clean. You will not be disappointed. This is a top rated hotel in a great location. I was not able to try their spa as it was undergoing renovations so I went to \"The Spa\" in Greenbelt I. I also highly recommend this spa. I hope they don't raise the prices as this makes me all the more feel great about their services. Excellent massages and facials and I was really impressed with their facilities.",
            "title": "Exceeded My Expectations",
            "user": "fortune5"
        },
        {
            "date": "July 11, 2008",
            "detail_rating": {
                "business": null,
                "cleanliness": 3.0,
                "desk": null,
                "front_desk": 4.0,
                "location": 5.0,
                "pool": null,
                "restaurant": null,
                "rooms": 4.0,
                "service": 5.0,
                "sleep": null,
                "value": 4.0
            },
            "helpfulness": 2,
            "id": 17780366,
            "likes": {
                "disliked": "\u2014 Mold in the bathroom",
                "liked": "\u2014 Exceptional Service. Location"
            },
            "rating": 4.0,
            "stay_parameters": "Stayed June 2008, traveled on business",
            "text": "Nice big rooms with expansive use of blond woods and enough space for a sitting area & couch. While the room design is undoubtedly contemporary, it is a business hotel and so kind of uninspiring\u2026 but supremely comfortable all the same. Service is exceptional (as you would expect in the Philippines), and the food at the in-house restaurants is very good (I had a surprisingly good steak). Facilities are good \u2013 there are two pools, the larger of which is quite massive, and I could see two tennis courts from my window. Location in the heart of Makati is very good with shopping all around.",
            "title": "Nice hotel in central Manila",
            "user": "Kram3474"
        },
        {
            "date": "June 4, 2008",
            "detail_rating": {
                "business": 5.0,
                "cleanliness": 5.0,
                "desk": null,
                "front_desk": 5.0,
                "location": 3.0,
                "pool": null,
                "restaurant": null,
                "rooms": 5.0,
                "service": 5.0,
                "sleep": null,
                "value": 5.0
            },
            "helpfulness": 2,
            "id": 16670629,
            "likes": {
                "disliked": null,
                "liked": null
            },
            "rating": 5.0,
            "stay_parameters": "Stayed June 2008, traveled with family",
            "text": "What problems if any\u2026? Mold in the bathroom \u2013 in the shower and around the toilet. It\u2019s not that hard to keep away and to my mind it\u2019s unacceptable in top quality hotel. Otherwise, faultlessly good.",
            "title": "First class service",
            "user": "Arlene&Co"
        },
        {
            "date": "May 30, 2008",
            "detail_rating": {
                "business": 3.0,
                "cleanliness": 3.0,
                "desk": null,
                "front_desk": 5.0,
                "location": 5.0,
                "pool": null,
                "restaurant": null,
                "rooms": 4.0,
                "service": 5.0,
                "sleep": null,
                "value": 3.0
            },
            "helpfulness": 2,
            "id": 16504279,
            "likes": {
                "disliked": "\u2014 Hustle and bustle at breakfast restaurant, room rate",
                "liked": "\u2014 Location"
            },
            "rating": 4.0,
            "stay_parameters": "Stayed April 2008, traveled as a couple",
            "text": "Fab hotel we went there direct from the Pan Pacific in Singapore, this hotel is in the business district so dont expect a beach!! ,the staff make this hotel even better than it is, they are so polite, we had an Horizon room on the 23rd floor you have access to computers and your own lounge, have a look at a web site for other benefits, the buffet meals are great the cost around 3,600 peso for buffet breakfast for 3 people which is around \u00a341 massive choice and all very nice, ours was included in the expedia booked package, the pool is okay its outside on the 4th floor ok for kids, nice gym and tennis courts. Its well worth a look Rod and family U.K.",
            "title": "Nice hotel in great location, but",
            "user": "larissa28"
        },
        {
            "date": "May 24, 2008",
            "detail_rating": {
                "business": 4.0,
                "cleanliness": 5.0,
                "desk": null,
                "front_desk": 5.0,
                "location": 5.0,
                "pool": null,
                "restaurant": null,
                "rooms": 5.0,
                "service": 5.0,
                "sleep": null,
                "value": 5.0
            },
            "helpfulness": 2,
            "id": 16359214,
            "likes": {
                "disliked": null,
                "liked": null
            },
            "rating": 5.0,
            "stay_parameters": "Stayed January 2008",
            "text": "Somehow accidentally, my husband and I spent three nights at the Makati-Shangri-la (actually we were on our way from Taipei to Shanghai via Manila, where they told us, that we would need a visa for entering Shanghai - we did not know that, because we've been to Hongkong and Macau before, where we always got a tourist visa on arrival -; that's why we ended up at Manila.",
            "title": "excellent hotel",
            "user": "rob6732"
        },
        {
            "date": "September 2, 2008",
            "detail_rating": {
                "business": null,
                "cleanliness": 5.0,
                "desk": null,
                "front_desk": 5.0,
                "location": 5.0,
                "pool": null,
                "restaurant": null,
                "rooms": 5.0,
                "service": 5.0,
                "sleep": null,
                "value": 5.0
            },
            "helpfulness": 2,
            "id": 19628356,
            "likes": {
                "disliked": null,
                "liked": null
            },
            "rating": 5.0,
            "stay_parameters": "Stayed September 2008",
            "text": "We spent one night there using their holiday rate. We stayed at their deluxe room, used the spa, had airport limo pick up and drop off and ate at their restaurant. Emails were responded to within 24 hours.",
            "title": "Wished we had stayed longer.",
            "user": "JedH"
        },
        {
            "date": "September 1, 2008",
            "detail_rating": {
                "business": 3.0,
                "cleanliness": 5.0,
                "desk": null,
                "front_desk": 5.0,
                "location": 5.0,
                "pool": null,
                "restaurant": null,
                "rooms": 5.0,
                "service": 5.0,
                "sleep": null,
                "value": 3.0
            },
            "helpfulness": 2,
            "id": 19592778,
            "likes": {
                "disliked": "\u2014 The high price for everything",
                "liked": "\u2014 The high quality of the food"
            },
            "rating": 4.0,
            "stay_parameters": "Stayed March 2008, traveled on business",
            "text": "1) Room: 5/5 with comfortable beds, 2 types of robes (japanese style and terry cloth), little extras like bath salts, \"art\" lights (mini bar turns on), (2) complimentary bottles of water, flashlight, umbrella, free shoe shine etc.",
            "title": "Good but very expensive",
            "user": "parityerror"
        },
        {
            "date": "August 19, 2008",
            "detail_rating": {
                "business": null,
                "cleanliness": null,
                "desk": null,
                "location": null,
                "pool": null,
                "restaurant": null,
                "rooms": null,
                "service": null,
                "sleep": null,
                "value": null
            },
            "helpfulness": 3,
            "id": 19095917,
            "likes": {
                "disliked": null,
                "liked": null
            },
            "rating": 3.0,
            "stay_parameters": null,
            "text": "2) Spa - 5/5 I used their spa next to the gym since they have 24 hour spa service. They come to your room as an option for the same price. Tip: from 10 am to 3 pm, they have 30% discount. The only downside was that my masseuse talked too much but that is only a minor irritation. The rooms have showers, it was beautifully decorated and their tea was delicious. (7 herbs). The price was right with a discount.",
            "title": "Robbery in the business centre",
            "user": "BarneyLo"
        },
        {
            "date": "July 31, 2008",
            "detail_rating": {
                "business": null,
                "cleanliness": 5.0,
                "desk": null,
                "front_desk": 5.0,
                "location": 5.0,
                "pool": null,
                "restaurant": null,
                "rooms": 5.0,
                "service": 5.0,
                "sleep": null,
                "value": 5.0
            },
            "helpfulness": 2,
            "id": 18445989,
            "likes": {
                "disliked": "\u2014 the bathroom had mold on the ceiling",
                "liked": "\u2014 Comfortable bed and beautiful decor"
            },
            "rating": 5.0,
            "stay_parameters": "Stayed June 2008, traveled on business",
            "text": "3) Limo service - 5/5, 2 bottles of water, cold towels, professional service, new cars. Overpriced as expected but it was worth the convenience. Use only as a perk.",
            "title": "The best hotel ever",
            "user": "keyraj"
        },
        {
            "date": "July 30, 2008",
            "detail_rating": {
                "business": 5.0,
                "cleanliness": 5.0,
                "desk": null,
                "front_desk": 5.0,
                "location": 5.0,
                "pool": null,
                "restaurant": null,
                "rooms": 5.0,
                "service": 5.0,
                "sleep": null,
                "value": 5.0
            },
            "helpfulness": 2,
            "id": 18426751,
            "likes": {
                "disliked": null,
                "liked": null
            },
            "rating": 5.0,
            "stay_parameters": "Stayed July 2008, traveled on business",
            "text": "4) Extras: 5/5 for security and customer service. We had no complaints and there was security cameras everywhere. The corridors was well lit and had airconditioning. Tried the restaurant in the lobby. It was not bad. I would give it a 3/5 for food and 5/5 for ambience. They had a tennis court, their gym had new equipments and they also had a hair salon on site.",
            "title": "Exceptional Property and Service",
            "user": "thecosytraveller"
        }
    ],
    "slim_ranking": 0.0333333333333,
    "stars": 5,
    "tripadvisor": {
        "VISITED": false,
        "country_name": null,
        "locality": null,
        "pic_link": null,
        "street_address": null
    },
    "user_rating": 4.5,
    "variance": {
        "average": 33,
        "excellent": 723,
        "poor": 20,
        "terrible": 12,
        "very good": 192
    }
}