{
    "aka": "Melissa Wasi Peru/Pisaq",
    "description": "Melissa Wasi is a peaceful site, a very comfortable B&B surrounded by nature, mountains and the best views of the valley. All of this in a very homey environment.",
    "detail_rating": {
        "cleanliness": null,
        "location": null,
        "rooms": null,
        "service": null,
        "sleep": null,
        "value": null
    },
    "location": {
        "city": null,
        "continent": "South America",
        "country": "Peru",
        "proposed_city": null,
        "province": null,
        "region": "Cusco Region"
    },
    "name": "Melissa Wasi",
    "places": {
        "aka": [],
        "hotel_description": [],
        "hotel_name": []
    },
    "review_count": 77,
    "review_count_current": 20,
    "reviews": [
        {
            "date": "October 17, 2012",
            "detail_rating": {
                "business": null,
                "cleanliness": 4.0,
                "desk": null,
                "location": 5.0,
                "pool": null,
                "restaurant": null,
                "rooms": 4.0,
                "service": 4.0,
                "sleep": null,
                "value": 5.0
            },
            "helpfulness": 2,
            "id": 143019785,
            "likes": {
                "disliked": null,
                "liked": null
            },
            "rating": 5.0,
            "stay_parameters": "Stayed October 2012",
            "text": "I teach spiritual retreats and there is no better place than Melissa Was I in Pisaq. We loved the people, the rooms, the food at the Trattoria and the Blue Llama Cafe in town. All of our requests were accommodated and we had a great retreat.",
            "title": "Best place in Pisac. Great place for a retreat.",
            "user": "Guidowalter"
        },
        {
            "date": "October 11, 2012",
            "detail_rating": {
                "business": null,
                "cleanliness": 5.0,
                "desk": null,
                "location": 4.0,
                "pool": null,
                "restaurant": null,
                "rooms": 4.0,
                "service": 5.0,
                "sleep": 5.0,
                "value": 4.0
            },
            "helpfulness": 1,
            "id": 142601934,
            "likes": {
                "disliked": null,
                "liked": null
            },
            "rating": 4.0,
            "stay_parameters": "Stayed October 2012, traveled with friends",
            "text": "Joyce and Chito, the owners are lovely and very helpful. Someone from our group needed medical help (don't drink Chicha in the street!) and Joyce spend a whole day taking care of him. Thank you Joyce.",
            "title": "Basic rooms, welcoming host, lovely garden",
            "user": "Carol S"
        },
        {
            "date": "October 8, 2012",
            "detail_rating": {
                "business": null,
                "cleanliness": 3.0,
                "desk": null,
                "location": 3.0,
                "pool": null,
                "restaurant": null,
                "rooms": 4.0,
                "service": 4.0,
                "sleep": 3.0,
                "value": 3.0
            },
            "helpfulness": null,
            "id": 142320278,
            "likes": {
                "disliked": null,
                "liked": null
            },
            "rating": 3.0,
            "stay_parameters": "Stayed June 2012, traveled with friends",
            "text": "We stayed here in October 2012 for one night with a friend. We were welcomed very graciously and visited with the host in a comfortable living room with a fire in the hearth. We were also able to eat our little repast here that we had brought. The rooms are in separate cabanas in a nice garden. Basic, clean, no heat, secure. The beds are lumpy, but did not keep us from sleeping soundly, because it is so quiet. Trees, lots of greenery and flowers, and an Italian restaurant on site with an American chef. Restaurant is closed Mon and Tues. Delicious home-made granola with quinoa for breakfast, and cooked eggs. The son of the host performs rituals using hallucinogenic roots--his father tells us people come from all over the world for these sessions. The hotel is hard to find because it is set apart from the main village, but all the taxis know where it is, and they are cheap and plentiful. The host also runs the Blue Llama restaurant in the center of Pisaq; food is very good there and they also have fruit smoothies and an ATM.",
            "title": "Melissa Wasi",
            "user": "Sheri M"
        },
        {
            "date": "September 9, 2012",
            "detail_rating": {
                "business": null,
                "cleanliness": 5.0,
                "desk": null,
                "location": 4.0,
                "pool": null,
                "restaurant": null,
                "rooms": 5.0,
                "service": 5.0,
                "sleep": 4.0,
                "value": 4.0
            },
            "helpfulness": 1,
            "id": 139806768,
            "likes": {
                "disliked": null,
                "liked": null
            },
            "rating": 5.0,
            "stay_parameters": "Stayed September 2012, traveled as a couple",
            "text": "I stayed at Melissa Wasi with a group of friends the end of June 2012. We got there at night and it was very dark with loud music playing and a \"purging ceremony\" going on---very weird. The rooms were comfortable and the food was good. Beware that there were RATS running up and down the walls of the restaurant. The restaurant was built into the side of a mountain so it was interesting to see but still the rats were a big worry. Some of the guys in our group heard them banging around the kitchen in the evening. We mentioned it to the owner and he just smiled.",
            "title": "Tranquil, welcoming and great showers",
            "user": "Heather S"
        },
        {
            "date": "June 15, 2012",
            "detail_rating": {
                "business": null,
                "cleanliness": 3.0,
                "desk": null,
                "location": 2.0,
                "pool": null,
                "restaurant": null,
                "rooms": 2.0,
                "service": 4.0,
                "sleep": 4.0,
                "value": 3.0
            },
            "helpfulness": null,
            "id": 132069380,
            "likes": {
                "disliked": null,
                "liked": null
            },
            "rating": 3.0,
            "stay_parameters": "Stayed May 2012, traveled with family",
            "text": "Situated outside the hustle and bustle of the touristy area and close to the river this B&B first welcomes you with a sign, \"Mi casa es tu casa\" and they mean it. We arrived after dark and without a reservation and the owner greeted us with a friendly smile and said, \"no problem.\" He then welcomed us into his personal residence for a fireside chat. The experience was a nice change from the austerity of some hotels and the down-to-earth nature of owner and well-kept grounds made for a very pleasant stay. Also- BEST showers in South America and the cleanest accommodations. Highly recommended for travelers that want more than just a room.",
            "title": "basic lodging in serene setting",
            "user": "Gibaoz"
        },
        {
            "date": "December 4, 2011",
            "detail_rating": {
                "business": null,
                "cleanliness": 5.0,
                "desk": null,
                "location": 5.0,
                "pool": null,
                "restaurant": null,
                "rooms": 5.0,
                "service": 5.0,
                "sleep": 5.0,
                "value": 5.0
            },
            "helpfulness": 1,
            "id": 121392997,
            "likes": {
                "disliked": null,
                "liked": null
            },
            "rating": 5.0,
            "stay_parameters": "Stayed November 2011, traveled with friends",
            "text": "Joyce and Chito, the owners, will do anything to make your stay so beautiful. They bring hospitality really to a different level. They live hospitality from their hearts. They inspire their staff to do the same! Melissa Wasi is the dreamspot in the valley. Surrounded by a beautiful garden where many hummingbirds love to stay. The rooms are located in original made houses of adobe, which create a wonderful atmosphere. They are very helpful in organizing you trip and know a lot of beautiful locations.",
            "title": "More than you can dream.",
            "user": "whopi"
        },
        {
            "date": "November 27, 2011",
            "detail_rating": {
                "business": null,
                "cleanliness": 4.0,
                "desk": null,
                "location": 5.0,
                "pool": null,
                "restaurant": null,
                "rooms": 4.0,
                "service": 5.0,
                "sleep": 5.0,
                "value": 4.0
            },
            "helpfulness": 1,
            "id": 121104698,
            "likes": {
                "disliked": null,
                "liked": null
            },
            "rating": 5.0,
            "stay_parameters": "Stayed October 2011, traveled with family",
            "text": "We chose Melissa Wasi to start our trip in the Sacred Valley. Because we have never been at altitudes higher than 2 km before, we decided to get acclimatized in the Valley before going up to Cusco and other places higher than 3 km. We stayed 2 nights in the bungalow B3 facing a newly built restaurant. We enjoyed our stay. The hosts are wonderful people ready to help with everything. They arranged a taxi to pick up us at airport. They called a taxi and provided walking sticks for our trip to Pisac ruins. When we found that TV in our room lacks DVD player, we asked the hosts and they sent a person who brought a player and connected it to TV. Every evening, a person appeared in our bungalow to start a fireplace for us. The only problem, I could not figure out how to stop smoke from seeping into the room. Aside from this, everything was great. We liked flowers, beautiful garden, and mountain scenery. We also liked the new restaurant building that uses natural rock as one of its walls.",
            "title": "Great place-wonderful hosts",
            "user": "IAF37221"
        },
        {
            "date": "August 20, 2011",
            "detail_rating": {
                "business": null,
                "cleanliness": null,
                "desk": null,
                "location": null,
                "pool": null,
                "restaurant": null,
                "rooms": null,
                "service": 5.0,
                "sleep": 5.0,
                "value": 5.0
            },
            "helpfulness": 1,
            "id": 116983936,
            "likes": {
                "disliked": null,
                "liked": null
            },
            "rating": 5.0,
            "stay_parameters": "Stayed August 2011, traveled as a couple",
            "text": "This bed and breakfast is nestled on a pristine piece of land framed with breathtaking views.",
            "title": "Like Home in Paradise",
            "user": "Sarah R"
        },
        {
            "date": "August 19, 2011",
            "detail_rating": {
                "business": null,
                "cleanliness": 3.0,
                "desk": null,
                "location": null,
                "pool": null,
                "restaurant": null,
                "rooms": null,
                "service": 5.0,
                "sleep": 3.0,
                "value": 5.0
            },
            "helpfulness": null,
            "id": 116935776,
            "likes": {
                "disliked": null,
                "liked": null
            },
            "rating": 4.0,
            "stay_parameters": "Stayed April 2011, traveled with family",
            "text": "Chito, the owner, (his wife Joyce was out of town) greeted my fiance and I when we arrived and showed us to our room. His sincerity and genuine hospitality were refreshing to say the least.",
            "title": "Beautiful location - great hosts - room avg",
            "user": "nb+kids"
        },
        {
            "date": "August 16, 2011",
            "detail_rating": {
                "business": null,
                "cleanliness": 5.0,
                "desk": null,
                "location": null,
                "pool": null,
                "restaurant": null,
                "rooms": null,
                "service": 5.0,
                "sleep": 5.0,
                "value": 5.0
            },
            "helpfulness": null,
            "id": 116796048,
            "likes": {
                "disliked": null,
                "liked": null
            },
            "rating": 5.0,
            "stay_parameters": "Stayed August 2011, traveled as a couple",
            "text": "We stayed in room 4 which was a sweet space including a comfortable bed and a brightly sun-lit bathroom.",
            "title": "Wonderful place to stay with delicious food!",
            "user": "Marie_Claire186338"
        },
        {
            "date": "May 9, 2013",
            "detail_rating": {
                "business": null,
                "cleanliness": 5.0,
                "desk": null,
                "location": 5.0,
                "pool": null,
                "restaurant": null,
                "rooms": 5.0,
                "service": 5.0,
                "sleep": 5.0,
                "value": 5.0
            },
            "helpfulness": null,
            "id": 160216184,
            "likes": {
                "disliked": null,
                "liked": null
            },
            "rating": 5.0,
            "stay_parameters": "Stayed April 2013, traveled with friends",
            "text": "Our group of seven spent one night at Melissa Wasi at the beginning of a week long tour of the Sacred Valley. And that would be my only regret, that it was just one night! We were instantly made to feel at home, and the views from the property are just wonderful. Tired and hungry, we enjoyed a delicious dinner in the on site restaurant, followed by a good night's sleep. Breakfast was included and served in the restaurant the next morning. The pancakes put smiles on our faces. This place is popular with retreat groups. The grounds are large and beautifully kept, the owner very kind, and the staff lovely.",
            "title": "Serene Setting and Warm Welcome",
            "user": "BarbaraElizabeth"
        },
        {
            "date": "April 24, 2013",
            "detail_rating": {
                "business": null,
                "cleanliness": 5.0,
                "desk": null,
                "location": 4.0,
                "pool": null,
                "restaurant": null,
                "rooms": 4.0,
                "service": 5.0,
                "sleep": 5.0,
                "value": 5.0
            },
            "helpfulness": 1,
            "id": 158688460,
            "likes": {
                "disliked": null,
                "liked": null
            },
            "rating": 5.0,
            "stay_parameters": "Stayed April 2013, traveled with friends",
            "text": "My friends and I always stay here when we are visiting the area of Pisac.",
            "title": "Magical, Peaceful and Rejuvenating",
            "user": "Calvenn S"
        },
        {
            "date": "January 24, 2013",
            "detail_rating": {
                "business": null,
                "cleanliness": 5.0,
                "desk": null,
                "location": 4.0,
                "pool": null,
                "restaurant": null,
                "rooms": 5.0,
                "service": 5.0,
                "sleep": 5.0,
                "value": 5.0
            },
            "helpfulness": 1,
            "id": 150543786,
            "likes": {
                "disliked": null,
                "liked": null
            },
            "rating": 5.0,
            "stay_parameters": "Stayed January 2013, traveled solo",
            "text": "The owner, Chito, is such a warm and amazing person. Very courteous and very service oriented.",
            "title": "Fantastic!",
            "user": "mary_l0is"
        },
        {
            "date": "December 27, 2012",
            "detail_rating": {
                "business": null,
                "cleanliness": 5.0,
                "desk": null,
                "location": 4.0,
                "pool": null,
                "restaurant": null,
                "rooms": 5.0,
                "service": 5.0,
                "sleep": 5.0,
                "value": 4.0
            },
            "helpfulness": 1,
            "id": 148154231,
            "likes": {
                "disliked": null,
                "liked": null
            },
            "rating": 5.0,
            "stay_parameters": "Stayed October 2012, traveled as a couple",
            "text": "I watched him enjoying pasta and some vino with some of his guests, while I was heading out to eat in town.",
            "title": "Our Pisac Choice",
            "user": "x2_travel_bug"
        },
        {
            "date": "November 4, 2012",
            "detail_rating": {
                "business": null,
                "cleanliness": 5.0,
                "desk": null,
                "location": 5.0,
                "pool": null,
                "restaurant": null,
                "rooms": 5.0,
                "service": 5.0,
                "sleep": 5.0,
                "value": 5.0
            },
            "helpfulness": 2,
            "id": 144508250,
            "likes": {
                "disliked": null,
                "liked": null
            },
            "rating": 5.0,
            "stay_parameters": "Stayed October 2012, traveled as a couple",
            "text": "There is also an incredible restaurant right across the street from the property owned by Chito as well. It makes for an amazing breakfast, lunch or dinner!",
            "title": "Great place to stay and live for a day or a month....",
            "user": "jboogie000"
        },
        {
            "date": "May 28, 2012",
            "detail_rating": {
                "business": null,
                "cleanliness": 5.0,
                "desk": null,
                "location": 5.0,
                "pool": null,
                "restaurant": null,
                "rooms": 5.0,
                "service": 5.0,
                "sleep": 5.0,
                "value": 5.0
            },
            "helpfulness": 1,
            "id": 130756147,
            "likes": {
                "disliked": null,
                "liked": null
            },
            "rating": 5.0,
            "stay_parameters": "Stayed November 2011, traveled with friends",
            "text": "a beautiful garden, comfortable rooms, delicious breakfast and lovely hospitable people .",
            "title": "beautiful and lovely place",
            "user": "jvb v"
        },
        {
            "date": "May 23, 2012",
            "detail_rating": {
                "business": null,
                "cleanliness": 2.0,
                "desk": null,
                "location": 4.0,
                "pool": null,
                "restaurant": null,
                "rooms": 2.0,
                "service": 3.0,
                "sleep": 2.0,
                "value": 2.0
            },
            "helpfulness": null,
            "id": 130485770,
            "likes": {
                "disliked": null,
                "liked": null
            },
            "rating": 3.0,
            "stay_parameters": "Stayed March 2012, traveled with family",
            "text": "a great place to stay.",
            "title": "Nice Area, Strange Atmosphere",
            "user": "johntrip01"
        },
        {
            "date": "May 10, 2012",
            "detail_rating": {
                "business": null,
                "cleanliness": 5.0,
                "desk": null,
                "location": 5.0,
                "pool": null,
                "restaurant": null,
                "rooms": 5.0,
                "service": 5.0,
                "sleep": 5.0,
                "value": 5.0
            },
            "helpfulness": null,
            "id": 129694943,
            "likes": {
                "disliked": null,
                "liked": null
            },
            "rating": 5.0,
            "stay_parameters": "Stayed April 2012, traveled with family",
            "text": "Rooms are expensive for the quality,some have no toilet inside.",
            "title": "Relaxing, amazing place!",
            "user": "mn2panama"
        },
        {
            "date": "December 17, 2011",
            "detail_rating": {
                "business": null,
                "cleanliness": 4.0,
                "desk": null,
                "location": 5.0,
                "pool": null,
                "restaurant": null,
                "rooms": 4.0,
                "service": 5.0,
                "sleep": 4.0,
                "value": 5.0
            },
            "helpfulness": 2,
            "id": 121841170,
            "likes": {
                "disliked": null,
                "liked": null
            },
            "rating": 5.0,
            "stay_parameters": "Stayed December 2011, traveled solo",
            "text": "You can also sleep with the same house of the owner like in a b&b,but you have them just close to your door.",
            "title": "A true home away from home",
            "user": "amatta69"
        },
        {
            "date": "December 12, 2011",
            "detail_rating": {
                "business": null,
                "cleanliness": 5.0,
                "desk": null,
                "location": 5.0,
                "pool": null,
                "restaurant": null,
                "rooms": 5.0,
                "service": 4.0,
                "sleep": 5.0,
                "value": 4.0
            },
            "helpfulness": 2,
            "id": 121668023,
            "likes": {
                "disliked": null,
                "liked": null
            },
            "rating": 5.0,
            "stay_parameters": "Stayed November 2011, traveled solo",
            "text": "His son is a Chaman and has a house on the same land and organize seminary chamanic rite and use the Ayawaska .",
            "title": "Great place, friendly people",
            "user": "swimthebeach"
        }
    ],
    "slim_ranking": 0.375,
    "stars": 3,
    "tripadvisor": {
        "VISITED": false,
        "country_name": null,
        "locality": null,
        "pic_link": null,
        "street_address": null
    },
    "user_rating": 4.5,
    "variance": {
        "average": 6,
        "excellent": 60,
        "poor": 0,
        "terrible": 0,
        "very good": 11
    }
}