{
    "aka": "Xanadu Island Resort Belize Hotel",
    "description": "Xanadu Island Resort lies hidden on an inviting palm lined beach, overlooking the Caribbean Sea and the Barrier Reef. Just a short walk to San Pedro Town, Xanadu Island Resort is close enough to enjoy the restaurants and other amenities of town, yet far enough from the hustle and bustle to be quiet and relaxed. All 18 of our luxurious condominium suites offer fully equipped kitchens and living/dining areas. Each suite is air conditioned, has cable TV, telephones, complimentary Wi-Fi and ethernet internet access, safes for valuables, hair dryers, IPOD docking stations, beach towels, large shaded decks with table, chairs and hammock overlooking the ocean, pool and/or gardens.",
    "detail_rating": {
        "cleanliness": 5.0,
        "location": 5.0,
        "rooms": 4.5,
        "service": 5.0,
        "sleep": 5.0,
        "value": 5.0
    },
    "location": {
        "city": null,
        "continent": "Central America",
        "country": "Belize",
        "proposed_city": "San",
        "province": null,
        "region": "Belize Cayes"
    },
    "name": "Xanadu Island Resort Belize",
    "places": {
        "aka": [],
        "hotel_description": [
            "San"
        ],
        "hotel_name": []
    },
    "review_count": 678,
    "review_count_current": 20,
    "reviews": [
        {
            "date": "February 25, 2011",
            "detail_rating": {
                "business": null,
                "cleanliness": 5.0,
                "desk": null,
                "location": 5.0,
                "pool": null,
                "restaurant": null,
                "rooms": 5.0,
                "service": 5.0,
                "sleep": 5.0,
                "value": 3.0
            },
            "helpfulness": 1,
            "id": 98002435,
            "likes": {
                "disliked": null,
                "liked": null
            },
            "rating": 5.0,
            "stay_parameters": "Stayed February 2011, traveled as a couple",
            "text": "This hotel is situated at the bottom of the strip. So it's still near everything with out being noisy. It has it's own lush gardens and private pier. The pool is heated and very cozy. The staff is wonderful and very accommodating. We had a great stay.",
            "title": "Very nice place",
            "user": "Nando18325"
        },
        {
            "date": "February 22, 2011",
            "detail_rating": {
                "business": null,
                "cleanliness": 4.0,
                "desk": null,
                "location": 5.0,
                "pool": null,
                "restaurant": null,
                "rooms": 3.0,
                "service": 4.0,
                "sleep": 4.0,
                "value": 3.0
            },
            "helpfulness": 1,
            "id": 97636523,
            "likes": {
                "disliked": null,
                "liked": null
            },
            "rating": 4.0,
            "stay_parameters": "Stayed February 2011, traveled as a couple",
            "text": "This is a great little hotel close to San Pedro but out of the busy city. It's on the beach, with a wonderful pool and grounds. One note however, the upstairs rooms require walking up quite a few stairs including a spiral staircase to the bedrooms. Not easy for all travelers.",
            "title": "Great little place",
            "user": "Kazan7151"
        },
        {
            "date": "February 17, 2011",
            "detail_rating": {
                "business": null,
                "cleanliness": 5.0,
                "desk": null,
                "location": 5.0,
                "pool": null,
                "restaurant": null,
                "rooms": 5.0,
                "service": 5.0,
                "sleep": 4.0,
                "value": 5.0
            },
            "helpfulness": 2,
            "id": 97020520,
            "likes": {
                "disliked": null,
                "liked": null
            },
            "rating": 5.0,
            "stay_parameters": "Stayed February 2011, traveled as a couple",
            "text": "This was our first trip to Belize, but definitely not our last! We were scheduled to vacation there a year ago but had to cancel that trip. We left our deposit on the books with Xanadu and excitedly re-scheduled for this year. Due to my miscommunication with them about our reservation, we ended up staying in three different units while there, but that was fine with us as we got to compare and contrast and have a better idea of which unit we will request when (not if) we return. As many others have already said, the staff at Xanadu is superb.....they are genuinely concerned about the comfort and happiness of their guests. Tiffany, Jamil and Orlando always greeted us with big smiles and warm conversation. The Belizeans in general are happy, friendly people and when you say no, the vendors don't harass you to buy their wares......the usual response was \"Well, maybe next time! Thank you for visiting our country!\" They are very appreciative of tourists there!",
            "title": "We'll be back!",
            "user": "StephanieCinMN"
        },
        {
            "date": "February 13, 2011",
            "detail_rating": {
                "business": null,
                "cleanliness": 5.0,
                "desk": null,
                "location": 5.0,
                "pool": null,
                "restaurant": null,
                "rooms": 5.0,
                "service": 5.0,
                "sleep": 5.0,
                "value": 5.0
            },
            "helpfulness": null,
            "id": 96392160,
            "likes": {
                "disliked": null,
                "liked": null
            },
            "rating": 5.0,
            "stay_parameters": "Stayed February 2011, traveled as a couple",
            "text": "We used Ecological Divers for several dives and also a snorkel trip to Shark Ray Alley. They, too, were wonderful to deal with.....very safety conscious, but still fun. Our trip to the Esmeralda site allowed us to see nurse sharks, stingrays, green eels, sea urchins, and many beautiful fish and corals! It was just awesome!",
            "title": "spectacular",
            "user": "1KAQ"
        },
        {
            "date": "February 5, 2011",
            "detail_rating": {
                "business": null,
                "cleanliness": 5.0,
                "desk": null,
                "location": 5.0,
                "pool": null,
                "restaurant": null,
                "rooms": 5.0,
                "service": 5.0,
                "sleep": 5.0,
                "value": 5.0
            },
            "helpfulness": 1,
            "id": 95619116,
            "likes": {
                "disliked": null,
                "liked": null
            },
            "rating": 5.0,
            "stay_parameters": "Stayed January 2011, traveled as a couple",
            "text": "We loved the ceviche at Fido's (and the relaxed atmosphere) and ate at Blue Water Grill several times because everything we ordered there was SO tasty! The highlight (food-wise) for us though, was the gibnut prepared especially at our request by Norman at El Fagon. He was a gracious host and we loved getting to know him.",
            "title": "Paradise With Wonderful Staff and Service",
            "user": "RushtonRocks"
        },
        {
            "date": "February 1, 2011",
            "detail_rating": {
                "business": null,
                "cleanliness": 5.0,
                "desk": null,
                "location": 5.0,
                "pool": null,
                "restaurant": null,
                "rooms": 5.0,
                "service": 5.0,
                "sleep": 5.0,
                "value": 5.0
            },
            "helpfulness": null,
            "id": 95233456,
            "likes": {
                "disliked": null,
                "liked": null
            },
            "rating": 5.0,
            "stay_parameters": "Stayed January 2011, traveled as a couple",
            "text": "Xanadu met all of our expectations. We loved the peaceful retreat-like feel of the resort and the \"step out your door\" proximity to the beach. The rooms were lovely. Pool was wonderful, and the lounge chairs placed strategically under the palms were perfect. The staff was always eager to help. The access to snorkeling and sea kayaking was very convenient. We would stay there again in a heart beat.",
            "title": "paradise",
            "user": "joanna057"
        },
        {
            "date": "January 27, 2011",
            "detail_rating": {
                "business": null,
                "cleanliness": 5.0,
                "desk": null,
                "location": 5.0,
                "pool": null,
                "restaurant": null,
                "rooms": 5.0,
                "service": 5.0,
                "sleep": 5.0,
                "value": 5.0
            },
            "helpfulness": null,
            "id": 94638763,
            "likes": {
                "disliked": null,
                "liked": null
            },
            "rating": 5.0,
            "stay_parameters": "Stayed January 2011, traveled as a couple",
            "text": "as usual we love going back to this friendly cozy home in the tropics....home is the right word. third time at the xanadu , and we already booked our forth time in september 2011. we are lucky enough to live in mexico, only 5 hours from the boat to san pedro, and we try to go back 2 times a year. the staff is incredible. Blanca, Tiffany, Jamil, Mr. Martin, Orlando, John and the cleaning staff all make you feel at home. I've been to many resorts around the world, ifrom 2 stars to 5 stars, but NEVER met a place quite like the Xanadu.....we are coming back in september, guys!",
            "title": "the best! now improved with heated pool!",
            "user": "fabiofort"
        },
        {
            "date": "January 27, 2011",
            "detail_rating": {
                "business": null,
                "cleanliness": 5.0,
                "desk": null,
                "location": 5.0,
                "pool": null,
                "restaurant": null,
                "rooms": 5.0,
                "service": 5.0,
                "sleep": 5.0,
                "value": 5.0
            },
            "helpfulness": null,
            "id": 94637492,
            "likes": {
                "disliked": null,
                "liked": null
            },
            "rating": 5.0,
            "stay_parameters": "Stayed January 2011, traveled as a couple",
            "text": "for the third time in one year we stayed at the xanadu resort. the prior two times management and staff were excellent, I did not believe that the excellence could improve, but it has! The friendly management and staff have made this my home away from home and totally cater to every want and need of their clients. This particular time my microwave went out and in 4 minutes the microwave was replaced. Again we thank Mr. Martin, Tiffany, Blanca, Jamil , Orlando and the cleaning staff for another wonderful stay in paradise.",
            "title": "6 stars again....and new heated pool!",
            "user": "the_bear32792"
        },
        {
            "date": "January 22, 2011",
            "detail_rating": {
                "business": null,
                "cleanliness": 5.0,
                "desk": null,
                "location": 5.0,
                "pool": null,
                "restaurant": null,
                "rooms": 5.0,
                "service": 5.0,
                "sleep": 5.0,
                "value": 5.0
            },
            "helpfulness": null,
            "id": 94037356,
            "likes": {
                "disliked": null,
                "liked": null
            },
            "rating": 5.0,
            "stay_parameters": "Stayed January 2011, traveled as a couple",
            "text": "We recently spent a week at Xanadu and truly enjoyed it. The facilities were kept very clean. The staff was always very nice and helpful whenever we needed it. While there are good restaurants only a few minutes away, we enjoyed the leisurely 20-minute walk along the beach to get to the central portion of San Pedro.",
            "title": "Lovely accomodations with very friendly & helpful staff!",
            "user": "JenK10213"
        },
        {
            "date": "January 21, 2011",
            "detail_rating": {
                "business": null,
                "cleanliness": 5.0,
                "desk": null,
                "location": 5.0,
                "pool": null,
                "restaurant": null,
                "rooms": 5.0,
                "service": 5.0,
                "sleep": 5.0,
                "value": 5.0
            },
            "helpfulness": null,
            "id": 93989989,
            "likes": {
                "disliked": null,
                "liked": null
            },
            "rating": 5.0,
            "stay_parameters": "Stayed August 2010, traveled on business",
            "text": "My fiance and I stayed at Xanadu in August and had the best vacation yet! We frequent SanPedro once a year and this was by far the best place to stay! The staff is very accomidating, the grounds are immaculate, and it is like you are in your own piece of paradise. Xanadu provides bikes to get to town in, kayaks to use, and a beautiful palapa bar near the pool. We went fishing and used the grill after each catch. Can't say enough positive things about the stay.",
            "title": "Tropical Splendor",
            "user": "jdrgnfli37"
        },
        {
            "date": "March 8, 2011",
            "detail_rating": {
                "business": null,
                "cleanliness": 5.0,
                "desk": null,
                "location": 5.0,
                "pool": null,
                "restaurant": null,
                "rooms": 5.0,
                "service": 5.0,
                "sleep": 5.0,
                "value": 5.0
            },
            "helpfulness": 1,
            "id": 99430705,
            "likes": {
                "disliked": null,
                "liked": null
            },
            "rating": 5.0,
            "stay_parameters": "Stayed March 2011, traveled as a couple",
            "text": "From the moment I inquired about availability many months ago, until our trip at the end of February/beginning of March, Blanca and Tiffany were efficient, accomodating, and a pleasure to work with in making our reservations and planning our stay. All of our excursions were booked prior to our arrival, and Jamil also made sure we were comfortable with our rooms, including purchasing a case of water for us to have in the fridge upon our arrival! Don't miss Collin's Lamanai tour, and Vitalino and Harrsion were perfect guides for the cave tubing and zip lining activities. The condo was exceptionally clean, and no details were underlooked. In fact, we tried to make coffee with the coffee pot in the kitchen the day of our arrival, and it was no longer operating. Our hosts returned with a brand new, in the box coffee maker within 1/2 hour! That's service! We will definitely return.",
            "title": "Magical Place and Oustanding Experience",
            "user": "ilona06"
        },
        {
            "date": "March 6, 2011",
            "detail_rating": {
                "business": null,
                "cleanliness": 4.0,
                "desk": null,
                "location": 4.0,
                "pool": null,
                "restaurant": null,
                "rooms": 4.0,
                "service": 5.0,
                "sleep": 4.0,
                "value": 4.0
            },
            "helpfulness": 1,
            "id": 99179844,
            "likes": {
                "disliked": null,
                "liked": null
            },
            "rating": 4.0,
            "stay_parameters": "Stayed June 2010, traveled as a couple",
            "text": "We really enjoyed our stay at Xanadu. The rooms were clean and even had a water spout at the bottom of the stairs to rinse off sand. We rented a golf cart and found it to be a good location from town. It's close enough to walk but also not so close that it becomes too noisy. They had a nice pier for boats to pick you up for excursions.",
            "title": "Cute rooms and nice pool",
            "user": "strawbebi"
        },
        {
            "date": "March 5, 2011",
            "detail_rating": {
                "business": null,
                "cleanliness": 5.0,
                "desk": null,
                "location": 5.0,
                "pool": null,
                "restaurant": null,
                "rooms": 5.0,
                "service": 5.0,
                "sleep": 5.0,
                "value": 5.0
            },
            "helpfulness": 1,
            "id": 99027436,
            "likes": {
                "disliked": null,
                "liked": null
            },
            "rating": 5.0,
            "stay_parameters": "Stayed February 2011, traveled as a couple",
            "text": "There was no restaurant on site but each room has a kitchen so it's easy to go shopping and prepare your own meals. The beds were comfortable and the bathrooms were clean as well.",
            "title": "A beautiful respite with excellent service",
            "user": "kderno"
        },
        {
            "date": "March 1, 2011",
            "detail_rating": {
                "business": null,
                "cleanliness": 5.0,
                "desk": null,
                "location": 5.0,
                "pool": null,
                "restaurant": null,
                "rooms": 5.0,
                "service": 5.0,
                "sleep": 4.0,
                "value": 5.0
            },
            "helpfulness": 1,
            "id": 98579154,
            "likes": {
                "disliked": null,
                "liked": null
            },
            "rating": 5.0,
            "stay_parameters": "Stayed December 2010, traveled with family",
            "text": "We had lil' alphonse for the snorkel tour and it was the most rewarding snorkel trip we have ever taken. The coral in belize is still really healthy and the abundance of fish was amazing!",
            "title": "Wonderful Resort in Paradise",
            "user": "joannau"
        },
        {
            "date": "February 27, 2011",
            "detail_rating": {
                "business": null,
                "cleanliness": 5.0,
                "desk": null,
                "location": 5.0,
                "pool": null,
                "restaurant": null,
                "rooms": 5.0,
                "service": 5.0,
                "sleep": 5.0,
                "value": 5.0
            },
            "helpfulness": 1,
            "id": 98267536,
            "likes": {
                "disliked": null,
                "liked": null
            },
            "rating": 5.0,
            "stay_parameters": "Stayed December 2010, traveled as a couple",
            "text": "We traveled to Xanadu with another couple with the aim of relaxation and some adventure. We found both! The resort is beautiful, very well maintained, and very relaxing. The service was wonderful! Jamil and Tiffany did a superb job of recommending and booking our activities and dining. We really were able to totally relax and enjoy. We miss it already!",
            "title": "A piece of paradise",
            "user": "Yvette9915"
        },
        {
            "date": "January 18, 2011",
            "detail_rating": {
                "business": null,
                "cleanliness": 5.0,
                "desk": null,
                "location": 5.0,
                "pool": null,
                "restaurant": null,
                "rooms": 4.0,
                "service": 5.0,
                "sleep": 4.0,
                "value": 4.0
            },
            "helpfulness": null,
            "id": 93564932,
            "likes": {
                "disliked": null,
                "liked": null
            },
            "rating": 4.0,
            "stay_parameters": "Stayed January 2011, traveled as a couple",
            "text": "My wife, daughter and I spent 5 days at Xanadu following a week in the interior of Belize and Guatamala. We were met at the airport and greeted on our arrival by a cordial and enthusiastic staff. Our room was upgraded to an ocean-ront condo with a full kitchen, two bedrooms, and two nicely appointed baths. The condo was immaculate and well maintained. There is a nice pool, small beach, and an \"activity desk\" for booking snorkeling trips and other excursions. They were also very helpful in suggesting restaurants and making reservations for us. The hotel also offers free use of bicycles and kayaks. We were able to explore the reef via kayak from the hotel. It is a 10 - 15 minute walk along the beach into downtown San Pedro for restaurants, shops and bars.",
            "title": "Wonderful Hotel on Ambergris Caye",
            "user": "esparelhoff"
        },
        {
            "date": "January 16, 2011",
            "detail_rating": {
                "business": null,
                "cleanliness": 5.0,
                "desk": null,
                "location": 5.0,
                "pool": null,
                "restaurant": null,
                "rooms": 5.0,
                "service": 5.0,
                "sleep": 5.0,
                "value": 5.0
            },
            "helpfulness": 1,
            "id": 93211459,
            "likes": {
                "disliked": null,
                "liked": null
            },
            "rating": 5.0,
            "stay_parameters": "Stayed January 2011, traveled as a couple",
            "text": "Overall, we would stay there again in a heartbeat. The staff was wonderful and very helpful.",
            "title": "Xanadu is perfect",
            "user": "jdmontana"
        },
        {
            "date": "January 5, 2011",
            "detail_rating": {
                "business": null,
                "cleanliness": 5.0,
                "desk": null,
                "location": 5.0,
                "pool": null,
                "restaurant": null,
                "rooms": 5.0,
                "service": 5.0,
                "sleep": 5.0,
                "value": 5.0
            },
            "helpfulness": 1,
            "id": 91840016,
            "likes": {
                "disliked": null,
                "liked": null
            },
            "rating": 5.0,
            "stay_parameters": "Stayed December 2010, traveled as a couple",
            "text": "I agree with the other reviews that say you cannot go wrong by staying at Xanadu. The grounds and rooms are beautiful and the people there could not be friendlier or more helpful. The location is great because you are just a walk away from San Pedro but far enough away that it is quiet and peaceful. We stayed in the studio suite and it was very spacious and had a well equipped kitchen. The kitchen was perfect because we are divers and could make our coffee and breakfast so we could be out on the dock for early boat rides. The other plus for divers is the free use of outdoor lockers to hang your dive stuff. The locker area has a good rinse area for your gear and secure storage-very helpful. Good grocery store about three minute walk away. Xanadu makes everything about your stay very easy.",
            "title": "Can't go wrong!",
            "user": "nikki545"
        },
        {
            "date": "January 3, 2011",
            "detail_rating": {
                "business": null,
                "cleanliness": 5.0,
                "desk": null,
                "location": 5.0,
                "pool": null,
                "restaurant": null,
                "rooms": 5.0,
                "service": 5.0,
                "sleep": 5.0,
                "value": 4.0
            },
            "helpfulness": 3,
            "id": 91628696,
            "likes": {
                "disliked": null,
                "liked": null
            },
            "rating": 5.0,
            "stay_parameters": "Stayed December 2010, traveled with family",
            "text": "What takes this place to another level is the people. Tiffany and Jamil help you arrange tours or whatever you need and everything they pointed us to was great. Orlando keeps the place beautiful and is perhaps the friendliest person you will ever meet and can answer any question you have about the island.",
            "title": "Excitement, Quiet, Comfort- all in one spot",
            "user": "HappyTraveler247"
        },
        {
            "date": "January 3, 2011",
            "detail_rating": {
                "business": null,
                "cleanliness": 5.0,
                "desk": null,
                "location": 5.0,
                "pool": null,
                "restaurant": null,
                "rooms": 5.0,
                "service": 5.0,
                "sleep": 5.0,
                "value": 5.0
            },
            "helpfulness": null,
            "id": 91548167,
            "likes": {
                "disliked": null,
                "liked": null
            },
            "rating": 5.0,
            "stay_parameters": "Stayed September 2010, traveled as a couple",
            "text": "Some reviews question the lack of a restaurant on property. This is no problem and frankly is a good thing because the resort is not large and a restaurant would just add noise. There are fine restaurants and bars within a five minute walk down the beach in either direction. When you want to go further away, cabs cost just five bucks U.S. and the desk can call one for you or you just walk out the front of the resort and wave one down. It never took more than two minutes to get a cab. If you do need a beer or soda while hanging around the pool or beach you can get one at the front desk for about the same price as the grocery, so no need for a bar. In short, you have everything you need at Xanadu and can get to whatever else you want in minutes. I would stay there again and would recommend it to anyone.",
            "title": "Nothing Better.",
            "user": "jdavis1735"
        }
    ],
    "slim_ranking": 0.0740740740741,
    "stars": null,
    "tripadvisor": {
        "VISITED": false,
        "country_name": null,
        "locality": null,
        "pic_link": null,
        "street_address": null
    },
    "user_rating": 5.0,
    "variance": {
        "average": 11,
        "excellent": 586,
        "poor": 5,
        "terrible": 1,
        "very good": 75
    }
}