{
    "aka": "Fairfield Inn Philadelphia Airport Hotel Philadelphia",
    "description": null,
    "detail_rating": {
        "cleanliness": null,
        "location": null,
        "rooms": null,
        "service": null,
        "sleep": null,
        "value": null
    },
    "location": {
        "city": "Philadelphia",
        "continent": null,
        "country": "United States",
        "proposed_city": null,
        "province": null,
        "region": null
    },
    "name": "Fairfield Inn Philadelphia Airport",
    "places": {
        "aka": [
            "Fairfield",
            "Philadelphia"
        ],
        "hotel_description": [],
        "hotel_name": [
            "Fairfield",
            "Philadelphia"
        ]
    },
    "review_count": 240,
    "review_count_current": 20,
    "reviews": [
        {
            "date": "December 29, 2011",
            "detail_rating": {
                "business": null,
                "cleanliness": 4.0,
                "desk": null,
                "location": 5.0,
                "pool": null,
                "restaurant": null,
                "rooms": 3.0,
                "service": 5.0,
                "sleep": 4.0,
                "value": 3.0
            },
            "helpfulness": null,
            "id": 122244700,
            "likes": {
                "disliked": null,
                "liked": null
            },
            "rating": 3.0,
            "stay_parameters": "Stayed September 2011, traveled as a couple",
            "text": "We have stayed here a few times now, after long-haul flights into Philly, before continuing our journey the following day. The hotel is pretty unremarkable, but is located close to the airport (with free shuttle bus service) and staff are very friendly and helpful.",
            "title": "Good Location, Friendly Staff",
            "user": "CJS1962"
        },
        {
            "date": "November 28, 2011",
            "detail_rating": {
                "business": null,
                "cleanliness": 4.0,
                "desk": null,
                "location": 5.0,
                "pool": null,
                "restaurant": null,
                "rooms": 5.0,
                "service": 4.0,
                "sleep": 4.0,
                "value": 4.0
            },
            "helpfulness": null,
            "id": 121156586,
            "likes": {
                "disliked": null,
                "liked": null
            },
            "rating": 4.0,
            "stay_parameters": "Stayed January 2011, traveled solo",
            "text": "In our experience, the prices aren't particularly cheap but breakfast is included,",
            "title": "Good place to be stuck!",
            "user": "BicoastalCa"
        },
        {
            "date": "November 5, 2011",
            "detail_rating": {
                "business": null,
                "cleanliness": 3.0,
                "desk": null,
                "location": 4.0,
                "pool": null,
                "restaurant": null,
                "rooms": 3.0,
                "service": 4.0,
                "sleep": 3.0,
                "value": 3.0
            },
            "helpfulness": null,
            "id": 120198672,
            "likes": {
                "disliked": null,
                "liked": null
            },
            "rating": 3.0,
            "stay_parameters": "Stayed September 2011, traveled with family",
            "text": "There's a Ruby Tuesday restaurant over the road from the hotel, which is very convenient if you have not yet picked up your rental car (which we tend to do the following morning). There's also an ATM/cash-point within walking distance.",
            "title": "Good enough for a one night stay",
            "user": "Patti9518"
        },
        {
            "date": "November 5, 2011",
            "detail_rating": {
                "business": null,
                "cleanliness": 4.0,
                "desk": null,
                "location": 5.0,
                "pool": null,
                "restaurant": null,
                "rooms": 4.0,
                "service": 5.0,
                "sleep": 4.0,
                "value": 4.0
            },
            "helpfulness": 1,
            "id": 120193806,
            "likes": {
                "disliked": null,
                "liked": null
            },
            "rating": 4.0,
            "stay_parameters": "Stayed October 2011, traveled as a couple",
            "text": "Was stuck here in January during an ice storm. Friendly staff who carefully handled getting all the stranded passengers to the airport in the morning. Good breakfast that thankfully was available early. Comfortable, clean room. Would definitely stay here again.",
            "title": "Clean, convenient, great service",
            "user": "greyheaded"
        },
        {
            "date": "October 24, 2011",
            "detail_rating": {
                "business": null,
                "cleanliness": 2.0,
                "desk": null,
                "location": 4.0,
                "pool": null,
                "restaurant": null,
                "rooms": 2.0,
                "service": 5.0,
                "sleep": null,
                "value": 1.0
            },
            "helpfulness": null,
            "id": 119693283,
            "likes": {
                "disliked": null,
                "liked": null
            },
            "rating": 2.0,
            "stay_parameters": "Stayed September 2011",
            "text": "My son and I stayed here for one night before flying out of Philadelphia International Airport. We arrived late and checked into our room. No issues with check in. The hotel was secure and the lobby and staff were nice. Our room, however, had a very musty odor. I sometimes suffer from asthma and thought that the smell was going to put me into an asthma attack. I should've requested a new room, but didn't because it was so late and we needed to leave at 4am the next morning.",
            "title": "Not worth staying here.",
            "user": "Tripmeister"
        },
        {
            "date": "May 30, 2012",
            "detail_rating": {
                "business": null,
                "cleanliness": 3.0,
                "desk": null,
                "location": null,
                "pool": null,
                "restaurant": null,
                "rooms": 3.0,
                "service": null,
                "sleep": 3.0,
                "value": 3.0
            },
            "helpfulness": null,
            "id": 130981135,
            "likes": {
                "disliked": null,
                "liked": null
            },
            "rating": 4.0,
            "stay_parameters": "Stayed May 2012, traveled on business",
            "text": "I didn't arrive until about 1130pm from a flight and still had no problems. Also I think I only waited about 10 minutes for the shuttle but I called when I arrived.",
            "title": "Little worn but no problems.",
            "user": "ktscott01"
        },
        {
            "date": "May 4, 2012",
            "detail_rating": {
                "business": null,
                "cleanliness": 4.0,
                "desk": null,
                "location": 4.0,
                "pool": null,
                "restaurant": null,
                "rooms": 4.0,
                "service": 5.0,
                "sleep": 4.0,
                "value": 4.0
            },
            "helpfulness": null,
            "id": 129374768,
            "likes": {
                "disliked": null,
                "liked": null
            },
            "rating": 5.0,
            "stay_parameters": "Stayed May 2012, traveled with family",
            "text": "Checkin",
            "title": "Good location, great staff",
            "user": "Mandy G"
        },
        {
            "date": "April 5, 2012",
            "detail_rating": {
                "business": null,
                "cleanliness": 4.0,
                "desk": null,
                "location": 4.0,
                "pool": null,
                "restaurant": null,
                "rooms": 4.0,
                "service": 5.0,
                "sleep": 4.0,
                "value": 4.0
            },
            "helpfulness": 3,
            "id": 127334919,
            "likes": {
                "disliked": null,
                "liked": null
            },
            "rating": 4.0,
            "stay_parameters": "Stayed March 2012, traveled with family",
            "text": "I was up there and to my room very fast. Plus they were training a new employee.",
            "title": "Good experience, convenient location",
            "user": "TexasClaire"
        },
        {
            "date": "March 21, 2012",
            "detail_rating": {
                "business": null,
                "cleanliness": 3.0,
                "desk": null,
                "location": 5.0,
                "pool": null,
                "restaurant": null,
                "rooms": 3.0,
                "service": 5.0,
                "sleep": 2.0,
                "value": 5.0
            },
            "helpfulness": null,
            "id": 126446688,
            "likes": {
                "disliked": null,
                "liked": null
            },
            "rating": 1.0,
            "stay_parameters": "Stayed January 2012, traveled with family",
            "text": "Room",
            "title": "Horrible stay!",
            "user": "leslie t"
        },
        {
            "date": "March 13, 2012",
            "detail_rating": {
                "business": null,
                "cleanliness": 3.0,
                "desk": null,
                "location": 3.0,
                "pool": null,
                "restaurant": null,
                "rooms": 2.0,
                "service": 3.0,
                "sleep": null,
                "value": 3.0
            },
            "helpfulness": null,
            "id": 126068588,
            "likes": {
                "disliked": null,
                "liked": null
            },
            "rating": 3.0,
            "stay_parameters": "Stayed March 2012",
            "text": "Yes the place is a little worn looking but I had no problems.",
            "title": "More basic than most",
            "user": "EricL97332"
        },
        {
            "date": "March 5, 2012",
            "detail_rating": {
                "business": null,
                "cleanliness": null,
                "desk": null,
                "location": null,
                "pool": null,
                "restaurant": null,
                "rooms": null,
                "service": null,
                "sleep": null,
                "value": null
            },
            "helpfulness": null,
            "id": 125676023,
            "likes": {
                "disliked": null,
                "liked": null
            },
            "rating": 2.0,
            "stay_parameters": null,
            "text": "\"Noise and mayhem in the hotel rooms at all hours.\" That sums up my experience.",
            "title": "Nice Building, Bad Hotel Guests",
            "user": "KorbinDallas"
        },
        {
            "date": "March 1, 2012",
            "detail_rating": {
                "business": null,
                "cleanliness": 4.0,
                "desk": null,
                "location": 5.0,
                "pool": null,
                "restaurant": null,
                "rooms": 4.0,
                "service": 5.0,
                "sleep": null,
                "value": 4.0
            },
            "helpfulness": null,
            "id": 125472516,
            "likes": {
                "disliked": null,
                "liked": null
            },
            "rating": 4.0,
            "stay_parameters": "Stayed February 2012",
            "text": "I give the facility 4 stars, housekeeping 4 stars, but hotel management 0 stars. I was here for a long weekend. I thought the airport travelers were well-behaved and mostly transparent. Some couples and large families though, staying here to attend functions or protests or youth sports tournaments were like crazy people. I was awakened all three nights of my stay by noise from an adjoining room.",
            "title": "Airport hotel",
            "user": "Traveler1966_MI"
        },
        {
            "date": "February 20, 2012",
            "detail_rating": {
                "business": null,
                "cleanliness": 2.0,
                "desk": null,
                "location": 2.0,
                "pool": null,
                "restaurant": null,
                "rooms": 2.0,
                "service": 2.0,
                "sleep": null,
                "value": 2.0
            },
            "helpfulness": null,
            "id": 124890956,
            "likes": {
                "disliked": null,
                "liked": null
            },
            "rating": 2.0,
            "stay_parameters": "Stayed February 2012",
            "text": "The location is a hidden gem if you are comfortable using the train to get to and from the central city inexpensively. I researched this long row of airport hotels ahead of time. Prices are great at all of them, this being one of the lowest. I will stay at a different one next time. The Eastwick station for the SEPTA train (it also services the airport) is a short four-block walk from here. And when it is time to leave, you don't have to worry about bad overnight weather because you are so close to the airport.",
            "title": "This should be a no go !!!!",
            "user": "jamid6"
        },
        {
            "date": "February 11, 2012",
            "detail_rating": {
                "business": null,
                "cleanliness": 3.0,
                "desk": null,
                "location": 4.0,
                "pool": null,
                "restaurant": null,
                "rooms": 3.0,
                "service": 3.0,
                "sleep": null,
                "value": 3.0
            },
            "helpfulness": null,
            "id": 124457086,
            "likes": {
                "disliked": null,
                "liked": null
            },
            "rating": 3.0,
            "stay_parameters": "Stayed February 2012",
            "text": "Great location near PHL, Ruby Tuesday across parking lot VERY convenient for business traveler without car. Breakfast in AM very basic...wouldn't mind seeing another hot item (i.e. biscuits & gravy).",
            "title": "Basic airport hotel",
            "user": "plightfo"
        },
        {
            "date": "January 5, 2012",
            "detail_rating": {
                "business": null,
                "cleanliness": 4.0,
                "desk": null,
                "location": 4.0,
                "pool": null,
                "restaurant": null,
                "rooms": 4.0,
                "service": 4.0,
                "sleep": 4.0,
                "value": 4.0
            },
            "helpfulness": null,
            "id": 122619165,
            "likes": {
                "disliked": null,
                "liked": null
            },
            "rating": 4.0,
            "stay_parameters": "Stayed December 2011, traveled with family",
            "text": "Basic hotel room, but fit my needs as business traveler, print boarding pass in lobby area. Shuttle service but did not utilize.",
            "title": "Fairfield inn by the Phila. Airport",
            "user": "akw1980"
        },
        {
            "date": "June 24, 2012",
            "detail_rating": {
                "business": null,
                "cleanliness": 5.0,
                "desk": null,
                "location": 5.0,
                "pool": null,
                "restaurant": null,
                "rooms": 4.0,
                "service": 5.0,
                "sleep": 4.0,
                "value": 4.0
            },
            "helpfulness": 1,
            "id": 132686171,
            "likes": {
                "disliked": null,
                "liked": null
            },
            "rating": 4.0,
            "stay_parameters": "Stayed June 2012, traveled on business",
            "text": "While this is an older hotel, it is well maintained, very clean, and has all the things business travellers need -- free internet, business center, continental breakfast. Staff was very pleasant. Very convenient to the airport and an easy shot to downtown. Will probably use it again.",
            "title": "Good hotel for overnight business trip",
            "user": "EJPVA"
        },
        {
            "date": "June 20, 2012",
            "detail_rating": {
                "business": null,
                "cleanliness": 5.0,
                "desk": null,
                "location": 3.0,
                "pool": null,
                "restaurant": null,
                "rooms": 3.0,
                "service": 5.0,
                "sleep": 3.0,
                "value": 5.0
            },
            "helpfulness": 1,
            "id": 132409715,
            "likes": {
                "disliked": null,
                "liked": null
            },
            "rating": 4.0,
            "stay_parameters": "Stayed June 2012, traveled with family",
            "text": "Stayed here for three nights on a \"mini-vacation\" to Philly (mostly a stop on the way to a week in DC). Hotel is out near the airport, so it is about 20 minutes to get into downtown (which we knew beforehand) but overall it was still pretty convenient.",
            "title": "Yup, it's a Fairfield Inn!",
            "user": "JDHLAGRK"
        },
        {
            "date": "June 16, 2012",
            "detail_rating": {
                "business": null,
                "cleanliness": 5.0,
                "desk": null,
                "location": 5.0,
                "pool": null,
                "restaurant": null,
                "rooms": 5.0,
                "service": 5.0,
                "sleep": 5.0,
                "value": 5.0
            },
            "helpfulness": 1,
            "id": 132125079,
            "likes": {
                "disliked": null,
                "liked": null
            },
            "rating": 5.0,
            "stay_parameters": "Stayed May 2012, traveled with friends",
            "text": "Hotel itself is unremarkable...it is a Fairfield Inn...but I will say that in general this particular hotel is extremely clean, and the staff has all been exceptionally friendly. There is a small pool here, they keep it nice and warm, and my kids loved it. Also a Ruby Tuesday right next door for dinner. There is a bit of noise from being so close to the airport, but honestly I didn't hear anything over the air conditioner, so it didn't bother me at all!",
            "title": "Excellent",
            "user": "jaybean"
        },
        {
            "date": "June 5, 2012",
            "detail_rating": {
                "business": null,
                "cleanliness": 4.0,
                "desk": null,
                "location": 5.0,
                "pool": null,
                "restaurant": null,
                "rooms": 4.0,
                "service": 5.0,
                "sleep": 3.0,
                "value": 4.0
            },
            "helpfulness": null,
            "id": 131355041,
            "likes": {
                "disliked": null,
                "liked": null
            },
            "rating": 4.0,
            "stay_parameters": "Stayed May 2012, traveled with family",
            "text": "Overall - I'd stay here again in a heartbeat!",
            "title": "Nice stay",
            "user": "kadett25"
        },
        {
            "date": "June 3, 2012",
            "detail_rating": {
                "business": null,
                "cleanliness": 3.0,
                "desk": null,
                "location": 5.0,
                "pool": null,
                "restaurant": null,
                "rooms": 3.0,
                "service": 5.0,
                "sleep": 2.0,
                "value": 5.0
            },
            "helpfulness": null,
            "id": 131204964,
            "likes": {
                "disliked": null,
                "liked": null
            },
            "rating": 3.0,
            "stay_parameters": "Stayed May 2012, traveled with family",
            "text": "I stayed here with two friends on Sunday May 20, 2012. We were going to MMRBQ in Camden NJ and were only at the hotel for a short time before and after the concert. It was very convenient for us as we were meeting from different parts of the east coast and it was an easy ride to and from the Susquehanna Bank Center.",
            "title": "Convenient location, okay stay",
            "user": "krisPa"
        }
    ],
    "slim_ranking": 0.392857142857,
    "stars": 2.5,
    "tripadvisor": {
        "VISITED": false,
        "country_name": null,
        "locality": null,
        "pic_link": null,
        "street_address": null
    },
    "user_rating": 3.5,
    "variance": {
        "average": 46,
        "excellent": 77,
        "poor": 21,
        "terrible": 18,
        "very good": 78
    }
}