{
    "aka": "Bartolomeo Hotel Venice",
    "description": null,
    "detail_rating": {
        "cleanliness": null,
        "location": null,
        "rooms": null,
        "service": null,
        "sleep": null,
        "value": null
    },
    "location": {
        "city": null,
        "continent": "Europe",
        "country": "Italy",
        "proposed_city": "Venice",
        "province": null,
        "region": "Veneto"
    },
    "name": "Hotel Bartolomeo",
    "places": {
        "aka": [
            "Venice"
        ],
        "hotel_description": [],
        "hotel_name": []
    },
    "review_count": 210,
    "review_count_current": 11,
    "reviews": [
        {
            "date": "October 25, 2007",
            "detail_rating": {
                "business": null,
                "cleanliness": 5.0,
                "desk": null,
                "front_desk": 4.0,
                "location": 5.0,
                "pool": null,
                "restaurant": null,
                "rooms": 5.0,
                "service": 4.0,
                "sleep": null,
                "value": 5.0
            },
            "helpfulness": 4,
            "id": 10314804,
            "likes": {
                "disliked": "\u2014 No lift",
                "liked": "\u2014 Everything"
            },
            "rating": 5.0,
            "stay_parameters": "Stayed July 2007, traveled with family",
            "text": "Could not have picked a better location if we paid five times as much! This hotel was awesome. It's right around the corner from the Rialto Bridge and 5 minutes walk (if you don't get lost) to St Marks. Breakfast was good, bed was comfortable and the room was clean and extremely spacious for European standards. Just beware that there is no lift which is probably the only thing keeping it from being a 3 star hotel (currently 2 star). Would definitely stay here again!!",
            "title": "Perfect location and an unbelievable 2* hotel!",
            "user": "Lijil"
        },
        {
            "date": "September 27, 2007",
            "detail_rating": {
                "business": null,
                "cleanliness": 4.0,
                "desk": null,
                "front_desk": 4.0,
                "location": 4.0,
                "pool": null,
                "restaurant": null,
                "rooms": 1.0,
                "service": 2.0,
                "sleep": null,
                "value": 3.0
            },
            "helpfulness": null,
            "id": 10010489,
            "likes": {
                "disliked": "\u2014 Muggy rooms, ineffective air con, noise 24/7",
                "liked": "\u2014 Good location close to attractions"
            },
            "rating": 2.0,
            "stay_parameters": "Stayed September 2007, traveled as a couple",
            "text": "When booking this hotel, I followed the advice of another reviewer and requested a high floor - to try and get a quiet room as much as to get a view over Venice! We were given a room on the 4th floor as requested however with no lift we had quite a hike to walk up and down each time. This also didn't counter the noise problem - everything from loud voices to clanging of dishes at all hours and of course a squillion church bells.",
            "title": "Noisy but good location",
            "user": "fm2007"
        },
        {
            "date": "August 24, 2007",
            "detail_rating": {
                "business": null,
                "cleanliness": 5.0,
                "desk": null,
                "front_desk": 5.0,
                "location": 5.0,
                "pool": null,
                "restaurant": null,
                "rooms": 4.0,
                "service": 4.0,
                "sleep": null,
                "value": 5.0
            },
            "helpfulness": null,
            "id": 8497612,
            "likes": {
                "disliked": "\u2014 no screens on windows - but common in italy",
                "liked": "\u2014 the bathroom"
            },
            "rating": 4.0,
            "stay_parameters": "Stayed August 2007, traveled with family",
            "text": "Another issue was that the room was hot and uncomfortably humid. Reception advised that the air conditioning is only turned on by request during off-peak times so we asked specifically for this to occur. Once operational, the air con was not very effective and even after running for several hours, the room wasn't noticeably cooler. Thus we left the windows open for fresh air one night and as there are no flywire screens we had the company of several hungry mosquitos! Also the next morning we found that the main control for our air con (at the front desk) had been turned off.",
            "title": "very impressed!",
            "user": "Ppessa"
        },
        {
            "date": "July 20, 2007",
            "detail_rating": {
                "business": null,
                "cleanliness": 5.0,
                "desk": null,
                "front_desk": 5.0,
                "location": 5.0,
                "pool": null,
                "restaurant": null,
                "rooms": 5.0,
                "service": 5.0,
                "sleep": null,
                "value": 5.0
            },
            "helpfulness": null,
            "id": 8207570,
            "likes": {
                "disliked": null,
                "liked": "\u2014 Price, nice room, location."
            },
            "rating": 5.0,
            "stay_parameters": "Stayed July 2007, traveled as a couple",
            "text": "Positive aspects - the hotel is in a convenient location near the main attractions of Venice. Reception staff were pleasant and easy to deal with, especially allowing us to leave luggage for a couple of hours after checking out. The breakfast options were good however the available quantities were quite small considering the number of guests (eg only a few yoghurt tubs were put out).",
            "title": "Highly recommended",
            "user": "Prinsarma"
        },
        {
            "date": "June 22, 2007",
            "detail_rating": {
                "business": null,
                "cleanliness": 5.0,
                "desk": null,
                "front_desk": 5.0,
                "location": 5.0,
                "pool": null,
                "restaurant": null,
                "rooms": 4.0,
                "service": 4.0,
                "sleep": null,
                "value": 5.0
            },
            "helpfulness": null,
            "id": 7960895,
            "likes": {
                "disliked": "\u2014 Room was minimally furnished",
                "liked": "\u2014 Location"
            },
            "rating": 4.0,
            "stay_parameters": "Stayed June 2007, traveled as a couple",
            "text": "Overall our experience could have been better as we didn't sleep well and wound up with heaps of mosquito bites. If we returned to Venice we would stay elsewhere; but only after asking questions about air con and noise issues!",
            "title": "Excellent value, good location",
            "user": "4eric"
        },
        {
            "date": "August 24, 2006",
            "detail_rating": {
                "business": null,
                "cleanliness": null,
                "desk": null,
                "location": null,
                "pool": null,
                "restaurant": null,
                "rooms": null,
                "service": null,
                "sleep": null,
                "value": null
            },
            "helpfulness": 3,
            "id": 5706634,
            "likes": {
                "disliked": null,
                "liked": null
            },
            "rating": 4.0,
            "stay_parameters": null,
            "text": "Just came back from venice and we had a great stay at hotel Bartolomeo! I booked it at the last minute at 70 euros a night and they told us it will be a small double room instead of the standard.",
            "title": "Good value for money. Great Location",
            "user": "Whyee"
        },
        {
            "date": "June 1, 2007",
            "detail_rating": {
                "business": null,
                "cleanliness": 4.0,
                "desk": null,
                "front_desk": 5.0,
                "location": 5.0,
                "pool": null,
                "restaurant": null,
                "rooms": 3.0,
                "service": 5.0,
                "sleep": null,
                "value": 4.0
            },
            "helpfulness": null,
            "id": 7729026,
            "likes": {
                "disliked": "\u2014 problems with A/C, no elevator",
                "liked": "\u2014 location"
            },
            "rating": 3.0,
            "stay_parameters": "Stayed May 2007, traveled as a couple",
            "text": "We booked the sister hotel, Rio Alto, but upon check-in, the room was not ready so they asked if we could stay here for the night instead.",
            "title": "Great Location. Good Price",
            "user": "OCragazza"
        },
        {
            "date": "May 15, 2007",
            "detail_rating": {
                "business": null,
                "cleanliness": 4.0,
                "desk": null,
                "front_desk": 4.0,
                "location": 4.0,
                "pool": null,
                "restaurant": null,
                "rooms": 4.0,
                "service": 4.0,
                "sleep": null,
                "value": 3.0
            },
            "helpfulness": 1,
            "id": 7624977,
            "likes": {
                "disliked": "\u2014 Some noise although it was not on a noisy street",
                "liked": "\u2014 Location"
            },
            "rating": 3.0,
            "stay_parameters": "Stayed May 2007, traveled as a couple",
            "text": "The hotel is definitely in a great location and for the price, the room is clean, quiet, and has all the basic amenities you need.",
            "title": "Good location, bit noisy",
            "user": "Zot"
        },
        {
            "date": "March 15, 2007",
            "detail_rating": {
                "business": null,
                "cleanliness": 4.0,
                "desk": null,
                "front_desk": 3.0,
                "location": 5.0,
                "pool": null,
                "restaurant": null,
                "rooms": 3.0,
                "service": 4.0,
                "sleep": null,
                "value": 5.0
            },
            "helpfulness": 1,
            "id": 7163577,
            "likes": {
                "disliked": null,
                "liked": null
            },
            "rating": 5.0,
            "stay_parameters": "Stayed November 2006, traveled with friends",
            "text": "The downside during our stay? Although there was A/C in the room, it shut off in the evening and we had to call front desk to turn it back on because the room (located on the top floor) was real hot during the night. When we checked in, another customer also complained their A/C shut off as well, so we must have not been the only ones that complained.",
            "title": "Fantastic location in the heart of Venice for a great price",
            "user": "SwannTraveller"
        },
        {
            "date": "March 6, 2007",
            "detail_rating": {
                "business": null,
                "cleanliness": 5.0,
                "desk": null,
                "front_desk": 5.0,
                "location": 5.0,
                "pool": null,
                "restaurant": null,
                "rooms": 4.0,
                "service": 5.0,
                "sleep": null,
                "value": 3.0
            },
            "helpfulness": 1,
            "id": 6925777,
            "likes": {
                "disliked": "\u2014 No lift",
                "liked": "\u2014 Simple, clean room"
            },
            "rating": 4.0,
            "stay_parameters": "Stayed October 2006, traveled as a couple",
            "text": "This hotel is great if you are on a budget or just passing through for a day or two. It is a basic, clean room but lacks any romantic charm. The next day when we checked into their sister hotel, Rio Alto, I would highly recommend that hotel much better (feel free to see my review on that one).",
            "title": "Nice, clean hotel",
            "user": "travelmot"
        },
        {
            "date": "October 30, 2006",
            "detail_rating": {
                "business": null,
                "cleanliness": 4.0,
                "desk": null,
                "front_desk": 5.0,
                "location": 5.0,
                "pool": null,
                "restaurant": null,
                "rooms": 5.0,
                "service": 4.0,
                "sleep": null,
                "value": 5.0
            },
            "helpfulness": 2,
            "id": 6030718,
            "likes": {
                "disliked": null,
                "liked": "\u2014 clean and safe"
            },
            "rating": 5.0,
            "stay_parameters": "Stayed October 2006, traveled with family",
            "text": "Last tip - make sure you print out the map on their website. We would have definitely gotten lost without it!! It's tucked away in a small alley.",
            "title": "Wonderful and reasonably priced",
            "user": "seek2know"
        }
    ],
    "slim_ranking": 0.45406824147,
    "stars": 2,
    "tripadvisor": {
        "VISITED": false,
        "country_name": null,
        "locality": null,
        "pic_link": null,
        "street_address": null
    },
    "user_rating": 4.0,
    "variance": {
        "average": 34,
        "excellent": 65,
        "poor": 8,
        "terrible": 3,
        "very good": 100
    }
}