{
    "aka": "Residence Inn Milpitas Silicon Valley Hotel",
    "description": null,
    "detail_rating": {
        "cleanliness": null,
        "location": null,
        "rooms": null,
        "service": null,
        "sleep": null,
        "value": null
    },
    "location": {
        "city": "Milpitas",
        "continent": null,
        "country": "United States",
        "proposed_city": "Milpitas",
        "province": null,
        "region": null
    },
    "name": "Residence Inn Milpitas Silicon Valley",
    "places": {
        "aka": [
            "Milpitas"
        ],
        "hotel_description": [],
        "hotel_name": [
            "Milpitas"
        ]
    },
    "review_count": 60,
    "review_count_current": 4,
    "reviews": [
        {
            "date": "March 1, 2006",
            "detail_rating": {
                "business": null,
                "cleanliness": 4.0,
                "desk": null,
                "location": null,
                "pool": null,
                "restaurant": null,
                "rooms": 4.0,
                "service": 5.0,
                "sleep": null,
                "value": 5.0
            },
            "helpfulness": 3,
            "id": 4567435,
            "likes": {
                "disliked": null,
                "liked": null
            },
            "rating": 5.0,
            "stay_parameters": "Stayed December 2005",
            "text": "Stayed there in December of 2005 on a family vacation. Front desk employees very accomodating and helpful. Breakfast basic but good enough. Room was cleaned daily including dirty dishes. Everyone there went out of their way to make us feel at home. Would stay again there any time.",
            "title": "Great place to stay!",
            "user": "TjLaura"
        },
        {
            "date": "February 6, 2006",
            "detail_rating": {
                "business": null,
                "cleanliness": null,
                "desk": null,
                "location": null,
                "pool": null,
                "restaurant": null,
                "rooms": null,
                "service": null,
                "sleep": null,
                "value": null
            },
            "helpfulness": 4,
            "id": 4418120,
            "likes": {
                "disliked": null,
                "liked": null
            },
            "rating": 5.0,
            "stay_parameters": null,
            "text": "The beauty of this property is that all aspects of services (genuinely friendly staff, nice clean quiet rooms, fantastic guest amenities and excellent location) are that of 5 star material. While initially I thought the (1) bedroom suite was a bit small (which it was compared to the larger studio), I came to appreciate the separation by wall and 2nd TV in the bedroom. Very impressed with the comfortable queen bed, 1/2 dozen pillows with snappy new pillow cases... oh can't forget to throw a shout out to what seemed like brand new towels also.",
            "title": "Serious bang for your buck",
            "user": "Rich a"
        },
        {
            "date": "January 3, 2006",
            "detail_rating": {
                "business": null,
                "cleanliness": 5.0,
                "desk": null,
                "location": null,
                "pool": null,
                "restaurant": null,
                "rooms": 4.0,
                "service": 4.0,
                "sleep": null,
                "value": 5.0
            },
            "helpfulness": 2,
            "id": 4319126,
            "likes": {
                "disliked": null,
                "liked": null
            },
            "rating": 5.0,
            "stay_parameters": "Stayed December 2005",
            "text": "Here's how far my $100 - out the door - got me and my family...",
            "title": "Great Hotel for a Family",
            "user": "wacko"
        },
        {
            "date": "June 2, 2005",
            "detail_rating": {
                "business": null,
                "cleanliness": null,
                "desk": null,
                "location": null,
                "pool": null,
                "restaurant": null,
                "rooms": null,
                "service": null,
                "sleep": null,
                "value": null
            },
            "helpfulness": 5,
            "id": 3522402,
            "likes": {
                "disliked": null,
                "liked": null
            },
            "rating": 4.0,
            "stay_parameters": null,
            "text": "STAFF - Offered free shuttle* services within a 5 mile radius of hotel, which we took to the Great Mall of Milpitas and connecting light rail station. We took the light rail into downtown for dinner and San Jose Sharks hockey game... Accomadating early check in and late check out, allowed us time to relax between outings.",
            "title": "Home away from Home",
            "user": "grandma joanie"
        }
    ],
    "slim_ranking": 0.0526315789474,
    "stars": 3,
    "tripadvisor": {
        "VISITED": false,
        "country_name": null,
        "locality": null,
        "pic_link": null,
        "street_address": null
    },
    "user_rating": 4.5,
    "variance": {
        "average": 5,
        "excellent": 33,
        "poor": 1,
        "terrible": 0,
        "very good": 21
    }
}