{
    "aka": "Residenz Stadslogement The Hague",
    "description": "Residenz is located right in the heart of the lively Duinoord neighbourhood of the Hague, on the almond-shaped Sweelinckplein square. The house was built in 1895 in preparation for the arrival of former emigrants returning from the Indias. More than 110 years after it was built Residenz opens its doors as a Guest House. We are a boutique hotel with the charm of a homely bed and breakfast and are ready to welcome you as our guests and offer a memorable stay.",
    "detail_rating": {
        "cleanliness": null,
        "location": null,
        "rooms": null,
        "service": null,
        "sleep": null,
        "value": null
    },
    "location": {
        "city": null,
        "continent": "Europe",
        "country": "The Netherlands",
        "proposed_city": null,
        "province": null,
        "region": null
    },
    "name": "Residenz Stadslogement",
    "places": {
        "aka": [],
        "hotel_description": [],
        "hotel_name": []
    },
    "review_count": 80,
    "review_count_current": 4,
    "reviews": [
        {
            "date": "June 28, 2009",
            "detail_rating": {
                "business": null,
                "cleanliness": 5.0,
                "desk": null,
                "location": 4.0,
                "pool": null,
                "restaurant": null,
                "rooms": 5.0,
                "service": 5.0,
                "sleep": null,
                "value": 5.0
            },
            "helpfulness": null,
            "id": 33346419,
            "likes": {
                "disliked": null,
                "liked": null
            },
            "rating": 5.0,
            "stay_parameters": "Stayed June 2009, traveled on business",
            "text": "Excellent location, spacious and comfortable. I stayed only one night but I felt at home and welcome. Delicious breakfast in the room, a lot of space and light, as well as all the niceties of a private apartment. I would recommend it without hesitation.",
            "title": "A gem",
            "user": "LuizTrip"
        },
        {
            "date": "April 22, 2009",
            "detail_rating": {
                "business": null,
                "cleanliness": 5.0,
                "desk": null,
                "location": 5.0,
                "pool": null,
                "restaurant": null,
                "rooms": 5.0,
                "service": 5.0,
                "sleep": null,
                "value": 5.0
            },
            "helpfulness": null,
            "id": 28567697,
            "likes": {
                "disliked": null,
                "liked": null
            },
            "rating": 5.0,
            "stay_parameters": "Stayed March 2009, traveled with family",
            "text": "I have just returned from a 2 night stay at The Residenz with my husband and our 2 year old son. It was a wonderful break and I will definitely return.",
            "title": "Wonderful find!",
            "user": "bkats"
        },
        {
            "date": "December 6, 2008",
            "detail_rating": {
                "business": null,
                "cleanliness": 5.0,
                "desk": null,
                "location": 5.0,
                "pool": null,
                "restaurant": null,
                "rooms": 5.0,
                "service": 5.0,
                "sleep": null,
                "value": 5.0
            },
            "helpfulness": 1,
            "id": 22489865,
            "likes": {
                "disliked": null,
                "liked": "\u2014 Our room was very comfortable"
            },
            "rating": 5.0,
            "stay_parameters": "Stayed November 2008, traveled as a couple",
            "text": "The building is on a little square about a 10 min tram ride from the centre of town and in the other direction, about a 10 min tram ride to the beach. It's a residential part of town with a few little local shops a minute's stroll away.",
            "title": "Very comfortable",
            "user": "BoDiddleyBoing"
        },
        {
            "date": "April 21, 2008",
            "detail_rating": {
                "business": 4.0,
                "cleanliness": 5.0,
                "desk": null,
                "location": 4.0,
                "pool": null,
                "restaurant": null,
                "rooms": 5.0,
                "service": 5.0,
                "sleep": null,
                "value": 4.0
            },
            "helpfulness": 2,
            "id": 15193329,
            "likes": {
                "disliked": null,
                "liked": null
            },
            "rating": 5.0,
            "stay_parameters": "Stayed April 2008, traveled on business",
            "text": "The room we stayed on was on the 1st floor overlooking the square. It was huge and accommodated all 3 of us with no problem. The bed is pretty much one of the most comfortable I have ever slept in with a remote control to raise head to your desired level. There's also a remote controlled real-look gas fire which made the room really cosy at night. There is a 'sitting room area' within the bedroom (all one big room) although we did see that the room on the other side of the landing had the 2 rooms split out (although that room had no fireplace or balcony).",
            "title": "a great little hotel",
            "user": "vinenid"
        }
    ],
    "slim_ranking": 0.0153846153846,
    "stars": 3,
    "tripadvisor": {
        "VISITED": false,
        "country_name": null,
        "locality": null,
        "pic_link": null,
        "street_address": null
    },
    "user_rating": 5.0,
    "variance": {
        "average": 2,
        "excellent": 76,
        "poor": 0,
        "terrible": 0,
        "very good": 2
    }
}