{
    "aka": "Magna Grecia Boutique Athens",
    "description": "Offering amazing views of the Acropolis, this intimate 4 star boutique hotel is centrally situated in historic Plaka, possibly the most charming Athens neighborhood, 5 minutes' walk from Syntagma Square.",
    "detail_rating": {
        "cleanliness": null,
        "location": null,
        "rooms": null,
        "service": null,
        "sleep": null,
        "value": null
    },
    "location": {
        "city": "Athens",
        "continent": "Europe",
        "country": "Greece",
        "proposed_city": null,
        "province": null,
        "region": "Attica"
    },
    "name": "Magna Grecia Boutique Hotel",
    "places": {
        "aka": [
            "Magna",
            "Athens"
        ],
        "hotel_description": [
            "Athens"
        ],
        "hotel_name": [
            "Magna"
        ]
    },
    "review_count": 247,
    "review_count_current": 20,
    "reviews": [
        {
            "date": "September 3, 2011",
            "detail_rating": {
                "business": null,
                "cleanliness": 4.0,
                "desk": null,
                "location": null,
                "pool": null,
                "restaurant": null,
                "rooms": null,
                "service": 5.0,
                "sleep": 5.0,
                "value": 4.0
            },
            "helpfulness": 1,
            "id": 117628288,
            "likes": {
                "disliked": null,
                "liked": null
            },
            "rating": 4.0,
            "stay_parameters": "Stayed August 2011, traveled as a couple",
            "text": "We stayed at Magna Grecia in Athens on our first night in Greece. The room was small, but had everything we needed - including an inward facing room not on the main road. The roof top terrace is quite lovely with good views of the acropolis, though the restaurant there is quite pricey. Magna Grecia is a short walk from two main metro stations, which is a real selling point of this place, as well as the location in a lovely part of historic Athens. The service here is also great - we left early in the morning before the buffet breakfast opened and the hotel staff packed us a very filling breakfast. Would definitely stay here again!",
            "title": "Great hotel, wonderful location",
            "user": "fortunecookies"
        },
        {
            "date": "August 15, 2011",
            "detail_rating": {
                "business": null,
                "cleanliness": 5.0,
                "desk": null,
                "location": null,
                "pool": null,
                "restaurant": null,
                "rooms": null,
                "service": 4.0,
                "sleep": 5.0,
                "value": 4.0
            },
            "helpfulness": null,
            "id": 116780337,
            "likes": {
                "disliked": null,
                "liked": null
            },
            "rating": 4.0,
            "stay_parameters": "Stayed May 2011, traveled as a couple",
            "text": "I really liked this hotel, mostly because of the location. We arrived at the Syntagma Metro station from the airport and walked 5-10 minutes to the hotel. It was little hard to find since the only thing on the street level is a door---next to a carpet shop! The reception is on the 2nd floor.",
            "title": "Great location!!",
            "user": "KitAustin_Texas"
        },
        {
            "date": "July 30, 2011",
            "detail_rating": {
                "business": null,
                "cleanliness": 4.0,
                "desk": null,
                "location": 5.0,
                "pool": null,
                "restaurant": null,
                "rooms": 2.0,
                "service": 3.0,
                "sleep": null,
                "value": 3.0
            },
            "helpfulness": 1,
            "id": 116010225,
            "likes": {
                "disliked": null,
                "liked": null
            },
            "rating": 3.0,
            "stay_parameters": "Stayed July 2011",
            "text": "We had an inside room, no windows to the outside, but that was okay with us. The room was lovely and more than adequate. The location is the best thing about this hotel. It is in walking distance to everything there is to see in Athens, and walk we did, so should you. It is the best was to experience this city.",
            "title": "Beautiful location, high ceilings but lack of luxury",
            "user": "Ozan81"
        },
        {
            "date": "July 21, 2011",
            "detail_rating": {
                "business": null,
                "cleanliness": 3.0,
                "desk": null,
                "location": null,
                "pool": null,
                "restaurant": null,
                "rooms": null,
                "service": 1.0,
                "sleep": 2.0,
                "value": 1.0
            },
            "helpfulness": 5,
            "id": 115621516,
            "likes": {
                "disliked": null,
                "liked": null
            },
            "rating": 2.0,
            "stay_parameters": "Stayed July 2011, traveled as a couple",
            "text": "Breakfast is served on the top floor (4th?) with a wonderful views of the Acropolis.",
            "title": "Worst experience in our trip to Greece.",
            "user": "Caseyella"
        },
        {
            "date": "July 18, 2011",
            "detail_rating": {
                "business": null,
                "cleanliness": 3.0,
                "desk": null,
                "location": null,
                "pool": null,
                "restaurant": null,
                "rooms": null,
                "service": 1.0,
                "sleep": 3.0,
                "value": 1.0
            },
            "helpfulness": 4,
            "id": 115477689,
            "likes": {
                "disliked": null,
                "liked": null
            },
            "rating": 2.0,
            "stay_parameters": "Stayed July 2011, traveled with friends",
            "text": "They even checked us out the evening prior to leaving so that we could catch the first train to the airport----very early flight.",
            "title": "Stay at another hotel, it's just not worth the money",
            "user": "1Spartan"
        },
        {
            "date": "May 22, 2011",
            "detail_rating": {
                "business": null,
                "cleanliness": 5.0,
                "desk": null,
                "location": 2.0,
                "pool": null,
                "restaurant": null,
                "rooms": 3.0,
                "service": 4.0,
                "sleep": 4.0,
                "value": 3.0
            },
            "helpfulness": 1,
            "id": 109363597,
            "likes": {
                "disliked": null,
                "liked": null
            },
            "rating": 3.0,
            "stay_parameters": "Stayed May 2011, traveled with family",
            "text": "Excellent beds and clean rooms. Some rooms have small showers and only double beds. Small elevator and many steps. Acropolis view is across from a church with bells every 1/2 hr. Good Wifi. Average breakfast. No kleenex in the baths. Very helpful front desk personnel.",
            "title": "Bells, Bells, Bells",
            "user": "neakaye"
        },
        {
            "date": "March 8, 2011",
            "detail_rating": {
                "business": null,
                "cleanliness": 1.0,
                "desk": null,
                "location": 5.0,
                "pool": null,
                "restaurant": null,
                "rooms": 1.0,
                "service": null,
                "sleep": 1.0,
                "value": 2.0
            },
            "helpfulness": 4,
            "id": 99369314,
            "likes": {
                "disliked": null,
                "liked": null
            },
            "rating": 1.0,
            "stay_parameters": "Stayed January 2011, traveled as a couple",
            "text": "We experienced the worst night ever in this hotel. Due to the beautiful fotos in the internet we booked online and arrived in the late afternoon. Still we had to wait due to repair issues. As we finally got into the room we were shocked!! There were no windows, the room was tiny, the bathroom old and worn and - worst of all - this jailhouse was stinking intensively of old smoke. We immediately asked for another room, but due to the receptionist there was no other available. They offered us to give us the money back - and we could go ahead an look for another hotel. As we only had one evening in town we did not think this as an option for us - BIG MISTAKE! I did not sleep a second due to the smoked filled air, the stinking blankets and cusions. And as noted: there was no possibility to open a window to let fresh air into the room. A stinking jail house room!!!",
            "title": "stinking jail house room",
            "user": "Rosstee"
        },
        {
            "date": "January 5, 2011",
            "detail_rating": {
                "business": null,
                "cleanliness": 5.0,
                "desk": null,
                "location": 5.0,
                "pool": null,
                "restaurant": null,
                "rooms": 4.0,
                "service": 5.0,
                "sleep": 5.0,
                "value": 4.0
            },
            "helpfulness": null,
            "id": 91888403,
            "likes": {
                "disliked": null,
                "liked": null
            },
            "rating": 5.0,
            "stay_parameters": "Stayed September 2010, traveled with friends",
            "text": "We found fine hospitality at the Magna Grecia four nights in September. The location was perfect. Opening our window onto the Mitropoli plaza or sitting on the rooftop terrace we listened to the sounds of life on the plaza below and watched the changing light on the Acropolis above. The rooms were clean and quiet, particularly the back room. On the front side, the heavy windows closed off the noise of the street. Breakfast was great, thanks to the sweet hostess in charge, and we enjoyed picnic suppers several evenings enjoying the lights on the Parthenon after dark. We began our Greek holiday here, and came back for a night in the middle and at the end. We were heartily welcomed back each time and enjoyed the quiet ambience as the perfect place to reflect on our travels. Hope to come back someday......",
            "title": "The rooftop terrace provided inspirational view and a place for relaxation and reflection.",
            "user": "hydra_11"
        },
        {
            "date": "December 16, 2010",
            "detail_rating": {
                "business": null,
                "cleanliness": 5.0,
                "desk": null,
                "location": 5.0,
                "pool": null,
                "restaurant": null,
                "rooms": 5.0,
                "service": 5.0,
                "sleep": 4.0,
                "value": 5.0
            },
            "helpfulness": null,
            "id": 89977756,
            "likes": {
                "disliked": null,
                "liked": null
            },
            "rating": 5.0,
            "stay_parameters": "Stayed November 2010, traveled solo",
            "text": "top notch location across from historic plaka district with stunning views of the acropolis...worth paying extra for the view...beautiful historic decor in guest rooms, hallways, and breakfast area...very generous breakfast...even fresh-squeezed orange juice...terrace has one of the best views in the city...extremely helpful staff...even made up an extra breakfast for me to-go as I had to leave at 4:00 a.m. to catch an early morning flight...I have stayed several places in Athens over the years but this was by far the best",
            "title": "a special opportunity not to be missed",
            "user": "katerina92037"
        },
        {
            "date": "December 1, 2010",
            "detail_rating": {
                "business": null,
                "cleanliness": 2.0,
                "desk": null,
                "location": 5.0,
                "pool": null,
                "restaurant": null,
                "rooms": 1.0,
                "service": 2.0,
                "sleep": 1.0,
                "value": 1.0
            },
            "helpfulness": 3,
            "id": 88774044,
            "likes": {
                "disliked": null,
                "liked": null
            },
            "rating": 2.0,
            "stay_parameters": "Stayed November 2010, traveled with friends",
            "text": "The negative reviews here are correct.",
            "title": "No sleep at night - \u0394\u03b5\u03bd \u03bc\u03c0\u03bf\u03c1\u03b5\u03af\u03c2 \u03bd\u03b1 \u03ba\u03bf\u03b9\u03bc\u03b7\u03b8\u03b5\u03af\u03c2 \u03c4\u03bf \u03b2\u03c1\u03ac\u03b4\u03c5",
            "user": "outlaws_2000"
        },
        {
            "date": "July 13, 2011",
            "detail_rating": {
                "business": null,
                "cleanliness": 5.0,
                "desk": null,
                "location": 5.0,
                "pool": null,
                "restaurant": null,
                "rooms": 5.0,
                "service": 3.0,
                "sleep": null,
                "value": 3.0
            },
            "helpfulness": null,
            "id": 115322111,
            "likes": {
                "disliked": null,
                "liked": null
            },
            "rating": 5.0,
            "stay_parameters": "Stayed July 2011",
            "text": "Our room was number 104 with high ceilings and a great acropolis view. The room was clean and fresh and bathroom was nicely sized with great water pressure in the shower. Location could not have been better within easy walking distance of most sights. Breakfast was good, a good continental style with the best part being the fresh orange juice squeezed a glass at a time after you choose and cut your own orange. The only negative would be the service at the front desk, which was often absent. The staff often did not address you when entering or exiting, and this we didnt bother to ask for anything. Dinner on the rooftop should be done just for the view, the food was average and on the expensive side.",
            "title": "Amazing view and a cute romantic room",
            "user": "mlh273"
        },
        {
            "date": "July 3, 2011",
            "detail_rating": {
                "business": null,
                "cleanliness": 4.0,
                "desk": null,
                "location": null,
                "pool": null,
                "restaurant": null,
                "rooms": null,
                "service": 4.0,
                "sleep": 3.0,
                "value": 4.0
            },
            "helpfulness": null,
            "id": 114982947,
            "likes": {
                "disliked": null,
                "liked": null
            },
            "rating": 3.0,
            "stay_parameters": "Stayed June 2011, traveled on business",
            "text": "This isa clean hotel, very close to all tourist attractions and with a a wonderful view. room , but along with the view came the noise.The hotel is situated on a very busy street across from a busy square. The cathedral bells ring regularly. The rooms are small and the bathroom is tiny! There are no tea and coffee making facilities or water in the fridge. Never the less we were comfortable and all this was worth it for the amazing Acroplis views.",
            "title": "Wonderful view, but.........",
            "user": "HMP1"
        },
        {
            "date": "June 19, 2011",
            "detail_rating": {
                "business": null,
                "cleanliness": 4.0,
                "desk": null,
                "location": 4.0,
                "pool": null,
                "restaurant": null,
                "rooms": 2.0,
                "service": 3.0,
                "sleep": null,
                "value": 1.0
            },
            "helpfulness": 4,
            "id": 114297673,
            "likes": {
                "disliked": null,
                "liked": null
            },
            "rating": 3.0,
            "stay_parameters": "Stayed June 2011",
            "text": "I had very high hopes when booking this hotel 7 months before our arrival. I was looking for something a bit different to chain hotels as part of my girlfriend's 30th birthday surprise trip to Greece. The website does show immaculate and charming looking rooms, and maybe some of them are! Not the one we stayed in unfortunately.",
            "title": "Do not believe that this a 'boutique' hotel.",
            "user": "Greavsie78"
        },
        {
            "date": "May 30, 2011",
            "detail_rating": {
                "business": null,
                "cleanliness": 5.0,
                "desk": null,
                "location": 5.0,
                "pool": null,
                "restaurant": null,
                "rooms": 4.0,
                "service": 4.0,
                "sleep": 3.0,
                "value": 4.0
            },
            "helpfulness": 2,
            "id": 110557364,
            "likes": {
                "disliked": null,
                "liked": null
            },
            "rating": 4.0,
            "stay_parameters": "Stayed May 2011, traveled as a couple",
            "text": "It was a massive anti-climax and I was slightly embarrassed because I booked this secretly. The acropolis view room we had was very small and was full of cheap or old furniture with no thought to decoration like I had been lead to believe. The bed was sagging with old covers on top. It immediately reminded me of a $25 hotel room in Thailand, and I felt cheated that I paid \u20ac175 a night for it.",
            "title": "Great concept for a traveller who likes a bit of funky quirkiness",
            "user": "starboy123"
        },
        {
            "date": "May 29, 2011",
            "detail_rating": {
                "business": null,
                "cleanliness": 3.0,
                "desk": null,
                "location": 5.0,
                "pool": null,
                "restaurant": null,
                "rooms": 3.0,
                "service": 3.0,
                "sleep": 2.0,
                "value": 2.0
            },
            "helpfulness": null,
            "id": 110444040,
            "likes": {
                "disliked": null,
                "liked": null
            },
            "rating": 3.0,
            "stay_parameters": "Stayed May 2011, traveled with family",
            "text": "Other rooms may be in better shape and I'm sure people have had good experiences at Magna Grecia, but if this is the case, there is a major inconsistency throughout the hotel.",
            "title": "great location...but didn't get much sleep",
            "user": "tahoe004"
        },
        {
            "date": "October 27, 2010",
            "detail_rating": {
                "business": null,
                "cleanliness": 4.0,
                "desk": null,
                "location": 5.0,
                "pool": null,
                "restaurant": null,
                "rooms": 2.0,
                "service": 3.0,
                "sleep": 3.0,
                "value": 3.0
            },
            "helpfulness": 2,
            "id": 85058233,
            "likes": {
                "disliked": null,
                "liked": null
            },
            "rating": 3.0,
            "stay_parameters": "Stayed October 2010, traveled as a couple",
            "text": "Some folks love this place and some hate it. We stayed here for three nights in October and can understand both points of view. This is an older hotel that reminds me of places I stayed in 35 years ago. The \"inside\" rooms have views of the elevator shaft and hallway. They can be dark and dreary. The elevator is tiny; barely big enough for 2 people and the air conditioning can be iffy. But the help is very pleasant, the breakfast is good, the location is excellent, and...the view of the acropolis is simply unbelievable. So, the outside rooms are well worth the price, and the view is available to all on the breakfast patio. All the guidebooks will tell you where to go for the best views and note that you will have to pay an exorbitant price for your coffee or drinks in order to get it. The view here is better than all those and it is free.",
            "title": "This hotel elicits strong opinions on both sides",
            "user": "msg_10"
        },
        {
            "date": "October 4, 2010",
            "detail_rating": {
                "business": null,
                "cleanliness": 2.0,
                "desk": null,
                "location": 3.0,
                "pool": null,
                "restaurant": null,
                "rooms": 1.0,
                "service": 1.0,
                "sleep": 1.0,
                "value": 1.0
            },
            "helpfulness": 4,
            "id": 82101362,
            "likes": {
                "disliked": null,
                "liked": null
            },
            "rating": 1.0,
            "stay_parameters": "Stayed June 2010, traveled with family",
            "text": "We reserved 2 \"Acropolis View\" Rooms for four nights over the internet for my wife and I , 22 year old daughter and 19 year old son specifically requesting twin beds in each room, which they noted in our reservation confirmation as a \"special request.\" When we arrived we were told that those rooms only come with one double bed (which would have been ok for my wife and I but not our son and daughter) and gave our son and daugher an interior windowless room with two beds at the same price. We never would have booked the rooms had we known this. To add insult to injury they told as that if we left they would charge us for a full night plus 50% for each of the remaining three nights of our reservation, even though their internet site provides for a cancellation fee of only one night. To top it off, the accomodations were nothing like their internet site indicated. The lift was inadequate (a small 2 person lift for the entire hotel) , the beds were saggy and uncomfortable, the rooms and furniture were worn and the breakfast was mediocre at best. The plumbing was in poor shape (eg you cannot flush toilet paper down the toilet) . There was a foot high door sill at the entry to our room. My wife had injured herself prior to arrival and was only able to walk with difficulty so this combined with the inadequate elevator and steps at the entrance made it particularly bad . After one night we checked out anyway, and they still insisted on charging us for 50% of the next three nights .",
            "title": "They mislead us, overcharged us and the accomodations were awful.",
            "user": "cbtraveler17"
        },
        {
            "date": "September 15, 2010",
            "detail_rating": {
                "business": null,
                "cleanliness": 5.0,
                "desk": null,
                "location": 5.0,
                "pool": null,
                "restaurant": null,
                "rooms": 5.0,
                "service": 5.0,
                "sleep": 5.0,
                "value": 5.0
            },
            "helpfulness": null,
            "id": 79710033,
            "likes": {
                "disliked": null,
                "liked": null
            },
            "rating": 5.0,
            "stay_parameters": "Stayed August 2010, traveled as a couple",
            "text": "Unfortunately i had only stayed in this hotel for 2 nights, but must admit it was perfect. Beautifully decored clean rooms, friendly and smiley staff and fantastic views. There was variety at breakfast in which i might add was overlooking the Acropolis. The hotel is situated close to all attractions and shopping strips. Reception pointed me and my partner in the right direction when it came time to choose a restaurant for dinner and a nice little bar for late night drinks. two thumbs up at reception staff!!! This hotel is a definate for anyone who wants to be in the centre of EVERYTHING!!!",
            "title": "SENSATIONAL VIEWS FROM BEDROOM",
            "user": "MRS_HAPPYAustralia"
        },
        {
            "date": "September 14, 2010",
            "detail_rating": {
                "business": null,
                "cleanliness": null,
                "desk": null,
                "location": null,
                "pool": null,
                "restaurant": null,
                "rooms": null,
                "service": 1.0,
                "sleep": null,
                "value": 1.0
            },
            "helpfulness": 2,
            "id": 79506689,
            "likes": {
                "disliked": null,
                "liked": null
            },
            "rating": 1.0,
            "stay_parameters": "Stayed September 2010, traveled as a couple",
            "text": "I booked a room 2th March 2010",
            "title": "Do not trust booking reservation",
            "user": "anne190492"
        },
        {
            "date": "September 11, 2010",
            "detail_rating": {
                "business": null,
                "cleanliness": null,
                "desk": null,
                "location": null,
                "pool": null,
                "restaurant": null,
                "rooms": null,
                "service": null,
                "sleep": null,
                "value": null
            },
            "helpfulness": 3,
            "id": 79171426,
            "likes": {
                "disliked": null,
                "liked": null
            },
            "rating": 1.0,
            "stay_parameters": null,
            "text": "Yesterday they just cancelled the reservation.They are blaming on difficulties with their online booking system",
            "title": "Worst hotel I have been in that was not a third world country",
            "user": "MaryLS"
        }
    ],
    "slim_ranking": 0.414893617021,
    "stars": 4,
    "tripadvisor": {
        "VISITED": false,
        "country_name": null,
        "locality": null,
        "pic_link": null,
        "street_address": null
    },
    "user_rating": 3.5,
    "variance": {
        "average": 27,
        "excellent": 85,
        "poor": 30,
        "terrible": 30,
        "very good": 75
    }
}