{
    "aka": "Hotel Derry",
    "description": "Modern building and interior, only hotel within Derry's historic walls - City centre, ideally located and the closest Hotel to both of the Citys Shopping Centres. Has on-site Restaurant, Function room, meeting spaces and Music Themed Bar",
    "detail_rating": {
        "cleanliness": null,
        "location": null,
        "rooms": null,
        "service": null,
        "sleep": null,
        "value": null
    },
    "location": {
        "city": null,
        "continent": "Europe",
        "country": "United Kingdom (UK)",
        "proposed_city": "Derry",
        "province": null,
        "region": null
    },
    "name": "Tower Hotel Derry",
    "places": {
        "aka": [
            "Derry"
        ],
        "hotel_description": [
            "Derry",
            "Bar"
        ],
        "hotel_name": [
            "Derry"
        ]
    },
    "review_count": 320,
    "review_count_current": 20,
    "reviews": [
        {
            "date": "May 6, 2013",
            "detail_rating": {
                "business": null,
                "cleanliness": 5.0,
                "desk": null,
                "location": 5.0,
                "pool": null,
                "restaurant": null,
                "rooms": 4.0,
                "service": 5.0,
                "sleep": 5.0,
                "value": 5.0
            },
            "helpfulness": 1,
            "id": 159772051,
            "likes": {
                "disliked": null,
                "liked": null
            },
            "rating": 5.0,
            "stay_parameters": "Stayed March 2013, traveled solo",
            "text": "I love staying at the Tower. it is central, has parking, the facilities are not over pretentious but always excellent and the staff beyond praise from reception, through catering to management. Welcome is effortless, humour and good information abound and nothing is too much trouble.",
            "title": "Always a good craic",
            "user": "Laindonladdie"
        },
        {
            "date": "May 3, 2013",
            "detail_rating": {
                "business": null,
                "cleanliness": null,
                "desk": null,
                "location": null,
                "pool": null,
                "restaurant": null,
                "rooms": null,
                "service": null,
                "sleep": null,
                "value": null
            },
            "helpfulness": null,
            "id": 159557518,
            "likes": {
                "disliked": null,
                "liked": null
            },
            "rating": 4.0,
            "stay_parameters": null,
            "text": "Someone said the breakfast was not brilliant and on once occasion there was not the usual spread but for very good reason For another good reason, Paddy's Day yielded fare that eschewed the need of meals for the rest of the day. The buffet is more than adequate and this is from a breakfast addict.",
            "title": "Good value for money",
            "user": "Paula O"
        },
        {
            "date": "May 3, 2013",
            "detail_rating": {
                "business": null,
                "cleanliness": 5.0,
                "desk": null,
                "location": 5.0,
                "pool": null,
                "restaurant": null,
                "rooms": 3.0,
                "service": 5.0,
                "sleep": 5.0,
                "value": 5.0
            },
            "helpfulness": null,
            "id": 159552282,
            "likes": {
                "disliked": null,
                "liked": null
            },
            "rating": 4.0,
            "stay_parameters": "Stayed May 2013, traveled solo",
            "text": "The d\u00e9cor is a little retro but why not. This is a genuine place not a wood and crystal palace, anonymous or fussy. Stay there!!!",
            "title": "Good value and good location",
            "user": "andiedan"
        },
        {
            "date": "May 3, 2013",
            "detail_rating": {
                "business": null,
                "cleanliness": 5.0,
                "desk": null,
                "location": 5.0,
                "pool": null,
                "restaurant": null,
                "rooms": 5.0,
                "service": 5.0,
                "sleep": 5.0,
                "value": 5.0
            },
            "helpfulness": null,
            "id": 159536610,
            "likes": {
                "disliked": null,
                "liked": null
            },
            "rating": 5.0,
            "stay_parameters": "Stayed March 2013, traveled with family",
            "text": "Stayed here mid-week with hubby to save a long drive home one night. Staff were excellent - very helpful and pleasant. Room was fine - clean and spacious. Nothing grand about it but it was functional. I wouldn't have classed the hotel as 4 star, more like 3 star. But for the money it was perfectly acceptable. Breakfast choices were extensive and service again was friendly.",
            "title": "Treasure within the Walls",
            "user": "Funloving5"
        },
        {
            "date": "May 3, 2013",
            "detail_rating": {
                "business": null,
                "cleanliness": 3.0,
                "desk": null,
                "location": 5.0,
                "pool": null,
                "restaurant": null,
                "rooms": 3.0,
                "service": 3.0,
                "sleep": 3.0,
                "value": 3.0
            },
            "helpfulness": null,
            "id": 159522101,
            "likes": {
                "disliked": null,
                "liked": null
            },
            "rating": 3.0,
            "stay_parameters": "Stayed April 2013, traveled on business",
            "text": "Clean and nice hotel with helpful and friendly staff. Location is excellent for the centre of town but no real view from the rooms. Decor is a bit dated. Didn't eat in the hotel so can't comment on the food. Wi-Fi was not free but once subscribed, was fast and reliable.",
            "title": "Average budget hotel",
            "user": "Justin K"
        },
        {
            "date": "May 16, 2013",
            "detail_rating": {
                "business": null,
                "cleanliness": 5.0,
                "desk": null,
                "location": 5.0,
                "pool": null,
                "restaurant": null,
                "rooms": 5.0,
                "service": 5.0,
                "sleep": 5.0,
                "value": 5.0
            },
            "helpfulness": null,
            "id": 160932110,
            "likes": {
                "disliked": null,
                "liked": null
            },
            "rating": 5.0,
            "stay_parameters": "Stayed March 2013, traveled with family",
            "text": "Went twice in March 2013: first for my brother's stag party (twin room), then took my girlfriend for her birthday (suite). Had an excellent stay both times.",
            "title": "Two great stays in a month!",
            "user": "Dec1988"
        },
        {
            "date": "May 16, 2013",
            "detail_rating": {
                "business": null,
                "cleanliness": 5.0,
                "desk": null,
                "location": 5.0,
                "pool": null,
                "restaurant": null,
                "rooms": 5.0,
                "service": 5.0,
                "sleep": 5.0,
                "value": 5.0
            },
            "helpfulness": null,
            "id": 160919814,
            "likes": {
                "disliked": null,
                "liked": null
            },
            "rating": 5.0,
            "stay_parameters": "Stayed May 2013, traveled solo",
            "text": "The rooms are clean and spacious with comfy beds and great showers. The staff are extremely friendly and helpful. The food in the restaurant is first class.",
            "title": "The towerHotel ... the only one inside Derry's walls!",
            "user": "Irishwriter1916"
        },
        {
            "date": "May 13, 2013",
            "detail_rating": {
                "business": null,
                "cleanliness": 5.0,
                "desk": null,
                "location": 4.0,
                "pool": null,
                "restaurant": null,
                "rooms": 4.0,
                "service": 4.0,
                "sleep": 5.0,
                "value": 5.0
            },
            "helpfulness": null,
            "id": 160562941,
            "likes": {
                "disliked": null,
                "liked": null
            },
            "rating": 5.0,
            "stay_parameters": "Stayed May 2013, traveled with friends",
            "text": "There is also a nice bar on the ground floor and a small sauna on the top floor.",
            "title": "Big Band Bonus",
            "user": "721Philip"
        },
        {
            "date": "May 12, 2013",
            "detail_rating": {
                "business": null,
                "cleanliness": 4.0,
                "desk": null,
                "location": 5.0,
                "pool": null,
                "restaurant": null,
                "rooms": 5.0,
                "service": 4.0,
                "sleep": null,
                "value": 3.0
            },
            "helpfulness": null,
            "id": 160485023,
            "likes": {
                "disliked": null,
                "liked": null
            },
            "rating": 4.0,
            "stay_parameters": "Stayed April 2013",
            "text": "The best bit however is the location; Tower is the only hotel inside Derry's walls. It is right next to the historic wall and the Diamond. Our rooms had great views right down to Free Derry Corner and across the river.",
            "title": "Good location. Lacked ambience. Would not rush back!",
            "user": "mags2324"
        },
        {
            "date": "May 7, 2013",
            "detail_rating": {
                "business": null,
                "cleanliness": 5.0,
                "desk": null,
                "location": 5.0,
                "pool": null,
                "restaurant": null,
                "rooms": 5.0,
                "service": 4.0,
                "sleep": 4.0,
                "value": 4.0
            },
            "helpfulness": null,
            "id": 159925575,
            "likes": {
                "disliked": null,
                "liked": null
            },
            "rating": 5.0,
            "stay_parameters": "Stayed May 2013, traveled with friends",
            "text": "I couldn't fault this hotel and would highly recommend it. Prices are very reasonable for a first class stay.",
            "title": "Would return",
            "user": "Liketogetoutandabout"
        },
        {
            "date": "June 5, 2013",
            "detail_rating": {
                "business": null,
                "cleanliness": 3.0,
                "desk": null,
                "location": 4.0,
                "pool": null,
                "restaurant": null,
                "rooms": 3.0,
                "service": 3.0,
                "sleep": 4.0,
                "value": 3.0
            },
            "helpfulness": null,
            "id": 163065803,
            "likes": {
                "disliked": null,
                "liked": null
            },
            "rating": 3.0,
            "stay_parameters": "Stayed May 2013, traveled as a couple",
            "text": "Good location for exploring on foot,good bars and restaurant,smallish rooms.Would use again if visiting Londonderry/Derry (stroke city).If you want to walk the famous city wall its 1 minute away and takes a 40 minute \"amble\" to get round but as the walk passes lots of interesting places could take longer,highly recomended.",
            "title": "ok",
            "user": "davidcarol"
        },
        {
            "date": "June 3, 2013",
            "detail_rating": {
                "business": null,
                "cleanliness": 4.0,
                "desk": null,
                "location": 5.0,
                "pool": null,
                "restaurant": null,
                "rooms": 3.0,
                "service": 4.0,
                "sleep": 4.0,
                "value": 4.0
            },
            "helpfulness": null,
            "id": 162875695,
            "likes": {
                "disliked": null,
                "liked": null
            },
            "rating": 5.0,
            "stay_parameters": "Stayed May 2013, traveled with family",
            "text": "we stayed here 2 nites as part of a tour, but would book this place independent of any tour. it is a charming hotel, close to restaurants and shops. beds were comfortable. tho our room was small, we lacked for nothing. the steak and guinness pie in the bar is very good. don't forget to try the irish whiskey on your porridge in the morning - what a wake-me-up!! be sure to walk the walls of the city as well.",
            "title": "wonderful hotel!",
            "user": "tinydog1"
        },
        {
            "date": "June 2, 2013",
            "detail_rating": {
                "business": null,
                "cleanliness": 4.0,
                "desk": null,
                "location": 5.0,
                "pool": null,
                "restaurant": null,
                "rooms": 4.0,
                "service": 4.0,
                "sleep": 4.0,
                "value": 4.0
            },
            "helpfulness": null,
            "id": 162750934,
            "likes": {
                "disliked": null,
                "liked": null
            },
            "rating": 4.0,
            "stay_parameters": "Stayed May 2013, traveled as a couple",
            "text": "We stayed two nights in this old hotel located within the walls of the town of Derry. It has parking under the building and was a challenge to enter but free and we did not need a car as everything we wanted to see we could reach on foot. The room was updated, clean and linens were very good quality. The steps to the wall were just outside our hotel so we walked the mile wall and saw the city from a different perspective as well as learned more history in the process. The breakfast buffet was the typical Irish Breakfast fare but had an extra treat....Bushmills and honey for the oatmeal......now that's the way to start the morning!!! The eating area is small and when the tour group was eating it was crowded and noisy but things could have been worse!!!! Also, security was very good, required password to enter car park and room key to go on the elevators.",
            "title": "Wonderful Old Hotel in the Walls of Derry, Updated and Wonderful Staff",
            "user": "creekertraveller"
        },
        {
            "date": "May 28, 2013",
            "detail_rating": {
                "business": null,
                "cleanliness": 5.0,
                "desk": null,
                "location": 5.0,
                "pool": null,
                "restaurant": null,
                "rooms": 5.0,
                "service": 5.0,
                "sleep": 5.0,
                "value": 3.0
            },
            "helpfulness": 1,
            "id": 162225711,
            "likes": {
                "disliked": null,
                "liked": null
            },
            "rating": 5.0,
            "stay_parameters": "Stayed May 2013, traveled as a couple",
            "text": "Hotel is located within the old city walls and city center is only a few minutes walk. Room was spacious and very clean. The staff were very helpful and courteous. The breakfast buffet was good. The only negative was the rather high room rate.",
            "title": "Great location",
            "user": "jblack49"
        },
        {
            "date": "May 26, 2013",
            "detail_rating": {
                "business": null,
                "cleanliness": null,
                "desk": null,
                "location": 5.0,
                "pool": null,
                "restaurant": null,
                "rooms": null,
                "service": 5.0,
                "sleep": null,
                "value": 5.0
            },
            "helpfulness": null,
            "id": 161881919,
            "likes": {
                "disliked": null,
                "liked": null
            },
            "rating": 5.0,
            "stay_parameters": "Stayed May 2013, traveled with family",
            "text": "Very friendly staff who couldn't do enough for you. Great choice of starters and deserts and three mains to choose from. Our waitress Natalie was very attentive to our baby grandson bringing him potatoes and vegetables the minute we sat down to eat. Johnny the barman was great too. Would definitely recommend.",
            "title": "Delicious sunday carvery",
            "user": "Catherine1962"
        },
        {
            "date": "May 25, 2013",
            "detail_rating": {
                "business": null,
                "cleanliness": 5.0,
                "desk": null,
                "location": 5.0,
                "pool": null,
                "restaurant": null,
                "rooms": 4.0,
                "service": 5.0,
                "sleep": 5.0,
                "value": 5.0
            },
            "helpfulness": 1,
            "id": 161816144,
            "likes": {
                "disliked": null,
                "liked": null
            },
            "rating": 5.0,
            "stay_parameters": "Stayed May 2013, traveled as a couple",
            "text": "Had a lovely stay at this very central hotel which was in walking distance to the city centre and situated along the famous walls. Hotel very clean and food delicious. Breakfast fantastic!!! Staff very friendly and helpful.",
            "title": "great city break",
            "user": "Ciara R"
        },
        {
            "date": "May 22, 2013",
            "detail_rating": {
                "business": null,
                "cleanliness": 5.0,
                "desk": null,
                "location": 5.0,
                "pool": null,
                "restaurant": null,
                "rooms": 5.0,
                "service": 5.0,
                "sleep": 5.0,
                "value": 5.0
            },
            "helpfulness": null,
            "id": 161502540,
            "likes": {
                "disliked": null,
                "liked": null
            },
            "rating": 5.0,
            "stay_parameters": "Stayed May 2013, traveled on business",
            "text": "very friendly staff and very helpfull (as are all the locals too ) ,clean modern rooms , good tv with lots of stations ,bar and reception area very pleasant .",
            "title": "friendly staff ,great location",
            "user": "sundles"
        },
        {
            "date": "May 22, 2013",
            "detail_rating": {
                "business": null,
                "cleanliness": 5.0,
                "desk": null,
                "location": 5.0,
                "pool": null,
                "restaurant": null,
                "rooms": 5.0,
                "service": 5.0,
                "sleep": 5.0,
                "value": 5.0
            },
            "helpfulness": null,
            "id": 161501219,
            "likes": {
                "disliked": null,
                "liked": null
            },
            "rating": 5.0,
            "stay_parameters": "Stayed January 2013, traveled solo",
            "text": "breakfast had everything you could want and again very nice staff .",
            "title": "Great Place to Stay!",
            "user": "Jillda50"
        },
        {
            "date": "May 22, 2013",
            "detail_rating": {
                "business": null,
                "cleanliness": 5.0,
                "desk": null,
                "location": 5.0,
                "pool": null,
                "restaurant": null,
                "rooms": 5.0,
                "service": 5.0,
                "sleep": 5.0,
                "value": 5.0
            },
            "helpfulness": 3,
            "id": 161473076,
            "likes": {
                "disliked": null,
                "liked": null
            },
            "rating": 5.0,
            "stay_parameters": "Stayed May 2013, traveled with friends",
            "text": "the hotel is in the centre so very easy to get around . you are at the top of the hill so no more up hill walking . the hotel is within the walled city and is next door so you can easily walk round the whole city which is lovely . check out the train journey along the coast .also the museum and the history of the town . i would recommend .",
            "title": "Hen Party Stay!",
            "user": "emmsy04"
        },
        {
            "date": "May 18, 2013",
            "detail_rating": {
                "business": null,
                "cleanliness": 5.0,
                "desk": null,
                "location": 5.0,
                "pool": null,
                "restaurant": null,
                "rooms": 5.0,
                "service": 5.0,
                "sleep": null,
                "value": 5.0
            },
            "helpfulness": null,
            "id": 161064245,
            "likes": {
                "disliked": null,
                "liked": null
            },
            "rating": 4.0,
            "stay_parameters": "Stayed May 2013",
            "text": "You won't find a hotel that is more conveniently located in Derry/Londonderry than the Tower Hotel. You can walk everywhere in the City Centre from here. And the staff is amazing - they make you feel very at home.",
            "title": "Awesome",
            "user": "Keatography"
        }
    ],
    "slim_ranking": 0.5,
    "stars": 4,
    "tripadvisor": {
        "VISITED": false,
        "country_name": null,
        "locality": null,
        "pic_link": null,
        "street_address": null
    },
    "user_rating": 4.5,
    "variance": {
        "average": 44,
        "excellent": 169,
        "poor": 10,
        "terrible": 5,
        "very good": 92
    }
}