{
    "aka": "Fita Hotel Amsterdam",
    "description": null,
    "detail_rating": {
        "cleanliness": 5.0,
        "location": 5.0,
        "rooms": 4.5,
        "service": 4.5,
        "sleep": 4.5,
        "value": 4.5
    },
    "location": {
        "city": "Amsterdam",
        "continent": "Europe",
        "country": "The Netherlands",
        "proposed_city": "Amsterdam",
        "province": null,
        "region": null
    },
    "name": "Hotel Fita",
    "places": {
        "aka": [
            "Amsterdam"
        ],
        "hotel_description": [],
        "hotel_name": []
    },
    "review_count": 1090,
    "review_count_current": 60,
    "reviews": [
        {
            "date": "May 6, 2010",
            "detail_rating": {
                "business": null,
                "cleanliness": 5.0,
                "desk": null,
                "location": 5.0,
                "pool": null,
                "restaurant": null,
                "rooms": 5.0,
                "service": 5.0,
                "sleep": 5.0,
                "value": 5.0
            },
            "helpfulness": null,
            "id": 63415443,
            "likes": {
                "disliked": null,
                "liked": null
            },
            "rating": 5.0,
            "stay_parameters": "Stayed April 2010, traveled as a couple",
            "text": "My wife and I had an enjoyable three days at Hotel Fita in late April. Everyone associated with the hotel were friendly and very helpful. Loes and Hans were excellent hosts and provided many helpful tips for sightseeing. All of the positives in previous reviews were met. The best recommendation would be \"We will stay again at Hotel Fita when we return to Holland\".",
            "title": "Outstanding and Enjoyable",
            "user": "OntarioSunsetter"
        },
        {
            "date": "May 6, 2010",
            "detail_rating": {
                "business": null,
                "cleanliness": 5.0,
                "desk": null,
                "location": 5.0,
                "pool": null,
                "restaurant": null,
                "rooms": 5.0,
                "service": 5.0,
                "sleep": 5.0,
                "value": 5.0
            },
            "helpfulness": null,
            "id": 63409510,
            "likes": {
                "disliked": null,
                "liked": null
            },
            "rating": 5.0,
            "stay_parameters": "Stayed May 2010, traveled solo",
            "text": "Vele bedanken, Loes & Hans",
            "title": "All the Comforts of Home . . .",
            "user": "harleygirrrl"
        },
        {
            "date": "May 3, 2010",
            "detail_rating": {
                "business": null,
                "cleanliness": 5.0,
                "desk": null,
                "location": 5.0,
                "pool": null,
                "restaurant": null,
                "rooms": 5.0,
                "service": 5.0,
                "sleep": 5.0,
                "value": 5.0
            },
            "helpfulness": null,
            "id": 63163951,
            "likes": {
                "disliked": null,
                "liked": null
            },
            "rating": 5.0,
            "stay_parameters": "Stayed April 2010, traveled with friends",
            "text": "I stayed at Hotel Fita for one evening this past week. The plan was to stay longer, but a family emergency called me home. Hans, Loes, and the Fita team were exceptional in a difficult time. My main contact was with Loes (pronounced 'luce'), who was so kind and understanding. She reassured me that they would do everything they could to help me, and to make my brief stay a good one . . . and, I'm pleased to report, it was.",
            "title": "Pristine, Quiet and Comfortable Accommodations",
            "user": "puckshoot"
        },
        {
            "date": "May 1, 2010",
            "detail_rating": {
                "business": null,
                "cleanliness": 5.0,
                "desk": null,
                "location": 5.0,
                "pool": null,
                "restaurant": null,
                "rooms": 5.0,
                "service": 5.0,
                "sleep": 4.0,
                "value": 5.0
            },
            "helpfulness": null,
            "id": 62959782,
            "likes": {
                "disliked": null,
                "liked": null
            },
            "rating": 5.0,
            "stay_parameters": "Stayed April 2010, traveled as a couple",
            "text": "I chose this hotel because of the great reviews I read here on Trip Advisor. The place is really clean and well-kept, and right near Museumplein. My single room was small, but very comfortable (the weather was cold and rainy when I arrived . . . the hospitality and the room were warm). There is a phone in the room with free calling to anywhere, which in my case was a godsend. The computer with internet connection, which is downstairs by the breakfast room, was very convenient and modern.",
            "title": "Warm and welcoming...fantastic!",
            "user": "droberts67"
        },
        {
            "date": "May 1, 2010",
            "detail_rating": {
                "business": null,
                "cleanliness": 5.0,
                "desk": null,
                "location": 5.0,
                "pool": null,
                "restaurant": null,
                "rooms": 5.0,
                "service": 5.0,
                "sleep": 5.0,
                "value": 5.0
            },
            "helpfulness": null,
            "id": 62915537,
            "likes": {
                "disliked": null,
                "liked": null
            },
            "rating": 5.0,
            "stay_parameters": "Stayed April 2010, traveled with friends",
            "text": "But the best thing beyond everything I've mentioned so far was the pancake and fruit smoothie served in addition to the fabulous breakfast. Both were so incredibly tasty, most especially the pancake (really, almost as thin as a crepe). Perhaps it was a special recipe that made each of them so good, but it very well could have been that they were served by wonderful, caring individuals.",
            "title": "Our Home In Amsterdam",
            "user": "Cargiom"
        },
        {
            "date": "April 7, 2008",
            "detail_rating": {
                "business": 5.0,
                "cleanliness": 5.0,
                "desk": null,
                "front_desk": 5.0,
                "location": 5.0,
                "pool": null,
                "restaurant": null,
                "rooms": 5.0,
                "service": 5.0,
                "sleep": null,
                "value": 4.0
            },
            "helpfulness": null,
            "id": 14850087,
            "likes": {
                "disliked": null,
                "liked": null
            },
            "rating": 5.0,
            "stay_parameters": "Stayed April 2008, traveled on business",
            "text": "Spent 3 nights in Hotel Fita for a business trip last week and have nothing but praise for this clean, friendly, quiet hotel.",
            "title": "Wonderful, friendly hotel, excellent location",
            "user": "KittyvB"
        },
        {
            "date": "April 3, 2008",
            "detail_rating": {
                "business": 3.0,
                "cleanliness": 5.0,
                "desk": null,
                "front_desk": 5.0,
                "location": 4.0,
                "pool": null,
                "restaurant": null,
                "rooms": 3.0,
                "service": 2.0,
                "sleep": null,
                "value": 2.0
            },
            "helpfulness": 1,
            "id": 14770470,
            "likes": {
                "disliked": "\u2014 Value for money",
                "liked": "\u2014 Location"
            },
            "rating": 3.0,
            "stay_parameters": "Stayed March 2008",
            "text": "Staff - absolutely wonderful, very friendly, spoke excellent English, helpful with directions.",
            "title": "Good, but put in perspective",
            "user": "DCLW"
        },
        {
            "date": "April 3, 2008",
            "detail_rating": {
                "business": 5.0,
                "cleanliness": 5.0,
                "desk": null,
                "front_desk": 5.0,
                "location": 4.0,
                "pool": null,
                "restaurant": null,
                "rooms": 4.0,
                "service": 5.0,
                "sleep": null,
                "value": 5.0
            },
            "helpfulness": null,
            "id": 14768843,
            "likes": {
                "disliked": null,
                "liked": null
            },
            "rating": 5.0,
            "stay_parameters": "Stayed March 2008, traveled as a couple",
            "text": "Room - stayed in no.32, which was a double with a balcony overlooking the street. Very clean, simple decor, all amenities you could want, free international calls from the telephone",
            "title": "Hotel Fita is as Expected",
            "user": "TexasTripper34"
        },
        {
            "date": "March 31, 2008",
            "detail_rating": {
                "business": 5.0,
                "cleanliness": 5.0,
                "desk": null,
                "front_desk": 5.0,
                "location": 5.0,
                "pool": null,
                "restaurant": null,
                "rooms": 5.0,
                "service": 5.0,
                "sleep": null,
                "value": 4.0
            },
            "helpfulness": null,
            "id": 14685137,
            "likes": {
                "disliked": "\u2014 Nothing",
                "liked": "\u2014 Location"
            },
            "rating": 5.0,
            "stay_parameters": "Stayed March 2008, traveled with family",
            "text": "Location - excellent, very close to a main tram line, near to lots of attractions, although everywhere in Amsterdam is pretty much in walking distance!",
            "title": "Great hotel in a convenient location",
            "user": "TravelIntl"
        },
        {
            "date": "March 30, 2008",
            "detail_rating": {
                "business": 5.0,
                "cleanliness": 5.0,
                "desk": null,
                "front_desk": 5.0,
                "location": 5.0,
                "pool": null,
                "restaurant": null,
                "rooms": 4.0,
                "service": 5.0,
                "sleep": null,
                "value": 4.0
            },
            "helpfulness": 1,
            "id": 14670900,
            "likes": {
                "disliked": null,
                "liked": "\u2014 The owners - they were so friendly and knowledgable"
            },
            "rating": 5.0,
            "stay_parameters": "Stayed April 2007, traveled solo",
            "text": "Price - a little expensive, but April is peak tourist season and Amsterdam is an expensive city at the best of times. Friendly staff and location more than make up for this.",
            "title": "Best Place to Stay in Amsterdam",
            "user": "Lorreen"
        },
        {
            "date": "May 22, 2010",
            "detail_rating": {
                "business": null,
                "cleanliness": 4.0,
                "desk": null,
                "location": 5.0,
                "pool": null,
                "restaurant": null,
                "rooms": 3.0,
                "service": 5.0,
                "sleep": 5.0,
                "value": 3.0
            },
            "helpfulness": 2,
            "id": 65004860,
            "likes": {
                "disliked": null,
                "liked": null
            },
            "rating": 4.0,
            "stay_parameters": "Stayed May 2010, traveled as a couple",
            "text": "We think that previous reviewers have over-rated the hotel because of the excellent service provided by the owners and their staff. The hotel is OK, but it's nothing special. Our room was a bit shabby, in need of painting. Linens were only OK, with a lumpy pillow and thin towels. The carpet was loose and stained in places, and the floor creaked mercilessly along one area. While these areas were admittedly minor, they were too numerous to give the hotel a five star rating.",
            "title": "Five star experience in a three star hotel",
            "user": "Twoprofs"
        },
        {
            "date": "May 20, 2010",
            "detail_rating": {
                "business": null,
                "cleanliness": 5.0,
                "desk": null,
                "location": 5.0,
                "pool": null,
                "restaurant": null,
                "rooms": 5.0,
                "service": 5.0,
                "sleep": 5.0,
                "value": 5.0
            },
            "helpfulness": null,
            "id": 64789031,
            "likes": {
                "disliked": null,
                "liked": null
            },
            "rating": 5.0,
            "stay_parameters": "Stayed April 2010, traveled as a couple",
            "text": "The breakfast was excellent. The staff was incredibly accommodating and helpful. The location was superb for visiting museums and walking into the historical areas. We would not hesitate to recommend the Fita because of its many assets, but a five start hotel it is not.",
            "title": "Friendly service",
            "user": "nangunia"
        },
        {
            "date": "May 12, 2010",
            "detail_rating": {
                "business": null,
                "cleanliness": 5.0,
                "desk": null,
                "location": 5.0,
                "pool": null,
                "restaurant": null,
                "rooms": 5.0,
                "service": 5.0,
                "sleep": 5.0,
                "value": 5.0
            },
            "helpfulness": 1,
            "id": 63935194,
            "likes": {
                "disliked": null,
                "liked": null
            },
            "rating": 5.0,
            "stay_parameters": "Stayed May 2010, traveled as a couple",
            "text": "My husband and I stayed at the Hotel Fita from the 6th to the 9th April this year. The staff were very friendly, breakfast was great, room and bathroom were clean. The free laundry service and internet service was a big bonus. The only thing after reading the reviews about the owners we were sad to find out upon arrival they were away visiting their daughter. Oh well maybe next time.",
            "title": "Excellent small hotel",
            "user": "AnotherHiker"
        },
        {
            "date": "May 10, 2010",
            "detail_rating": {
                "business": null,
                "cleanliness": 5.0,
                "desk": null,
                "location": 5.0,
                "pool": null,
                "restaurant": null,
                "rooms": 5.0,
                "service": 5.0,
                "sleep": 5.0,
                "value": 5.0
            },
            "helpfulness": null,
            "id": 63768144,
            "likes": {
                "disliked": null,
                "liked": null
            },
            "rating": 5.0,
            "stay_parameters": "Stayed April 2010, traveled with family",
            "text": "We arrived in the morning after a long airplane flight, and were given the choice of two rooms, one which was clean and ready, the other just vacated. The other room had a small balcony that overlooked a playground and we thought it was worth the wait. We changed clothes and (at the owner's suggestion) we took a canal ride from a boat about a block from the hotel. Then back for a much-needed nap. The Van Gogh museum is around the block and the hotel will sell you tickets, avoiding a long line. The owners and staff were friendly and helpful, the rooms immaculate, and the location exactly what we wanted for Amsterdam. It was easy to get there using the trolley, next to parks, canals and museums. Even though it was in the middle of a large city, the immediate neighborhood felt residential - during the day we could hear the happy sounds of children playing and at night it was quiet.",
            "title": "THIS HOTEL TICKS ALL THE BOXES",
            "user": "woofHampshire"
        },
        {
            "date": "May 7, 2010",
            "detail_rating": {
                "business": null,
                "cleanliness": 5.0,
                "desk": null,
                "location": 5.0,
                "pool": null,
                "restaurant": null,
                "rooms": 5.0,
                "service": 5.0,
                "sleep": 5.0,
                "value": 5.0
            },
            "helpfulness": null,
            "id": 63502099,
            "likes": {
                "disliked": null,
                "liked": null
            },
            "rating": 5.0,
            "stay_parameters": "Stayed May 2010, traveled as a couple",
            "text": "Lovely warm welcome from Hans on arrival at 21.30 with welcome drink. This hotel is in a convenient location just 10 mins walk to the Museums in a quiet side street. Breakfast was excellent with good choice and delicious pancakes. All the staff were very friendly and helpful and this is the hotel we would come back to again.",
            "title": "Hotel Fita made this our best trip to Amsterdam",
            "user": "Mossin163"
        },
        {
            "date": "May 15, 2008",
            "detail_rating": {
                "business": 5.0,
                "cleanliness": 5.0,
                "desk": null,
                "front_desk": 4.0,
                "location": 5.0,
                "pool": null,
                "restaurant": null,
                "rooms": 5.0,
                "service": 5.0,
                "sleep": null,
                "value": 5.0
            },
            "helpfulness": 1,
            "id": 16066810,
            "likes": {
                "disliked": "\u2014 nothing",
                "liked": "\u2014 location, cleanliness, staff"
            },
            "rating": 5.0,
            "stay_parameters": "Stayed May 2008, traveled as a couple",
            "text": "We won't repeat the details in the previous reviews, but will just say that they are all true: this is a wonderful little hotel, absolutely spotlessly clean. Fine breakfast buffet. The location is spectacular, and the nearby #2 and 5 streetcars will take you everywhere (7-8 minute ride to within 4 blocks of the Anne Frank House, for example); we never waited more than 5 minutes for one. The Van Gogh museum is 75 yards away, and the Concertgebouw three blocks. The staff is extremely helpful and friendly. One earlier review carped about the small elevator: yes, it's not large, but two people plus some luggage fit easily, and most hotels don't have an elevator at all. Among the other amenities: free laundry service. Just an outstanding value, all around.",
            "title": "As good as the reviews say",
            "user": "Genings"
        },
        {
            "date": "May 14, 2008",
            "detail_rating": {
                "business": 5.0,
                "cleanliness": 5.0,
                "desk": null,
                "front_desk": 5.0,
                "location": 5.0,
                "pool": null,
                "restaurant": null,
                "rooms": 5.0,
                "service": 5.0,
                "sleep": null,
                "value": 5.0
            },
            "helpfulness": 2,
            "id": 16027051,
            "likes": {
                "disliked": "\u2014 The short period of my trip! Could have stayed much longer there!",
                "liked": "\u2014 Every Little Thing! Completely Perfect!"
            },
            "rating": 5.0,
            "stay_parameters": "Stayed April 2008, traveled with family",
            "text": "THE BIGGEST AND MOST INCREDIBLE SURPRISE OF AMSTERDAM TRIP!!!!!!!!!!",
            "title": "Loved This Place!!!!!",
            "user": "Ma2008BR"
        },
        {
            "date": "May 11, 2008",
            "detail_rating": {
                "business": null,
                "cleanliness": 5.0,
                "desk": null,
                "front_desk": 5.0,
                "location": 5.0,
                "pool": null,
                "restaurant": null,
                "rooms": 5.0,
                "service": 5.0,
                "sleep": null,
                "value": 5.0
            },
            "helpfulness": null,
            "id": 15934185,
            "likes": {
                "disliked": "\u2014 We liked everything about it",
                "liked": "\u2014 Clean, great location, very safe, small and friendly"
            },
            "rating": 5.0,
            "stay_parameters": "Stayed April 2008, traveled as a couple",
            "text": "We tryed to book another hotel but it was full and there we were to Fita Hotel... a little disappointed cause the other one was full. THANK GOD THE OTHER ONE WAS FULL!!!!!!!!!!!!!!!!!!!!!!!!!!!!!!!!!!",
            "title": "Hotel Fita - One of Amsterdam's Best Kept Secrets!",
            "user": "Patmel"
        },
        {
            "date": "May 8, 2008",
            "detail_rating": {
                "business": 5.0,
                "cleanliness": 5.0,
                "desk": null,
                "front_desk": 5.0,
                "location": 5.0,
                "pool": null,
                "restaurant": null,
                "rooms": 5.0,
                "service": 5.0,
                "sleep": null,
                "value": 5.0
            },
            "helpfulness": null,
            "id": 15823506,
            "likes": {
                "disliked": "\u2014 it was all perfect!",
                "liked": "\u2014 spotlessly clean and generously sized bathroom"
            },
            "rating": 5.0,
            "stay_parameters": "Stayed April 2008, traveled with friends",
            "text": "We felt COMPLETLY at home!!!! So warm people!!!!! We were received by Suzanne, a so sweet girl who took us right after arriving and with an incredible smile began helping us with a map and ALL informations about where to go, how to go, what we couldn\u00b4t miss... it was a so cute reception and made us feel EXTREMALLY welcome. It was like if we were the first guests of the hotel! We felt so specil!!!! We stayed there for just 3 days, it was our first time there, so all this was so important! \"She must be the owner\u00b4s daughter\" - we thought!",
            "title": "Best hotel in Amsterdam!",
            "user": "siwaoasis"
        },
        {
            "date": "May 6, 2008",
            "detail_rating": {
                "business": 5.0,
                "cleanliness": 5.0,
                "desk": null,
                "front_desk": 4.0,
                "location": 5.0,
                "pool": null,
                "restaurant": null,
                "rooms": 5.0,
                "service": 5.0,
                "sleep": null,
                "value": 4.0
            },
            "helpfulness": null,
            "id": 15714566,
            "likes": {
                "disliked": "\u2014 Access from street level to lobby. Lucklly my suitcases were not that heavy.",
                "liked": "\u2014 The comfort of the room. The location. The staff. The fast internet service."
            },
            "rating": 5.0,
            "stay_parameters": "Stayed April 2008, traveled as a couple",
            "text": "Then we went up to our EXTREMALLY CLEAN, WELL ORGANIZED, COMFORTABLE BEDROOM. The same with bathroom.... WONDERFUL!!!!!!!!!!!!!!!!!!!!!!!!!! I\u00b4m used to use my plastic sandals to take shower when I\u00b4m away.... NOT NECESSARY THERE AT ALL!!!!!!!!!!!!!!!!!! Bathroom is incredibly clean! You fell it! You smeel it!!!!!! PERFECT!!!!!!!!!!!!!!!!!!!!!!",
            "title": "Loved this hotel!",
            "user": "wzb3"
        },
        {
            "date": "April 27, 2010",
            "detail_rating": {
                "business": null,
                "cleanliness": 5.0,
                "desk": null,
                "location": 5.0,
                "pool": null,
                "restaurant": null,
                "rooms": 5.0,
                "service": 5.0,
                "sleep": 5.0,
                "value": 5.0
            },
            "helpfulness": null,
            "id": 62571908,
            "likes": {
                "disliked": null,
                "liked": null
            },
            "rating": 5.0,
            "stay_parameters": "Stayed March 2010, traveled solo",
            "text": "my stay at the hotel fita was great, very freindly people with great sense of humor made me feel at home for a quiet stay in amsterdam i recomend it highly close to everything museums transport ex",
            "title": "great people great place",
            "user": "robfromoz"
        },
        {
            "date": "April 24, 2010",
            "detail_rating": {
                "business": null,
                "cleanliness": 5.0,
                "desk": null,
                "location": 5.0,
                "pool": null,
                "restaurant": null,
                "rooms": 5.0,
                "service": 5.0,
                "sleep": 5.0,
                "value": 5.0
            },
            "helpfulness": null,
            "id": 62322045,
            "likes": {
                "disliked": null,
                "liked": null
            },
            "rating": 5.0,
            "stay_parameters": "Stayed April 2010, traveled as a couple",
            "text": "We recently booked four nights at the Hotel Fita that unexpectedly resulted in becoming ten nights due to the explosion of volcano Eyjafjallajokull on Thursday April 14th two days before our departure. Hans and Loes, along with the entire staff of the Hotel Fita treated us and the other \"stranded\" guests kindly. Everyone was able to extend their stay. The free Internet and Wi-Fi, along with the free telephone (local and long distance) helped keep everyone connected. The hotel is in an excellent location for the museums, trams and restaurants. The rooms are clean, comfortable and well maintained. We had room number six the least expensive and it was perfectly adequate--comfortable bed, good size bathroom (great water pressure), TV and a couple of chairs. The room has a wardrobe cabinet. My wife and I have been traveling to Europe for fifteen years, we pack light and are prepared to wash clothes out in the sink and hang them to dry. So, having the free laundry was really nice. We placed our clothes in the laundry basket gave them to Hans, and when we stopped back after lunch the clothes were in the room. The breakfast was very enjoyable. We ate in a comfortable room, were served coffee or tea, fresh squeezed juice and pancakes every morning. The buffet included eggs, meat, cheese, fresh fruit, breads, Hans' homemade jam, granola, yogurt and cereal. During breakfast Hans was always available to answer questions, give advice or just chat. It was also an opportunity to talk with the other guest and share suggestions about things to do or restaurants to go to. It is a family run business whose owners make their guests feel like family. If your only reason for travel is to check things off your list then maybe it doesn't matter where you stay. But, if you travel in order to meet new people and experience other cultures, then where you stay is part of your visit. The people at the Hotel Fita made our stay in Amsterdam a visit. They are wonderful hosts who sincerely care about their guests.",
            "title": "Friendly and Kind",
            "user": "BearTavern"
        },
        {
            "date": "April 24, 2010",
            "detail_rating": {
                "business": null,
                "cleanliness": 5.0,
                "desk": null,
                "location": 5.0,
                "pool": null,
                "restaurant": null,
                "rooms": 3.0,
                "service": 5.0,
                "sleep": 4.0,
                "value": 3.0
            },
            "helpfulness": null,
            "id": 62299076,
            "likes": {
                "disliked": null,
                "liked": null
            },
            "rating": 4.0,
            "stay_parameters": "Stayed April 2010, traveled on business",
            "text": "Note about Eyjafjallajokull: The time during the eruption of Eyjafjallajokull was stressful. Planes were grounded across Europe and no one knew when the eruption was going to end and when we could get back home. In spite of the inconvenience and anxiety that accompanied this event, two blessings came out of it. First, though over a million people were affected no one was hurt. Second, we had the good fortune to spend those days at the Hotel Fita with Hans and Loes, the hotel staff and the other guests whom we met. I'm thankful everyone returned home safe and maybe in five years we'll have a reunion.",
            "title": "Wonderful location near beautiful Vondel Park and Museums",
            "user": "Mom-and-daughter88"
        },
        {
            "date": "April 22, 2010",
            "detail_rating": {
                "business": null,
                "cleanliness": 5.0,
                "desk": null,
                "location": 5.0,
                "pool": null,
                "restaurant": null,
                "rooms": 5.0,
                "service": 5.0,
                "sleep": 5.0,
                "value": 5.0
            },
            "helpfulness": null,
            "id": 62150082,
            "likes": {
                "disliked": null,
                "liked": null
            },
            "rating": 5.0,
            "stay_parameters": "Stayed April 2010, traveled solo",
            "text": "My husband traveled to Amsterdam on business, and I accompanied him. Because of the vocano erruption and the closing of the airport (Schippol) we had an extended \"vacation\" in lovely Amsterdam. The hotel was very nice, comfortable and in a wonderful location. We walked all over the city, and rented bikes on three separate occasions. We were very well treated and respected by the friendly staff, and would stay there again. (price was 159 Euros per night, queen bed and private bath.)",
            "title": "Great value - location, service and cost",
            "user": "rachaelc"
        },
        {
            "date": "April 17, 2010",
            "detail_rating": {
                "business": null,
                "cleanliness": 5.0,
                "desk": null,
                "location": 5.0,
                "pool": null,
                "restaurant": null,
                "rooms": 5.0,
                "service": 5.0,
                "sleep": 5.0,
                "value": 5.0
            },
            "helpfulness": null,
            "id": 61753982,
            "likes": {
                "disliked": null,
                "liked": null
            },
            "rating": 5.0,
            "stay_parameters": "Stayed March 2010, traveled with family",
            "text": "I stayed in the hotel in the beginning of spring so many places were booked to capactiy from travlers coming to see the flowers bloom. Service was great.",
            "title": "Art Lovers stay here",
            "user": "ssajan"
        },
        {
            "date": "May 4, 2008",
            "detail_rating": {
                "business": 5.0,
                "cleanliness": 5.0,
                "desk": null,
                "front_desk": 5.0,
                "location": 5.0,
                "pool": null,
                "restaurant": null,
                "rooms": 5.0,
                "service": 5.0,
                "sleep": null,
                "value": 5.0
            },
            "helpfulness": null,
            "id": 15626572,
            "likes": {
                "disliked": null,
                "liked": "\u2014 Family owned hotel. It was also very clean."
            },
            "rating": 5.0,
            "stay_parameters": "Stayed April 2008",
            "text": "We stayed at the Hotel Fita for 3 nights. The room had 2 twin sized beds. The room itself was quite large, equal to US standards. The bathroom was also very large. The entire hotel was spotless. The breakfast was simple, but, tasty and ample. The staff, particularly the owners, were always very helpful. I will not hesitate to stay here again.",
            "title": "Lovely family owned hotel",
            "user": "hang"
        },
        {
            "date": "May 2, 2008",
            "detail_rating": {
                "business": 5.0,
                "cleanliness": 4.0,
                "desk": null,
                "front_desk": 4.0,
                "location": 5.0,
                "pool": null,
                "restaurant": null,
                "rooms": 4.0,
                "service": 4.0,
                "sleep": null,
                "value": 4.0
            },
            "helpfulness": null,
            "id": 15572650,
            "likes": {
                "disliked": "\u2014 The single room was small--but then I expected it and was prepared for it.",
                "liked": "\u2014 Clean, nice and good breakfast."
            },
            "rating": 4.0,
            "stay_parameters": "Stayed April 2008, traveled solo",
            "text": "Great little hotel. I was very happy with my stay and definately would stay again. It was clean with a nice breakfast. The hotel keepers were very knowledgeable with information. A reasonably priced nice hotel.",
            "title": "Great Stay",
            "user": "sanjuanisland"
        },
        {
            "date": "April 17, 2008",
            "detail_rating": {
                "business": 5.0,
                "cleanliness": 5.0,
                "desk": null,
                "front_desk": 5.0,
                "location": 5.0,
                "pool": null,
                "restaurant": null,
                "rooms": 5.0,
                "service": 5.0,
                "sleep": null,
                "value": 5.0
            },
            "helpfulness": 1,
            "id": 15108629,
            "likes": {
                "disliked": null,
                "liked": "\u2014 The staff and breakfast"
            },
            "rating": 5.0,
            "stay_parameters": "Stayed April 2008, traveled on business",
            "text": "In April 2008, I spent four nights at Hotel Fita. I made reservations there based on the reviews I had read. I was not disappointed. The staff was very friendly and helpful. The breakfast was very good and was a wonderful way to start each day. As others mentioned, the rooms were relatively small, very clean and functional, but very sufficient for my purposes. I arrived after an overnight flight about 10 a.m. with the expectation that I would be able to leave my bags there since check-in wasn't until 3. My room was available so they let me check in right away and I was very thankful that they did as it allowed me to take a short nap and relax. I would be hard pressed to find a downside to this hotel, but the only one would be that they are located right next to a small playground that can get a little noisy during school hours. Thank you Hotel Fita for providing such excellent service and thank you to TripAdvisor for letting me know you exist!",
            "title": "Great place to stay",
            "user": "travelsome1"
        },
        {
            "date": "April 16, 2008",
            "detail_rating": {
                "business": null,
                "cleanliness": null,
                "desk": null,
                "location": null,
                "pool": null,
                "restaurant": null,
                "rooms": null,
                "service": null,
                "sleep": null,
                "value": null
            },
            "helpfulness": null,
            "id": 15073239,
            "likes": {
                "disliked": null,
                "liked": null
            },
            "rating": 5.0,
            "stay_parameters": null,
            "text": "We have just returned from a joint short break with our American friends in Hotel Fita. We were made to feel very welcome and comfortable. With free telephone (international and international), a splendid new coffee machine, free internet and coffee/tea making facilities in our room, this small family hotel provides more services than larger, more luxurious hotels.",
            "title": "Very comfortable stay at Hotel Fita",
            "user": "sietie"
        },
        {
            "date": "April 7, 2008",
            "detail_rating": {
                "business": 5.0,
                "cleanliness": 5.0,
                "desk": null,
                "front_desk": 4.0,
                "location": 5.0,
                "pool": null,
                "restaurant": null,
                "rooms": 5.0,
                "service": 4.0,
                "sleep": null,
                "value": 4.0
            },
            "helpfulness": null,
            "id": 14860209,
            "likes": {
                "disliked": null,
                "liked": null
            },
            "rating": 5.0,
            "stay_parameters": "Stayed March 2008, traveled with family",
            "text": "The location is excellent, with the Rijksmuseum at the end of the road, the Van Gogh museum around the corner and Concertgebouw within walking distance.",
            "title": "A perfect hotel!",
            "user": "dipti29"
        },
        {
            "date": "October 8, 2007",
            "detail_rating": {
                "business": 4.0,
                "cleanliness": 5.0,
                "desk": null,
                "front_desk": 4.0,
                "location": 4.0,
                "pool": null,
                "restaurant": null,
                "rooms": 4.0,
                "service": 5.0,
                "sleep": null,
                "value": 3.0
            },
            "helpfulness": null,
            "id": 10055939,
            "likes": {
                "disliked": null,
                "liked": null
            },
            "rating": 3.0,
            "stay_parameters": "Stayed September 2007",
            "text": "After reading the reviews, I was excited about my upcoming visit to Amsterdam. Yes the hotel is run by super friendly people, yes the breakfast is good, yes the free internet and phone calls are definitely a perk, yes the free laundry is a luxury and the location to a couple of trams is great. The only thing I would say is that the room felt a bit that for a family run hotel, there could be a little more charm and or character. The bathrooms (large in size) have soap dispensers on the wall, same with the shower. There is no shampoo provided which I was prepared for but it would have been a nice touch. We were in a room on the bottom floor which faced a school. This wasn't a problem because we were out site seeing when school let out but it was a concern at first. Don't get me wrong, I have traveled extensively so I know what is out there. I guess it was just a little hyped up. Overall is was a good hotel and we got a great deal. It's just hard because we came from such a charming B&B in Brugge that I can't help but compare.",
            "title": "Hotel Fita",
            "user": "Zoooz"
        },
        {
            "date": "September 28, 2007",
            "detail_rating": {
                "business": 5.0,
                "cleanliness": 5.0,
                "desk": null,
                "front_desk": 5.0,
                "location": 5.0,
                "pool": null,
                "restaurant": null,
                "rooms": 5.0,
                "service": null,
                "sleep": null,
                "value": 5.0
            },
            "helpfulness": 2,
            "id": 10014359,
            "likes": {
                "disliked": "\u2014 Nothing",
                "liked": "\u2014 Location, cleaniness, character of the hotel"
            },
            "rating": 5.0,
            "stay_parameters": "Stayed June 2007, traveled as a couple",
            "text": "We stayed here two nights prior to a cruise. Hotel Fita had such good reviews on tripadvisor so we thought we'd give it a try. The location was perfect, the hotel was clean and quiet, the staff was pleasant and helpful and the breakfast was great. Check out the elevator! Didn't want to stay in a big, North American style hotel..wanted a place with character and the Hotel Fita delivered. Close to the museums, restaurants, parks. Wouldn't hesitate to stay again.",
            "title": "We made the right choice...",
            "user": "MooseTracks"
        },
        {
            "date": "September 24, 2007",
            "detail_rating": {
                "business": 5.0,
                "cleanliness": 5.0,
                "desk": null,
                "front_desk": 5.0,
                "location": 5.0,
                "pool": null,
                "restaurant": null,
                "rooms": 3.0,
                "service": 5.0,
                "sleep": null,
                "value": 4.0
            },
            "helpfulness": 1,
            "id": 8885535,
            "likes": {
                "disliked": null,
                "liked": "\u2014 The Staff"
            },
            "rating": 5.0,
            "stay_parameters": "Stayed September 2007, traveled as a couple",
            "text": "One thing to keep in mind about the Dutch is that if you are ever invited into the home of a Dutch person, than this is usually considered a very special thing. I was taught that this kind of invitation means you are considered a friend, and friendship is usually not taken lightly with the Dutch. It is typically a long process.",
            "title": "The Right way, the Dutch way",
            "user": "bigbertha707"
        },
        {
            "date": "September 23, 2007",
            "detail_rating": {
                "business": 5.0,
                "cleanliness": 5.0,
                "desk": null,
                "front_desk": 3.0,
                "location": 5.0,
                "pool": null,
                "restaurant": null,
                "rooms": 5.0,
                "service": 4.0,
                "sleep": null,
                "value": 4.0
            },
            "helpfulness": 2,
            "id": 8862190,
            "likes": {
                "disliked": "\u2014 12 steps from street to reception desk",
                "liked": "\u2014 Large bedroom, good breakfast"
            },
            "rating": 5.0,
            "stay_parameters": "Stayed September 2007, traveled as a couple",
            "text": "At Hotel Fita, i felt as though i was invited into a Dutch home and treated as a friend. And in reality, you are coming into the home of the owners Hans and Loes de Rapper. They own and run the hotel.",
            "title": "Fine family run Hotel",
            "user": "Robert-J"
        },
        {
            "date": "September 15, 2007",
            "detail_rating": {
                "business": 5.0,
                "cleanliness": 5.0,
                "desk": null,
                "front_desk": 4.0,
                "location": 5.0,
                "pool": null,
                "restaurant": null,
                "rooms": 4.0,
                "service": 4.0,
                "sleep": null,
                "value": 5.0
            },
            "helpfulness": null,
            "id": 8719469,
            "likes": {
                "disliked": "\u2014 Nothing",
                "liked": "\u2014 The neighborhood and proximity to museums"
            },
            "rating": 4.0,
            "stay_parameters": "Stayed September 2007, traveled on business",
            "text": "The hotel was very clean and quite spacious considering it is a renovated large house. The hotel is located in the perfect position, only a hop away from the Van Gogh Museum.",
            "title": "A wonderful stay at the Fita",
            "user": "sbduo"
        },
        {
            "date": "March 24, 2008",
            "detail_rating": {
                "business": 5.0,
                "cleanliness": 5.0,
                "desk": null,
                "front_desk": 5.0,
                "location": 5.0,
                "pool": null,
                "restaurant": null,
                "rooms": 5.0,
                "service": 5.0,
                "sleep": null,
                "value": 5.0
            },
            "helpfulness": null,
            "id": 14472686,
            "likes": {
                "disliked": null,
                "liked": null
            },
            "rating": 5.0,
            "stay_parameters": "Stayed March 2008, traveled with friends",
            "text": "Our expectations have been surpassed. We were received with the most friendly welcome of the hotel owners including a welcome drink and were also otherwise impeccably served. The rooms were very clean with a warm atmosphere. The free use of internet and telephone was an unexpected and pleasant surprise. There was a rich choice at the breakfast buffet and the fresh pressed orange juice gave us the boost for the day. Furthermore the hotel is located at a fantastic spot, just next to the van Gogh and the Rijks Museum, and downtown Amsterdam is in short walking distance.",
            "title": "Best Place to Stay!",
            "user": "Amber89"
        },
        {
            "date": "March 19, 2008",
            "detail_rating": {
                "business": 5.0,
                "cleanliness": 5.0,
                "desk": null,
                "front_desk": 5.0,
                "location": 5.0,
                "pool": null,
                "restaurant": null,
                "rooms": 5.0,
                "service": 5.0,
                "sleep": null,
                "value": 5.0
            },
            "helpfulness": null,
            "id": 14394228,
            "likes": {
                "disliked": "\u2014 No negative comments at all.",
                "liked": "\u2014 Convenience, comfort, cleanliness and cooking."
            },
            "rating": 5.0,
            "stay_parameters": "Stayed March 2008, traveled as a couple",
            "text": "We herewith thank the staff for their kind attention and would love to once again return to the Hotel Fita.",
            "title": "Fita is a uniformly wonderful hotel.",
            "user": "BryanWSU"
        },
        {
            "date": "March 17, 2008",
            "detail_rating": {
                "business": 4.0,
                "cleanliness": 5.0,
                "desk": null,
                "front_desk": 4.0,
                "location": 5.0,
                "pool": null,
                "restaurant": null,
                "rooms": 5.0,
                "service": 5.0,
                "sleep": null,
                "value": 4.0
            },
            "helpfulness": null,
            "id": 14340717,
            "likes": {
                "disliked": "\u2014 we liked it all",
                "liked": "\u2014 everthing"
            },
            "rating": 5.0,
            "stay_parameters": "Stayed February 2008, traveled as a couple",
            "text": "The owners and staff are friendly and helpful without being intrusive. The property is immaculate, comfortable and perfectly situated near Museum Plein and Vondel Park. Breakfasts are amazingly diverse and well prepared. And the large, well laid-out rooms have extremely comfortable beds and great, roomy baths. All this and free internet and long-distance telephone calls too!",
            "title": "Loved amsterdam fantastic hotel and staff vey good b/fast",
            "user": "allzzz"
        },
        {
            "date": "March 15, 2008",
            "detail_rating": {
                "business": 5.0,
                "cleanliness": 5.0,
                "desk": null,
                "front_desk": 5.0,
                "location": 5.0,
                "pool": null,
                "restaurant": null,
                "rooms": 5.0,
                "service": 5.0,
                "sleep": null,
                "value": 5.0
            },
            "helpfulness": 1,
            "id": 14306480,
            "likes": {
                "disliked": null,
                "liked": "\u2014 Cleanliness of Hotel"
            },
            "rating": 5.0,
            "stay_parameters": "Stayed March 2008, traveled as a couple",
            "text": "The hotel is on one of the best roads in amsterdam ,great for the van goth gallery and museums. with very friendly staff and management.the building is beautiful outside, and very comfortable inside,our bedroom was lovely ,with a very smart bathroom with lots of piping hot water. Our stay was near perfect and we wuold not only love to return to amsterdam soon but would definately stay at the Fita welldone Hans and Loes",
            "title": "This is a great little hotel",
            "user": "GeeBee26"
        },
        {
            "date": "March 15, 2008",
            "detail_rating": {
                "business": 4.0,
                "cleanliness": 5.0,
                "desk": null,
                "front_desk": 5.0,
                "location": 5.0,
                "pool": null,
                "restaurant": null,
                "rooms": 4.0,
                "service": 5.0,
                "sleep": null,
                "value": 5.0
            },
            "helpfulness": null,
            "id": 14296808,
            "likes": {
                "disliked": "\u2014 small elevator and steap staircase",
                "liked": "\u2014 Clean and the location"
            },
            "rating": 5.0,
            "stay_parameters": "Stayed March 2008, traveled as a couple",
            "text": "ALAN & TONI MURRELL LONDON",
            "title": "A really nice place to stay",
            "user": "antiquehound"
        },
        {
            "date": "October 22, 2007",
            "detail_rating": {
                "business": null,
                "cleanliness": null,
                "desk": null,
                "location": null,
                "pool": null,
                "restaurant": null,
                "rooms": null,
                "service": null,
                "sleep": null,
                "value": null
            },
            "helpfulness": 1,
            "id": 10244300,
            "likes": {
                "disliked": null,
                "liked": null
            },
            "rating": 5.0,
            "stay_parameters": null,
            "text": "We were 4 Aussie couples who were spending the last few days of a five week holiday in Amsterdam. We were delighted with our choice of Hotel Fita. On arrival the owner Hans greeted us with some peach cider and nibbles. A very nice touch. The hotel was in a quiet location,yet handy to trams & museums. Our romms were clean, and spacious with a large bathroom , an ironing board & iron, tea & coffee making facilities , writing desk, and two comfy chairs. Everything a traveller could want. Breakfasts were good, fresh orangeg juice, fruit, cereal, cheeses, toast, and cooked breakfast. Hans was only too happy to give advice on what to do and where to go and our group were very happy with his individual recommendations. Four of us had a late flight home and for an extra fee were were able to secure a room for a late check out. We were given fresh towells, making the prospect of our long haul home to Australia easier.",
            "title": "Loved the Fita Hotel!",
            "user": "Dandy2007"
        },
        {
            "date": "October 22, 2007",
            "detail_rating": {
                "business": 3.0,
                "cleanliness": 4.0,
                "desk": null,
                "front_desk": 4.0,
                "location": 4.0,
                "pool": null,
                "restaurant": null,
                "rooms": 4.0,
                "service": 5.0,
                "sleep": null,
                "value": 4.0
            },
            "helpfulness": 1,
            "id": 10221940,
            "likes": {
                "disliked": null,
                "liked": null
            },
            "rating": 4.0,
            "stay_parameters": "Stayed August 2006",
            "text": "Only imporvementI could suggest: Australians do not like powdered milk in the tea. Fresh is best!",
            "title": "Very Good Hotel",
            "user": "rosstheboss"
        },
        {
            "date": "October 13, 2007",
            "detail_rating": {
                "business": 5.0,
                "cleanliness": 5.0,
                "desk": null,
                "front_desk": 5.0,
                "location": 5.0,
                "pool": null,
                "restaurant": null,
                "rooms": 5.0,
                "service": 5.0,
                "sleep": null,
                "value": 5.0
            },
            "helpfulness": null,
            "id": 10073619,
            "likes": {
                "disliked": "\u2014 Parking",
                "liked": "\u2014 Location"
            },
            "rating": 5.0,
            "stay_parameters": "Stayed October 2007, traveled as a couple",
            "text": "Forgot to do this review but just got back from another city break in Paris so here goes...Lovely hotel, lovely staff, fizzy wine on arrival, had a ground level room which was strange (watching peoples feet usually is!!) but very clean and respectable. Cracking breakfast. Its in a nice quiet location and please walk around the corner to the van goch museum and take an audio tour, its fab!",
            "title": "Loved The Hotel Fita",
            "user": "Jolinda"
        },
        {
            "date": "October 12, 2007",
            "detail_rating": {
                "business": null,
                "cleanliness": 5.0,
                "desk": null,
                "front_desk": 5.0,
                "location": 5.0,
                "pool": null,
                "restaurant": null,
                "rooms": 4.0,
                "service": 3.0,
                "sleep": null,
                "value": 5.0
            },
            "helpfulness": null,
            "id": 10071379,
            "likes": {
                "disliked": "\u2014 Lack of space for storing unpacked clothes",
                "liked": "\u2014 Cleanliness"
            },
            "rating": 5.0,
            "stay_parameters": "Stayed October 2007, traveled as a couple",
            "text": "My husband and I just returned from a three week vacation in Europe and had the pleasure of staying one week at the wonderful Hotel Fita in Amsterdam. Upon our arrival we were offered a welcome drink from the owner himself, Hans, who is a very funny and entertaining fellow. This hotel is in a beautiful location, close to all the museums and within walking distance to everything. They also sell tickets to most museums at a discount. The staff is very friendly and helpful with any questions or recommendations to make your stay in Amsterdam very pleasant. The hotel offers free internet and phone calls (just do not take advantage) and a very nice buffet breakfast. Most hotel rooms in Europe are very small, but we had a nice size medium double room, large bathroom, small balcony, overall very comfortable. We absolutely loved the Hotel Fita in Amsterdam and will definitely stay there again on our next trip to Amsterdam. We have been to Amsterdam on several occasions and I must say the Hotel Fita is the best hotel we have visited.",
            "title": "Fine hotel",
            "user": "TravellerBrighton"
        },
        {
            "date": "October 12, 2007",
            "detail_rating": {
                "business": 5.0,
                "cleanliness": 5.0,
                "desk": null,
                "front_desk": 5.0,
                "location": 4.0,
                "pool": null,
                "restaurant": null,
                "rooms": 5.0,
                "service": 5.0,
                "sleep": null,
                "value": 4.0
            },
            "helpfulness": null,
            "id": 10070331,
            "likes": {
                "disliked": "\u2014 Very steep steps leading upstairs, but there is a small lift.",
                "liked": "\u2014 Friendly staff, large clean rooms, great location."
            },
            "rating": 5.0,
            "stay_parameters": "Stayed October 2007, traveled as a couple",
            "text": "My wife and I found the Hotel Fita to be excellent. A very warm welcome and personal service from a charming host/owner. The hotel is ideally situated for the major museums and concert hall.",
            "title": "Great Hotel, Nice Staff",
            "user": "BlueSkies510"
        },
        {
            "date": "October 31, 2007",
            "detail_rating": {
                "business": null,
                "cleanliness": null,
                "desk": null,
                "location": null,
                "pool": null,
                "restaurant": null,
                "rooms": null,
                "service": null,
                "sleep": null,
                "value": null
            },
            "helpfulness": null,
            "id": 10470539,
            "likes": {
                "disliked": null,
                "liked": null
            },
            "rating": 5.0,
            "stay_parameters": null,
            "text": "A great place to stay especially if you want quick access to the Rijks and/or Van Gogh museums.",
            "title": "A small, wonderful hotel in the Museumplein area of Amsterdam.",
            "user": "TheAnxiousTravelers"
        },
        {
            "date": "October 28, 2007",
            "detail_rating": {
                "business": 5.0,
                "cleanliness": 5.0,
                "desk": null,
                "front_desk": 3.0,
                "location": 4.0,
                "pool": null,
                "restaurant": null,
                "rooms": 3.0,
                "service": 5.0,
                "sleep": null,
                "value": 3.0
            },
            "helpfulness": 1,
            "id": 10391588,
            "likes": {
                "disliked": "\u2014 No bar, small",
                "liked": "\u2014 Friendly service & character"
            },
            "rating": 4.0,
            "stay_parameters": "Stayed October 2007, traveled with family",
            "text": "Hans and Loes de Rapper offer great hospitality and careful attention to detail.",
            "title": "Small touches and friendly service make the difference.",
            "user": "Wandring_star"
        },
        {
            "date": "October 27, 2007",
            "detail_rating": {
                "business": 5.0,
                "cleanliness": 5.0,
                "desk": null,
                "front_desk": 5.0,
                "location": 5.0,
                "pool": null,
                "restaurant": null,
                "rooms": 3.0,
                "service": 5.0,
                "sleep": null,
                "value": null
            },
            "helpfulness": 1,
            "id": 10376216,
            "likes": {
                "disliked": "\u2014 breakfast",
                "liked": "\u2014 location"
            },
            "rating": 4.0,
            "stay_parameters": "Stayed July 2007, traveled with family",
            "text": "Public transportation is close at hand.",
            "title": "extremely pleasant stay",
            "user": "amira1001"
        },
        {
            "date": "October 26, 2007",
            "detail_rating": {
                "business": 5.0,
                "cleanliness": 5.0,
                "desk": null,
                "front_desk": 5.0,
                "location": 5.0,
                "pool": null,
                "restaurant": null,
                "rooms": 3.0,
                "service": 5.0,
                "sleep": null,
                "value": 5.0
            },
            "helpfulness": null,
            "id": 10353172,
            "likes": {
                "disliked": "\u2014 Tight space",
                "liked": "\u2014 Location"
            },
            "rating": 5.0,
            "stay_parameters": "Stayed October 2007, traveled on business",
            "text": "A really nice experience. I was travelling with family and as it was our first time in Amsterdam it was nice to have a friendly welcome from the hotel. The service does make all the difference in this hotel, and did make a very enjoyable stay. The location is also great. It was very close to Vondelpark, Leidseplein and the museums. On the negative side the hotel itself and the rooms are fairly smally.There are no public areas (which can make waiting for a taxi in a small party wuite awkward) and no bar which would have been nice.",
            "title": "Location is everything",
            "user": "Eurotrip_7"
        },
        {
            "date": "October 25, 2007",
            "detail_rating": {
                "business": 5.0,
                "cleanliness": 5.0,
                "desk": null,
                "front_desk": 5.0,
                "location": 5.0,
                "pool": null,
                "restaurant": null,
                "rooms": 5.0,
                "service": 5.0,
                "sleep": null,
                "value": 4.0
            },
            "helpfulness": 1,
            "id": 10326665,
            "likes": {
                "disliked": "\u2014 breakfast",
                "liked": "\u2014 size of room and quality of welcome"
            },
            "rating": 5.0,
            "stay_parameters": "Stayed October 2007, traveled on business",
            "text": "We were quite pleased with our stay at Hotel Fita. The owners were organized and knowledgeable about the city, offering us museum discounts and offering advice about points of interest with directions and maps.",
            "title": "very nice experience at the Fita",
            "user": "annajustine"
        },
        {
            "date": "April 15, 2010",
            "detail_rating": {
                "business": null,
                "cleanliness": 5.0,
                "desk": null,
                "location": 3.0,
                "pool": null,
                "restaurant": null,
                "rooms": 5.0,
                "service": 5.0,
                "sleep": 5.0,
                "value": 5.0
            },
            "helpfulness": null,
            "id": 61402235,
            "likes": {
                "disliked": null,
                "liked": null
            },
            "rating": 5.0,
            "stay_parameters": "Stayed April 2010, traveled with family",
            "text": "All I can say is the services received from Hotel Fita team were the best ever service experience of my holidays in Amsterdam. The staff were really friendly and helpful. Clean and spacious room. Breakfast were superb. The best thing is, they understand and respect the various culture and religious believed of their customers. Personally, I can't find any negative points about the hotel or the staff. You should experience it yourself!. -Honey & CT.",
            "title": "A Great Hotel, Friendly Services",
            "user": "HaniHoney"
        },
        {
            "date": "April 14, 2010",
            "detail_rating": {
                "business": null,
                "cleanliness": 5.0,
                "desk": null,
                "location": 5.0,
                "pool": null,
                "restaurant": null,
                "rooms": 5.0,
                "service": 5.0,
                "sleep": 5.0,
                "value": 5.0
            },
            "helpfulness": 1,
            "id": 61339848,
            "likes": {
                "disliked": null,
                "liked": null
            },
            "rating": 5.0,
            "stay_parameters": "Stayed April 2010, traveled with family",
            "text": "Stayed here for 4 nights and everything was great. Rooms were modern and updated, with a very spacious bathroom with GREAT water pressure. Hans was a riot every morning at breakfast, always around to talk to and joke with. The rest of the staff were friendly and helpful. My sister and I both had our laundry done - dropped it off in the morning and by the evening when we returned to the room it was neatly folded in the basket for us. The location can't be beat, it's quiet but it's also right near 2 tram stops and the museums and about a nice 10-15 minute stroll to Leidseplein. I would definitely stay here again and would recommend it to anyone.",
            "title": "Great!",
            "user": "StupidMop"
        },
        {
            "date": "April 14, 2010",
            "detail_rating": {
                "business": null,
                "cleanliness": 5.0,
                "desk": null,
                "location": 3.0,
                "pool": null,
                "restaurant": null,
                "rooms": 4.0,
                "service": 5.0,
                "sleep": 4.0,
                "value": 4.0
            },
            "helpfulness": null,
            "id": 61321907,
            "likes": {
                "disliked": null,
                "liked": null
            },
            "rating": 5.0,
            "stay_parameters": "Stayed April 2010, traveled solo",
            "text": "I have never experienced such a wonderful stay like this. The hotel staffs are very kind. The hotel lies in the museum area of Amsterdam. It is very convenient to visit these museums and shops.",
            "title": "wonderful hotel",
            "user": "atms"
        },
        {
            "date": "April 11, 2010",
            "detail_rating": {
                "business": null,
                "cleanliness": 4.0,
                "desk": null,
                "location": 5.0,
                "pool": null,
                "restaurant": null,
                "rooms": 3.0,
                "service": 4.0,
                "sleep": 3.0,
                "value": 4.0
            },
            "helpfulness": null,
            "id": 61022751,
            "likes": {
                "disliked": null,
                "liked": null
            },
            "rating": 4.0,
            "stay_parameters": "Stayed April 2010, traveled as a couple",
            "text": "I really liked this hotel. We spent Easter in Amsterdam at the Hotel Fita, and we were really glad we did. The hotel is smart and clean, in a quiet street very close to the museums, but a short tram ride from the rest of the city. Our room was big and bright, overlooking a side street even quieter than the quiet street which the hotel sits on. It had a big bathroom, a good quality coffee maker, and a reasonable bed. The breakfast is splendid, with the pancakes and freshly-squeezed juices as mentioned elsewhere, as well as good coffee, excellent cheese and vanilla-flecked yoghurt.",
            "title": "Great place, in a great place",
            "user": "george_lazenby"
        },
        {
            "date": "April 6, 2010",
            "detail_rating": {
                "business": null,
                "cleanliness": 5.0,
                "desk": null,
                "location": 5.0,
                "pool": null,
                "restaurant": null,
                "rooms": 5.0,
                "service": 5.0,
                "sleep": 5.0,
                "value": 5.0
            },
            "helpfulness": null,
            "id": 60540766,
            "likes": {
                "disliked": null,
                "liked": null
            },
            "rating": 5.0,
            "stay_parameters": "Stayed April 2010, traveled solo",
            "text": "All of the staff are great. Some reviewers have described problems with the owner, Hans and he is a bit eccentric. We witnessed a hilarious encounter between him and a rather ponderous guest who clearly wanted to ask him something, but was taking forever to do it during a busy breakfast session. Put it this way - Hans made it clear that he wanted him to get to the point. But we found him charming and helpful, and besides, if you want bland and robotic service, stay at a big international chain hotel. This is a good quality, individual hotel. I liked it (and Hans) a lot, and when we return to Amsterdam, we'll stay here again.",
            "title": "You gotta love Jan and his pancakes!",
            "user": "JamaicanCaramel"
        },
        {
            "date": "November 21, 2007",
            "detail_rating": {
                "business": null,
                "cleanliness": null,
                "desk": null,
                "location": null,
                "pool": null,
                "restaurant": null,
                "rooms": null,
                "service": null,
                "sleep": null,
                "value": null
            },
            "helpfulness": 3,
            "id": 10957655,
            "likes": {
                "disliked": null,
                "liked": null
            },
            "rating": 4.0,
            "stay_parameters": null,
            "text": "Stayed here with Australian colleague couples x3 (in 60's) for 3 nights. Very comfortable, spacious ensuite rooms, but not 'high end'. (We had a very nice last night 'farewell to holiday' drinks pre-dinner meeting in one of our rooms).",
            "title": "Hotel Fita is a handy & very comfortable base for Amsterdam",
            "user": "Drut"
        },
        {
            "date": "November 14, 2007",
            "detail_rating": {
                "business": 4.0,
                "cleanliness": 5.0,
                "desk": null,
                "front_desk": 4.0,
                "location": 4.0,
                "pool": null,
                "restaurant": null,
                "rooms": 4.0,
                "service": 4.0,
                "sleep": null,
                "value": 3.0
            },
            "helpfulness": 1,
            "id": 10819415,
            "likes": {
                "disliked": null,
                "liked": null
            },
            "rating": 4.0,
            "stay_parameters": "Stayed November 2007, traveled as a couple",
            "text": "Friendly, helpful host Hans - he advises succintly on Amsterdam points of interest & beyond - eg he directed Priscilla & I to undertake a day's cycling adventure into a national park just over an hour by fast train from Amsterdam. We had a fantastic day in rural Holland, while also getting to understand the major attractions of Amsterdam itself in the 3 days we had there!",
            "title": "Will recommend it.",
            "user": "SuperDosa"
        },
        {
            "date": "November 3, 2007",
            "detail_rating": {
                "business": 5.0,
                "cleanliness": 5.0,
                "desk": null,
                "front_desk": 4.0,
                "location": 5.0,
                "pool": null,
                "restaurant": null,
                "rooms": 5.0,
                "service": 5.0,
                "sleep": null,
                "value": 5.0
            },
            "helpfulness": 2,
            "id": 10572401,
            "likes": {
                "disliked": null,
                "liked": null
            },
            "rating": 5.0,
            "stay_parameters": "Stayed November 2007, traveled with family",
            "text": "The canals, museums, reasonable restaurants, and transport around Amsterdam are all very accessible from the Frita.",
            "title": "Great Hotel",
            "user": "MissLister"
        },
        {
            "date": "November 3, 2007",
            "detail_rating": {
                "business": 4.0,
                "cleanliness": 5.0,
                "desk": null,
                "front_desk": 2.0,
                "location": 5.0,
                "pool": null,
                "restaurant": null,
                "rooms": 2.0,
                "service": 3.0,
                "sleep": null,
                "value": 2.0
            },
            "helpfulness": 3,
            "id": 10562157,
            "likes": {
                "disliked": "\u2014 deluxe room and bed didnt match expectations from website, uncomfortable bed",
                "liked": "\u2014 Free laundry, local phone calls, cleanliness"
            },
            "rating": 2.0,
            "stay_parameters": "Stayed October 2007, traveled as a couple",
            "text": "Great base for Amsterdam!",
            "title": "Very disappointed with room and bed",
            "user": "peanutsrio"
        },
        {
            "date": "November 2, 2007",
            "detail_rating": {
                "business": 4.0,
                "cleanliness": 5.0,
                "desk": null,
                "front_desk": 4.0,
                "location": 4.0,
                "pool": null,
                "restaurant": null,
                "rooms": 4.0,
                "service": 4.0,
                "sleep": null,
                "value": 5.0
            },
            "helpfulness": null,
            "id": 10540654,
            "likes": {
                "disliked": "\u2014 Next door to a school - noise",
                "liked": "\u2014 Very clean"
            },
            "rating": 4.0,
            "stay_parameters": "Stayed September 2007, traveled as a couple",
            "text": "Denis - Sydney",
            "title": "A fine stay",
            "user": "Sidney2007"
        }
    ],
    "slim_ranking": 0.0176470588235,
    "stars": 3,
    "tripadvisor": {
        "VISITED": false,
        "country_name": null,
        "locality": null,
        "pic_link": null,
        "street_address": null
    },
    "user_rating": 4.5,
    "variance": {
        "average": 38,
        "excellent": 776,
        "poor": 19,
        "terrible": 8,
        "very good": 249
    }
}