{
    "aka": "Usha Kiran Palace Hotel",
    "description": "Usha Kiran Palace has played host to the King of England and is now a heritage hotel. Set amidst 9 acres of beautifully landscaped lawns, this 120 year old regal palace, rich in history, is outfitted with artistic stone carvings and delicate filigree work. Conveniently located, the hotel has 40 beautiful rooms including Villas with private pool and suites, a dining room truly reminiscent of royalty, a Bar and the award winning Jiva Spa.",
    "detail_rating": {
        "cleanliness": null,
        "location": null,
        "rooms": null,
        "service": null,
        "sleep": null,
        "value": null
    },
    "location": {
        "city": "Gwalior",
        "continent": "Asia",
        "country": "India",
        "proposed_city": "Bar",
        "province": null,
        "region": null
    },
    "name": "Usha Kiran Palace",
    "places": {
        "aka": [],
        "hotel_description": [
            "Bar"
        ],
        "hotel_name": []
    },
    "review_count": 257,
    "review_count_current": 20,
    "reviews": [
        {
            "date": "November 18, 2011",
            "detail_rating": {
                "business": null,
                "cleanliness": 5.0,
                "desk": null,
                "location": 5.0,
                "pool": null,
                "restaurant": null,
                "rooms": 5.0,
                "service": 5.0,
                "sleep": 5.0,
                "value": 5.0
            },
            "helpfulness": null,
            "id": 120744293,
            "likes": {
                "disliked": null,
                "liked": null
            },
            "rating": 5.0,
            "stay_parameters": "Stayed November 2011, traveled with family",
            "text": "Everybody in the Hotel is quite kind and gentle.",
            "title": "Pleasant stay",
            "user": "Antonio-Correia"
        },
        {
            "date": "November 11, 2011",
            "detail_rating": {
                "business": null,
                "cleanliness": 4.0,
                "desk": null,
                "location": 4.0,
                "pool": null,
                "restaurant": null,
                "rooms": 4.0,
                "service": 4.0,
                "sleep": 5.0,
                "value": 5.0
            },
            "helpfulness": null,
            "id": 120482095,
            "likes": {
                "disliked": null,
                "liked": null
            },
            "rating": 4.0,
            "stay_parameters": "Stayed March 2011, traveled on business",
            "text": "Everything is clean and the restaurant is great. We have eaten outside as the interior has no air conditioning and is rather hot.",
            "title": "Balance of Luxury and Value for money",
            "user": "medhurocks"
        },
        {
            "date": "November 5, 2011",
            "detail_rating": {
                "business": null,
                "cleanliness": 5.0,
                "desk": null,
                "location": 5.0,
                "pool": null,
                "restaurant": null,
                "rooms": 5.0,
                "service": 5.0,
                "sleep": 4.0,
                "value": 3.0
            },
            "helpfulness": null,
            "id": 120191032,
            "likes": {
                "disliked": null,
                "liked": null
            },
            "rating": 5.0,
            "stay_parameters": "Stayed October 2011, traveled as a couple",
            "text": "Shame that there are glasses - unmovable - dividing the dinning room from the outside.",
            "title": "Charmed!",
            "user": "mona_4888"
        },
        {
            "date": "October 28, 2011",
            "detail_rating": {
                "business": null,
                "cleanliness": 5.0,
                "desk": null,
                "location": 3.0,
                "pool": null,
                "restaurant": null,
                "rooms": 4.0,
                "service": 5.0,
                "sleep": 5.0,
                "value": 4.0
            },
            "helpfulness": null,
            "id": 119834030,
            "likes": {
                "disliked": null,
                "liked": null
            },
            "rating": 4.0,
            "stay_parameters": "Stayed October 2011, traveled with friends",
            "text": "The waiter was Mr Santosh who suggested us good Indian food.",
            "title": "Relaxing stay !!",
            "user": "Ganesh18"
        },
        {
            "date": "October 15, 2011",
            "detail_rating": {
                "business": null,
                "cleanliness": 5.0,
                "desk": null,
                "location": 2.0,
                "pool": null,
                "restaurant": null,
                "rooms": 5.0,
                "service": 4.0,
                "sleep": 4.0,
                "value": 4.0
            },
            "helpfulness": null,
            "id": 119315144,
            "likes": {
                "disliked": null,
                "liked": null
            },
            "rating": 4.0,
            "stay_parameters": "Stayed October 2011, traveled on business",
            "text": "The Housekeeping in charge at the moment was a young Mr Jasil Ponnachan who was very kind and attentive.",
            "title": "Show of Wealth of Indian Kings",
            "user": "manishjnewdelhi"
        },
        {
            "date": "March 11, 2012",
            "detail_rating": {
                "business": null,
                "cleanliness": 5.0,
                "desk": null,
                "location": 5.0,
                "pool": null,
                "restaurant": null,
                "rooms": 5.0,
                "service": 3.0,
                "sleep": 4.0,
                "value": 5.0
            },
            "helpfulness": null,
            "id": 125938326,
            "likes": {
                "disliked": null,
                "liked": null
            },
            "rating": 4.0,
            "stay_parameters": "Stayed March 2012, traveled with family",
            "text": "We stayed the hotel for 2 night. Our room was really beautiful, we had a roya suite room, chand niwas. The room was well-decorated and beautiful surrounding. I love the bathroom and living area. We had a big terrace for only two suites rooms.",
            "title": "Stunning hotel, average service",
            "user": "churachura"
        },
        {
            "date": "March 10, 2012",
            "detail_rating": {
                "business": null,
                "cleanliness": 5.0,
                "desk": null,
                "location": 5.0,
                "pool": null,
                "restaurant": null,
                "rooms": 5.0,
                "service": 5.0,
                "sleep": 4.0,
                "value": 5.0
            },
            "helpfulness": null,
            "id": 125903817,
            "likes": {
                "disliked": null,
                "liked": null
            },
            "rating": 5.0,
            "stay_parameters": "Stayed February 2012, traveled as a couple",
            "text": "Our deal included breakfast and one meal, transport which I found very reasonable. Hotel has a beautiful swimming pool, garden. I also love the decorations and architecture of the hotel. They maintained well.",
            "title": "what a gem.....",
            "user": "queensquitter"
        },
        {
            "date": "February 13, 2012",
            "detail_rating": {
                "business": null,
                "cleanliness": 5.0,
                "desk": null,
                "location": 5.0,
                "pool": null,
                "restaurant": null,
                "rooms": 5.0,
                "service": 4.0,
                "sleep": 4.0,
                "value": 5.0
            },
            "helpfulness": null,
            "id": 124525495,
            "likes": {
                "disliked": null,
                "liked": null
            },
            "rating": 5.0,
            "stay_parameters": "Stayed December 2011, traveled as a couple",
            "text": "However, the service is not impressive. We ordered the drinks at the restaurant. Although there were nobody when we arrived, it took over 30 mins to bring us the drinks. If you want to have one thing in the restaurant, you have to ask 2-3 times till they get it right. Also housekeeping is talking to me too much. It was very clear that he wanted to have tips. I wish they left me alone and peace. They should manage their staff training better. It is really a shame for such a beautiful hotel. If they have well-trained staffs, this hotel worths much better.",
            "title": "beautiful heritage hotel",
            "user": "classychickdevon"
        },
        {
            "date": "January 25, 2012",
            "detail_rating": {
                "business": null,
                "cleanliness": 5.0,
                "desk": null,
                "location": 4.0,
                "pool": null,
                "restaurant": null,
                "rooms": 5.0,
                "service": 5.0,
                "sleep": 5.0,
                "value": 5.0
            },
            "helpfulness": null,
            "id": 123583271,
            "likes": {
                "disliked": null,
                "liked": null
            },
            "rating": 5.0,
            "stay_parameters": "Stayed December 2011, traveled with family",
            "text": "This season has many mosquitoes. If you are going now, you should bring some mosquito cream etc. Someone recommended to eat outside, however, it is too cold to eat when I was there. Maybe nice for lunch and breakfast.",
            "title": "Absolute value for Money",
            "user": "RahulTT"
        },
        {
            "date": "January 22, 2012",
            "detail_rating": {
                "business": null,
                "cleanliness": 3.0,
                "desk": null,
                "location": 4.0,
                "pool": null,
                "restaurant": null,
                "rooms": 5.0,
                "service": 5.0,
                "sleep": 4.0,
                "value": 4.0
            },
            "helpfulness": 1,
            "id": 123438119,
            "likes": {
                "disliked": null,
                "liked": null
            },
            "rating": 4.0,
            "stay_parameters": "Stayed August 2011, traveled on business",
            "text": "Also for the palace museum time is 10am-5pm. And the fort is closing around 5pm and it takes quite long time to see all. So it is better to go early in the morning.",
            "title": "Fabulous property....",
            "user": "Ashsagar"
        },
        {
            "date": "January 16, 2012",
            "detail_rating": {
                "business": null,
                "cleanliness": 5.0,
                "desk": null,
                "location": 5.0,
                "pool": null,
                "restaurant": null,
                "rooms": 5.0,
                "service": 5.0,
                "sleep": 5.0,
                "value": 5.0
            },
            "helpfulness": null,
            "id": 123145469,
            "likes": {
                "disliked": null,
                "liked": null
            },
            "rating": 5.0,
            "stay_parameters": "Stayed December 2011, traveled with family",
            "text": "Don't miss out on Gwalior if you are visiting Northern India - the fort is particularly interesting. And don't miss out on this hotel - again, a beautifully restored property now run by Taj Hotels. Our room was so big and luxuriously appointed we couldn't have asked for more. But it was the staff also who were so friendly and accommodating - to the extent that my daughter was in the kitchen getting lessons from chef on Indian food, a personal touch that made our stay so delightfu;/ Dinner was excellent and reasonably priced. Gardens were lovely to sit and have a drink before or after dinner.",
            "title": "Great hotel",
            "user": "travellersalways"
        },
        {
            "date": "January 14, 2012",
            "detail_rating": {
                "business": null,
                "cleanliness": 5.0,
                "desk": null,
                "location": 5.0,
                "pool": null,
                "restaurant": null,
                "rooms": 5.0,
                "service": 5.0,
                "sleep": 5.0,
                "value": 4.0
            },
            "helpfulness": null,
            "id": 123064958,
            "likes": {
                "disliked": null,
                "liked": null
            },
            "rating": 5.0,
            "stay_parameters": "Stayed May 2011, traveled solo",
            "text": "What can I say? Circa 5000INR a night so not really budget, but still cheper than some UK budget chains at about \u00a362.50 a night including breakfast and taxes. I did take advantage of the reduction in price after the 1st of May (off season charges) which made the hotel better value than it would have been and found it cheaper booking directly through the Taj hotels website.",
            "title": "Beacause you're worth it......!",
            "user": "Yorkie1970"
        },
        {
            "date": "December 25, 2011",
            "detail_rating": {
                "business": null,
                "cleanliness": 5.0,
                "desk": null,
                "location": 3.0,
                "pool": null,
                "restaurant": null,
                "rooms": 5.0,
                "service": 3.0,
                "sleep": 5.0,
                "value": 4.0
            },
            "helpfulness": 1,
            "id": 122075792,
            "likes": {
                "disliked": null,
                "liked": null
            },
            "rating": 5.0,
            "stay_parameters": "Stayed December 2011, traveled on business",
            "text": "Built by the Maharajah of Gwalior for the visit of King George and Queen Mary it's a kind of mini palace, but still pretty amazing for all that. The restaurant is superb and there's live music most nights. There are indoor and outdoor dining facilities and the courtyard flanked by the reataurant and bar is magical in the evening. The room wasn't huge but the facilities were first rate (may bath was more like a small swimming pool) and the beds comfortable and boasting decent matrresses.",
            "title": "Luxury!",
            "user": "avinashmnayak"
        },
        {
            "date": "December 6, 2011",
            "detail_rating": {
                "business": null,
                "cleanliness": 5.0,
                "desk": null,
                "location": 4.0,
                "pool": null,
                "restaurant": null,
                "rooms": 4.0,
                "service": 4.0,
                "sleep": 4.0,
                "value": 3.0
            },
            "helpfulness": null,
            "id": 121447813,
            "likes": {
                "disliked": null,
                "liked": null
            },
            "rating": 5.0,
            "stay_parameters": "Stayed November 2011, traveled as a couple",
            "text": "The staff could not have been more helpful, well I suppose you'd expect that from a Taj property, but still, their ability to arrange anything at short notice was very much appreciated.",
            "title": "U'll love it",
            "user": "harshkrg"
        },
        {
            "date": "December 1, 2011",
            "detail_rating": {
                "business": null,
                "cleanliness": 5.0,
                "desk": null,
                "location": 4.0,
                "pool": null,
                "restaurant": null,
                "rooms": 5.0,
                "service": 5.0,
                "sleep": 5.0,
                "value": 5.0
            },
            "helpfulness": null,
            "id": 121273768,
            "likes": {
                "disliked": null,
                "liked": null
            },
            "rating": 5.0,
            "stay_parameters": "Stayed November 2011, traveled with friends",
            "text": "A very nice place to spend you weekend! The rooms we had got were huge and truly exemplified luxury! The bath tubs and toilets were redone and it was truly going back in time. A very well kept lawn greets you! When we had visited the hotel was undergoing a few renovations and hence there were a few things out of place. Service however is something that needs to improve. A bit too slow - possibly it is because of the location rather than the hotel group. Worth spending a couple of weekends every year at the place!",
            "title": "A bit of luxury in Gwalior!",
            "user": "KatjaUK"
        },
        {
            "date": "October 8, 2011",
            "detail_rating": {
                "business": null,
                "cleanliness": 5.0,
                "desk": null,
                "location": 4.0,
                "pool": null,
                "restaurant": null,
                "rooms": 4.0,
                "service": 4.0,
                "sleep": 4.0,
                "value": 4.0
            },
            "helpfulness": null,
            "id": 119059470,
            "likes": {
                "disliked": null,
                "liked": null
            },
            "rating": 4.0,
            "stay_parameters": "Stayed October 2011, traveled on business",
            "text": "Stayed here last week. I did stay here a few months back but didnt have a very good experience that time so was a little sceptical getting back here, The last time had nothing to do with service but you really need to get used to staying in a heritage hotel with rooms three times the rooms you are used to staying in !! this time around i requested for a smaller room and didnt want a football feild for a room. it was very nice. great service and a very good staff. its an amazingly well kept heritage hotel managed by Taj. The rooms are good and spacious and the staff very courteous. the bathrooms are huge and really very good. the foods also good.",
            "title": "Majestic Usha Kiran Palace",
            "user": "jayeshgadia"
        },
        {
            "date": "September 22, 2011",
            "detail_rating": {
                "business": null,
                "cleanliness": 4.0,
                "desk": null,
                "location": 4.0,
                "pool": null,
                "restaurant": null,
                "rooms": 4.0,
                "service": 4.0,
                "sleep": 4.0,
                "value": 4.0
            },
            "helpfulness": null,
            "id": 118452050,
            "likes": {
                "disliked": null,
                "liked": null
            },
            "rating": 4.0,
            "stay_parameters": "Stayed August 2011, traveled on business",
            "text": "Usha kiran is part of the palace premises and was use as the guest house for the guests visiting the king.",
            "title": "A comfortable bit of history for a quick business trip",
            "user": "koldkitty"
        },
        {
            "date": "September 22, 2011",
            "detail_rating": {
                "business": null,
                "cleanliness": 5.0,
                "desk": null,
                "location": 1.0,
                "pool": null,
                "restaurant": null,
                "rooms": 5.0,
                "service": 5.0,
                "sleep": 5.0,
                "value": 5.0
            },
            "helpfulness": null,
            "id": 118435477,
            "likes": {
                "disliked": null,
                "liked": null
            },
            "rating": 5.0,
            "stay_parameters": "Stayed September 2011, traveled on business",
            "text": "If you love heritage properties this is a very nice and well maintained property. You can stay here and spend one day at the main palace and the museum. Day two you can do the fort and some local shopping and stay at the hotel.",
            "title": "unique experience",
            "user": "rafi3342"
        },
        {
            "date": "September 16, 2011",
            "detail_rating": {
                "business": null,
                "cleanliness": null,
                "desk": null,
                "location": 5.0,
                "pool": null,
                "restaurant": null,
                "rooms": 5.0,
                "service": 5.0,
                "sleep": null,
                "value": 4.0
            },
            "helpfulness": null,
            "id": 118181708,
            "likes": {
                "disliked": null,
                "liked": null
            },
            "rating": 5.0,
            "stay_parameters": "Stayed June 2011, traveled with friends",
            "text": "There isnt much to do for the kids here so if you have very small kids it would be challenge as there isnt much they can do besides play on the lawn and use the swimming pool. The swimming pools also very nice and in great ambience.",
            "title": "Old-world charm",
            "user": "BrokeTraveller88"
        },
        {
            "date": "September 13, 2011",
            "detail_rating": {
                "business": null,
                "cleanliness": null,
                "desk": null,
                "location": 4.0,
                "pool": null,
                "restaurant": null,
                "rooms": 4.0,
                "service": null,
                "sleep": null,
                "value": 3.0
            },
            "helpfulness": null,
            "id": 118073841,
            "likes": {
                "disliked": null,
                "liked": null
            },
            "rating": 4.0,
            "stay_parameters": "Stayed February 2011, traveled on business",
            "text": "The conference facilities are average and not very great. Guess this hotel is more for the traveller and lesser for the business types for having meetings.",
            "title": "Review on Usha Kiran",
            "user": "sankap"
        }
    ],
    "slim_ranking": 0.153846153846,
    "stars": 4,
    "tripadvisor": {
        "VISITED": false,
        "country_name": null,
        "locality": null,
        "pic_link": null,
        "street_address": null
    },
    "user_rating": 4.5,
    "variance": {
        "average": 17,
        "excellent": 159,
        "poor": 5,
        "terrible": 2,
        "very good": 74
    }
}