{
    "aka": "Doubletree Denver Aurora Hotel",
    "description": "Attractive Suburban Hotel in glass-&-brick building with 6-story Atrium.",
    "detail_rating": {
        "cleanliness": null,
        "location": null,
        "rooms": null,
        "service": null,
        "sleep": null,
        "value": null
    },
    "location": {
        "city": "Aurora",
        "continent": null,
        "country": "United States",
        "proposed_city": null,
        "province": null,
        "region": null
    },
    "name": "DoubleTree Denver Aurora",
    "places": {
        "aka": [
            "Denver",
            "Aurora"
        ],
        "hotel_description": [],
        "hotel_name": [
            "Denver",
            "Aurora"
        ]
    },
    "review_count": 296,
    "review_count_current": 20,
    "reviews": [
        {
            "date": "April 9, 2013",
            "detail_rating": {
                "business": null,
                "cleanliness": 1.0,
                "desk": null,
                "location": 1.0,
                "pool": null,
                "restaurant": null,
                "rooms": 1.0,
                "service": 1.0,
                "sleep": 1.0,
                "value": 1.0
            },
            "helpfulness": 2,
            "id": 157372208,
            "likes": {
                "disliked": null,
                "liked": null
            },
            "rating": 1.0,
            "stay_parameters": "Stayed April 2013, traveled on business",
            "text": "When someone books a room wouldn\u2019t it be nice to know if there was construction going on? I would.. The workers were noisy and vulgar.. Hotel smelled on paint and plastic, every floor.. Dusty rooms with all the construction noises one tries to escape.. Great job can\u2019t wait to torture myself again at your rundown hotel\u2026",
            "title": "Lied to again...",
            "user": "Mark K"
        },
        {
            "date": "March 12, 2013",
            "detail_rating": {
                "business": null,
                "cleanliness": 4.0,
                "desk": null,
                "location": 4.0,
                "pool": null,
                "restaurant": null,
                "rooms": 3.0,
                "service": 5.0,
                "sleep": 2.0,
                "value": 3.0
            },
            "helpfulness": null,
            "id": 154374606,
            "likes": {
                "disliked": null,
                "liked": null
            },
            "rating": 3.0,
            "stay_parameters": "Stayed March 2013, traveled with friends",
            "text": "The hotel was a bit shabby, carpets thin and slightly stained. Beds were uncomfortable. However hotel was clean, staff friendly and the warm cookie was nice. The rooms could have used a safe but all my electronics were not disturbed! They were working on the lobby so hopefully this hotel is undergoing a much needed remodeling. Could use more shuttles to places other than airport.",
            "title": "Friendly, clean rooms, No room safe yet computer not stolen! A bit shabby & beds uncomfortable.",
            "user": "Leisa G"
        },
        {
            "date": "February 28, 2013",
            "detail_rating": {
                "business": null,
                "cleanliness": 5.0,
                "desk": null,
                "location": null,
                "pool": null,
                "restaurant": null,
                "rooms": 5.0,
                "service": 5.0,
                "sleep": 5.0,
                "value": null
            },
            "helpfulness": null,
            "id": 153371590,
            "likes": {
                "disliked": null,
                "liked": null
            },
            "rating": 5.0,
            "stay_parameters": "Stayed February 2013, traveled solo",
            "text": "I would recommend this hotel to any one, the hotel was clean and the room was beautiful. I found it to be priced right and the clerks at the front desk were curtious and friendly. This is my first time staying at the DoubleTree and I would if need be stay again.",
            "title": "Beautiful",
            "user": "rlw1957"
        },
        {
            "date": "February 27, 2013",
            "detail_rating": {
                "business": null,
                "cleanliness": 3.0,
                "desk": null,
                "location": 3.0,
                "pool": null,
                "restaurant": null,
                "rooms": 1.0,
                "service": 1.0,
                "sleep": 1.0,
                "value": 1.0
            },
            "helpfulness": 2,
            "id": 153341188,
            "likes": {
                "disliked": null,
                "liked": null
            },
            "rating": 1.0,
            "stay_parameters": "Stayed February 2013, traveled on business",
            "text": "Booked two hotel rooms through a third party that my boss had already booked a flight and rental car from. The hotel put my companion and I in two handicap rooms on the bottom floor. Neither of us being handicapped. There were no ice machines on the bottom floor. If we wanted ice we were told we would have to go to the bar to get it. The TV blared next to me so loud that I didn't need the picture to know exactly what was going on. After midnight I called the front desk only to get no answer. I later called again, this time after numerous rings the front desk answered. I asked if it was normal to hear the tv from another room and was told yes, but they would ask them to turn the tv down. Didn't get any sleep. Wanted moved or refund knowing we would be here for an entire week. Front desk told us that because we booked 3rd party and getting rooms cheaper than their normal $168 price rate they got to choose what rooms we had. Called 3rd party and they refunded the rooms & told us to stay anywhere we liked. We moved to the Doubletree in Westminster, CO and had a fantastic stay. Beware of Aurora Doubletree.",
            "title": "Beware of booking through 3rd party at this hotel",
            "user": "Deena S"
        },
        {
            "date": "February 18, 2013",
            "detail_rating": {
                "business": null,
                "cleanliness": 2.0,
                "desk": null,
                "location": 3.0,
                "pool": null,
                "restaurant": null,
                "rooms": 3.0,
                "service": 2.0,
                "sleep": null,
                "value": 2.0
            },
            "helpfulness": 7,
            "id": 152440905,
            "likes": {
                "disliked": null,
                "liked": null
            },
            "rating": 2.0,
            "stay_parameters": "Stayed February 2013",
            "text": "Returning from Iceland we had a layover in Denver. I called this hotel before our trip and asked if there was a shuttle to/from the hotel, etc.",
            "title": "Worst Service at a Hilton Property",
            "user": "Ammon C"
        },
        {
            "date": "May 7, 2013",
            "detail_rating": {
                "business": null,
                "cleanliness": 5.0,
                "desk": null,
                "location": 5.0,
                "pool": null,
                "restaurant": null,
                "rooms": 5.0,
                "service": 5.0,
                "sleep": 5.0,
                "value": 5.0
            },
            "helpfulness": null,
            "id": 160669511,
            "likes": {
                "disliked": null,
                "liked": null
            },
            "rating": 5.0,
            "stay_parameters": "Stayed May 2013, traveled on business",
            "text": "My room was extremely quiet and comfortable. It was clean and had everything I needed, coffee maker, refrigerator, comfortable bed. The only thing I didn't like was apparently someone was smoking in their room about halfway down my hall. Other than that (which the hotel does not have control over), I would stay here again. The conference rate was very affordable and easy to get to from the airport. The office staff were very accommodating and proffessional as I needed to scan some documents and send them.",
            "title": "Conference Attendee Stay",
            "user": "Shannon W"
        },
        {
            "date": "May 3, 2013",
            "detail_rating": {
                "business": null,
                "cleanliness": 5.0,
                "desk": null,
                "location": 5.0,
                "pool": null,
                "restaurant": null,
                "rooms": 5.0,
                "service": 5.0,
                "sleep": 5.0,
                "value": 5.0
            },
            "helpfulness": null,
            "id": 160662580,
            "likes": {
                "disliked": null,
                "liked": null
            },
            "rating": 5.0,
            "stay_parameters": "Stayed April 2013, traveled as a couple",
            "text": "Beautiful new lobby, excellent staff, excellent value. Cookie on arrival is always nice and being vegetarian, it was nice to see a veggie wrap on the breakfast menu in the dining room. Parking is not a problem and at no extra charge.",
            "title": "Excellent Value",
            "user": "Paul M S"
        },
        {
            "date": "May 3, 2013",
            "detail_rating": {
                "business": null,
                "cleanliness": 4.0,
                "desk": null,
                "location": 4.0,
                "pool": null,
                "restaurant": null,
                "rooms": 4.0,
                "service": 2.0,
                "sleep": 4.0,
                "value": 1.0
            },
            "helpfulness": null,
            "id": 159501656,
            "likes": {
                "disliked": null,
                "liked": null
            },
            "rating": 2.0,
            "stay_parameters": "Stayed May 2013, traveled on business",
            "text": "The Doubletree in Aurora had a decent room for us: clean, a tv, a bed, a bathroom. My complaints: when we went down from breakfast, we were asked, \"Do you have coupons? Do you have vouchers?\" I don't know how you get the coupons or the vouchers, and no one told us either. So if you don't have the vouchers, a standard fare breakfast buffet is $15.07, or $17 when you include tip. For a $149 room and as a frequent business traveler, this was unheard of to me. And to use the wifi, you got to get another coupon or pay some extra money or join a stupid club so they can email you every day.",
            "title": "Doubletree Aurora Home of $17 Breakfast and No Wifi",
            "user": "Bismarck M"
        },
        {
            "date": "May 2, 2013",
            "detail_rating": {
                "business": null,
                "cleanliness": 1.0,
                "desk": null,
                "location": 4.0,
                "pool": null,
                "restaurant": null,
                "rooms": 1.0,
                "service": 1.0,
                "sleep": 1.0,
                "value": 1.0
            },
            "helpfulness": 1,
            "id": 159469044,
            "likes": {
                "disliked": null,
                "liked": null
            },
            "rating": 1.0,
            "stay_parameters": "Stayed March 2013, traveled with family",
            "text": "That's not competitive. I won't be staying at any Doubletree again. There are too many hotels that provide wifi and give you breakfast without eating up a big chunk of per diem.",
            "title": "Change in Management = Negative Results",
            "user": "Cindy2096"
        },
        {
            "date": "May 1, 2013",
            "detail_rating": {
                "business": null,
                "cleanliness": 4.0,
                "desk": null,
                "location": 4.0,
                "pool": null,
                "restaurant": null,
                "rooms": 4.0,
                "service": 5.0,
                "sleep": 4.0,
                "value": 3.0
            },
            "helpfulness": null,
            "id": 159366112,
            "likes": {
                "disliked": null,
                "liked": null
            },
            "rating": 5.0,
            "stay_parameters": "Stayed April 2013, traveled on business",
            "text": "My husband and I have stayed at this Double Tree year after year during our visits to Denver. This last visit, there was a change in management and ongoing reservation. The customer service is non existant. The rooms were unclean with old linens. The waitress was sitting at the bar folding cloth napkins while eating cookies; thus, cleaning her hands on the napkins as she folded them. The Manager was unfriendy and when my husband and I asked if the shuttle was available, he said it was not when it was clearly parked in front. I asked again and he said they had two shuttles and only one driver - very rude and no customer service. We will not be staying there again....",
            "title": "Very Hospitable!",
            "user": "Kelli K"
        },
        {
            "date": "May 1, 2013",
            "detail_rating": {
                "business": null,
                "cleanliness": 5.0,
                "desk": null,
                "location": 5.0,
                "pool": null,
                "restaurant": null,
                "rooms": 5.0,
                "service": 5.0,
                "sleep": 5.0,
                "value": 5.0
            },
            "helpfulness": null,
            "id": 160659178,
            "likes": {
                "disliked": null,
                "liked": null
            },
            "rating": 5.0,
            "stay_parameters": "Stayed April 2013, traveled on business",
            "text": "Very enjoyable and will probably return again. It was nice to able to stay and attend the conference in the same facility. Even though the lobby was under construction the staff was very efficient and friendly.",
            "title": "Nice Stay",
            "user": "Bobee B"
        },
        {
            "date": "April 28, 2013",
            "detail_rating": {
                "business": null,
                "cleanliness": 4.0,
                "desk": null,
                "location": 3.0,
                "pool": null,
                "restaurant": null,
                "rooms": 3.0,
                "service": 4.0,
                "sleep": null,
                "value": 4.0
            },
            "helpfulness": null,
            "id": 159016341,
            "likes": {
                "disliked": null,
                "liked": null
            },
            "rating": 4.0,
            "stay_parameters": "Stayed April 2013",
            "text": "Three key things drive my reviews: good bed, quiet room, and good shower. The beds here are comfy and nice linens. The room was quiet and I even had trashy neighbors but couldn't hear them in my room. The shower though needs a redesign. I'm 5'10 so not very tall and I had to duck and twist about to wash my face and head. The shower head is way too low. They are currently doing construction so it's a quest to get to the elevators. Overall, staff is nice and rooms are good b",
            "title": "Not bad",
            "user": "Chefjeffsd"
        },
        {
            "date": "April 21, 2013",
            "detail_rating": {
                "business": null,
                "cleanliness": 1.0,
                "desk": null,
                "location": 2.0,
                "pool": null,
                "restaurant": null,
                "rooms": 1.0,
                "service": 1.0,
                "sleep": null,
                "value": 2.0
            },
            "helpfulness": 3,
            "id": 158332067,
            "likes": {
                "disliked": null,
                "liked": null
            },
            "rating": 1.0,
            "stay_parameters": "Stayed April 2013",
            "text": "We checked in expecting doubletree quality and what a surprise. The hotel is being remodeled and that was definitely not conveyed when we called. We booked the hotel on Priceline and named our own price. Now I know why it was so cheap. When we arrived the floors in the room hasn't been vacuumed and there was a huge chunk of a cinnamon roll behind the door!!!! The carpets are worn and the elevators smell like smoke. The hotel put is on the second floor and starting about 9:00 pm a party started right below us with screaming children in the hallway. When I called the front desk to ask what was going on I was told the \"function\" would last until 2 am! When the conversation escalated the front desk person hung up on me!!! I called back and was offered another room but its ridiculous to wake up the rest of the family and move at 10:00 pm at night! knowing they were going to have a loud function till late why put someone on the second floor directly over the noise! Definitely not a hotel I would recommend. The neighborhood is questionable and the staff is rude! Steer clear!!!!!!!!",
            "title": "Rundown Hotel. Not clean! Staff rude",
            "user": "Ironhorsecb"
        },
        {
            "date": "April 18, 2013",
            "detail_rating": {
                "business": null,
                "cleanliness": 3.0,
                "desk": null,
                "location": 4.0,
                "pool": null,
                "restaurant": null,
                "rooms": 3.0,
                "service": 2.0,
                "sleep": 3.0,
                "value": 2.0
            },
            "helpfulness": 1,
            "id": 158198405,
            "likes": {
                "disliked": null,
                "liked": null
            },
            "rating": 2.0,
            "stay_parameters": "Stayed April 2013, traveled on business",
            "text": "This hotel doesn't measure up to Doubletree standards. Everything about it was sub-par, especially the restaurant. The food was mediocre at best and the service was lacking. The front desk staff was unpleasant and unwelcoming. Due to construction there were all sorts of problems with the water and I was uncomfortable for the majority of my short stay.",
            "title": "Doesn't measure up to Doubletree standards",
            "user": "Carrie M"
        },
        {
            "date": "April 16, 2013",
            "detail_rating": {
                "business": null,
                "cleanliness": 4.0,
                "desk": null,
                "location": 3.0,
                "pool": null,
                "restaurant": null,
                "rooms": 3.0,
                "service": 5.0,
                "sleep": 4.0,
                "value": 5.0
            },
            "helpfulness": 1,
            "id": 157902639,
            "likes": {
                "disliked": null,
                "liked": null
            },
            "rating": 4.0,
            "stay_parameters": "Stayed October 2012, traveled as a couple",
            "text": "Got sent here by airline when flight cancelled and had low expectations . However I was pleasantly surprised. Reception assigned a nice quiet room and a good experience at the restaurant led to us extending our stay . Airport shuttle efficient and cheerful. All in all a good operation.",
            "title": "Surprisingly good airport Hotel",
            "user": "fortq"
        },
        {
            "date": "May 22, 2013",
            "detail_rating": {
                "business": null,
                "cleanliness": 5.0,
                "desk": null,
                "location": 3.0,
                "pool": null,
                "restaurant": null,
                "rooms": 4.0,
                "service": 3.0,
                "sleep": 5.0,
                "value": 3.0
            },
            "helpfulness": null,
            "id": 161510157,
            "likes": {
                "disliked": null,
                "liked": null
            },
            "rating": 4.0,
            "stay_parameters": "Stayed May 2013, traveled with family",
            "text": "This hotel is a solid choice - exactly what you would expect from a Doubletree. The rooms are nice and well designed. Our room had a small sitting area and a desk for work. The beds are comfortable with good quality linens. The common areas of the hotel are comfortable and inviting.",
            "title": "Solid place to stay",
            "user": "november_moon"
        },
        {
            "date": "May 14, 2013",
            "detail_rating": {
                "business": null,
                "cleanliness": 5.0,
                "desk": null,
                "location": 3.0,
                "pool": null,
                "restaurant": null,
                "rooms": 4.0,
                "service": 4.0,
                "sleep": 3.0,
                "value": 4.0
            },
            "helpfulness": null,
            "id": 161290186,
            "likes": {
                "disliked": null,
                "liked": null
            },
            "rating": 4.0,
            "stay_parameters": "Stayed May 2013, traveled on business",
            "text": "I didn't have much interaction with the staff, but everyone seemed pleasant.",
            "title": "Nice Experience",
            "user": "Robert S"
        },
        {
            "date": "May 14, 2013",
            "detail_rating": {
                "business": null,
                "cleanliness": 3.0,
                "desk": null,
                "location": 2.0,
                "pool": null,
                "restaurant": null,
                "rooms": 1.0,
                "service": 2.0,
                "sleep": 4.0,
                "value": 2.0
            },
            "helpfulness": null,
            "id": 160627918,
            "likes": {
                "disliked": null,
                "liked": null
            },
            "rating": 2.0,
            "stay_parameters": "Stayed May 2013, traveled as a couple",
            "text": "Never stayed in a Double Tree before. The room was nice ans spacious plus the cookie they give is delicious. They ask for you car make and license for security. Also, its right by the highway, so it is convenient to get to Denver.",
            "title": "Not worth it...",
            "user": "KLDM419"
        },
        {
            "date": "May 8, 2013",
            "detail_rating": {
                "business": null,
                "cleanliness": 2.0,
                "desk": null,
                "location": 4.0,
                "pool": null,
                "restaurant": null,
                "rooms": 3.0,
                "service": 3.0,
                "sleep": 3.0,
                "value": 2.0
            },
            "helpfulness": null,
            "id": 160088554,
            "likes": {
                "disliked": null,
                "liked": null
            },
            "rating": 2.0,
            "stay_parameters": "Stayed April 2013, traveled with family",
            "text": "No one at the front desk read the reservation notes prior to our arrival. They preassigned rooms without reading the notes, so they had to move rooms around when we got there. I had to speak to 4 people before one of them spoke enough english to understand that my husband and I are allergic to down and needed new pillows and blankets. Internet is ridiculously overpriced, $12.95 per device per day, for very low internet speed. I couldn't even work or have a live chat conference in my room. They don't have microwaves available, and fridges are only available for $10. Everyone who worked there was nice, but only three employees out of the 8 employees I came in contact with spike and understood english. The walls were dirty, and everything in the rooms were outdated. They clearly spent a lot of money redoing the lobby, but they would've saved a lot of money by updating small things like wallpaper, shower curtains, and window treatments in the rooms. The jacuzzi only has jets on the ground working, and the scented oils in it caused me to have a rash.",
            "title": "Construction Mess",
            "user": "chajoy"
        },
        {
            "date": "May 7, 2013",
            "detail_rating": {
                "business": null,
                "cleanliness": 5.0,
                "desk": null,
                "location": 5.0,
                "pool": null,
                "restaurant": null,
                "rooms": 5.0,
                "service": 5.0,
                "sleep": 5.0,
                "value": 5.0
            },
            "helpfulness": null,
            "id": 159943715,
            "likes": {
                "disliked": null,
                "liked": null
            },
            "rating": 5.0,
            "stay_parameters": "Stayed May 2013, traveled on business",
            "text": "The place was undergoing construction and there was dust everywhere. I had entered my hotel room earlier in the afternoon and no smells. When I returned to it a couple of hours later, I couldn't even breathe. There was some kind of chemical epoxy which smelled very strong and VERY toxic. Many hotel guests complained of the same thing. I don't know if they entered my room while I wasn't there and epoxied the tub but that's what some people were saying. Of course they let me change rooms, but the fact that they were so discourteous and didn't mention it, I'm not sure what to think. It's not like the hotel was booked so they couldn't wait til I checked out. I really should have asked for a discount in hindsight.",
            "title": "Fantastic Sevice...Hotel Feels Like New",
            "user": "Rone M"
        }
    ],
    "slim_ranking": 0.224489795918,
    "stars": 3.5,
    "tripadvisor": {
        "VISITED": false,
        "country_name": null,
        "locality": null,
        "pic_link": null,
        "street_address": null
    },
    "user_rating": 4.0,
    "variance": {
        "average": 44,
        "excellent": 102,
        "poor": 30,
        "terrible": 19,
        "very good": 101
    }
}