{
    "aka": "Leverton House Hotel Cambridge",
    "description": "We pride ourselves on our clean and comfortable rooms and friendly service. All our rooms are non-smoking and have color TVs, tea and coffee making facilities and hairdryers. We also provide a patio area at the end of a pleasant garden, and off-road parking. We are located a mile and a half east of Cambridge City Centre on the A1303 (Newmarket Road) which is easily accessible from the M11 via the A14.",
    "detail_rating": {
        "cleanliness": null,
        "location": null,
        "rooms": null,
        "service": null,
        "sleep": null,
        "value": null
    },
    "location": {
        "city": null,
        "continent": "Europe",
        "country": "United Kingdom (UK)",
        "proposed_city": "Cambridge",
        "province": null,
        "region": null
    },
    "name": "Leverton House",
    "places": {
        "aka": [
            "Cambridge"
        ],
        "hotel_description": [
            "Cambridge",
            "Newmarket"
        ],
        "hotel_name": []
    },
    "review_count": 151,
    "review_count_current": 17,
    "reviews": [
        {
            "date": "October 7, 2008",
            "detail_rating": {
                "business": null,
                "cleanliness": 5.0,
                "desk": null,
                "front_desk": 5.0,
                "location": 4.0,
                "pool": null,
                "restaurant": null,
                "rooms": 5.0,
                "service": null,
                "sleep": null,
                "value": null
            },
            "helpfulness": 1,
            "id": 20701899,
            "likes": {
                "disliked": "\u2014 No Lounge",
                "liked": "\u2014 Proprietor"
            },
            "rating": 5.0,
            "stay_parameters": "Stayed October 2008, traveled with friends",
            "text": "I have stayed in different guest houses in Cambridge over a period of eight years . I opted for Leverton House this year and I certainly \" hit the jackpot\" It was superior to any I have stayed in. I have no hesitation in recommending this establishment.",
            "title": "The Best",
            "user": "jayasee"
        },
        {
            "date": "September 29, 2008",
            "detail_rating": {
                "business": 5.0,
                "cleanliness": 5.0,
                "desk": null,
                "front_desk": 5.0,
                "location": 3.0,
                "pool": null,
                "restaurant": null,
                "rooms": 5.0,
                "service": 5.0,
                "sleep": null,
                "value": 5.0
            },
            "helpfulness": 1,
            "id": 20463992,
            "likes": {
                "disliked": "\u2014 Nothing!",
                "liked": "\u2014 The host"
            },
            "rating": 5.0,
            "stay_parameters": "Stayed September 2008, traveled as a couple",
            "text": "Tony,",
            "title": "HIGHLY RECOMMEND THIS LOVELY BnB",
            "user": "1Betty1"
        },
        {
            "date": "September 25, 2008",
            "detail_rating": {
                "business": 4.0,
                "cleanliness": 5.0,
                "desk": null,
                "front_desk": 5.0,
                "location": 4.0,
                "pool": null,
                "restaurant": null,
                "rooms": 4.0,
                "service": 5.0,
                "sleep": null,
                "value": 5.0
            },
            "helpfulness": 1,
            "id": 20378618,
            "likes": {
                "disliked": "\u2014 Nothing",
                "liked": "\u2014 Welcoming atmosphere"
            },
            "rating": 5.0,
            "stay_parameters": "Stayed September 2008, traveled on business",
            "text": "Cork.",
            "title": "Definitely A Place To Return To",
            "user": "Mtshasta"
        },
        {
            "date": "September 10, 2008",
            "detail_rating": {
                "business": 5.0,
                "cleanliness": 5.0,
                "desk": null,
                "front_desk": 5.0,
                "location": 4.0,
                "pool": null,
                "restaurant": null,
                "rooms": 5.0,
                "service": 5.0,
                "sleep": null,
                "value": 4.0
            },
            "helpfulness": 1,
            "id": 19964544,
            "likes": {
                "disliked": "\u2014 Nothing",
                "liked": "\u2014 The service"
            },
            "rating": 5.0,
            "stay_parameters": "Stayed August 2008, traveled as a couple",
            "text": "We couldn't have been more pleased with the room (very un-b and b like with absolutely no chintz - even a flat-screen TV in the room!) and the service was topnotch. Wendy is a lovely host and keeps everything spotless. Breakfast is organic and made to order and as a very picky coffee-drinker, the coffee was first-rate.",
            "title": "Beautiful house and lovely host",
            "user": "ConnieCK"
        },
        {
            "date": "September 10, 2008",
            "detail_rating": {
                "business": 5.0,
                "cleanliness": 5.0,
                "desk": null,
                "front_desk": 5.0,
                "location": 5.0,
                "pool": null,
                "restaurant": null,
                "rooms": 5.0,
                "service": 5.0,
                "sleep": null,
                "value": 5.0
            },
            "helpfulness": 1,
            "id": 19956864,
            "likes": {
                "disliked": "\u2014 ummm nothing I think it is a perfect B&B",
                "liked": "\u2014 The host"
            },
            "rating": 5.0,
            "stay_parameters": "Stayed September 2008, traveled on business",
            "text": "Don't be put off by the distance from town - the bus stop is right outside the BnB and you're in town in 10 minutes.",
            "title": "It is the BEST in the UK !",
            "user": "MontseLondon"
        },
        {
            "date": "November 24, 2008",
            "detail_rating": {
                "business": null,
                "cleanliness": 5.0,
                "desk": null,
                "front_desk": 5.0,
                "location": 4.0,
                "pool": null,
                "restaurant": null,
                "rooms": 5.0,
                "service": 5.0,
                "sleep": null,
                "value": 5.0
            },
            "helpfulness": 1,
            "id": 22129117,
            "likes": {
                "disliked": null,
                "liked": "\u2014 How clean it was and the friendly host!"
            },
            "rating": 5.0,
            "stay_parameters": "Stayed November 2008, traveled as a couple",
            "text": "My husband and I were visiting family in nearby Waterbeach and found this B&B on this website. Upon arrival, we were very impressed with the friendly and efficient host, Wendy. The room we were shown to was very well decorated and absolutely spotlessly clean! Everything felt very fresh and new. Tea and coffee making facilities were good with biscuits and even Ovaltine to warm us up on the wintry night!",
            "title": "Very welcoming B&B and host",
            "user": "Claire G"
        },
        {
            "date": "November 21, 2008",
            "detail_rating": {
                "business": 5.0,
                "cleanliness": 5.0,
                "desk": null,
                "front_desk": 5.0,
                "location": 4.0,
                "pool": null,
                "restaurant": null,
                "rooms": 5.0,
                "service": 5.0,
                "sleep": null,
                "value": 5.0
            },
            "helpfulness": 1,
            "id": 22071269,
            "likes": {
                "disliked": "\u2014 no complaints",
                "liked": "\u2014 sweet n clean n friendly n nice"
            },
            "rating": 5.0,
            "stay_parameters": "Stayed July 2008, traveled with family",
            "text": "Breakfast the following morning was delicious and well-prepared and nothing was too much trouble.",
            "title": "truely lovely n big fish in the pond",
            "user": "florapost"
        },
        {
            "date": "November 15, 2008",
            "detail_rating": {
                "business": null,
                "cleanliness": 5.0,
                "desk": null,
                "front_desk": 5.0,
                "location": 4.0,
                "pool": null,
                "restaurant": null,
                "rooms": 5.0,
                "service": 5.0,
                "sleep": null,
                "value": 5.0
            },
            "helpfulness": 1,
            "id": 21867114,
            "likes": {
                "disliked": "\u2014 n/a",
                "liked": "\u2014 Clean room"
            },
            "rating": 5.0,
            "stay_parameters": "Stayed November 2008",
            "text": "Although we did not go into Cambridge itself, it was clear that access to the city would be very easy from Leverton House. There is a Park & Ride just down the road, and the B&B is on a bus route into town.",
            "title": "fab",
            "user": "jinx48"
        },
        {
            "date": "October 27, 2008",
            "detail_rating": {
                "business": 4.0,
                "cleanliness": 5.0,
                "desk": null,
                "front_desk": 5.0,
                "location": 4.0,
                "pool": null,
                "restaurant": null,
                "rooms": 5.0,
                "service": 5.0,
                "sleep": null,
                "value": 5.0
            },
            "helpfulness": 1,
            "id": 21279394,
            "likes": {
                "disliked": "\u2014 Nothing",
                "liked": "\u2014 Everything"
            },
            "rating": 5.0,
            "stay_parameters": "Stayed October 2008, traveled with friends",
            "text": "I would have no hesitation in recommending this B&B to visitors to Cambridge. We will certainly be booking in again next time we visit our family.",
            "title": "A great stay",
            "user": "Geekalert"
        },
        {
            "date": "October 13, 2008",
            "detail_rating": {
                "business": null,
                "cleanliness": null,
                "desk": null,
                "location": null,
                "pool": null,
                "restaurant": null,
                "rooms": null,
                "service": null,
                "sleep": null,
                "value": null
            },
            "helpfulness": 1,
            "id": 20841468,
            "likes": {
                "disliked": null,
                "liked": null
            },
            "rating": 5.0,
            "stay_parameters": null,
            "text": "a bit of a late review, but it was lovely, cleanest place we'd ever stayed and real staffordshire pottery plates at breakfast. lovely and highly recommended",
            "title": "The Perfect B&B!",
            "user": "Traveller323232"
        },
        {
            "date": "September 7, 2008",
            "detail_rating": {
                "business": 4.0,
                "cleanliness": 5.0,
                "desk": null,
                "front_desk": 5.0,
                "location": 4.0,
                "pool": null,
                "restaurant": null,
                "rooms": 5.0,
                "service": 5.0,
                "sleep": null,
                "value": 4.0
            },
            "helpfulness": 1,
            "id": 19848583,
            "likes": {
                "disliked": null,
                "liked": null
            },
            "rating": 5.0,
            "stay_parameters": "Stayed July 2008, traveled on business",
            "text": "I had a wonderful and great time here. I felt really comfortable and personal. The rooms are extra clean and everywhere is a great fragrance. Wendy and Andy are so lovely people. They are extremly friendly and hospitable people. I\u00b4m so sad that I can\u00b4t stay longer (than 5 weeks). Thanks a lot for everything! Best wishes your german girl Marika :)!",
            "title": "My second feel at home",
            "user": "PancakeBerlin"
        },
        {
            "date": "September 1, 2008",
            "detail_rating": {
                "business": 5.0,
                "cleanliness": 5.0,
                "desk": null,
                "front_desk": 5.0,
                "location": 5.0,
                "pool": null,
                "restaurant": null,
                "rooms": 5.0,
                "service": 5.0,
                "sleep": null,
                "value": 5.0
            },
            "helpfulness": 1,
            "id": 19618244,
            "likes": {
                "disliked": null,
                "liked": "\u2014 warm wecome, cleaness"
            },
            "rating": 5.0,
            "stay_parameters": "Stayed August 2008, traveled with friends",
            "text": "We are two Italians currently working in a Guest House in Brighton&Hove. We decided to spend a couple of days away mainly to relax and visiting a new city. Wendy, the lovely hostess, gave us all the instructions to get to her place, despite of this - and it wasn t her fault,of course! - we got off in the wrong place and she came over to pick us up with her car: we didn t expect such a warm welcome! This new, 4stars b&b is just 10 minutes by bus off the city centre as well as the airport, and smells fresh and clean since you get in. No doubts: it is family run, with all their love. Biscuits, Tea and coffee facilities in the room are a nice touch. En suite bathroom very clean, too. English Breakfast freshly cooked by Wendy - but we chose the continental one,ahh these Italians so traditional... - juices, milk, fresh fruits, cereals, wide selection of yogurts and jams...we were full up in a few minutes.",
            "title": "Everybody feels at home at Leverton House!",
            "user": "attyandmeca"
        },
        {
            "date": "April 14, 2009",
            "detail_rating": {
                "business": null,
                "cleanliness": 5.0,
                "desk": null,
                "location": 4.0,
                "pool": null,
                "restaurant": null,
                "rooms": 5.0,
                "service": 5.0,
                "sleep": null,
                "value": 5.0
            },
            "helpfulness": 1,
            "id": 28018371,
            "likes": {
                "disliked": null,
                "liked": null
            },
            "rating": 5.0,
            "stay_parameters": "Stayed April 2009, traveled with family",
            "text": "After a day's visiting in Cambridge we spent a wonderfully relaxing night at Leverton House. Wendy made us feel very welcome and catered to all our needs. We were pleased to have a family room and much appreciated the tea making facilities plus biscuits, the good beds as well as the on-suite shower room (well working shower! - not always available in the UK ...). The room was well insulated, spotlessly clean and freshly decorated. We also enjoyed the generous and varied breakfast and marvelled at the fact that Wendy managed to serve a cooked breakfast that felt light.",
            "title": "Wonderfully welcoming",
            "user": "asmile"
        },
        {
            "date": "February 26, 2009",
            "detail_rating": {
                "business": null,
                "cleanliness": 5.0,
                "desk": null,
                "location": 4.0,
                "pool": null,
                "restaurant": null,
                "rooms": 5.0,
                "service": 5.0,
                "sleep": null,
                "value": 5.0
            },
            "helpfulness": 1,
            "id": 25204777,
            "likes": {
                "disliked": null,
                "liked": null
            },
            "rating": 5.0,
            "stay_parameters": "Stayed February 2009, traveled as a couple",
            "text": "We spend a lovely valentine's weekend in this amazing bed and breakfast. When we arrived we were nicely surprised by a bottle of (really good) champagne and a box of chocolates because the room that Wendy wanted to put us in wasnt available so she put us in another room. Well, I haven't seen the room that we were supposed to be in, but our room and bathroom was perfect as well! A Laura Ashley kind of style and really good beds! The breakfast is really nice as well, and lastly, what can we say about Wendy, she's just the best person to run a B&B, she makes you feel at home straight away and does everything to make you feel at ease. Rodrigo and Leonie",
            "title": "Homely and Relaxing",
            "user": "LeonieBrighton"
        },
        {
            "date": "February 23, 2009",
            "detail_rating": {
                "business": null,
                "cleanliness": 5.0,
                "desk": null,
                "location": 5.0,
                "pool": null,
                "restaurant": null,
                "rooms": 5.0,
                "service": 5.0,
                "sleep": null,
                "value": 5.0
            },
            "helpfulness": 2,
            "id": 25046782,
            "likes": {
                "disliked": null,
                "liked": null
            },
            "rating": 5.0,
            "stay_parameters": "Stayed February 2009, traveled with family",
            "text": "My daughter and I decided to visit Cambridge for my birthday. Luckily we found the Leverton and Wendy...what a wonderful place to stay as a base. Wendy is such a lovely lady and the rooms were spotless, comfortable and the breakfast delicious (especially the poached eggs). My daughter and I were making our own separate ways to the Leverton, I arrived first and Wendy kindly offered to pick my daughter up from the bus stop which was really appreciated. Also, what a lovely personal touch as when arriving back one evening, I found a birthday card with a pressie Wendy had left in the room for me. I can honestly say that staying at the Leverton made our stay in Cambridge all the more enjoyable, I wish I could have stayed longer.",
            "title": "A delightful Gem with a wonderfully warm welcolme",
            "user": "sue_macks"
        },
        {
            "date": "January 23, 2009",
            "detail_rating": {
                "business": null,
                "cleanliness": 5.0,
                "desk": null,
                "front_desk": 5.0,
                "location": 3.0,
                "pool": null,
                "restaurant": null,
                "rooms": 5.0,
                "service": 5.0,
                "sleep": null,
                "value": null
            },
            "helpfulness": 1,
            "id": 23820851,
            "likes": {
                "disliked": "\u2014 Nothing",
                "liked": "\u2014 Very clean and bright"
            },
            "rating": 5.0,
            "stay_parameters": "Stayed November 2008, traveled on business",
            "text": "Very welcoming. Room was spotless and very comfortable and the breakfast was great. I got the impression that Wendy couldn't do enough for you. Very happy.",
            "title": "Perfect!",
            "user": "sopheisnail05"
        },
        {
            "date": "January 6, 2009",
            "detail_rating": {
                "business": null,
                "cleanliness": 5.0,
                "desk": null,
                "front_desk": 5.0,
                "location": 5.0,
                "pool": null,
                "restaurant": null,
                "rooms": 5.0,
                "service": 5.0,
                "sleep": null,
                "value": 5.0
            },
            "helpfulness": 2,
            "id": 23323999,
            "likes": {
                "disliked": null,
                "liked": null
            },
            "rating": 5.0,
            "stay_parameters": "Stayed November 2008, traveled as a couple",
            "text": "As with several reviewers, we were staying to visit family in Cambridge, and found this B&B to be wonderful. Wendy was so welcoming, the room spotless and comfortable, and an excellent breakfast. We would recommend it to anyone.",
            "title": "Excellent B&B",
            "user": "Annabel2008"
        }
    ],
    "slim_ranking": 0.0630630630631,
    "stars": null,
    "tripadvisor": {
        "VISITED": false,
        "country_name": null,
        "locality": null,
        "pic_link": null,
        "street_address": null
    },
    "user_rating": 5.0,
    "variance": {
        "average": 2,
        "excellent": 132,
        "poor": 0,
        "terrible": 1,
        "very good": 16
    }
}