{
    "aka": "Intercontinental Tokyo Bay",
    "description": "You can practically feel the heartbeat of the city from the impressive InterContinental Tokyo Bay. Convenient for business or pleasure travel, the hotel puts you in easy reach of business, shopping and entertainment centres including the World Trade Center Tokyo, Shiodome and Ginza. The Imperial Palace and Shiki Theatre provide tastes of culture.",
    "detail_rating": {
        "cleanliness": null,
        "location": null,
        "rooms": null,
        "service": null,
        "sleep": null,
        "value": null
    },
    "location": {
        "city": null,
        "continent": "Asia",
        "country": "Japan",
        "proposed_city": "Bay",
        "province": null,
        "region": "Kanto"
    },
    "name": "InterContinental Hotel Tokyo Bay",
    "places": {
        "aka": [
            "Tokyo",
            "Bay"
        ],
        "hotel_description": [
            "Tokyo",
            "Bay",
            "Imperial",
            "Shiki"
        ],
        "hotel_name": [
            "Tokyo",
            "Bay"
        ]
    },
    "review_count": 561,
    "review_count_current": 19,
    "reviews": [
        {
            "date": "July 9, 2009",
            "detail_rating": {
                "business": null,
                "cleanliness": 5.0,
                "desk": null,
                "location": 4.0,
                "pool": null,
                "restaurant": null,
                "rooms": 5.0,
                "service": 5.0,
                "sleep": null,
                "value": 5.0
            },
            "helpfulness": 1,
            "id": 34281781,
            "likes": {
                "disliked": null,
                "liked": null
            },
            "rating": 4.0,
            "stay_parameters": "Stayed June 2009, traveled as a couple",
            "text": "Snagged a rate of $500 for a three-night stay in late June on their website. Booked a \"city view\" (rather than the more expensive Bay View room), and got a pleasant view of the city and the river. Expedia rate wasnearly twice as much, so we knew we were getting a good deal. Room was large (for Japanese standards), with two double beds. Had we not been jetlagged, we might have asked for one queen bed (which was what we had requested), but we are both skinny so we just used one bed. Bed linens were gorgeous and bed heavenly. Bathrobes were provides, as were Elemis bath products. The huge (for Japan standards) bathroom contained both a shower and a lovely deep bathtub. Free internet upstairs in the \"business center\"; there were only two computers but we never had to wait. Room service at what appeared to be reasonable prices available at all ours. Faultless staff. Hotel was ten minutes' walk to the Hammamatsucho JR station; two minutes walk to the Takeshiba station. Area was close to the water nd not at all crowded. Overall, a GREAT deal. especially for the deeply discounted rate. Of course, a cheaper business hotel or tourist class hotel would have been cheaper, but it was wonderful yo have such luxury by paying just a bit more.",
            "title": "I wish I could live at the Intercontinental Tokyo Bay",
            "user": "PT1976"
        },
        {
            "date": "June 14, 2009",
            "detail_rating": {
                "business": null,
                "cleanliness": 5.0,
                "desk": null,
                "location": 3.0,
                "pool": null,
                "restaurant": null,
                "rooms": 4.0,
                "service": 5.0,
                "sleep": null,
                "value": 4.0
            },
            "helpfulness": null,
            "id": 32323444,
            "likes": {
                "disliked": null,
                "liked": null
            },
            "rating": 5.0,
            "stay_parameters": "Stayed June 2008, traveled on business",
            "text": "Positive:",
            "title": "Japanese exquisite service",
            "user": "magoulet"
        },
        {
            "date": "June 2, 2009",
            "detail_rating": {
                "business": 5.0,
                "cleanliness": 5.0,
                "desk": null,
                "front_desk": 5.0,
                "location": 5.0,
                "pool": null,
                "restaurant": null,
                "rooms": 5.0,
                "service": 5.0,
                "sleep": null,
                "value": 5.0
            },
            "helpfulness": null,
            "id": 31360215,
            "likes": {
                "disliked": null,
                "liked": null
            },
            "rating": 5.0,
            "stay_parameters": "Stayed May 2006, traveled on business",
            "text": "Rooms are normally sized, the bathroom is excellent. Marble counter, electronic toilet, therapeutic bathtub, corner shower with glass walls. Very good selection of soaps, lotions, etc... The breakfast selection is very impressive. Excellent quality food, including Japanese and Western styled breakfast items. Extremely quiet rooms. Amazing view from the higher floors. The Business Support Center offers good drinks and quality food, along with the expected Japanese service for all your needs (translation, reservations, insights about the city, anything to make your stay comfortable).",
            "title": "Excellent",
            "user": "SunitaMumbai"
        },
        {
            "date": "June 2, 2009",
            "detail_rating": {
                "business": null,
                "cleanliness": 5.0,
                "desk": null,
                "location": 3.0,
                "pool": null,
                "restaurant": null,
                "rooms": 4.0,
                "service": 5.0,
                "sleep": null,
                "value": 4.0
            },
            "helpfulness": null,
            "id": 31359165,
            "likes": {
                "disliked": null,
                "liked": null
            },
            "rating": 5.0,
            "stay_parameters": "Stayed May 2009, traveled with family",
            "text": "Negative:",
            "title": "Wonderful property on Tokyo Bay",
            "user": "robertocusato"
        },
        {
            "date": "December 8, 2006",
            "detail_rating": {
                "business": null,
                "cleanliness": null,
                "desk": null,
                "location": null,
                "pool": null,
                "restaurant": null,
                "rooms": null,
                "service": null,
                "sleep": null,
                "value": null
            },
            "helpfulness": null,
            "id": 6348922,
            "likes": {
                "disliked": null,
                "liked": null
            },
            "rating": 4.0,
            "stay_parameters": null,
            "text": "Spent 6 nights at the Intercontinental as part of a business trip. Several travel guides had warned against the Hotel somehow isolated location, but in reality the Hotel is very well connected through the JR Yamanote line (Ginza in 5 minutes, and easy connections to Shinjuku and Roppongi). I also had business in Odaiba for which it was convenient as well. The room was spacious and had great views of the harbour. Service was good like it is often the case in Japan, but room service (in room dining) was really efficient as well as dry cleaning. I would certainly consider staying there again when in Tokyo.",
            "title": "Very good and convenient",
            "user": "MCMember"
        },
        {
            "date": "May 23, 2006",
            "detail_rating": {
                "business": null,
                "cleanliness": null,
                "desk": null,
                "location": null,
                "pool": null,
                "restaurant": null,
                "rooms": null,
                "service": null,
                "sleep": null,
                "value": null
            },
            "helpfulness": null,
            "id": 5204690,
            "likes": {
                "disliked": null,
                "liked": null
            },
            "rating": 5.0,
            "stay_parameters": null,
            "text": "Rooms are clean, modern, if small, and some have great views of the rainbow bridge and Tokyo Bay. It is a pleasant 10+ minute walk away from JR station, and right next to the hotel is a smaller, privately operated metro line which is more expensive than JR but provides a faster link to city centre from this hotel.",
            "title": "Very nice",
            "user": "A TripAdvisor user"
        },
        {
            "date": "May 12, 2006",
            "detail_rating": {
                "business": null,
                "cleanliness": null,
                "desk": null,
                "location": null,
                "pool": null,
                "restaurant": null,
                "rooms": null,
                "service": null,
                "sleep": null,
                "value": null
            },
            "helpfulness": null,
            "id": 5064758,
            "likes": {
                "disliked": null,
                "liked": null
            },
            "rating": 4.0,
            "stay_parameters": null,
            "text": "Food and drink were not as expensive as we feared in the lobby restaurant, but the nightclub on the higher floor needs more dough. Delicious food!",
            "title": "Good Hotel.. with some Minor Grumbles",
            "user": "sg_tripper"
        },
        {
            "date": "April 29, 2006",
            "detail_rating": {
                "business": null,
                "cleanliness": null,
                "desk": null,
                "location": null,
                "pool": null,
                "restaurant": null,
                "rooms": null,
                "service": null,
                "sleep": null,
                "value": null
            },
            "helpfulness": null,
            "id": 5017865,
            "likes": {
                "disliked": null,
                "liked": null
            },
            "rating": 4.0,
            "stay_parameters": null,
            "text": "The limousine bus service was 3000 yen from NRT airport and took 1,5 hours due to many other stops on the way (we were last on the bus when it finally reached the hotel).",
            "title": "Off the beaten path but wonderful hotel",
            "user": "JLF923"
        },
        {
            "date": "January 20, 2006",
            "detail_rating": {
                "business": null,
                "cleanliness": null,
                "desk": null,
                "location": null,
                "pool": null,
                "restaurant": null,
                "rooms": null,
                "service": null,
                "sleep": null,
                "value": null
            },
            "helpfulness": null,
            "id": 4366472,
            "likes": {
                "disliked": null,
                "liked": null
            },
            "rating": 5.0,
            "stay_parameters": null,
            "text": "Would definitely stay again. The location would remain the only slight negative point.",
            "title": "Awesome by the bay!",
            "user": "swash"
        },
        {
            "date": "April 10, 2009",
            "detail_rating": {
                "business": null,
                "cleanliness": 5.0,
                "desk": null,
                "location": 3.0,
                "pool": null,
                "restaurant": null,
                "rooms": 5.0,
                "service": 4.0,
                "sleep": null,
                "value": 5.0
            },
            "helpfulness": 1,
            "id": 27777485,
            "likes": {
                "disliked": null,
                "liked": null
            },
            "rating": 5.0,
            "stay_parameters": "Stayed March 2009, traveled as a couple",
            "text": "Stayed here as part of a recent trip to Japan for 2 nights. Location is so so, as it is near a train stop, but not a very useful one. To get anywhere you have to either walk 10 minutes to a subway or change trains a bit, but this is not a major issue. Hotel lobby was elegant and very quiet. We saw no one pretty much in the lobby area at any time we were in the hotel. Check in and check out were very painless with a friendly staff. Received a very nice room with a spectacular view of Tokyo Bay. Room was very nice, clean and had a spacious bathroom, with a tub that was right next to the window so you could overlook the bay. Club lounge was adequate and served a satisfactory breakfast, but nothing extraordinary. Overall, a nice hotel and for the 18,000 yen I paid per night, very much worth it.",
            "title": "Quiet hotel with great views of Tokyo Bay",
            "user": "antonius66"
        },
        {
            "date": "February 12, 2009",
            "detail_rating": {
                "business": null,
                "cleanliness": 5.0,
                "desk": null,
                "front_desk": 4.0,
                "location": 5.0,
                "pool": null,
                "restaurant": null,
                "rooms": 5.0,
                "service": 5.0,
                "sleep": null,
                "value": 4.0
            },
            "helpfulness": null,
            "id": 24511552,
            "likes": {
                "disliked": "\u2014 No free internet",
                "liked": "\u2014 Tokyo Bay overview"
            },
            "rating": 4.0,
            "stay_parameters": "Stayed February 2009, traveled with friends",
            "text": "My first time to Tokyo and I had no idea where to book a hotel. I had read a review that I should get a room with an overview of Tokyo Bay and so I did \u2013 Thanks it was fantastic. Instead of looking into a wall or another building you now have a magnificent overview of the Tokyo Bay harbor. It\u2019s about 25 min walk from the shopping street \u201cGinza\u201d. Our room was big with a spacious bathroom.",
            "title": "Fantastic view",
            "user": "Ksvaneborg"
        },
        {
            "date": "October 5, 2008",
            "detail_rating": {
                "business": 5.0,
                "cleanliness": 5.0,
                "desk": null,
                "front_desk": 5.0,
                "location": 5.0,
                "pool": null,
                "restaurant": null,
                "rooms": 4.0,
                "service": 5.0,
                "sleep": null,
                "value": 5.0
            },
            "helpfulness": null,
            "id": 20649254,
            "likes": {
                "disliked": "\u2014 Not in thte center of the action",
                "liked": "\u2014 Views and staff"
            },
            "rating": 5.0,
            "stay_parameters": "Stayed October 2008, traveled solo",
            "text": "On a one night stop in Tokyo on my way to Singapore I stayed at the Intercontinental Tokyo Bay. The hotel staff was very friendly and the view from the hotel was amazing. As a girl traveling by herself through Tokyo I was a bit nervous at first but the hotel staff was very helpful. The morning that I was there I woke up very early to go to the Fish Market. The concierge gave an overview of the market, called a taxi and gave me the card to the hotel in case I were to get lost I was to show the card to the taxi driver. In the mornings you can get a awesome view of the sun rising over the Rainbow Bridge and in the evenings you can enjoy a relaxing time at the Sunset Lounge while watching the Rainbow Bridge display it's lights.",
            "title": "Fantastic Hotel",
            "user": "YRamos82"
        },
        {
            "date": "August 1, 2008",
            "detail_rating": {
                "business": 5.0,
                "cleanliness": 5.0,
                "desk": null,
                "front_desk": 5.0,
                "location": 5.0,
                "pool": null,
                "restaurant": null,
                "rooms": 5.0,
                "service": 5.0,
                "sleep": null,
                "value": 5.0
            },
            "helpfulness": 1,
            "id": 18492469,
            "likes": {
                "disliked": null,
                "liked": null
            },
            "rating": 5.0,
            "stay_parameters": "Stayed July 2008, traveled with family",
            "text": "I would stay here again in a heartbeat!",
            "title": "Fantastic hotel in Tokyo -- great hub for families not only business",
            "user": "S3CR3T3X3C"
        },
        {
            "date": "January 17, 2008",
            "detail_rating": {
                "business": 5.0,
                "cleanliness": 5.0,
                "desk": null,
                "front_desk": 5.0,
                "location": 5.0,
                "pool": null,
                "restaurant": null,
                "rooms": 5.0,
                "service": 5.0,
                "sleep": null,
                "value": 5.0
            },
            "helpfulness": null,
            "id": 12742171,
            "likes": {
                "disliked": "\u2014 Nothing.",
                "liked": "\u2014 The view and location."
            },
            "rating": 5.0,
            "stay_parameters": "Stayed March 2007, traveled on business",
            "text": "This is a really nice hotel. I stayed there with family in July 2008. The rooms were HUGE for Tokyo and if you can get a room facing the bay the views are to die for. The rooms are spotless, immaculate and feature those amazing TOTO washlets (look it up ;-).",
            "title": "Beautiful View",
            "user": "defreitasgirl"
        },
        {
            "date": "October 27, 2007",
            "detail_rating": {
                "business": null,
                "cleanliness": 5.0,
                "desk": null,
                "front_desk": 5.0,
                "location": 5.0,
                "pool": null,
                "restaurant": null,
                "rooms": 5.0,
                "service": 5.0,
                "sleep": null,
                "value": 5.0
            },
            "helpfulness": 8,
            "id": 10384901,
            "likes": {
                "disliked": null,
                "liked": "\u2014 View, Room, location, staff, price, service"
            },
            "rating": 5.0,
            "stay_parameters": "Stayed October 2007, traveled with family",
            "text": "Family of 4 (Parents & 2 teens) - 10 nights in Tokyo. Did the research and as expected, rates at Ryokans and hotels were numbingly expensive. Ryokans averaged maybe 7000y -20,000y per person per night",
            "title": "Surprisingly good choice for family vacation",
            "user": "family-mcbirnie"
        },
        {
            "date": "July 20, 2007",
            "detail_rating": {
                "business": 5.0,
                "cleanliness": 5.0,
                "desk": null,
                "front_desk": 5.0,
                "location": 5.0,
                "pool": null,
                "restaurant": null,
                "rooms": 4.0,
                "service": 5.0,
                "sleep": null,
                "value": 5.0
            },
            "helpfulness": 2,
            "id": 8203094,
            "likes": {
                "disliked": "\u2014 was a bit old for intercontinental standards",
                "liked": "\u2014 service level, views"
            },
            "rating": 4.0,
            "stay_parameters": "Stayed July 2007, traveled on business",
            "text": "(converting to avg Au$70 - AU$200 per person per night), and hotels were quite restrictive in # persons per room (max 2 or 3 with rollaway). With Ryokans, we would most likely be in the suburbs (so allow extra for transport), sharing bathroom facilities, living in a spartan environment - difficult with 2 restless teens. Took a punt and emailed Intercontinental TB after reading reviews, and got a great rate for Tokyo of 17,500y+tax per night hoping that the room would accommodate 4 persons. Err I may have not mentioned that we were a party of 4.",
            "title": "Nice hotel",
            "user": "Ash7777"
        },
        {
            "date": "June 8, 2007",
            "detail_rating": {
                "business": 5.0,
                "cleanliness": 5.0,
                "desk": null,
                "front_desk": 5.0,
                "location": 5.0,
                "pool": null,
                "restaurant": null,
                "rooms": 5.0,
                "service": 5.0,
                "sleep": null,
                "value": 5.0
            },
            "helpfulness": 3,
            "id": 7804259,
            "likes": {
                "disliked": "\u2014 no pool",
                "liked": "\u2014 excellent service,good food"
            },
            "rating": 5.0,
            "stay_parameters": "Stayed January 2007, traveled with family",
            "text": "Let's see the positives:",
            "title": "Well looked after at the intercontinental",
            "user": "lindsay56"
        },
        {
            "date": "April 9, 2007",
            "detail_rating": {
                "business": null,
                "cleanliness": 5.0,
                "desk": null,
                "front_desk": 2.0,
                "location": 3.0,
                "pool": null,
                "restaurant": null,
                "rooms": 5.0,
                "service": 5.0,
                "sleep": null,
                "value": 3.0
            },
            "helpfulness": 2,
            "id": 7301947,
            "likes": {
                "disliked": "\u2014 Lack of comfortable walking distance to restaurants, shops.",
                "liked": "\u2014 View from room, cleanliness, amenities."
            },
            "rating": 3.0,
            "stay_parameters": "Stayed March 2007, traveled with family",
            "text": "- Great view of Tokyo Bay: - 17th floor: a huge plus after a long day of sightseeing (being in a country where we can't communicate makes touring doubly exhausting)",
            "title": "Jaw Dropping Views",
            "user": "AWOS1244"
        },
        {
            "date": "February 7, 2007",
            "detail_rating": {
                "business": 3.0,
                "cleanliness": 1.0,
                "desk": null,
                "front_desk": 2.0,
                "location": 2.0,
                "pool": null,
                "restaurant": null,
                "rooms": 3.0,
                "service": 2.0,
                "sleep": null,
                "value": 2.0
            },
            "helpfulness": 5,
            "id": 6752631,
            "likes": {
                "disliked": "\u2014 Dirty and well-worn carpets and common areas in the hotel.",
                "liked": "\u2014 View of Tokyo Bay from the bathtub"
            },
            "rating": 2.0,
            "stay_parameters": "Stayed February 2007, traveled on business",
            "text": "- Luxe bathroom amenites (and not just one each of the little bottles, but 4 of each item!)/ comp chocolates/ comp plate of fruit on arrival, and again during our stay.",
            "title": "Not to Inter-continental Standards",
            "user": "allthroughoutasia"
        }
    ],
    "slim_ranking": 0.239130434783,
    "stars": 4.5,
    "tripadvisor": {
        "VISITED": false,
        "country_name": null,
        "locality": null,
        "pic_link": null,
        "street_address": null
    },
    "user_rating": 4.0,
    "variance": {
        "average": 87,
        "excellent": 177,
        "poor": 19,
        "terrible": 8,
        "very good": 270
    }
}