{
    "aka": "Ottoman Hotel Istanbul",
    "description": "Ottoman Hotel Imperial is situated on the truly premium location in Istanbul, on an elevated position, surrounded by all the major historical and cultural sights in the heart of the old town, Sultanahmet, viewing the impressive Hagia Sophia (St.Sophia, Aya Sofya) Museum. This is absolutely the best location in Istanbul, within easy walking distance of the main monuments.",
    "detail_rating": {
        "cleanliness": 5.0,
        "location": 5.0,
        "rooms": 4.5,
        "service": 4.5,
        "sleep": 4.5,
        "value": 4.5
    },
    "location": {
        "city": null,
        "continent": "Europe",
        "country": "Turkey",
        "proposed_city": "Imperial",
        "province": null,
        "region": null
    },
    "name": "Ottoman Hotel Imperial",
    "places": {
        "aka": [],
        "hotel_description": [
            "Imperial"
        ],
        "hotel_name": [
            "Imperial"
        ]
    },
    "review_count": 1331,
    "review_count_current": 20,
    "reviews": [
        {
            "date": "August 14, 2012",
            "detail_rating": {
                "business": null,
                "cleanliness": 3.0,
                "desk": null,
                "location": 5.0,
                "pool": null,
                "restaurant": null,
                "rooms": 3.0,
                "service": 4.0,
                "sleep": null,
                "value": 4.0
            },
            "helpfulness": null,
            "id": 137135405,
            "likes": {
                "disliked": null,
                "liked": null
            },
            "rating": 4.0,
            "stay_parameters": "Stayed August 2012",
            "text": "The best feature of this hotel was the location, directly across from the Aya Sofya on a small cobblestone street. We had a view of Aya Sofya from our room that was only partly obacured by big leafy trees. That was lovely.",
            "title": "Terrific location, smallish rooms, food could be better.",
            "user": "esheng"
        },
        {
            "date": "August 13, 2012",
            "detail_rating": {
                "business": null,
                "cleanliness": 5.0,
                "desk": null,
                "location": 5.0,
                "pool": null,
                "restaurant": null,
                "rooms": 5.0,
                "service": 5.0,
                "sleep": 5.0,
                "value": 5.0
            },
            "helpfulness": null,
            "id": 137075592,
            "likes": {
                "disliked": null,
                "liked": null
            },
            "rating": 5.0,
            "stay_parameters": "Stayed July 2012, traveled as a couple",
            "text": "The hotel itself is nice. Decor is traditional with some Turkish touches; there are traditional costumes hanging in the halls and interesting lamps in the rooms. There's some lokum/Turkish delight in the room in a pretty pewter (?) container when you arrive. The room is not big, which could be a problem is you have a lot of luggage but it was sufficient.",
            "title": "What you see is what you get. Quality",
            "user": "truetravel99"
        },
        {
            "date": "August 11, 2012",
            "detail_rating": {
                "business": null,
                "cleanliness": 5.0,
                "desk": null,
                "location": 5.0,
                "pool": null,
                "restaurant": null,
                "rooms": 5.0,
                "service": 5.0,
                "sleep": 5.0,
                "value": 5.0
            },
            "helpfulness": null,
            "id": 136875880,
            "likes": {
                "disliked": null,
                "liked": null
            },
            "rating": 5.0,
            "stay_parameters": "Stayed June 2012, traveled as a couple",
            "text": "There is room for improvement in the breakfast. Variety was fine but the food could be more fresh. Some of the bread and pastry were a bit stale. Also please do something about those scrambled eggs! Another reviewer noted that they are sitting in a puddle of water. It's totally true. Please fix that or just make eggs to order!",
            "title": "Istanbul Gem.",
            "user": "lawmate55"
        },
        {
            "date": "August 5, 2012",
            "detail_rating": {
                "business": null,
                "cleanliness": 4.0,
                "desk": null,
                "location": 5.0,
                "pool": null,
                "restaurant": null,
                "rooms": 3.0,
                "service": 4.0,
                "sleep": null,
                "value": 3.0
            },
            "helpfulness": null,
            "id": 136270258,
            "likes": {
                "disliked": null,
                "liked": null
            },
            "rating": 4.0,
            "stay_parameters": "Stayed July 2012",
            "text": "We recently stayed here for 4 days in July based on other travelers reviews. The location was ideal and we had a lovely room , bright, airy, spacious and of course very clean ( gets cleaned everyday ) and the bathroom was huge and modern. the breakfast was great and the staff was friendly and helpful. Well worth the price!",
            "title": "The best location for exploring Sultanahmet",
            "user": "Tombias"
        },
        {
            "date": "August 4, 2012",
            "detail_rating": {
                "business": null,
                "cleanliness": 5.0,
                "desk": null,
                "location": 5.0,
                "pool": null,
                "restaurant": null,
                "rooms": 5.0,
                "service": 5.0,
                "sleep": 5.0,
                "value": 5.0
            },
            "helpfulness": null,
            "id": 136203539,
            "likes": {
                "disliked": null,
                "liked": null
            },
            "rating": 5.0,
            "stay_parameters": "Stayed July 2012, traveled as a couple",
            "text": "The hotel was fantastic. Our stay was for only for a short time, but even then we were delighted with the hotel itself and was in a great location allowing easy access to the city centre and to the hostorical sights.",
            "title": "Extraordinary Hotel.",
            "user": "rosegarden698"
        },
        {
            "date": "August 4, 2012",
            "detail_rating": {
                "business": null,
                "cleanliness": 4.0,
                "desk": null,
                "location": 5.0,
                "pool": null,
                "restaurant": null,
                "rooms": 3.0,
                "service": 4.0,
                "sleep": 4.0,
                "value": 3.0
            },
            "helpfulness": null,
            "id": 136192456,
            "likes": {
                "disliked": null,
                "liked": null
            },
            "rating": 4.0,
            "stay_parameters": "Stayed July 2012, traveled on business",
            "text": "The hotel's location can't be beaten. Located in a quiet street besides Hagia Sophia but away from the maddening crowds of the Sultanahmet area. 5 minutes walk to both Sultanahmet and Gulhane tram station.",
            "title": "Right besides Hagia Sophia!!!",
            "user": "feibeesi"
        },
        {
            "date": "August 2, 2012",
            "detail_rating": {
                "business": null,
                "cleanliness": 5.0,
                "desk": null,
                "location": 5.0,
                "pool": null,
                "restaurant": null,
                "rooms": 4.0,
                "service": 5.0,
                "sleep": 5.0,
                "value": 4.0
            },
            "helpfulness": null,
            "id": 136047981,
            "likes": {
                "disliked": null,
                "liked": null
            },
            "rating": 5.0,
            "stay_parameters": "Stayed July 2012, traveled with family",
            "text": "I arrived at the hotel at 7.30am and was allowed to check in immediately and as I was to leave the hotel in the wee hours the next day, the front office offered me breakfast on the morning I checked in. I had a single room which was small but adequate and quiet with everything in working order.",
            "title": "Great Hotel Great Location",
            "user": "tangotangocharlie"
        },
        {
            "date": "August 2, 2012",
            "detail_rating": {
                "business": null,
                "cleanliness": 5.0,
                "desk": null,
                "location": 5.0,
                "pool": null,
                "restaurant": null,
                "rooms": 5.0,
                "service": 5.0,
                "sleep": 5.0,
                "value": 5.0
            },
            "helpfulness": null,
            "id": 136042598,
            "likes": {
                "disliked": null,
                "liked": null
            },
            "rating": 5.0,
            "stay_parameters": "Stayed May 2012, traveled solo",
            "text": "I suggest a hotel pick-up to/from the airport to save the pain of dealing with taxi drivers which is giving the city a bad name. I was stupid enough to fall for the \"50 lira changes to 5 lira\" scam.",
            "title": "Awesome hotel in amazing location.",
            "user": "hiffer385"
        },
        {
            "date": "August 1, 2012",
            "detail_rating": {
                "business": null,
                "cleanliness": 5.0,
                "desk": null,
                "location": 5.0,
                "pool": null,
                "restaurant": null,
                "rooms": 5.0,
                "service": 5.0,
                "sleep": 5.0,
                "value": 5.0
            },
            "helpfulness": null,
            "id": 135970701,
            "likes": {
                "disliked": null,
                "liked": null
            },
            "rating": 5.0,
            "stay_parameters": "Stayed July 2012, traveled as a couple",
            "text": "Apart from this, Istanbul is a magical city although this is my second time here and would definitely return again and stay in this hotel.",
            "title": "Fantastic boutique hotel",
            "user": "Nickleb"
        },
        {
            "date": "July 31, 2012",
            "detail_rating": {
                "business": null,
                "cleanliness": 5.0,
                "desk": null,
                "location": 5.0,
                "pool": null,
                "restaurant": null,
                "rooms": 5.0,
                "service": 5.0,
                "sleep": 5.0,
                "value": 5.0
            },
            "helpfulness": null,
            "id": 135902392,
            "likes": {
                "disliked": null,
                "liked": null
            },
            "rating": 5.0,
            "stay_parameters": "Stayed May 2012, traveled as a couple",
            "text": "We spent one night here prior to joining a cruise to the Black Sea. It was recommended by a travel agent and we found it excellent. Charming reception and welcome overall. The rooms are not large but this is in an ancient part of the city - the bathroom was stunning!",
            "title": "Good hotel to start off our two week European journey.",
            "user": "woodlande296"
        },
        {
            "date": "July 28, 2012",
            "detail_rating": {
                "business": null,
                "cleanliness": 5.0,
                "desk": null,
                "location": 5.0,
                "pool": null,
                "restaurant": null,
                "rooms": 5.0,
                "service": 5.0,
                "sleep": 5.0,
                "value": 4.0
            },
            "helpfulness": null,
            "id": 135627487,
            "likes": {
                "disliked": null,
                "liked": null
            },
            "rating": 5.0,
            "stay_parameters": "Stayed July 2012, traveled as a couple",
            "text": "Hotel staff were very friendly and helpful.",
            "title": "Great hotel in a fantastic location",
            "user": "John H"
        },
        {
            "date": "July 28, 2012",
            "detail_rating": {
                "business": null,
                "cleanliness": 5.0,
                "desk": null,
                "location": 5.0,
                "pool": null,
                "restaurant": null,
                "rooms": 5.0,
                "service": 5.0,
                "sleep": 5.0,
                "value": 5.0
            },
            "helpfulness": null,
            "id": 135604386,
            "likes": {
                "disliked": null,
                "liked": null
            },
            "rating": 5.0,
            "stay_parameters": "Stayed July 2012, traveled as a couple",
            "text": "We stayed in room 302 and everything was great especially the haman bathroom.",
            "title": "Premium location, quality hotel.",
            "user": "hendwardscue"
        },
        {
            "date": "July 28, 2012",
            "detail_rating": {
                "business": null,
                "cleanliness": 5.0,
                "desk": null,
                "location": 5.0,
                "pool": null,
                "restaurant": null,
                "rooms": 5.0,
                "service": 5.0,
                "sleep": 5.0,
                "value": 5.0
            },
            "helpfulness": null,
            "id": 135597713,
            "likes": {
                "disliked": null,
                "liked": null
            },
            "rating": 5.0,
            "stay_parameters": "Stayed May 2012, traveled solo",
            "text": "The transfers booked through the hotel worked well both ways",
            "title": "One very satisfied guest.",
            "user": "rubygoldshoe33"
        },
        {
            "date": "July 26, 2012",
            "detail_rating": {
                "business": null,
                "cleanliness": 5.0,
                "desk": null,
                "location": 5.0,
                "pool": null,
                "restaurant": null,
                "rooms": 5.0,
                "service": 5.0,
                "sleep": 5.0,
                "value": 5.0
            },
            "helpfulness": null,
            "id": 135442391,
            "likes": {
                "disliked": null,
                "liked": null
            },
            "rating": 5.0,
            "stay_parameters": "Stayed June 2012, traveled solo",
            "text": "I would definitely recommend this hotel as it's location is outstanding",
            "title": "Absolutely Fab",
            "user": "coolbreezego19"
        },
        {
            "date": "July 25, 2012",
            "detail_rating": {
                "business": null,
                "cleanliness": 5.0,
                "desk": null,
                "location": 5.0,
                "pool": null,
                "restaurant": null,
                "rooms": 5.0,
                "service": 5.0,
                "sleep": 5.0,
                "value": 5.0
            },
            "helpfulness": null,
            "id": 135355165,
            "likes": {
                "disliked": null,
                "liked": null
            },
            "rating": 5.0,
            "stay_parameters": "Stayed April 2012, traveled as a couple",
            "text": "This hotel is truly located on the premium location, every major attractions are all around you and it's within five minutes of the hotel. We splurge and reserved one of the premium Sultans rooms and it was very comfortable, bright, spacious, all amenities that we would need for our stay were available, had a good surprise in the bathroom were it was designed in a Turkish hammam style, very interesting. As I stated earlier, all your top attractions as Hagia Sofia, Topkapi Palace, Blue Mosque, Grand Bazar, Underground Cistern are few minutes away. There is a nice park not far from the hotel, if you walk through to the other side of the park you'll come across to Bosphoruse. Good stay, do recommend this hotel.",
            "title": "Could not have asked for a better location.",
            "user": "world999"
        },
        {
            "date": "July 25, 2012",
            "detail_rating": {
                "business": null,
                "cleanliness": 4.0,
                "desk": null,
                "location": 5.0,
                "pool": null,
                "restaurant": null,
                "rooms": 1.0,
                "service": 2.0,
                "sleep": 1.0,
                "value": 1.0
            },
            "helpfulness": null,
            "id": 135304526,
            "likes": {
                "disliked": null,
                "liked": null
            },
            "rating": 2.0,
            "stay_parameters": "Stayed July 2012, traveled with friends",
            "text": "On arrival at hotel we were welcomed with welcome drinks and given key & card to room.",
            "title": "Not what I expected",
            "user": "MFworld"
        },
        {
            "date": "July 24, 2012",
            "detail_rating": {
                "business": null,
                "cleanliness": 5.0,
                "desk": null,
                "location": 5.0,
                "pool": null,
                "restaurant": null,
                "rooms": 5.0,
                "service": 5.0,
                "sleep": 5.0,
                "value": 5.0
            },
            "helpfulness": null,
            "id": 135270418,
            "likes": {
                "disliked": null,
                "liked": null
            },
            "rating": 5.0,
            "stay_parameters": "Stayed February 2012, traveled with family",
            "text": "We were taken up to our room (308) on the second floor through the restaurant and the small lift, which goes to show the hotel is really small.",
            "title": "Wonderful Experience.",
            "user": "haydays49"
        },
        {
            "date": "July 21, 2012",
            "detail_rating": {
                "business": null,
                "cleanliness": null,
                "desk": null,
                "location": null,
                "pool": null,
                "restaurant": null,
                "rooms": null,
                "service": null,
                "sleep": null,
                "value": null
            },
            "helpfulness": null,
            "id": 135018313,
            "likes": {
                "disliked": null,
                "liked": null
            },
            "rating": 4.0,
            "stay_parameters": null,
            "text": "The room itself was clean and plenty of towels and clean sheets were provided. Our beds were single as we had a twin room and I have to say they were not single beds but were sized like children\u2019s beds. I am not that tall and my feet stuck out of the bed. There were two pillows provided, a large and a larger one but both had so much fluff and air that it was uncomfortable to sleep on.",
            "title": "Location can't be beat",
            "user": "Sara E"
        },
        {
            "date": "July 18, 2012",
            "detail_rating": {
                "business": null,
                "cleanliness": 5.0,
                "desk": null,
                "location": 5.0,
                "pool": null,
                "restaurant": null,
                "rooms": 5.0,
                "service": 5.0,
                "sleep": 5.0,
                "value": 5.0
            },
            "helpfulness": null,
            "id": 134734482,
            "likes": {
                "disliked": null,
                "liked": null
            },
            "rating": 5.0,
            "stay_parameters": "Stayed June 2012, traveled as a couple",
            "text": "The breakfast was so bad that I just had tea and toast every morning after trying the ridiculously low quality food. The scrambled eggs had water puddles in them, disgusting. For the small amount of guests they have you would expect fresh orange juice not concentrate. I have had better breakfast in a B&B hotel.",
            "title": "Wonderful location, good base to explore Istanbul.",
            "user": "jojowhite55"
        },
        {
            "date": "July 18, 2012",
            "detail_rating": {
                "business": null,
                "cleanliness": 3.0,
                "desk": null,
                "location": 5.0,
                "pool": null,
                "restaurant": null,
                "rooms": 3.0,
                "service": 4.0,
                "sleep": 3.0,
                "value": 4.0
            },
            "helpfulness": null,
            "id": 134708421,
            "likes": {
                "disliked": null,
                "liked": null
            },
            "rating": 4.0,
            "stay_parameters": "Stayed July 2012, traveled with friends",
            "text": "The bathroom/toilet was so small that you had to move sideways in and out. When I was sat on the toilet my knees were right against the wall. As for the shower the whole 3 days I was there the water would not drain properly and I was standing foot deep in dirty water.",
            "title": "Great Location near major historical attractions",
            "user": "Dina T"
        }
    ],
    "slim_ranking": 0.257540603248,
    "stars": 4,
    "tripadvisor": {
        "VISITED": false,
        "country_name": null,
        "locality": null,
        "pic_link": null,
        "street_address": null
    },
    "user_rating": 4.5,
    "variance": {
        "average": 56,
        "excellent": 973,
        "poor": 37,
        "terrible": 9,
        "very good": 256
    }
}