{
    "aka": "Rio Grande Hotel Monte Vista",
    "description": null,
    "detail_rating": {
        "cleanliness": null,
        "location": null,
        "rooms": null,
        "service": null,
        "sleep": null,
        "value": null
    },
    "location": {
        "city": "Monte Vista",
        "continent": null,
        "country": "United States",
        "proposed_city": "Vista",
        "province": null,
        "region": null
    },
    "name": "Rio Grande Motel",
    "places": {
        "aka": [
            "Vista"
        ],
        "hotel_description": [],
        "hotel_name": []
    },
    "review_count": 19,
    "review_count_current": 2,
    "reviews": [
        {
            "date": "June 21, 2008",
            "detail_rating": {
                "business": 4.0,
                "cleanliness": 4.0,
                "desk": null,
                "front_desk": 5.0,
                "location": 3.0,
                "pool": null,
                "restaurant": null,
                "rooms": 5.0,
                "service": 5.0,
                "sleep": null,
                "value": 4.0
            },
            "helpfulness": 2,
            "id": 17111825,
            "likes": {
                "disliked": "\u2014 Surroundings",
                "liked": "\u2014 Character"
            },
            "rating": 4.0,
            "stay_parameters": "Stayed June 2008, traveled with family",
            "text": "I must admit that my heart sank as we pulled up outside the stop that we had booked by phone the previous evening. Speaking as a light sleeper, the proximity of the gas station and tyre depot right outside the window was not promising.",
            "title": "Surprisingly good Mom & Pop motel",
            "user": "Aztec_Tripper"
        },
        {
            "date": "December 5, 2006",
            "detail_rating": {
                "business": null,
                "cleanliness": null,
                "desk": null,
                "location": null,
                "pool": null,
                "restaurant": null,
                "rooms": null,
                "service": null,
                "sleep": null,
                "value": null
            },
            "helpfulness": 6,
            "id": 6333181,
            "likes": {
                "disliked": null,
                "liked": null
            },
            "rating": 4.0,
            "stay_parameters": null,
            "text": "However, my misgivings were unjustified. The proprietor, a cheery fellow from Alabama, chatted with me for so long that the wife came to find out where I'd got to. He's a hunter, and the rooms are full of memorabilia. I forget how many sets of horns festooned our Mule Deer Room, but anyway, it was lots. I don't generally have a lot of time for people who go shooting defenceless animals - seems a bit one sided to me - but this guy only hunts with a bow and arrow, and his wife only uses a muzzleloading powder and ball, so respect to them for not being part of the usual AK47 brigade.",
            "title": "Better than Expected Motel Stay Right in Town",
            "user": "dogbuckeye"
        }
    ],
    "slim_ranking": 0.5,
    "stars": null,
    "tripadvisor": {
        "VISITED": false,
        "country_name": null,
        "locality": null,
        "pic_link": null,
        "street_address": null
    },
    "user_rating": 4.0,
    "variance": {
        "average": 4,
        "excellent": 7,
        "poor": 2,
        "terrible": 0,
        "very good": 6
    }
}