{
    "aka": "The Courtyard At Lake Lucerne Hotel",
    "description": null,
    "detail_rating": {
        "cleanliness": null,
        "location": null,
        "rooms": null,
        "service": null,
        "sleep": null,
        "value": null
    },
    "location": {
        "city": null,
        "continent": null,
        "country": "United States",
        "proposed_city": null,
        "province": null,
        "region": null
    },
    "name": "The Courtyard at Lake Lucerne",
    "places": {
        "aka": [],
        "hotel_description": [],
        "hotel_name": []
    },
    "review_count": 105,
    "review_count_current": 20,
    "reviews": [
        {
            "date": "July 26, 2009",
            "detail_rating": {
                "business": null,
                "cleanliness": 5.0,
                "desk": null,
                "location": 4.0,
                "pool": null,
                "restaurant": null,
                "rooms": 4.0,
                "service": 5.0,
                "sleep": null,
                "value": 4.0
            },
            "helpfulness": 1,
            "id": 35832921,
            "likes": {
                "disliked": null,
                "liked": null
            },
            "rating": 4.0,
            "stay_parameters": "Stayed July 2009, traveled as a couple",
            "text": "Staff was so friendly and genuine. Fantastic elegant breakfast, far beyond a continental breakfast! Great egg dish, strong coffee in dainty china cups, fresh fruit, high quality pastries. With the \"summer special,\" of course you are not going to get the fancy Victorian rooms, but the Art Deco (which was roomy and comfortable, but not elegant or romantic). If elegance is what you want, spring for a specific room. Great location in the heart of the city.",
            "title": "First rate staff, excellent b-fast, urban setting",
            "user": "schoojerger"
        },
        {
            "date": "May 4, 2009",
            "detail_rating": {
                "business": null,
                "cleanliness": 5.0,
                "desk": null,
                "location": 5.0,
                "pool": null,
                "restaurant": null,
                "rooms": 5.0,
                "service": 5.0,
                "sleep": null,
                "value": 4.0
            },
            "helpfulness": null,
            "id": 29295866,
            "likes": {
                "disliked": null,
                "liked": null
            },
            "rating": 5.0,
            "stay_parameters": "Stayed April 2009, traveled with friends",
            "text": "Ah to step back in time and be treated so elegantly! This B&B complex is a hidden jewel, breathtakingly beautiful and painstakenly cared for. How fortunate that someone how the intellegience to save these historic homes.",
            "title": "A Feast for the Soul !!!",
            "user": "MyInfoPage"
        },
        {
            "date": "April 29, 2009",
            "detail_rating": {
                "business": null,
                "cleanliness": 5.0,
                "desk": null,
                "location": 5.0,
                "pool": null,
                "restaurant": null,
                "rooms": 4.0,
                "service": 5.0,
                "sleep": null,
                "value": 4.0
            },
            "helpfulness": 1,
            "id": 29032410,
            "likes": {
                "disliked": null,
                "liked": null
            },
            "rating": 4.0,
            "stay_parameters": "Stayed May 2008, traveled as a couple",
            "text": "There are major highway ramps bordering the complex, but you soon forget them when you see the courtyard. However, with this location, you can walk to downtown and the Wall St. area, or take a free city shuttle.",
            "title": "Overall beauty, late night traffic noise",
            "user": "happybethel"
        },
        {
            "date": "February 11, 2009",
            "detail_rating": {
                "business": null,
                "cleanliness": 4.0,
                "desk": null,
                "location": 4.0,
                "pool": null,
                "restaurant": null,
                "rooms": 2.0,
                "service": 5.0,
                "sleep": null,
                "value": 4.0
            },
            "helpfulness": null,
            "id": 24469414,
            "likes": {
                "disliked": null,
                "liked": null
            },
            "rating": 3.0,
            "stay_parameters": "Stayed February 2009, traveled on business",
            "text": "The rooms were expertly decorated, roomy and comfortable. The staff was very accomodating especially Maria who made our visit even friendlier.",
            "title": "Not as advertised",
            "user": "Steve8329"
        },
        {
            "date": "January 28, 2009",
            "detail_rating": {
                "business": null,
                "cleanliness": 1.0,
                "desk": null,
                "front_desk": 2.0,
                "location": 4.0,
                "pool": null,
                "restaurant": null,
                "rooms": 1.0,
                "service": null,
                "sleep": null,
                "value": 1.0
            },
            "helpfulness": 2,
            "id": 23981119,
            "likes": {
                "disliked": "\u2014 The accomodations",
                "liked": "\u2014 Location"
            },
            "rating": 2.0,
            "stay_parameters": "Stayed January 2009, traveled with family",
            "text": "There is no pool, but you don't go there for a pool, but for the beauty of the place.",
            "title": "Not What We Expected",
            "user": "AB28512"
        },
        {
            "date": "October 23, 2008",
            "detail_rating": {
                "business": 3.0,
                "cleanliness": 3.0,
                "desk": null,
                "front_desk": 4.0,
                "location": 4.0,
                "pool": null,
                "restaurant": null,
                "rooms": 4.0,
                "service": 4.0,
                "sleep": null,
                "value": 4.0
            },
            "helpfulness": null,
            "id": 21158797,
            "likes": {
                "disliked": null,
                "liked": "\u2014 Romantic period property with original features and antiques."
            },
            "rating": 4.0,
            "stay_parameters": "Stayed October 2008, traveled as a couple",
            "text": "We stayed here for two nights 8 & 9 October and had a fabulous time. We stayed in one of two Victorian houses in the honeymoon suite. The room which was furnished with antiques was great and the bathroom spacious with a fabulous Victorian enamel bath. Original features abound. If you like sanitized contemporary corporate style accommodation this may not be the place for you. The staff are very friendly and helpful. We walked around the area during our stay and loved the area around Lake Eola. At night we walked to 'Spice' overlooking Lake Eola to eat (that was a great dining experience) and had a taxi back (because of rain not fear!). I thought the contrast between the modern surrounding area and the oasis that is The Courtyard was amazing. Stand back, take it all in and wonder at the advances made in the period between the two. Wonderful!",
            "title": "Romantic getaway",
            "user": "smiler1Derbyshire"
        },
        {
            "date": "October 6, 2008",
            "detail_rating": {
                "business": 5.0,
                "cleanliness": 5.0,
                "desk": null,
                "front_desk": 5.0,
                "location": 5.0,
                "pool": null,
                "restaurant": null,
                "rooms": 5.0,
                "service": 5.0,
                "sleep": null,
                "value": 5.0
            },
            "helpfulness": null,
            "id": 20664456,
            "likes": {
                "disliked": "\u2014 N/A",
                "liked": "\u2014 The location"
            },
            "rating": 5.0,
            "stay_parameters": "Stayed September 2008, traveled with friends",
            "text": "My stay at the courtyard was absolutely wonderful!",
            "title": "The Oasis of Orlando!!!",
            "user": "lica_br"
        },
        {
            "date": "October 1, 2008",
            "detail_rating": {
                "business": 3.0,
                "cleanliness": 1.0,
                "desk": null,
                "front_desk": 3.0,
                "location": 1.0,
                "pool": null,
                "restaurant": null,
                "rooms": 1.0,
                "service": 3.0,
                "sleep": null,
                "value": 1.0
            },
            "helpfulness": null,
            "id": 20537500,
            "likes": {
                "disliked": "\u2014 site",
                "liked": "\u2014 nothing"
            },
            "rating": 1.0,
            "stay_parameters": "Stayed September 2008, traveled on business",
            "text": "The grounds are really well conserve...the rooms are decorated with antiques , and the whole experience was amazing..the staff is amazing too!",
            "title": "Dump, Dump, Dump",
            "user": "goingthru"
        },
        {
            "date": "July 20, 2008",
            "detail_rating": {
                "business": 4.0,
                "cleanliness": 4.0,
                "desk": null,
                "front_desk": 5.0,
                "location": 3.0,
                "pool": null,
                "restaurant": null,
                "rooms": 3.0,
                "service": 5.0,
                "sleep": null,
                "value": 4.0
            },
            "helpfulness": 1,
            "id": 18075504,
            "likes": {
                "disliked": "\u2014 Dated Bathroom",
                "liked": "\u2014 HIstory and Charm"
            },
            "rating": 4.0,
            "stay_parameters": "Stayed July 2008, traveled with friends",
            "text": "It's a oasis in the middle of the city!",
            "title": "Perfect Wedding Location :-)",
            "user": "PrissyPixie"
        },
        {
            "date": "May 13, 2008",
            "detail_rating": {
                "business": 5.0,
                "cleanliness": 5.0,
                "desk": null,
                "front_desk": 5.0,
                "location": 4.0,
                "pool": null,
                "restaurant": null,
                "rooms": 5.0,
                "service": 5.0,
                "sleep": null,
                "value": 5.0
            },
            "helpfulness": 1,
            "id": 16012504,
            "likes": {
                "disliked": "\u2014 Quality of free breakfast",
                "liked": "\u2014 Property (i.e. accomodations, gardens) and Price"
            },
            "rating": 5.0,
            "stay_parameters": "Stayed May 2008, traveled as a couple",
            "text": "s:",
            "title": "Don't Listen To Whiners, This B&B's A Gorgeous Steal.",
            "user": "TheAngus"
        },
        {
            "date": "May 7, 2008",
            "detail_rating": {
                "business": 3.0,
                "cleanliness": 2.0,
                "desk": null,
                "front_desk": 4.0,
                "location": 2.0,
                "pool": null,
                "restaurant": null,
                "rooms": 2.0,
                "service": 2.0,
                "sleep": null,
                "value": 3.0
            },
            "helpfulness": 1,
            "id": 15782874,
            "likes": {
                "disliked": "\u2014 room quality and location",
                "liked": "\u2014 porches"
            },
            "rating": 2.0,
            "stay_parameters": "Stayed April 2008, traveled on business",
            "text": "I was in town for business and stayed at this property in the apartment style building. Overall I was disappointed with my room, but the property grew on me as my stay went on.",
            "title": "Disappointed, but could be worse",
            "user": "nytraveler78"
        },
        {
            "date": "March 10, 2008",
            "detail_rating": {
                "business": null,
                "cleanliness": 4.0,
                "desk": null,
                "front_desk": 5.0,
                "location": 5.0,
                "pool": null,
                "restaurant": null,
                "rooms": 5.0,
                "service": 5.0,
                "sleep": null,
                "value": 5.0
            },
            "helpfulness": null,
            "id": 14189878,
            "likes": {
                "disliked": null,
                "liked": null
            },
            "rating": 5.0,
            "stay_parameters": "Stayed April 2008",
            "text": "The kitchen feature was nice, and the living room was large. The furniture was not clean as the couch was covered in white specks. I did have the pleasure of encountering a cockroach, however this only happened once during my stay. The TV's are small, the air conditioning was loud. I came back one day and my a/c had been turned up to 90 degrees. The maid also left the door unlocked on more than one occassion. The bathroom had dirty grout, and the tubs faucets were corroded. There were days that I know the bathroom was not cleaned. The walls are paper thin and you hear your neighbors coming and going as well as conversations near by. There were weddings two nights that I was there and the music was extremely loud, although it does end by 10pm. However, when you book a room in a place that advertises outdoor weddings the music should be expected.",
            "title": "Quaint & Comfortable - who knew Orlando could be so lovely?",
            "user": "jacksonrosebnb"
        },
        {
            "date": "February 2, 2008",
            "detail_rating": {
                "business": null,
                "cleanliness": 5.0,
                "desk": null,
                "front_desk": 4.0,
                "location": 4.0,
                "pool": null,
                "restaurant": null,
                "rooms": 4.0,
                "service": 5.0,
                "sleep": null,
                "value": 4.0
            },
            "helpfulness": 1,
            "id": 13215207,
            "likes": {
                "disliked": "\u2014 hum of traffic from 408 but it was not overwhelming",
                "liked": "\u2014 Old Florida feeling"
            },
            "rating": 4.0,
            "stay_parameters": "Stayed January 2008, traveled on business",
            "text": "The highway ramp is literally in the front yard and does obstruct the view of the lake, but again when you book in a downtown establishment, some city features should be expected.",
            "title": "Finding Old Florida in Downtown Orlando",
            "user": "Lindy047"
        },
        {
            "date": "January 23, 2008",
            "detail_rating": {
                "business": 1.0,
                "cleanliness": 2.0,
                "desk": null,
                "front_desk": 2.0,
                "location": 2.0,
                "pool": null,
                "restaurant": null,
                "rooms": 1.0,
                "service": 2.0,
                "sleep": null,
                "value": 1.0
            },
            "helpfulness": 3,
            "id": 12916261,
            "likes": {
                "disliked": "\u2014 Close to I-4 and absolute lies website to actual experience",
                "liked": "\u2014 Close to I-4"
            },
            "rating": 2.0,
            "stay_parameters": "Stayed January 2008, traveled with family",
            "text": "The continental breakfast left a little to be desired. However, I enjoyed eating breakfast in the warm Florida air each morning. I also enjoyed many evenings on the porch with a glass of wine. They give you a carafe of wine during your stay, and while it is not the best of quality, they give you a large quantity. My carafe lasted me several nights.",
            "title": "Misleading Advertising!",
            "user": "PleaseRead03"
        },
        {
            "date": "January 21, 2008",
            "detail_rating": {
                "business": null,
                "cleanliness": 2.0,
                "desk": null,
                "front_desk": 1.0,
                "location": 1.0,
                "pool": null,
                "restaurant": null,
                "rooms": 2.0,
                "service": null,
                "sleep": null,
                "value": 2.0
            },
            "helpfulness": 1,
            "id": 12846564,
            "likes": {
                "disliked": "\u2014 Noise!",
                "liked": "\u2014 the fact that we could walk to the wedding."
            },
            "rating": 2.0,
            "stay_parameters": "Stayed January 2008, traveled on business",
            "text": "The gardens were smaller than I expected based on the advertising, and there were tons of small lizards that would scurry as you walked down the path.",
            "title": "Very Disappointed",
            "user": "Parrothead6706"
        },
        {
            "date": "March 30, 2010",
            "detail_rating": {
                "business": null,
                "cleanliness": 3.0,
                "desk": null,
                "location": 3.0,
                "pool": null,
                "restaurant": null,
                "rooms": 3.0,
                "service": 4.0,
                "sleep": 4.0,
                "value": 3.0
            },
            "helpfulness": 1,
            "id": 59971898,
            "likes": {
                "disliked": null,
                "liked": null
            },
            "rating": 3.0,
            "stay_parameters": "Stayed March 2010, traveled as a couple",
            "text": "The Courtyard at Lake Lucerne is 3 historic properties next to each other--2 beautifully restored ornate inns flanking a classic Art Deco apartment building where most guests stay. Weddings are held at both inns throughout the weekend, so guests in the Art Deco building (the Welborn) are \"treated\" to music from both sides. Happily, the weddings end promptly at 10 pm. Another thing to know beforehand: there is no view of Lake Lucerne, as a freeway offramp separates the lake from the inns. Aside from that, it's a convenient location in downtown Orlando. Thumbs up for the breakfast that comes with the room--nice presentation and good variety. Although most rooms in the Welborn are suites with kitchenettes, ours did not have one, but management supplied an ice chest.",
            "title": "Nice but not for everyone",
            "user": "calligcat"
        },
        {
            "date": "February 21, 2010",
            "detail_rating": {
                "business": null,
                "cleanliness": 5.0,
                "desk": null,
                "location": 5.0,
                "pool": null,
                "restaurant": null,
                "rooms": 5.0,
                "service": 5.0,
                "sleep": 5.0,
                "value": 5.0
            },
            "helpfulness": 3,
            "id": 56665548,
            "likes": {
                "disliked": null,
                "liked": null
            },
            "rating": 5.0,
            "stay_parameters": "Stayed February 2010, traveled as a couple",
            "text": "This was our first experience at a B&B, and being a little tight on funds we decided to make The Courtyard our destination. We stayed in the Yellow Room in the Dr. Phillips House. It was my birthday weekend. We checked in a little before 3 and made our way to the room. The house was very elegantly decorated with antiques everywhere. When I opened the door to our room, it was decorated with Happy Birthday balloons, banners and streamers. Turns out, my fiancee called the manager and was able to come by the day before our stay to decorate our room and have a cake waiting for me. Our room had a door that opened directly to the large balcony that over looked the grounds. The next morning we enjoyed the variety of breakfast foods they had to offer, from french toast, bagels, cereals and so on. Before we knew it, it was time to check out. It was a blast. The staff was very nice and accomodating. Don't bother staying at the Wellborn, spend a little extra and stay in the Dr. Phillips house, it's worth it!!!",
            "title": "Amazing Stay at an Amazing B&B",
            "user": "KeriandScott"
        },
        {
            "date": "January 8, 2010",
            "detail_rating": {
                "business": null,
                "cleanliness": 3.0,
                "desk": null,
                "location": 1.0,
                "pool": null,
                "restaurant": null,
                "rooms": 2.0,
                "service": 4.0,
                "sleep": null,
                "value": 1.0
            },
            "helpfulness": 1,
            "id": 52985484,
            "likes": {
                "disliked": null,
                "liked": null
            },
            "rating": 3.0,
            "stay_parameters": "Stayed January 2010, traveled as a couple",
            "text": "My husband and I stayed here just after the new year. We don't have much money but decided to spend a bit more than the Motel 6 places we are used to and treat ourselves. And boy were we disappointed. We paid almost $150 for 1 night and got a Motel 6 type of room.",
            "title": "Not as Advertised - ok but Very Disappointed",
            "user": "carajul"
        },
        {
            "date": "November 5, 2009",
            "detail_rating": {
                "business": null,
                "cleanliness": 5.0,
                "desk": null,
                "location": 5.0,
                "pool": null,
                "restaurant": null,
                "rooms": 5.0,
                "service": 5.0,
                "sleep": null,
                "value": 5.0
            },
            "helpfulness": 2,
            "id": 48563173,
            "likes": {
                "disliked": null,
                "liked": null
            },
            "rating": 5.0,
            "stay_parameters": "Stayed August 2009, traveled as a couple",
            "text": "1. The property - when you look online you are shown a photo of a huge victorian mansion surrounded by woods on a lake. In reality, there are several buildings that overtime became part of one hotel property. The I-4 is an elevated highway that nearly goes right over the property! And what's worse, an access ramp goes up to the I-4 about 20 feet from the hotel's front door! There is no view of the lake, as the highway ramp blocks it.",
            "title": "Beautiful, elegant b & b in the heart of Orlando!",
            "user": "ladyday540"
        },
        {
            "date": "September 11, 2009",
            "detail_rating": {
                "business": null,
                "cleanliness": null,
                "desk": null,
                "location": null,
                "pool": null,
                "restaurant": null,
                "rooms": null,
                "service": null,
                "sleep": null,
                "value": null
            },
            "helpfulness": 2,
            "id": 40910629,
            "likes": {
                "disliked": null,
                "liked": null
            },
            "rating": 5.0,
            "stay_parameters": null,
            "text": "2. The buildings - you don't get to stay in the gorgeous victorian mansion pictured on the web site. You get to stay in the dumpy \"art deco\" apartments next door. Filthy, run down, plastic WalMart blinds in windows, cheap furniture. We were really disappointed that we got this room. It was basically a Motel 6 if not worse. Thats why we were so upset. You pay money for a victorian mansion and get a dump instead. In all the photos online they have basically cropped the images so you don't see the real property. These are old apartments nurses used to live in who worked at the hospital next door.",
            "title": "Beautiful Gardens",
            "user": "Images_7"
        }
    ],
    "slim_ranking": 0.333333333333,
    "stars": 2.5,
    "tripadvisor": {
        "VISITED": false,
        "country_name": null,
        "locality": null,
        "pic_link": null,
        "street_address": null
    },
    "user_rating": 4.0,
    "variance": {
        "average": 10,
        "excellent": 57,
        "poor": 13,
        "terrible": 2,
        "very good": 23
    }
}