{
    "aka": "RACV Healesville Country Club Yarra Valley",
    "description": null,
    "detail_rating": {
        "cleanliness": null,
        "location": null,
        "rooms": null,
        "service": null,
        "sleep": null,
        "value": null
    },
    "location": {
        "city": null,
        "continent": "South Pacific",
        "country": "Australia",
        "proposed_city": null,
        "province": null,
        "region": null
    },
    "name": "RACV Healesville Country Club",
    "places": {
        "aka": [],
        "hotel_description": [],
        "hotel_name": []
    },
    "review_count": 38,
    "review_count_current": 1,
    "reviews": [
        {
            "date": "August 6, 2011",
            "detail_rating": {
                "business": null,
                "cleanliness": 5.0,
                "desk": null,
                "location": null,
                "pool": null,
                "restaurant": null,
                "rooms": null,
                "service": 5.0,
                "sleep": 5.0,
                "value": 3.0
            },
            "helpfulness": 2,
            "id": 116336930,
            "likes": {
                "disliked": null,
                "liked": null
            },
            "rating": 5.0,
            "stay_parameters": "Stayed July 2011, traveled as a couple",
            "text": "We stayed here for a relaxing weekend and had a great time. The facilities are superb. The hotel is in a rural setting but just 20minutes walk (or 5 minutes drive) from the centre of Healesville. The dining was very good and not bad value for a 5* hotel.",
            "title": "Great hotel in country setting",
            "user": "Kevin B"
        }
    ],
    "slim_ranking": 0.25,
    "stars": null,
    "tripadvisor": {
        "VISITED": false,
        "country_name": null,
        "locality": null,
        "pic_link": null,
        "street_address": null
    },
    "user_rating": 4.5,
    "variance": {
        "average": 3,
        "excellent": 24,
        "poor": 1,
        "terrible": 1,
        "very good": 9
    }
}