{
    "aka": "Tune Hotel - Double Six, Legian Bali",
    "description": "Hotel opens on 15 December 2009 - Get a 5-star sleeping experience at a 1-star price with Tune Hotels.com branded limited-service hotels. The Legian, Bali hotel features 170 private rooms with en-suite bathrooms. We believe in letting our guests know exactly what you pay for, and offer the capability to design your stay via reasonably priced pay-as-you-use add-ons. The prices quoted are inclusive of the room price, applicable fees and prevailing taxes only.",
    "detail_rating": {
        "cleanliness": 4.0,
        "location": 4.0,
        "rooms": 3.5,
        "service": 4.0,
        "sleep": 4.0,
        "value": 4.0
    },
    "location": {
        "city": "Legian",
        "continent": "Asia",
        "country": "Indonesia",
        "proposed_city": "Bali",
        "province": null,
        "region": null
    },
    "name": "Tune Hotel - Double Six, Legian",
    "places": {
        "aka": [
            "Bali"
        ],
        "hotel_description": [
            "Bali"
        ],
        "hotel_name": []
    },
    "review_count": 415,
    "review_count_current": 20,
    "reviews": [
        {
            "date": "July 10, 2012",
            "detail_rating": {
                "business": null,
                "cleanliness": 5.0,
                "desk": null,
                "location": 4.0,
                "pool": null,
                "restaurant": null,
                "rooms": 4.0,
                "service": 5.0,
                "sleep": 5.0,
                "value": 5.0
            },
            "helpfulness": null,
            "id": 133959471,
            "likes": {
                "disliked": null,
                "liked": null
            },
            "rating": 4.0,
            "stay_parameters": "Stayed June 2012, traveled with family",
            "text": "When booking the hotel, honestly I had doubt about staying here. The rate was very economical (about Rp 200.000/night for double room) and first I was afraid the room would be terrible. However, my doubt was proven wrong! The room, though small, was very clean. The bathroom had nice shower. It was perfect because our plan in Bali was not to relax & linger all day at the hotel. We only needed the hotel to have a good sleep and nice hot shower!",
            "title": "A nice budget hotel",
            "user": "sandrinagracia"
        },
        {
            "date": "July 9, 2012",
            "detail_rating": {
                "business": null,
                "cleanliness": 5.0,
                "desk": null,
                "location": 5.0,
                "pool": null,
                "restaurant": null,
                "rooms": 4.0,
                "service": 5.0,
                "sleep": null,
                "value": 4.0
            },
            "helpfulness": 1,
            "id": 133822088,
            "likes": {
                "disliked": null,
                "liked": null
            },
            "rating": 4.0,
            "stay_parameters": "Stayed July 2012",
            "text": "The hotel has a small restaurant on the G floor, not a fancy one but enough to have a descent meal that is not over-priced. One more thing I love about this hotel that, it's only 5 mins walking distance to the beach!",
            "title": "tiny rooms but clean",
            "user": "Cocorobet"
        },
        {
            "date": "July 9, 2012",
            "detail_rating": {
                "business": null,
                "cleanliness": 5.0,
                "desk": null,
                "location": 4.0,
                "pool": null,
                "restaurant": null,
                "rooms": 5.0,
                "service": 5.0,
                "sleep": 5.0,
                "value": 5.0
            },
            "helpfulness": null,
            "id": 133812211,
            "likes": {
                "disliked": null,
                "liked": null
            },
            "rating": 5.0,
            "stay_parameters": "Stayed May 2012, traveled as a couple",
            "text": "Cheap but dignified. There is a minimart and cheap restaurant inside the hotel. Super small room but clean and well looked after. Designated smoking areas. Loved the one night we stayed, it was quiet and the shower was so nice. No rats nor gecko in the room.",
            "title": "\"very recomended ^__^\"",
            "user": "herlinda_82"
        },
        {
            "date": "July 9, 2012",
            "detail_rating": {
                "business": null,
                "cleanliness": 3.0,
                "desk": null,
                "location": 5.0,
                "pool": null,
                "restaurant": null,
                "rooms": 4.0,
                "service": 3.0,
                "sleep": 5.0,
                "value": 5.0
            },
            "helpfulness": null,
            "id": 133810084,
            "likes": {
                "disliked": null,
                "liked": null
            },
            "rating": 4.0,
            "stay_parameters": "Stayed July 2012, traveled as a couple",
            "text": "I spent 5 nights at the Legian tune.",
            "title": "WORTHED!",
            "user": "Ahmad Firdaus M"
        },
        {
            "date": "July 8, 2012",
            "detail_rating": {
                "business": null,
                "cleanliness": 5.0,
                "desk": null,
                "location": 5.0,
                "pool": null,
                "restaurant": null,
                "rooms": 5.0,
                "service": 5.0,
                "sleep": 5.0,
                "value": 5.0
            },
            "helpfulness": null,
            "id": 133731554,
            "likes": {
                "disliked": null,
                "liked": null
            },
            "rating": 5.0,
            "stay_parameters": "Stayed June 2012, traveled with friends",
            "text": "very clean and comfortable hotel",
            "title": "It really WORTHED",
            "user": "a57ried"
        },
        {
            "date": "June 17, 2012",
            "detail_rating": {
                "business": null,
                "cleanliness": 5.0,
                "desk": null,
                "location": 4.0,
                "pool": null,
                "restaurant": null,
                "rooms": 4.0,
                "service": 4.0,
                "sleep": 5.0,
                "value": 4.0
            },
            "helpfulness": 1,
            "id": 132131216,
            "likes": {
                "disliked": null,
                "liked": null
            },
            "rating": 5.0,
            "stay_parameters": "Stayed February 2012, traveled as a couple",
            "text": "go to Bali with minimum budget? do not afraid,, you still can sleep tight if you sleep here,, at tune hotel,,",
            "title": "best price for good sleep",
            "user": "snowcone09"
        },
        {
            "date": "June 16, 2012",
            "detail_rating": {
                "business": null,
                "cleanliness": 4.0,
                "desk": null,
                "location": 3.0,
                "pool": null,
                "restaurant": null,
                "rooms": 4.0,
                "service": 4.0,
                "sleep": 5.0,
                "value": 4.0
            },
            "helpfulness": null,
            "id": 132129583,
            "likes": {
                "disliked": null,
                "liked": null
            },
            "rating": 4.0,
            "stay_parameters": "Stayed June 2012, traveled solo",
            "text": "with backpacker price, its a big deal.totally love it. all the staff its very kind and there always smile in their face.",
            "title": "comfort backpacker hotel",
            "user": "Jtt K"
        },
        {
            "date": "June 12, 2012",
            "detail_rating": {
                "business": null,
                "cleanliness": 4.0,
                "desk": null,
                "location": 4.0,
                "pool": null,
                "restaurant": null,
                "rooms": 4.0,
                "service": 4.0,
                "sleep": 4.0,
                "value": 5.0
            },
            "helpfulness": null,
            "id": 131807020,
            "likes": {
                "disliked": null,
                "liked": null
            },
            "rating": 4.0,
            "stay_parameters": "Stayed June 2012, traveled with friends",
            "text": "i check out from the hotel,, and 2 days later come back to check in again,,,",
            "title": "1 star price for 5 star bed!",
            "user": "nkr28"
        },
        {
            "date": "June 10, 2012",
            "detail_rating": {
                "business": null,
                "cleanliness": 4.0,
                "desk": null,
                "location": 4.0,
                "pool": null,
                "restaurant": null,
                "rooms": 3.0,
                "service": 4.0,
                "sleep": 5.0,
                "value": 4.0
            },
            "helpfulness": null,
            "id": 131713560,
            "likes": {
                "disliked": null,
                "liked": null
            },
            "rating": 4.0,
            "stay_parameters": "Stayed May 2012, traveled as a couple",
            "text": "receptionist at lobby still remember us and he give us room at 3rd floor,, with the villa view,, very nice.",
            "title": "Good Backpackers hotel",
            "user": "krisn81"
        },
        {
            "date": "June 7, 2012",
            "detail_rating": {
                "business": null,
                "cleanliness": 4.0,
                "desk": null,
                "location": 2.0,
                "pool": null,
                "restaurant": null,
                "rooms": 3.0,
                "service": 3.0,
                "sleep": 4.0,
                "value": 4.0
            },
            "helpfulness": 1,
            "id": 131454539,
            "likes": {
                "disliked": null,
                "liked": null
            },
            "rating": 3.0,
            "stay_parameters": "Stayed October 2011, traveled with friends",
            "text": "room always clean,, and its a good price for sleeping..",
            "title": "Small and Quiet",
            "user": "tieneit"
        },
        {
            "date": "June 6, 2012",
            "detail_rating": {
                "business": null,
                "cleanliness": 4.0,
                "desk": null,
                "location": 3.0,
                "pool": null,
                "restaurant": null,
                "rooms": 4.0,
                "service": 4.0,
                "sleep": null,
                "value": 4.0
            },
            "helpfulness": null,
            "id": 131417609,
            "likes": {
                "disliked": null,
                "liked": null
            },
            "rating": 4.0,
            "stay_parameters": "Stayed April 2012",
            "text": "The room is quite small actually",
            "title": "Good hotel",
            "user": "nFatrin"
        },
        {
            "date": "June 6, 2012",
            "detail_rating": {
                "business": null,
                "cleanliness": 3.0,
                "desk": null,
                "location": 4.0,
                "pool": null,
                "restaurant": null,
                "rooms": 3.0,
                "service": 3.0,
                "sleep": 4.0,
                "value": 3.0
            },
            "helpfulness": null,
            "id": 131390829,
            "likes": {
                "disliked": null,
                "liked": null
            },
            "rating": 3.0,
            "stay_parameters": "Stayed June 2012, traveled with family",
            "text": "And i hate the fact that they dont have any TV",
            "title": "good for backpackers :)",
            "user": "Edvi89"
        },
        {
            "date": "June 6, 2012",
            "detail_rating": {
                "business": null,
                "cleanliness": 5.0,
                "desk": null,
                "location": 5.0,
                "pool": null,
                "restaurant": null,
                "rooms": 5.0,
                "service": 5.0,
                "sleep": 5.0,
                "value": 5.0
            },
            "helpfulness": null,
            "id": 131383046,
            "likes": {
                "disliked": null,
                "liked": null
            },
            "rating": 5.0,
            "stay_parameters": "Stayed June 2012, traveled with family",
            "text": "But the bed is soool comfortable!!!!",
            "title": "Great location, Nice, & suitable for family",
            "user": "james131"
        },
        {
            "date": "June 5, 2012",
            "detail_rating": {
                "business": null,
                "cleanliness": 3.0,
                "desk": null,
                "location": 4.0,
                "pool": null,
                "restaurant": null,
                "rooms": 3.0,
                "service": 3.0,
                "sleep": 3.0,
                "value": 3.0
            },
            "helpfulness": 1,
            "id": 131327092,
            "likes": {
                "disliked": null,
                "liked": null
            },
            "rating": 3.0,
            "stay_parameters": "Stayed May 2012, traveled with family",
            "text": "It was nice small room",
            "title": "Cheap but not my primary choice",
            "user": "ausicopy"
        },
        {
            "date": "June 4, 2012",
            "detail_rating": {
                "business": null,
                "cleanliness": 4.0,
                "desk": null,
                "location": 5.0,
                "pool": null,
                "restaurant": null,
                "rooms": 3.0,
                "service": 4.0,
                "sleep": 4.0,
                "value": 5.0
            },
            "helpfulness": null,
            "id": 131240367,
            "likes": {
                "disliked": null,
                "liked": null
            },
            "rating": 3.0,
            "stay_parameters": "Stayed May 2012, traveled with friends",
            "text": "It was pretty good hotel to stay, the room was simple, clean, cozy( used king koil LOL ) so obviously you'll get your best rest.",
            "title": "for budget hotel the best accomodation that i can afford",
            "user": "arryohana"
        },
        {
            "date": "July 7, 2012",
            "detail_rating": {
                "business": null,
                "cleanliness": 4.0,
                "desk": null,
                "location": 2.0,
                "pool": null,
                "restaurant": null,
                "rooms": 3.0,
                "service": 4.0,
                "sleep": 4.0,
                "value": 4.0
            },
            "helpfulness": null,
            "id": 133691061,
            "likes": {
                "disliked": null,
                "liked": null
            },
            "rating": 4.0,
            "stay_parameters": "Stayed July 2012, traveled with family",
            "text": "I spent 5 nights in Tune Hotel, booked 3 rooms, pay very cheap rate because early booking.",
            "title": "simple, clean, but no parking space",
            "user": "vitruvian"
        },
        {
            "date": "July 5, 2012",
            "detail_rating": {
                "business": null,
                "cleanliness": 4.0,
                "desk": null,
                "location": 5.0,
                "pool": null,
                "restaurant": null,
                "rooms": 4.0,
                "service": 4.0,
                "sleep": 4.0,
                "value": 5.0
            },
            "helpfulness": null,
            "id": 133494480,
            "likes": {
                "disliked": null,
                "liked": null
            },
            "rating": 5.0,
            "stay_parameters": "Stayed May 2012, traveled as a couple",
            "text": "it was nice, simple,clean, great staff. located between kuta area and seminyak",
            "title": "u won't find better",
            "user": "aldi s"
        },
        {
            "date": "June 23, 2012",
            "detail_rating": {
                "business": null,
                "cleanliness": 4.0,
                "desk": null,
                "location": 5.0,
                "pool": null,
                "restaurant": null,
                "rooms": 4.0,
                "service": 5.0,
                "sleep": 4.0,
                "value": 5.0
            },
            "helpfulness": null,
            "id": 132627049,
            "likes": {
                "disliked": null,
                "liked": null
            },
            "rating": 4.0,
            "stay_parameters": "Stayed June 2012, traveled with family",
            "text": "cons: very far from kuta beach, rent a motorcycle for more convenient to move around",
            "title": "Tune in Legian, Bali",
            "user": "Adrian W"
        },
        {
            "date": "June 21, 2012",
            "detail_rating": {
                "business": null,
                "cleanliness": 4.0,
                "desk": null,
                "location": 5.0,
                "pool": null,
                "restaurant": null,
                "rooms": 4.0,
                "service": 4.0,
                "sleep": 5.0,
                "value": 5.0
            },
            "helpfulness": null,
            "id": 132489431,
            "likes": {
                "disliked": null,
                "liked": null
            },
            "rating": 5.0,
            "stay_parameters": "Stayed June 2012, traveled with family",
            "text": "very small parking space for car, so you have to park the car quite far from the hotel.",
            "title": "Nice hotel with excellent location",
            "user": "Charless2012"
        },
        {
            "date": "June 20, 2012",
            "detail_rating": {
                "business": null,
                "cleanliness": 4.0,
                "desk": null,
                "location": 3.0,
                "pool": null,
                "restaurant": null,
                "rooms": 3.0,
                "service": 5.0,
                "sleep": 4.0,
                "value": 5.0
            },
            "helpfulness": null,
            "id": 132376046,
            "likes": {
                "disliked": null,
                "liked": null
            },
            "rating": 4.0,
            "stay_parameters": "Stayed May 2012, traveled with friends",
            "text": "Overal: very good for the price i pay.",
            "title": "Totally worth the price",
            "user": "Junique"
        }
    ],
    "slim_ranking": 0.37037037037,
    "stars": 2.5,
    "tripadvisor": {
        "VISITED": false,
        "country_name": null,
        "locality": null,
        "pic_link": null,
        "street_address": null
    },
    "user_rating": 4.0,
    "variance": {
        "average": 69,
        "excellent": 104,
        "poor": 20,
        "terrible": 13,
        "very good": 209
    }
}