{
    "aka": "Budget Backpackers Hotel Edinburgh",
    "description": "With over 250 beds, and located in the heart of beautiful Old Town, Budget Backpackers is one of the best places to stay in Edinburgh! All of the amenities you need including free linen, free hot showers, a self catering kitchen, and a bar/cafe! Budget Backpackers is one of the best located hostels in the city, being only a 10 minute walk from Waverly Train Station, a 2 minute walk from the Royal Mile, and the breathtaking Edinburgh Castle practically on our doorstep! There is also always something happening within the hostel, with weekly Wii and Pool Competitions, Quiz and Movie Nights, Free Walking Tours 11am daily Monday to Saturday, and our infamous Pub Crawls Monday to Friday kicking off in our very own bar! Whether you want to see the sights, make friends, party it up, or just relax, Budget Backpackers has everything you need to make your stay in Edinburgh memorable!",
    "detail_rating": {
        "cleanliness": 4.0,
        "location": 4.5,
        "rooms": 3.5,
        "service": 4.0,
        "sleep": 3.5,
        "value": 4.0
    },
    "location": {
        "city": null,
        "continent": null,
        "country": null,
        "proposed_city": "Edinburgh",
        "province": null,
        "region": null
    },
    "name": "Budget Backpackers",
    "places": {
        "aka": [
            "Edinburgh"
        ],
        "hotel_description": [
            "Edinburgh",
            "Waverly",
            "Tours"
        ],
        "hotel_name": []
    },
    "review_count": 339,
    "review_count_current": 14,
    "reviews": [
        {
            "date": "June 4, 2007",
            "detail_rating": {
                "business": null,
                "cleanliness": null,
                "desk": null,
                "location": null,
                "pool": null,
                "restaurant": null,
                "rooms": null,
                "service": null,
                "sleep": null,
                "value": null
            },
            "helpfulness": null,
            "id": 7757953,
            "likes": {
                "disliked": null,
                "liked": null
            },
            "rating": 3.0,
            "stay_parameters": null,
            "text": "Good hostel, good location and good staff. Our twin private room was very good hostel room.",
            "title": "Good Hostel - just a few small issues!",
            "user": "iainskye"
        },
        {
            "date": "May 31, 2007",
            "detail_rating": {
                "business": null,
                "cleanliness": null,
                "desk": null,
                "location": null,
                "pool": null,
                "restaurant": null,
                "rooms": null,
                "service": null,
                "sleep": null,
                "value": null
            },
            "helpfulness": null,
            "id": 7723092,
            "likes": {
                "disliked": null,
                "liked": null
            },
            "rating": 4.0,
            "stay_parameters": null,
            "text": "All thats needed is some new mattresses and some hooks in the showers!!!!!!",
            "title": "Loved my stay",
            "user": "Cora_the_explorer"
        },
        {
            "date": "April 28, 2007",
            "detail_rating": {
                "business": null,
                "cleanliness": null,
                "desk": null,
                "location": null,
                "pool": null,
                "restaurant": null,
                "rooms": null,
                "service": null,
                "sleep": null,
                "value": null
            },
            "helpfulness": null,
            "id": 7479311,
            "likes": {
                "disliked": null,
                "liked": null
            },
            "rating": 5.0,
            "stay_parameters": null,
            "text": "I stayed here for 3 nights May 2006 a loved my stay!",
            "title": "Best... Hostel... Ever!!!",
            "user": "vegie_travellers"
        },
        {
            "date": "April 16, 2007",
            "detail_rating": {
                "business": null,
                "cleanliness": null,
                "desk": null,
                "location": null,
                "pool": null,
                "restaurant": null,
                "rooms": null,
                "service": null,
                "sleep": null,
                "value": null
            },
            "helpfulness": null,
            "id": 7366133,
            "likes": {
                "disliked": null,
                "liked": null
            },
            "rating": 1.0,
            "stay_parameters": null,
            "text": "Great location less then a 10 minute walk to eveything , train, airport bus, castle, and new town shopping.",
            "title": "The Good, the Bad, The Downright Ugly of it",
            "user": "Miser"
        },
        {
            "date": "April 11, 2007",
            "detail_rating": {
                "business": null,
                "cleanliness": null,
                "desk": null,
                "location": null,
                "pool": null,
                "restaurant": null,
                "rooms": null,
                "service": null,
                "sleep": null,
                "value": null
            },
            "helpfulness": null,
            "id": 7332419,
            "likes": {
                "disliked": null,
                "liked": null
            },
            "rating": 2.0,
            "stay_parameters": null,
            "text": "The hostel itself was great clean rooms, comfy beds. I stayed in a four person dorm that was clean and quite big, nice hardwood floors, bright colours, and lockers.",
            "title": "Issues",
            "user": "gotravelNyc"
        },
        {
            "date": "April 9, 2007",
            "detail_rating": {
                "business": null,
                "cleanliness": null,
                "desk": null,
                "location": null,
                "pool": null,
                "restaurant": null,
                "rooms": null,
                "service": null,
                "sleep": null,
                "value": null
            },
            "helpfulness": null,
            "id": 7302496,
            "likes": {
                "disliked": null,
                "liked": null
            },
            "rating": 5.0,
            "stay_parameters": null,
            "text": "This is the nicest hostel I've ever stayed in. We arrived in Edinburgh and got a room at Castle Rock, and then promptly left because it was nasty (see my Castle Rock review). We went right down the street and found Budget Backpackers. For about the same price, we got a room for 4 instead of 14, and it was actually clean.",
            "title": "Amazing - clean, cheap, and nice. Left Castle Rock to come here.",
            "user": "bobert24"
        },
        {
            "date": "February 28, 2007",
            "detail_rating": {
                "business": null,
                "cleanliness": null,
                "desk": null,
                "location": null,
                "pool": null,
                "restaurant": null,
                "rooms": null,
                "service": null,
                "sleep": null,
                "value": null
            },
            "helpfulness": null,
            "id": 6856717,
            "likes": {
                "disliked": null,
                "liked": null
            },
            "rating": 4.0,
            "stay_parameters": null,
            "text": "Everything here was very nice. It was very clean, there wwas plenty of room in the kiychen, heck, it even had plasma TVs.",
            "title": "Cool atmosphere",
            "user": "Hack_attack_ie"
        },
        {
            "date": "February 7, 2007",
            "detail_rating": {
                "business": null,
                "cleanliness": null,
                "desk": null,
                "location": null,
                "pool": null,
                "restaurant": null,
                "rooms": null,
                "service": null,
                "sleep": null,
                "value": null
            },
            "helpfulness": null,
            "id": 6757309,
            "likes": {
                "disliked": null,
                "liked": null
            },
            "rating": 4.0,
            "stay_parameters": null,
            "text": "The only problem that we had at all was that there was only one washer and dryer. But we managed to find somewhere else to do it, so it wasn't a real problem.",
            "title": "Nice, clean hostel",
            "user": "TheWearyTraveller-7"
        },
        {
            "date": "January 23, 2007",
            "detail_rating": {
                "business": null,
                "cleanliness": null,
                "desk": null,
                "location": null,
                "pool": null,
                "restaurant": null,
                "rooms": null,
                "service": null,
                "sleep": null,
                "value": null
            },
            "helpfulness": null,
            "id": 6649763,
            "likes": {
                "disliked": null,
                "liked": null
            },
            "rating": 5.0,
            "stay_parameters": null,
            "text": "All in all, I would absolutely recommend a stay here. Don't be fooled by the other places.",
            "title": "Loved it, awesome hostel",
            "user": "Sovietagent"
        },
        {
            "date": "November 22, 2006",
            "detail_rating": {
                "business": null,
                "cleanliness": null,
                "desk": null,
                "location": null,
                "pool": null,
                "restaurant": null,
                "rooms": null,
                "service": null,
                "sleep": null,
                "value": null
            },
            "helpfulness": null,
            "id": 6164498,
            "likes": {
                "disliked": null,
                "liked": null
            },
            "rating": 5.0,
            "stay_parameters": null,
            "text": "Me and the boyfriend stayed at Budget Backpackers at the beginning of the month. We booked a private room, which was pretty large, with a lovely, comfortable double bed, as well as nice and warm considering the cold early Feb weather outside! We had a gorgeous bathroom next to our room, which was very popular with the other residents due to the fact that it seemed to be one of the only ones on our floor without a huge window, letting all the freezing air and nosy neighbours' looks in!",
            "title": "Best hostel i have ever stayed in.",
            "user": "mmfactor"
        },
        {
            "date": "November 12, 2006",
            "detail_rating": {
                "business": 5.0,
                "cleanliness": 4.0,
                "desk": null,
                "front_desk": 5.0,
                "location": 4.0,
                "pool": null,
                "restaurant": null,
                "rooms": 5.0,
                "service": null,
                "sleep": null,
                "value": 5.0
            },
            "helpfulness": null,
            "id": 6109655,
            "likes": {
                "disliked": null,
                "liked": null
            },
            "rating": 5.0,
            "stay_parameters": "Stayed November 2006, traveled solo",
            "text": "I just got back from a few nights here. The rooms and bathrooms were very clean. The staff were extremely friendly and helpful. The location is great too. I would highly recommend this hostel. They give free city tours and organize pub crawls most evenings.",
            "title": "Great hostel",
            "user": "hil1211"
        },
        {
            "date": "October 25, 2006",
            "detail_rating": {
                "business": null,
                "cleanliness": 5.0,
                "desk": null,
                "front_desk": 3.0,
                "location": 5.0,
                "pool": null,
                "restaurant": null,
                "rooms": 4.0,
                "service": 5.0,
                "sleep": null,
                "value": 5.0
            },
            "helpfulness": null,
            "id": 6008952,
            "likes": {
                "disliked": null,
                "liked": "\u2014 GREAT location"
            },
            "rating": 5.0,
            "stay_parameters": "Stayed August 2006, traveled as a couple",
            "text": "This hostel was GREAT, if you don't mind the bright colour scheme! We had a double room (sadly no double bed), which was very clean and in a quiet part of the hostel. The toilets and showers were always clean, and the breakfast was cheap and adequate (although be warned, they really pack up quick at the end). Give the muffins / pastries a miss though - they're dried out and not too tasty. We were there during the Edinburgh Festival, so the whole place was buzzing and yet we could still get a great night's sleep. Everything was within easy walking distance, and the friendly staff were great for directions when needed. Would definitely stay there again - if we can every afford to get over to Scotland again!!",
            "title": "Incredibly fabulous location, great hostel",
            "user": "mstiff"
        },
        {
            "date": "October 9, 2006",
            "detail_rating": {
                "business": 3.0,
                "cleanliness": 5.0,
                "desk": null,
                "front_desk": 4.0,
                "location": 5.0,
                "pool": null,
                "restaurant": null,
                "rooms": 4.0,
                "service": 4.0,
                "sleep": null,
                "value": 4.0
            },
            "helpfulness": null,
            "id": 5930766,
            "likes": {
                "disliked": null,
                "liked": "\u2014 comfy beds and location"
            },
            "rating": 4.0,
            "stay_parameters": "Stayed October 2006, traveled with friends",
            "text": "We (4 girls mid 20yrs-early 30yrs) stayed 1 night on a Saturday",
            "title": "great location and place to stay",
            "user": "alansgirl"
        },
        {
            "date": "September 23, 2006",
            "detail_rating": {
                "business": 3.0,
                "cleanliness": 3.0,
                "desk": null,
                "front_desk": 4.0,
                "location": 4.0,
                "pool": null,
                "restaurant": null,
                "rooms": 3.0,
                "service": 4.0,
                "sleep": null,
                "value": 5.0
            },
            "helpfulness": 1,
            "id": 5830256,
            "likes": {
                "disliked": null,
                "liked": null
            },
            "rating": 5.0,
            "stay_parameters": "Stayed September 2006",
            "text": "We choose it due to previous reviews, location. We were not backpacking, just wanted somewhere reasonably priced, central and clean for 1 night... here we got all 3.",
            "title": "Great Staff and a Fun Place!",
            "user": "Manny C"
        }
    ],
    "slim_ranking": 0.27950310559,
    "stars": null,
    "tripadvisor": {
        "VISITED": false,
        "country_name": null,
        "locality": null,
        "pic_link": null,
        "street_address": null
    },
    "user_rating": 4.0,
    "variance": {
        "average": 47,
        "excellent": 110,
        "poor": 23,
        "terrible": 13,
        "very good": 146
    }
}