{
    "aka": "Cedar Gables Hotel Napa",
    "description": null,
    "detail_rating": {
        "cleanliness": 5.0,
        "location": 5.0,
        "rooms": 5.0,
        "service": 5.0,
        "sleep": 5.0,
        "value": 5.0
    },
    "location": {
        "city": null,
        "continent": null,
        "country": "United States",
        "proposed_city": "Cedar",
        "province": null,
        "region": null
    },
    "name": "Cedar Gables Inn",
    "places": {
        "aka": [
            "Cedar",
            "Napa"
        ],
        "hotel_description": [],
        "hotel_name": [
            "Cedar"
        ]
    },
    "review_count": 255,
    "review_count_current": 7,
    "reviews": [
        {
            "date": "March 9, 2006",
            "detail_rating": {
                "business": null,
                "cleanliness": null,
                "desk": null,
                "location": null,
                "pool": null,
                "restaurant": null,
                "rooms": null,
                "service": null,
                "sleep": null,
                "value": null
            },
            "helpfulness": 4,
            "id": 4597156,
            "likes": {
                "disliked": null,
                "liked": null
            },
            "rating": 5.0,
            "stay_parameters": null,
            "text": "My husband and I needed a much deserved break. What a perfect,romantic place to go. The Inn is beautifully decorated and the location is walking distance to Old Downtown. Susie and Ken are naturals!!! I was treated as a guest with everyting I needed,yet I felt like family. I didn't want to leave!",
            "title": "Warm and inviting",
            "user": "A TripAdvisor user"
        },
        {
            "date": "March 7, 2006",
            "detail_rating": {
                "business": null,
                "cleanliness": null,
                "desk": null,
                "location": null,
                "pool": null,
                "restaurant": null,
                "rooms": null,
                "service": null,
                "sleep": null,
                "value": null
            },
            "helpfulness": 7,
            "id": 4592229,
            "likes": {
                "disliked": null,
                "liked": null
            },
            "rating": 5.0,
            "stay_parameters": null,
            "text": "I just returned from a long weekend at Cedar Gables Inn.",
            "title": "home away from home",
            "user": "A TripAdvisor user"
        },
        {
            "date": "September 8, 2006",
            "detail_rating": {
                "business": null,
                "cleanliness": null,
                "desk": null,
                "location": null,
                "pool": null,
                "restaurant": null,
                "rooms": null,
                "service": null,
                "sleep": null,
                "value": null
            },
            "helpfulness": 1,
            "id": 5779274,
            "likes": {
                "disliked": null,
                "liked": null
            },
            "rating": 5.0,
            "stay_parameters": null,
            "text": "This is everything a B&B is supposed to be. It's not cheap, and because of that, I had very high expectations. To my pleasant surprise, they were more than met. As other reviews have said, husband/wife owners Ken and Susie are the perfect hosts. They really seem to love what they do, which adds to the enjoyment of staying here. Every evening, they host a happy hour in their downstairs pub, generously pouring local wines with accompanying appetizers and telling stories. It's like being invited to a party every day. We stayed there three nights celebrating our 11th wedding anniversary and got to know other guests and Ken and Susie, adding to the party feel. (By the way, we were suprised by a bottle of champagne waiting in our room with anniverary wishes.) Ken and Susie will do everything they can to help you and make your stay enjoyable. They even offer a tutorial about local vineyards, providing coupons and making recommendations. Our room was great. We were there during what was possibly the hottest week in Napa Valley history, and thankfully our room had two air conditioners. Breakfasts were lovely, coffee and tea were always available and there were dishes of chocolate candy everywhere. The home-baked chocolate-chip cookies left in the lobby throughout the day are to die for (I think the best I've ever had) and are reason enough to stay here! Thanks, Ken and Susie, for making our anniversary memorable, romantic and fun despite the uncomfortable weather!",
            "title": "A model for B&Bs",
            "user": "Kaycj"
        },
        {
            "date": "June 20, 2006",
            "detail_rating": {
                "business": null,
                "cleanliness": 5.0,
                "desk": null,
                "location": null,
                "pool": null,
                "restaurant": null,
                "rooms": 5.0,
                "service": 5.0,
                "sleep": null,
                "value": 5.0
            },
            "helpfulness": 7,
            "id": 5363489,
            "likes": {
                "disliked": null,
                "liked": null
            },
            "rating": 5.0,
            "stay_parameters": "Stayed June 2006",
            "text": "Our weekend get-a-way to Napa was planned to be a very special anniversary celebration, so consequently we did some research to locate the perfect B&B and are so pleased we chose the magnificent Cedar Gables Inn!",
            "title": "This place is truly Napa Valley's most enjoyable B&B",
            "user": "Luluslegacy"
        },
        {
            "date": "June 11, 2006",
            "detail_rating": {
                "business": null,
                "cleanliness": null,
                "desk": null,
                "location": null,
                "pool": null,
                "restaurant": null,
                "rooms": null,
                "service": null,
                "sleep": null,
                "value": null
            },
            "helpfulness": 3,
            "id": 5332198,
            "likes": {
                "disliked": null,
                "liked": null
            },
            "rating": 5.0,
            "stay_parameters": null,
            "text": "The location was perfect, just on the fringe of downtown Napa, in a safe neighborhood within walking distance to several great restaurants. Each morning we were greeted by a gourmet breakfast of home baked breads, fresh fruit, juices & coffee along with an outrageous special entr\u00e9e that changed daily. We enjoyed Strawberry French Toast Souffl\u00e9 served alongside the best apple sausage we\u2019ve ever tasted on the first morning. This was not to be outdone by the second morning, a southwestern style strata made with tortillas, country sausage, fresh salsa and rich corn muffins.",
            "title": "We Loved It!",
            "user": "RE_Michael"
        },
        {
            "date": "April 3, 2006",
            "detail_rating": {
                "business": null,
                "cleanliness": 5.0,
                "desk": null,
                "location": null,
                "pool": null,
                "restaurant": null,
                "rooms": 4.0,
                "service": 5.0,
                "sleep": null,
                "value": 5.0
            },
            "helpfulness": 6,
            "id": 4831148,
            "likes": {
                "disliked": null,
                "liked": null
            },
            "rating": 5.0,
            "stay_parameters": "Stayed April 2006",
            "text": "Each evening we mingled with our gracious Innkeepers, Ken & Susie, along with the other guests in the old English style pub over a glass (or two) of wine and nibbles.",
            "title": "Great place - We didn't want to leave!",
            "user": "smakudown"
        },
        {
            "date": "March 14, 2006",
            "detail_rating": {
                "business": null,
                "cleanliness": 5.0,
                "desk": null,
                "location": null,
                "pool": null,
                "restaurant": null,
                "rooms": 5.0,
                "service": 5.0,
                "sleep": null,
                "value": 4.0
            },
            "helpfulness": 7,
            "id": 4615732,
            "likes": {
                "disliked": null,
                "liked": null
            },
            "rating": 5.0,
            "stay_parameters": "Stayed March 2006",
            "text": "Susie arranged our restaurant reservations and Ken helped us plan our winery tour. Their recommendations were spot on, helping to ensure a perfect weekend. An unexpected bonus was all the complementary wine tastings we received when the winery staff would learn that Ken & Susie from Cedar Gables had sent us.",
            "title": "An elegant, romantic Inn",
            "user": "rbbaskets"
        }
    ],
    "slim_ranking": 0.2,
    "stars": 3.5,
    "tripadvisor": {
        "VISITED": false,
        "country_name": null,
        "locality": null,
        "pic_link": null,
        "street_address": null
    },
    "user_rating": 5.0,
    "variance": {
        "average": 1,
        "excellent": 247,
        "poor": 0,
        "terrible": 0,
        "very good": 7
    }
}