{
    "aka": null,
    "description": "A sober and elegant Hotel, located in the most exclusive area near a major business centers, financial and trade. The hotel is known for its peaceful and welcoming environments. For rest and relaxation with a solarium terrace equipped with jacuzzy, hydromassage shower and steam bath. All rates include breakfast buffet and a wireless Internet connection unlimited. The warm service and personalized direct engagement with our guest",
    "detail_rating": {
        "cleanliness": null,
        "location": null,
        "rooms": null,
        "service": null,
        "sleep": null,
        "value": null
    },
    "location": {
        "city": "Medellin",
        "continent": "South America",
        "country": "Colombia",
        "proposed_city": null,
        "province": null,
        "region": null
    },
    "name": "Hotel Porton Medellin",
    "places": {
        "aka": [],
        "hotel_description": [],
        "hotel_name": []
    },
    "review_count": 86,
    "review_count_current": 1,
    "reviews": [
        {
            "date": "May 27, 2005",
            "detail_rating": {
                "business": null,
                "cleanliness": 4.0,
                "desk": null,
                "location": null,
                "pool": null,
                "restaurant": null,
                "rooms": 4.0,
                "service": 5.0,
                "sleep": null,
                "value": 3.0
            },
            "helpfulness": 24,
            "id": 3503675,
            "likes": {
                "disliked": null,
                "liked": null
            },
            "rating": 4.0,
            "stay_parameters": "Stayed May 2005",
            "text": "I recently stayed at the Porton de Medellin. I found this property to be clean, modern, safe and the service was excellent.",
            "title": "Porton De Medellin",
            "user": "ColombiaRiz"
        }
    ],
    "slim_ranking": 0.243902439024,
    "stars": 4,
    "tripadvisor": {
        "VISITED": false,
        "country_name": null,
        "locality": null,
        "pic_link": null,
        "street_address": null
    },
    "user_rating": 4.5,
    "variance": {
        "average": 10,
        "excellent": 49,
        "poor": 2,
        "terrible": 2,
        "very good": 23
    }
}