{
    "aka": "Woehrdersee Mercure Nuernberg City",
    "description": "The 4 star Wohrdersee Mercure Nurnberg City hotel is close to the city centre -1 km-, the main railway station -0.8 km- and the Exhibition centre -4 km-.",
    "detail_rating": {
        "cleanliness": null,
        "location": null,
        "rooms": null,
        "service": null,
        "sleep": null,
        "value": null
    },
    "location": {
        "city": null,
        "continent": "Europe",
        "country": "Germany",
        "proposed_city": null,
        "province": null,
        "region": null
    },
    "name": "Woehrdersee Hotel Mercure Nuernberg City",
    "places": {
        "aka": [],
        "hotel_description": [],
        "hotel_name": []
    },
    "review_count": 248,
    "review_count_current": 15,
    "reviews": [
        {
            "date": "April 22, 2011",
            "detail_rating": {
                "business": null,
                "cleanliness": 5.0,
                "desk": null,
                "location": 4.0,
                "pool": null,
                "restaurant": null,
                "rooms": 4.0,
                "service": 4.0,
                "sleep": 3.0,
                "value": 1.0
            },
            "helpfulness": null,
            "id": 105000735,
            "likes": {
                "disliked": null,
                "liked": null
            },
            "rating": 4.0,
            "stay_parameters": "Stayed March 2011, traveled on business",
            "text": "Stayed at this hotel during a recent exhibition in Nuremberg - the hotel is well located about a 10 min walk from the city centre and railway station and 20-25 mins from the airport and 15 mins from the exhibition centre",
            "title": "Messe Trip",
            "user": "Belflyer1"
        },
        {
            "date": "February 20, 2011",
            "detail_rating": {
                "business": null,
                "cleanliness": 3.0,
                "desk": null,
                "location": 5.0,
                "pool": null,
                "restaurant": null,
                "rooms": 2.0,
                "service": 3.0,
                "sleep": 3.0,
                "value": 2.0
            },
            "helpfulness": null,
            "id": 97323286,
            "likes": {
                "disliked": null,
                "liked": null
            },
            "rating": 3.0,
            "stay_parameters": "Stayed February 2011, traveled on business",
            "text": "I had one of the renovated rooms with modern bathroom facilities, flat screen TV and modern decor - the shower is a glass affair which looks into the room - a little disconcerting if you are sharing the room as your room mate can see you in the shower from the room....OK if you are on your own",
            "title": "it's ok...",
            "user": "Rita113"
        },
        {
            "date": "February 15, 2011",
            "detail_rating": {
                "business": null,
                "cleanliness": 3.0,
                "desk": null,
                "location": 3.0,
                "pool": null,
                "restaurant": null,
                "rooms": 2.0,
                "service": 1.0,
                "sleep": 3.0,
                "value": 1.0
            },
            "helpfulness": null,
            "id": 96697640,
            "likes": {
                "disliked": null,
                "liked": null
            },
            "rating": 3.0,
            "stay_parameters": "Stayed February 2011, traveled on business",
            "text": "The staff were very helpful - from check-in to restaurant staff who help some arab colleagues with the menu in terms of suitability etc",
            "title": "No Value for Money",
            "user": "Neeshalaw"
        },
        {
            "date": "May 30, 2010",
            "detail_rating": {
                "business": null,
                "cleanliness": 5.0,
                "desk": null,
                "location": 5.0,
                "pool": null,
                "restaurant": null,
                "rooms": 5.0,
                "service": 5.0,
                "sleep": 5.0,
                "value": 5.0
            },
            "helpfulness": null,
            "id": 65833227,
            "likes": {
                "disliked": null,
                "liked": null
            },
            "rating": 5.0,
            "stay_parameters": "Stayed May 2010, traveled on business",
            "text": "i boooked via hotel.de roulette for 50 Euro the night including breakfast buffet which was very reasonable. you can walk ftom railway station or go by tram nr. 5 2 stations. daily ticket for 4 euro. buffet was little poor. hotel had very nice new design with glass wall bathroom, flat screen tv, nice colours. also in city center you can walk. nearby is HDI- Office (Insurance). Hot Water Cooker in the room. Very nice staff.",
            "title": "new hotel with nice design, quiet location, near railway station",
            "user": "BrunoldL"
        },
        {
            "date": "December 17, 2008",
            "detail_rating": {
                "business": null,
                "cleanliness": null,
                "desk": null,
                "location": null,
                "pool": null,
                "restaurant": null,
                "rooms": null,
                "service": null,
                "sleep": null,
                "value": null
            },
            "helpfulness": null,
            "id": 22820791,
            "likes": {
                "disliked": null,
                "liked": null
            },
            "rating": 4.0,
            "stay_parameters": null,
            "text": "In 2005, I stayed at this hotel for a total of 75 days for business in Nurnberg. After working hours, we generally just walked 10 minutes to the old city for dinner and browsing. The walk thru Worderweise park was always a good exercise and not too long. The tram to the Haputbahnhoff was easy from the hotel and not too expensize with a weekly open pass. In Dec 2007, I brought my wife for my final trip during the Christkindlesmarkt and the week was very enjoyable for us. Again a simple walk or tram ride to the heart of the event.",
            "title": "Outstanding staff",
            "user": "HerrWeizen"
        },
        {
            "date": "May 17, 2008",
            "detail_rating": {
                "business": 3.0,
                "cleanliness": 3.0,
                "desk": null,
                "front_desk": 3.0,
                "location": 3.0,
                "pool": null,
                "restaurant": null,
                "rooms": 3.0,
                "service": 3.0,
                "sleep": null,
                "value": 3.0
            },
            "helpfulness": null,
            "id": 16131862,
            "likes": {
                "disliked": null,
                "liked": null
            },
            "rating": 3.0,
            "stay_parameters": "Stayed October 2007",
            "text": "But what really set this hotel off from others was the staff. They were very down to earth and accomodating. And very professional. They are well trained and do a great job. Kaled in the bar and dinning area will do anything you ask to make you stay pleasant.",
            "title": "Standard 4* Hotel",
            "user": "oscarMadrid"
        },
        {
            "date": "October 9, 2007",
            "detail_rating": {
                "business": null,
                "cleanliness": null,
                "desk": null,
                "location": null,
                "pool": null,
                "restaurant": null,
                "rooms": null,
                "service": null,
                "sleep": null,
                "value": null
            },
            "helpfulness": 4,
            "id": 10061392,
            "likes": {
                "disliked": null,
                "liked": null
            },
            "rating": 1.0,
            "stay_parameters": null,
            "text": "Althought from the exterior look a bit old hotel the interior is very modern. the bedrooms are new and fashionable. The bathroom is literally in suite, since the shower is in the middle of the bedroom, only separated from the bed by a transparent glass wall, that could be a bit of a problem if you travel with someone who you don\u00b4t have enough confidence with.",
            "title": "Cancellation Refund",
            "user": "Sedina"
        },
        {
            "date": "June 26, 2007",
            "detail_rating": {
                "business": 4.0,
                "cleanliness": 5.0,
                "desk": null,
                "front_desk": 4.0,
                "location": 3.0,
                "pool": null,
                "restaurant": null,
                "rooms": 4.0,
                "service": 3.0,
                "sleep": null,
                "value": 3.0
            },
            "helpfulness": 1,
            "id": 7998205,
            "likes": {
                "disliked": "\u2014 The spider problem on the outside of the building",
                "liked": "\u2014 Free internet and secure bag check-in when our room was not ready"
            },
            "rating": 3.0,
            "stay_parameters": "Stayed June 2007, traveled with family",
            "text": "The hotel is 15 minutes walking from the historical center of the city",
            "title": "Decent hotel close the main train station",
            "user": "erin464"
        },
        {
            "date": "January 6, 2011",
            "detail_rating": {
                "business": null,
                "cleanliness": 3.0,
                "desk": null,
                "location": 2.0,
                "pool": null,
                "restaurant": null,
                "rooms": 2.0,
                "service": 3.0,
                "sleep": 2.0,
                "value": 3.0
            },
            "helpfulness": null,
            "id": 92022382,
            "likes": {
                "disliked": null,
                "liked": null
            },
            "rating": 3.0,
            "stay_parameters": "Stayed August 2010, traveled with family",
            "text": "City hotel, funny rooms with shower placed in the middle of the room, see through, good idea only for single travellers as you have to see the other person showering, cramped feeling, roll-away-bed was terrible, only part of the hotel was renovated, make sure you get newly renovated rooms, otherwise too expensive for the qualtiy, only one elevator working for 5 stories, breakfast good, restaurant also good, parking in garage cramped too,",
            "title": "Value if assigned the renovated rooms",
            "user": "travellover122"
        },
        {
            "date": "December 12, 2010",
            "detail_rating": {
                "business": null,
                "cleanliness": 4.0,
                "desk": null,
                "location": 4.0,
                "pool": null,
                "restaurant": null,
                "rooms": 4.0,
                "service": 4.0,
                "sleep": 5.0,
                "value": 5.0
            },
            "helpfulness": 1,
            "id": 89657326,
            "likes": {
                "disliked": null,
                "liked": null
            },
            "rating": 5.0,
            "stay_parameters": "Stayed December 2010, traveled with family",
            "text": "Pleasantly surprised by this hotel. Clean, comfortable with amazing buffet breakfast (I'm not aware of many 4 start hotels that have a chef at breakfast too cook waffles, crepes and other hot food). Excellent value for Christmas Market time. My only criticism would be that it's not centrally located. However, it's minutes away from an S-bahn station and bus and tram stops for the centre, so this is not too big a problem. Would happily stay here again.",
            "title": "Comfortable With Excellent Breakfast",
            "user": "ankomonkey"
        },
        {
            "date": "January 6, 2012",
            "detail_rating": {
                "business": null,
                "cleanliness": 5.0,
                "desk": null,
                "location": 4.0,
                "pool": null,
                "restaurant": null,
                "rooms": 4.0,
                "service": 5.0,
                "sleep": 4.0,
                "value": 4.0
            },
            "helpfulness": 1,
            "id": 122678107,
            "likes": {
                "disliked": null,
                "liked": null
            },
            "rating": 4.0,
            "stay_parameters": "Stayed December 2011, traveled with family",
            "text": "Stayed two nights. Liked the buffet breakfast. Front desk staff was very helpful. Room was functional, comfortable and quiet for sleeping. Windows open!",
            "title": "Close to the centre of town",
            "user": "simpme"
        },
        {
            "date": "January 3, 2012",
            "detail_rating": {
                "business": null,
                "cleanliness": null,
                "desk": null,
                "location": null,
                "pool": null,
                "restaurant": null,
                "rooms": null,
                "service": null,
                "sleep": null,
                "value": null
            },
            "helpfulness": null,
            "id": 122483285,
            "likes": {
                "disliked": null,
                "liked": null
            },
            "rating": 4.0,
            "stay_parameters": null,
            "text": "Well situated; only two stops from the main train station by tram. Tram stops almost a the front door of the hotel. Hotel is an easy walk to the centre of town and therefore close to the Christmas Markets.",
            "title": "Review of Woehrdersee Hotel Mercure Nuernberg City",
            "user": "A TripAdvisor user"
        },
        {
            "date": "January 3, 2012",
            "detail_rating": {
                "business": null,
                "cleanliness": 2.0,
                "desk": null,
                "location": 1.0,
                "pool": null,
                "restaurant": null,
                "rooms": 2.0,
                "service": 3.0,
                "sleep": 2.0,
                "value": 1.0
            },
            "helpfulness": 1,
            "id": 122466820,
            "likes": {
                "disliked": null,
                "liked": null
            },
            "rating": 2.0,
            "stay_parameters": "Stayed December 2011, traveled as a couple",
            "text": "The hotel staff provided a warm welcome and the service was great. The buffet breakfast was superb - a large and excellent variety of food. The main transport hub is only a short ride by tram (which stops near the hotel).",
            "title": "Disappointed, poor value for money",
            "user": "MozReliefWorkers"
        },
        {
            "date": "December 7, 2011",
            "detail_rating": {
                "business": null,
                "cleanliness": null,
                "desk": null,
                "location": null,
                "pool": null,
                "restaurant": null,
                "rooms": null,
                "service": null,
                "sleep": null,
                "value": null
            },
            "helpfulness": null,
            "id": 121497914,
            "likes": {
                "disliked": null,
                "liked": null
            },
            "rating": 5.0,
            "stay_parameters": null,
            "text": "Have stayed at many Mercure hotels world wide, and this was very disappointing. First we were given keys to an uncleaned room. Once they gave us the correct room, we had to ask for extra pillows, then bathrobes, then internet access - all of which were to be included. Flooring wasn't nice, had molded areas. Although the room was to have coffee service, sadly it didn't have a coffee maker but a hot pot with granulated coffee, 2 each decaf and regular. Front desk staff raved that everything in the mini bar was included, that was two bottles of water and soda. Rain shower was a nice touch, but it dripped and was noisy. Sink not user friendly, stainless steel and at such an angle that it splashed you. They say it's 800 m from train station, that is underestimated, it's quite a walk. There was no cafe to get coffee in the day time. Many better lodging options in Nurnberg!",
            "title": "Christmas Market Weekend in Nurnberg",
            "user": "A TripAdvisor user"
        },
        {
            "date": "July 16, 2011",
            "detail_rating": {
                "business": null,
                "cleanliness": null,
                "desk": null,
                "location": null,
                "pool": null,
                "restaurant": null,
                "rooms": null,
                "service": null,
                "sleep": null,
                "value": null
            },
            "helpfulness": 1,
            "id": 115411587,
            "likes": {
                "disliked": null,
                "liked": null
            },
            "rating": 3.0,
            "stay_parameters": null,
            "text": "We had stayed in this hotel years back - before they remodeled. We enjoyed our stay this time, as well, although the room took a little getting used to. The glass shower stall is pretty much in the center of the room and there is no door on the bathroom. It was OK for us, but wouldn't suit a person/couple who are used to privacy in the bathroom. Hotel location isn't exactly downtown, but we didn't mnd the walk plus the tram stop is just outside the front door. The breakfast was OUTSTANDING - one of the best/nicest hotel breakfasts we've had in Europe. And, last but not least, the staff was great - helpful and friendly. We'd stay there again.",
            "title": "First Time Stay",
            "user": "A TripAdvisor user"
        }
    ],
    "slim_ranking": 0.354330708661,
    "stars": 4,
    "tripadvisor": {
        "VISITED": false,
        "country_name": null,
        "locality": null,
        "pic_link": null,
        "street_address": null
    },
    "user_rating": 3.5,
    "variance": {
        "average": 78,
        "excellent": 53,
        "poor": 17,
        "terrible": 3,
        "very good": 97
    }
}