{
    "aka": "Es Saadi Marrakech",
    "description": "An historical institution which opened its door in 1966. Fully renovated in 2005, this 5 star hotel mixes a unique nostalgic style with the latest hi-tech amenities. Top-level services are overseen by a \u201cgolden keys\u201d Chief Concierge. Full access to all resort activities: Bars and Restaurants, Spas, Morrocan Diner-Show, Casino de Marrakech, Night Clubbing.Located in the heart of Marrakech, in the \u201cHivernage\u201d residential area, and surrounded by 20 acres of beautiful gardens.",
    "detail_rating": {
        "cleanliness": null,
        "location": null,
        "rooms": null,
        "service": null,
        "sleep": null,
        "value": null
    },
    "location": {
        "city": "Marrakech",
        "continent": "Africa",
        "country": "Morocco",
        "proposed_city": null,
        "province": null,
        "region": "Marrakech-Tensift-El Haouz Region"
    },
    "name": "Es Saadi Gardens & Resort - Hotel",
    "places": {
        "aka": [],
        "hotel_description": [],
        "hotel_name": []
    },
    "review_count": 378,
    "review_count_current": 5,
    "reviews": [
        {
            "date": "August 29, 2007",
            "detail_rating": {
                "business": 4.0,
                "cleanliness": 5.0,
                "desk": null,
                "front_desk": 5.0,
                "location": 5.0,
                "pool": null,
                "restaurant": null,
                "rooms": 5.0,
                "service": 5.0,
                "sleep": null,
                "value": null
            },
            "helpfulness": 1,
            "id": 8536492,
            "likes": {
                "disliked": "\u2014 Sun loungers are packed in a bit too close round the pool.",
                "liked": "\u2014 The peaceful location whilst still being close to the livelier areas."
            },
            "rating": 5.0,
            "stay_parameters": "Stayed August 2007, traveled with friends",
            "text": "This hotel is great. You are about 15-20 mins walk from the main square and souks so close enough to the main attractions, but set in very peaceful gardens in the modern area of Hivernage. The staff are friendly, very helpful and speak a variety of languages very well. We found the concierge to be particularly helpful and he even spoke to the tour company (who couldn't speak English) for us and was great at getting taxis for us at decent prices. Everywhere is spotlessly clean and a welcome quiet calm away from the famous hustle and bustle of the markets etc. The included breakfast was delicious with plenty of fresh fruit and hot and cold buffet available. Also recommend the Spa as the treatments were great and also of a reasonable price for the standard. We had a great relaxing break thanks to the hotel and definitely made the most of our time in Marrakech by being close enough to the busier areas of the city.",
            "title": "Great hotel for location and staff",
            "user": "FayeW"
        },
        {
            "date": "August 6, 2007",
            "detail_rating": {
                "business": null,
                "cleanliness": 5.0,
                "desk": null,
                "front_desk": 5.0,
                "location": 5.0,
                "pool": null,
                "restaurant": null,
                "rooms": 5.0,
                "service": 5.0,
                "sleep": null,
                "value": 5.0
            },
            "helpfulness": 1,
            "id": 8361717,
            "likes": {
                "disliked": "\u2014 Can't think of anything!",
                "liked": "\u2014 Pool area"
            },
            "rating": 5.0,
            "stay_parameters": "Stayed July 2007, traveled as a couple",
            "text": "We've just returned from a 6 night stay at the Es Saadi Hotel in Marrakech and agree completely with Mike from Warrington. We didn't get the complimentary fruit and delicasies but everything else he wrote was certainly true for us.",
            "title": "Lovely Es Saadi",
            "user": "janwatty"
        },
        {
            "date": "July 31, 2007",
            "detail_rating": {
                "business": 4.0,
                "cleanliness": 5.0,
                "desk": null,
                "front_desk": 5.0,
                "location": 4.0,
                "pool": null,
                "restaurant": null,
                "rooms": 4.0,
                "service": 5.0,
                "sleep": null,
                "value": 5.0
            },
            "helpfulness": 2,
            "id": 8264679,
            "likes": {
                "disliked": "\u2014 N/A",
                "liked": "\u2014 Style, classy, clean"
            },
            "rating": 5.0,
            "stay_parameters": "Stayed July 2007",
            "text": "It is a lovely hotel, full of character and charm. The service was excellent and we really did feel as though we were valued guests.",
            "title": "What a relief !",
            "user": "Mike19Golf"
        },
        {
            "date": "June 27, 2007",
            "detail_rating": {
                "business": null,
                "cleanliness": 5.0,
                "desk": null,
                "front_desk": 5.0,
                "location": 5.0,
                "pool": null,
                "restaurant": null,
                "rooms": 5.0,
                "service": 5.0,
                "sleep": null,
                "value": 5.0
            },
            "helpfulness": null,
            "id": 8006880,
            "likes": {
                "disliked": "\u2014 nothing",
                "liked": "\u2014 Luxury"
            },
            "rating": 5.0,
            "stay_parameters": "Stayed June 2007, traveled as a couple",
            "text": "I would certainly recommend it.",
            "title": "Fantastic stay in 1001 nights villa",
            "user": "EMCLC"
        },
        {
            "date": "June 5, 2007",
            "detail_rating": {
                "business": null,
                "cleanliness": 5.0,
                "desk": null,
                "front_desk": 5.0,
                "location": 5.0,
                "pool": null,
                "restaurant": null,
                "rooms": 5.0,
                "service": 5.0,
                "sleep": null,
                "value": 5.0
            },
            "helpfulness": 1,
            "id": 7772494,
            "likes": {
                "disliked": null,
                "liked": "\u2014 Everything was clean and inviting. The rooms were relatively spacious and we were lucky to have a room overlooking the extremely attractive pool"
            },
            "rating": 5.0,
            "stay_parameters": "Stayed May 2007",
            "text": "What a relief it was to arrive at the Es Saadi. I was uneasy travelling to the hotel because I booked it before seeing the conflicting reviews on Trip Advisor! If I had read these prior to booking I probably wouldn't have done so and would have missed out on a fantastic holiday. The hotel is truly a 5 star in every way and we are not old 'fuddy duddys' (40's) so don't believe a word about the clientele being old. Average age of people there was around 30-40 - a few children but not many.",
            "title": "Fantastic location",
            "user": "Jacaranda99"
        }
    ],
    "slim_ranking": 0.63436123348,
    "stars": 5,
    "tripadvisor": {
        "VISITED": false,
        "country_name": null,
        "locality": null,
        "pic_link": null,
        "street_address": null
    },
    "user_rating": 3.5,
    "variance": {
        "average": 71,
        "excellent": 108,
        "poor": 48,
        "terrible": 27,
        "very good": 124
    }
}