{
    "aka": "Windsor Asturias Hotel Rio De Janeiro, Brazil",
    "description": null,
    "detail_rating": {
        "cleanliness": null,
        "location": null,
        "rooms": null,
        "service": null,
        "sleep": null,
        "value": null
    },
    "location": {
        "city": "Rio de Janeiro",
        "continent": "South America",
        "country": "Brazil",
        "proposed_city": "Windsor",
        "province": null,
        "region": null
    },
    "name": "Windsor Asturias Hotel",
    "places": {
        "aka": [
            "Windsor"
        ],
        "hotel_description": [],
        "hotel_name": [
            "Windsor"
        ]
    },
    "review_count": 246,
    "review_count_current": 28,
    "reviews": [
        {
            "date": "April 8, 2012",
            "detail_rating": {
                "business": null,
                "cleanliness": 5.0,
                "desk": null,
                "location": 4.0,
                "pool": null,
                "restaurant": null,
                "rooms": 3.0,
                "service": 5.0,
                "sleep": 4.0,
                "value": 2.0
            },
            "helpfulness": 2,
            "id": 127469132,
            "likes": {
                "disliked": null,
                "liked": null
            },
            "rating": 3.0,
            "stay_parameters": "Stayed March 2012, traveled with friends",
            "text": "Thought the price of the room was a little high for what was offered. The rooftop view was nice, but the workout center was small and unappealing. The room was clean, but nothing too exciting. Location to Lapa is the best part and its nightlife close within walking distance. Helpful staff and speaks English. Breakfast buffet simple. You'll have to take approximately a R25 cab ride to get to Ipanema beach. WiFi is an extra charge.",
            "title": "Location to Lapa ideal",
            "user": "amitdds"
        },
        {
            "date": "March 22, 2012",
            "detail_rating": {
                "business": null,
                "cleanliness": 5.0,
                "desk": null,
                "location": 5.0,
                "pool": null,
                "restaurant": null,
                "rooms": 5.0,
                "service": 5.0,
                "sleep": null,
                "value": 4.0
            },
            "helpfulness": null,
            "id": 126491053,
            "likes": {
                "disliked": null,
                "liked": null
            },
            "rating": 5.0,
            "stay_parameters": "Stayed March 2012",
            "text": "Great room, service, rooftop pool and bar with views, security. Good location with easy metro/bus access to everything if you are ok with being away from beaches. Decent breakfast.",
            "title": "Perfect if ok with not being at beach",
            "user": "MarinaRon"
        },
        {
            "date": "March 18, 2012",
            "detail_rating": {
                "business": null,
                "cleanliness": 4.0,
                "desk": null,
                "location": 5.0,
                "pool": null,
                "restaurant": null,
                "rooms": 4.0,
                "service": 4.0,
                "sleep": 4.0,
                "value": 5.0
            },
            "helpfulness": 2,
            "id": 126302315,
            "likes": {
                "disliked": null,
                "liked": null
            },
            "rating": 5.0,
            "stay_parameters": "Stayed February 2012, traveled as a couple",
            "text": "We stayed here only a couple of months ago, and found the hotel to be good value for the money. We came back for Carnival 2012 and chose this hotel for its central location. This proved to be a very good choice, as Centro and Cinelandia are party central for Carnival. Massive gatherings happen just around the corner from the hotel - either in the square in front of the Teatro Municipal or a block away in the shadows of the Arcos de Lapa. Loud music, cold beer and street stalls serving all kinds of food make for a very festive atmosphere. The hotel provides armbands as an added security measure indicating that you are in fact guests of the hotel. The sambadrome is only a short Metro ride away for whichever night you choose to attend the incredible \"desfiles das escolas de samba\". The rooftop bar and swimming pool are a great place to relax in the afternoon while preparing for another evening of celebration in the cidade maravilhosa. And bartender Leandro does make the finest caipirinhas. Through it all the hotel remains cool, comfortable, quiet and a safe oasis from the noise on the street outside.",
            "title": "A good hotel when in Rio for Carnival",
            "user": "ajaceman"
        },
        {
            "date": "February 23, 2012",
            "detail_rating": {
                "business": null,
                "cleanliness": 5.0,
                "desk": null,
                "location": 4.0,
                "pool": null,
                "restaurant": null,
                "rooms": 5.0,
                "service": 5.0,
                "sleep": null,
                "value": 5.0
            },
            "helpfulness": 2,
            "id": 125103675,
            "likes": {
                "disliked": null,
                "liked": null
            },
            "rating": 5.0,
            "stay_parameters": "Stayed February 2012",
            "text": "Great location for carnivale if you like to party (near where many of the parties are but with good sound insulation) and the desk staff speak good English and are very helpful.",
            "title": "I have no idea why this place was 2 star - it was fantastic!",
            "user": "schnark"
        },
        {
            "date": "February 16, 2012",
            "detail_rating": {
                "business": null,
                "cleanliness": 5.0,
                "desk": null,
                "location": 4.0,
                "pool": null,
                "restaurant": null,
                "rooms": 4.0,
                "service": 5.0,
                "sleep": 5.0,
                "value": 5.0
            },
            "helpfulness": null,
            "id": 124674635,
            "likes": {
                "disliked": null,
                "liked": null
            },
            "rating": 5.0,
            "stay_parameters": "Stayed July 2011, traveled with friends",
            "text": "Can't recommend this hotel enough - and can't understand why it's so cheap. The rooms were clean, spacious and comfortable. Other facilities were fine - breakfast was fine but it's south America - so if you expect much more than cheese and meat, you're on the wrong continent however there was still bacon, cereal and eggs.",
            "title": "Great place for a short stay in Rio",
            "user": "BYUDad"
        },
        {
            "date": "June 24, 2012",
            "detail_rating": {
                "business": null,
                "cleanliness": 4.0,
                "desk": null,
                "location": 4.0,
                "pool": null,
                "restaurant": null,
                "rooms": 3.0,
                "service": 4.0,
                "sleep": 4.0,
                "value": 3.0
            },
            "helpfulness": null,
            "id": 132668930,
            "likes": {
                "disliked": null,
                "liked": null
            },
            "rating": 4.0,
            "stay_parameters": "Stayed June 2012, traveled as a couple",
            "text": "Stayed here on the first night of our trip in Brasil. The hotel is centrally located in an area that felt quite safe at night. It's very near the theatre area and has some nice bars nearby.",
            "title": "Business like hotel in a central area",
            "user": "Bilbodotcom"
        },
        {
            "date": "May 20, 2012",
            "detail_rating": {
                "business": null,
                "cleanliness": 5.0,
                "desk": null,
                "location": 4.0,
                "pool": null,
                "restaurant": null,
                "rooms": 5.0,
                "service": 5.0,
                "sleep": 4.0,
                "value": 4.0
            },
            "helpfulness": null,
            "id": 130301065,
            "likes": {
                "disliked": null,
                "liked": null
            },
            "rating": 4.0,
            "stay_parameters": "Stayed March 2012, traveled as a couple",
            "text": "Recption staff were very friendly and helpful. Room was clean and a decent size, and the rooftop pool had a great view over Rio.",
            "title": "I liked the hotel!",
            "user": "VVanderGirl"
        },
        {
            "date": "May 12, 2012",
            "detail_rating": {
                "business": null,
                "cleanliness": 5.0,
                "desk": null,
                "location": 4.0,
                "pool": null,
                "restaurant": null,
                "rooms": 3.0,
                "service": 3.0,
                "sleep": 4.0,
                "value": 3.0
            },
            "helpfulness": 2,
            "id": 129814357,
            "likes": {
                "disliked": null,
                "liked": null
            },
            "rating": 3.0,
            "stay_parameters": "Stayed April 2012, traveled with friends",
            "text": "Lapa (for bars and restaurants) is a 15 minute walk away but wouldn't recommend at night or alone.",
            "title": "Boring but pleasant, clean and convenient",
            "user": "ELHC"
        },
        {
            "date": "January 22, 2012",
            "detail_rating": {
                "business": null,
                "cleanliness": 5.0,
                "desk": null,
                "location": 5.0,
                "pool": null,
                "restaurant": null,
                "rooms": 5.0,
                "service": 4.0,
                "sleep": 5.0,
                "value": 4.0
            },
            "helpfulness": 1,
            "id": 123465690,
            "likes": {
                "disliked": null,
                "liked": null
            },
            "rating": 4.0,
            "stay_parameters": "Stayed May 2011, traveled with family",
            "text": "My mother and I stayed in this hotel for 2 nights. We arrived early in the morning by an air france flight from Paris and the room wasn't ready for us. We went to beaches and came back around noon and were informed that the room was ready for us. The room was well decorated and comfortable. It's not big bit not to small. The view from the room is rather limited as it is blocked by other tall buildings in downtown Rio. The bathroom is fairly spacious. The hotel is very clean. The rooftop is small. I went to see the swimming pool, which is very small and there's a sauna next to it. I didn't use either the pool nor the sauna. From the top, you can see the Corcovado as well as the Sugar Loaf. We didn't take the tram to Santa Teresa though the station is within a walking distance from the hotel. The breakfast at the hotel was very good. Staffs are friendly. This is my second time in Rio and I am glad that I chose this hotel.",
            "title": "A decent hotel in centro of Rio",
            "user": "Banlue"
        },
        {
            "date": "December 17, 2011",
            "detail_rating": {
                "business": null,
                "cleanliness": 5.0,
                "desk": null,
                "location": 4.0,
                "pool": null,
                "restaurant": null,
                "rooms": 3.0,
                "service": 4.0,
                "sleep": null,
                "value": 4.0
            },
            "helpfulness": 3,
            "id": 121820548,
            "likes": {
                "disliked": null,
                "liked": null
            },
            "rating": 3.0,
            "stay_parameters": "Stayed December 2011",
            "text": "I stay 5d at this hotel, I had a good experience there, clean room, good breakfast, good rate for exchange. I just want to comment about noise level at the rooms, you can hear everything even the elevator engine and the shower of the others, I remembered a travel in a military submarine. The other fact is the expensive internet service, it must be free as the 99% of other hotels that I have hosted. Location is fine because Cinelandia metro station near.",
            "title": "Yellow submarine",
            "user": "mmaannuueell"
        },
        {
            "date": "December 15, 2011",
            "detail_rating": {
                "business": null,
                "cleanliness": 5.0,
                "desk": null,
                "location": 4.0,
                "pool": null,
                "restaurant": null,
                "rooms": 5.0,
                "service": 5.0,
                "sleep": 4.0,
                "value": 4.0
            },
            "helpfulness": 2,
            "id": 121784582,
            "likes": {
                "disliked": null,
                "liked": null
            },
            "rating": 5.0,
            "stay_parameters": "Stayed November 2011, traveled as a couple",
            "text": "The Asturias is one of ten Windsor hotels in Rio, including three in centro, six in Copacabana, and one in Barra da Tijuca. This moderately priced hotel is in Cinelandia. It is very close to a Metro station, only one block from the financial heart of Rio in Avenida Rio Branco and but a short walk or cab ride from Santos Dumont airport. Rooms are clean, comfortable and nicely appointed. The wrap around rooftop terrace has a small swimming pool, gym, and bar for those afternoons when you don't feel up to fighting the crowds on Ipanema Beach. Enjoy fine vistas of Santa Teresa, the Arcos de Lapa and Flamengo Park. Staff are attentive and helpful, and may allow late checkout and baggage storage if you are catching a night flight home. Cafe de manha is excellent with service by white dinner jacketed/black bow tied waiters The downtown location of this 22 storey, 166 room hotel means the early morning roar of an awakening Rio de Janeiro will seep in through your windows. No matter. It's time to get up and on with another day in the cidade maravilhoso.",
            "title": "Centrally located in Cinelandia",
            "user": "ajaceman"
        },
        {
            "date": "November 7, 2011",
            "detail_rating": {
                "business": null,
                "cleanliness": 4.0,
                "desk": null,
                "location": 2.0,
                "pool": null,
                "restaurant": null,
                "rooms": 3.0,
                "service": 3.0,
                "sleep": 4.0,
                "value": 4.0
            },
            "helpfulness": 2,
            "id": 120293539,
            "likes": {
                "disliked": null,
                "liked": null
            },
            "rating": 3.0,
            "stay_parameters": "Stayed October 2011, traveled as a couple",
            "text": "We did not realize that, when travelling to Rio, Rock in Rio was going on, which explained the lack of available hotels. The Windsor Asturias was one of the very few, and, therefore, we decided to stay here. My impressions are as follows:",
            "title": "Good hotel in a grungy area",
            "user": "CanarioViajero"
        },
        {
            "date": "October 22, 2011",
            "detail_rating": {
                "business": null,
                "cleanliness": 4.0,
                "desk": null,
                "location": 4.0,
                "pool": null,
                "restaurant": null,
                "rooms": 4.0,
                "service": 4.0,
                "sleep": 4.0,
                "value": 3.0
            },
            "helpfulness": 1,
            "id": 119578916,
            "likes": {
                "disliked": null,
                "liked": null
            },
            "rating": 4.0,
            "stay_parameters": "Stayed September 2011, traveled with family",
            "text": "(a) location: only good if you have to do business downtown. We arrived on a Saturday evening, and we decided not to leave the hotel that night because the area is really dangerous on weekends and in the evenings (we had both things at the same time!). However, it is great if you want to visit some of the \"historical\" sites, and Lapa and the Bairro de Santa Teresa are just around the corner, and there is a conveniente metro station just around the corner, which goes directly to Copacabana and Ipanema;",
            "title": "New and well located",
            "user": "MarcioLS"
        },
        {
            "date": "October 26, 2012",
            "detail_rating": {
                "business": null,
                "cleanliness": 5.0,
                "desk": null,
                "location": 4.0,
                "pool": null,
                "restaurant": null,
                "rooms": 3.0,
                "service": 4.0,
                "sleep": 5.0,
                "value": 4.0
            },
            "helpfulness": 1,
            "id": 143775906,
            "likes": {
                "disliked": null,
                "liked": null
            },
            "rating": 4.0,
            "stay_parameters": "Stayed October 2012, traveled on business",
            "text": "Stayed one night only on a flight stopover. Seemed nearest reasonable hotel to the GIG airport. R$80 and 35 minutes from the airport in RadioTaxi. 'Superior' double room was very good but basic, 18th floor, no noise issues. Good bathroom, big shower. Room, like the hotel, was quiet, clean, bland, a bit austere: basically a good business hotel. Very pleasant roof terrace and bar with city view including Cristo and Lapa arches: excellent when illuminated at night, not so impressive view of roofs in daylight. Drinks on the terrace slightly spoilt by cooking smells presumably from kitchen exhausts. Tiny pool. Good breakfast with plenty of selection. Reception staff very helpful - booked a car (nice car, not a taxi) to the airport for 7 am next day: R$60 and 20 minutes.",
            "title": "Basically all good",
            "user": "salmoneater"
        },
        {
            "date": "October 10, 2012",
            "detail_rating": {
                "business": null,
                "cleanliness": 4.0,
                "desk": null,
                "location": 4.0,
                "pool": null,
                "restaurant": null,
                "rooms": 4.0,
                "service": 4.0,
                "sleep": 4.0,
                "value": 4.0
            },
            "helpfulness": null,
            "id": 142525174,
            "likes": {
                "disliked": null,
                "liked": null
            },
            "rating": 4.0,
            "stay_parameters": "Stayed September 2012, traveled as a couple",
            "text": "Excellent place to stay: good staff, good breakfast, good transports links. The hotel is walking distance from Lapa, so is ideal for those that live the night. Also, lots of restaurants nearby much cheaper and with much more genuine flavour of Brazilian food than in \u201czona sul\u201d.",
            "title": "Great for night life!",
            "user": "Cecilia B"
        },
        {
            "date": "September 23, 2012",
            "detail_rating": {
                "business": null,
                "cleanliness": 4.0,
                "desk": null,
                "location": 4.0,
                "pool": null,
                "restaurant": null,
                "rooms": 4.0,
                "service": 5.0,
                "sleep": 4.0,
                "value": 5.0
            },
            "helpfulness": 1,
            "id": 141052026,
            "likes": {
                "disliked": null,
                "liked": null
            },
            "rating": 5.0,
            "stay_parameters": "Stayed September 2012, traveled on business",
            "text": "Pool and great view over the city on top floor.",
            "title": "Excellent cost/benefit",
            "user": "AleTravelBR"
        },
        {
            "date": "September 21, 2012",
            "detail_rating": {
                "business": null,
                "cleanliness": 3.0,
                "desk": null,
                "location": 2.0,
                "pool": null,
                "restaurant": null,
                "rooms": 2.0,
                "service": 4.0,
                "sleep": 3.0,
                "value": 3.0
            },
            "helpfulness": null,
            "id": 140858008,
            "likes": {
                "disliked": null,
                "liked": null
            },
            "rating": 3.0,
            "stay_parameters": "Stayed August 2012, traveled as a couple",
            "text": ".",
            "title": "3 Star Hotel with 4/5 Star Staff",
            "user": "Sanjay P"
        },
        {
            "date": "September 11, 2012",
            "detail_rating": {
                "business": null,
                "cleanliness": 4.0,
                "desk": null,
                "location": 4.0,
                "pool": null,
                "restaurant": null,
                "rooms": 4.0,
                "service": 5.0,
                "sleep": 4.0,
                "value": 3.0
            },
            "helpfulness": 2,
            "id": 140037961,
            "likes": {
                "disliked": null,
                "liked": null
            },
            "rating": 4.0,
            "stay_parameters": "Stayed September 2012, traveled on business",
            "text": "Although at first this hotel appears do be just \"ok in a bad location\", turns out that this is a very good one in a surprisingly good location. See comments below:",
            "title": "Great business hotel in Rio",
            "user": "gfp76"
        },
        {
            "date": "August 11, 2012",
            "detail_rating": {
                "business": null,
                "cleanliness": 5.0,
                "desk": null,
                "location": 5.0,
                "pool": null,
                "restaurant": null,
                "rooms": 4.0,
                "service": 5.0,
                "sleep": 4.0,
                "value": 5.0
            },
            "helpfulness": 1,
            "id": 136865439,
            "likes": {
                "disliked": null,
                "liked": null
            },
            "rating": 5.0,
            "stay_parameters": "Stayed August 2012, traveled on business",
            "text": "I was very happy with my stay at the Windsor Asturias Hotel. I was in Rio for a week for business in Centro and it was perfect for what I needed. The location within a few steps of the Cinelandia Metro stop and ear shot of the party at Lapa was perfect for me. The area felt safe at all hours of the day and night. The bar, pool, and view from the top floor of the city and Cristo Redentor was impressive. Breakfast was OK, not great, but decent. The fitness room was spartan, small, and stuffy but suited my needs. My room was not overly luxurious but was clean, comfortable, and functional. I do recommend asking for a room on the highest floor possible away from the lifts (I brought earplugs and got great sleep). The staff was very friendly and helpful. I was able to book my room for a low price relative to other hotels in Rio. Overall, my week in Rio was absolutely fantastic and my experience at the Windsor Asturias was a big part of that. I would not hesitate to stay here again, although if in Rio only for leisure and having stayed in Centro already, I might look for a hotel closer to the beaches first (likely another Windsor property).",
            "title": "Excellent for what and where it is...",
            "user": "pktrain"
        },
        {
            "date": "July 31, 2012",
            "detail_rating": {
                "business": null,
                "cleanliness": 3.0,
                "desk": null,
                "location": 4.0,
                "pool": null,
                "restaurant": null,
                "rooms": 3.0,
                "service": 3.0,
                "sleep": 2.0,
                "value": 3.0
            },
            "helpfulness": null,
            "id": 135877242,
            "likes": {
                "disliked": null,
                "liked": null
            },
            "rating": 3.0,
            "stay_parameters": "Stayed July 2012, traveled on business",
            "text": "Location + In Centro close to Cinelandia Metro and Lapa",
            "title": "Average",
            "user": "Zippyboarder"
        },
        {
            "date": "July 23, 2012",
            "detail_rating": {
                "business": null,
                "cleanliness": 4.0,
                "desk": null,
                "location": 4.0,
                "pool": null,
                "restaurant": null,
                "rooms": 3.0,
                "service": 5.0,
                "sleep": 4.0,
                "value": 4.0
            },
            "helpfulness": 2,
            "id": 135200874,
            "likes": {
                "disliked": null,
                "liked": null
            },
            "rating": 4.0,
            "stay_parameters": "Stayed July 2012, traveled on business",
            "text": "Room OK",
            "title": "very good....would return",
            "user": "rgw54"
        },
        {
            "date": "July 21, 2012",
            "detail_rating": {
                "business": null,
                "cleanliness": 3.0,
                "desk": null,
                "location": 2.0,
                "pool": null,
                "restaurant": null,
                "rooms": 3.0,
                "service": 5.0,
                "sleep": 2.0,
                "value": 3.0
            },
            "helpfulness": 1,
            "id": 135004211,
            "likes": {
                "disliked": null,
                "liked": null
            },
            "rating": 3.0,
            "stay_parameters": "Stayed July 2012, traveled on business",
            "text": "Service OK",
            "title": "Totally average",
            "user": "JeffStranks"
        },
        {
            "date": "July 16, 2012",
            "detail_rating": {
                "business": null,
                "cleanliness": 3.0,
                "desk": null,
                "location": 3.0,
                "pool": null,
                "restaurant": null,
                "rooms": 3.0,
                "service": 3.0,
                "sleep": 2.0,
                "value": 3.0
            },
            "helpfulness": 2,
            "id": 134483910,
            "likes": {
                "disliked": null,
                "liked": null
            },
            "rating": 3.0,
            "stay_parameters": "Stayed June 2012, traveled as a couple",
            "text": "Breakfast OK",
            "title": "Meets all your requirements",
            "user": "TerryBogard99"
        },
        {
            "date": "October 3, 2011",
            "detail_rating": {
                "business": null,
                "cleanliness": 4.0,
                "desk": null,
                "location": 3.0,
                "pool": null,
                "restaurant": null,
                "rooms": 3.0,
                "service": 5.0,
                "sleep": 4.0,
                "value": 5.0
            },
            "helpfulness": 3,
            "id": 118883677,
            "likes": {
                "disliked": null,
                "liked": null
            },
            "rating": 4.0,
            "stay_parameters": "Stayed September 2011, traveled on business",
            "text": "The Windsor Asturias is in the Centro district (Cinelandia), a bit away from the beaches and general tourist crowd. What I really liked about this hotel is the friendly and professional service - it was not a problem to check in at 10am (after an overnight flight), and staff were very helpful. Great value too: only \u20ac108 per night, including breakfast (through Expedia). Other pros: it is clean and quiet. I had an 'executive' room with Jacuzzi as the other rooms were sold out.The rooms are rather sparsely furnished, small conveniences like a reading light or comfy chair would have been nice. The rooms come with a good safe, minibar (good prices), and WIFI is available, but quite expensive and slow. The hotel is in a fairly safe part of town, but is right next door to the (in)famous Lapa district where you can spend the whole night enjoying the crowds, food, music and drinks. Hotel is also only one street away from the Subway. The view from the roof top bar and terrace is great, but unfortunately the bar wasn't staffed at any of the nights I went up there.",
            "title": "Professional, safe and clean",
            "user": "Peanut-NL"
        },
        {
            "date": "August 12, 2011",
            "detail_rating": {
                "business": null,
                "cleanliness": 4.0,
                "desk": null,
                "location": null,
                "pool": null,
                "restaurant": null,
                "rooms": null,
                "service": 4.0,
                "sleep": 2.0,
                "value": 2.0
            },
            "helpfulness": 3,
            "id": 116620121,
            "likes": {
                "disliked": null,
                "liked": null
            },
            "rating": 3.0,
            "stay_parameters": "Stayed July 2011, traveled on business",
            "text": "Recently returned from business trip where stayed at this property. For my meetings...quite convenient, as was walking distance. However, being in Centro almost everything shuts down at end of business day so options for outside food and drink are limited. Breakfast buffet is of good value, but lunch and dinner prices are a bit steep given location, atmosphere and quality. Cost for internet seemed a bit out of touch for today's hotels - although may have been average for area. Room was smallish and sparse but comfortable. Elevators were spastic in that they like to stop on random floors. NO IRONING kit in room (fail) so any pressing needs to be sent out at quite an expense. Staff was very courteous and helpful. Rooftop bar/pool offers amazing views of city and mountains - hint...go up at sunset. TV offering was good. Windows open (nice).",
            "title": "Good for business...out of loop for sightseeing",
            "user": "PeterJMDC"
        },
        {
            "date": "July 28, 2011",
            "detail_rating": {
                "business": null,
                "cleanliness": 5.0,
                "desk": null,
                "location": null,
                "pool": null,
                "restaurant": null,
                "rooms": null,
                "service": 5.0,
                "sleep": 5.0,
                "value": 5.0
            },
            "helpfulness": 2,
            "id": 115915080,
            "likes": {
                "disliked": null,
                "liked": null
            },
            "rating": 5.0,
            "stay_parameters": "Stayed July 2011, traveled solo",
            "text": "Taxis to the beaches will run about $20-30 each way, depending on time and traffic.",
            "title": "Great Value",
            "user": "swiftcreek30"
        },
        {
            "date": "July 25, 2011",
            "detail_rating": {
                "business": null,
                "cleanliness": 3.0,
                "desk": null,
                "location": null,
                "pool": null,
                "restaurant": null,
                "rooms": null,
                "service": 4.0,
                "sleep": 3.0,
                "value": 3.0
            },
            "helpfulness": 1,
            "id": 115771455,
            "likes": {
                "disliked": null,
                "liked": null
            },
            "rating": 3.0,
            "stay_parameters": "Stayed June 2011, traveled with family",
            "text": "I recently stayed in this hotel this past weekend and I was pleased with everything. The neighborhood is not much to look at but it is close to other pretty areas. The subway is only 5 minutes away and it is on the mainline to all of the popular areas. If you don\u2019t want to pay the high hotel prices that the pretty areas have then stay at Windsor Asturias. The hotel was nice inside and the staff was very friendly. My room was cozy and the shower was amazing. I could have stayed in the shower for hours. The hotel is close to some really good restaurants and you will actually run into a lot of locals at these eateries. Why go to another country to search out other tourist?",
            "title": "Good but needs a few small improvements",
            "user": "Bill_M_Toronto"
        },
        {
            "date": "July 13, 2011",
            "detail_rating": {
                "business": null,
                "cleanliness": 5.0,
                "desk": null,
                "location": null,
                "pool": null,
                "restaurant": null,
                "rooms": null,
                "service": null,
                "sleep": 5.0,
                "value": 5.0
            },
            "helpfulness": 1,
            "id": 115341556,
            "likes": {
                "disliked": null,
                "liked": null
            },
            "rating": 5.0,
            "stay_parameters": "Stayed March 2011, traveled with family",
            "text": "stayed at the Asturias late June 2011 -",
            "title": "Excellent Value!",
            "user": "brian45011"
        }
    ],
    "slim_ranking": 0.117647058824,
    "stars": 3.5,
    "tripadvisor": {
        "VISITED": false,
        "country_name": null,
        "locality": null,
        "pic_link": null,
        "street_address": null
    },
    "user_rating": 4.0,
    "variance": {
        "average": 47,
        "excellent": 67,
        "poor": 2,
        "terrible": 1,
        "very good": 129
    }
}