{
    "aka": "Bed And Breakfast La Romea",
    "description": "The Bed and Breakfast La Romea is a typical exemple of historic residence, located on the first floor of a late XIVth century palace in Via Sant'Andrea, a short walk fron the Guinigi Tower. Guests will be welcome in a relaxed and friendly atmosphere at the hart of the medieval town. The spacious living room gives room for your private meetings and a wonderful breakfast. We can organize Baby sitting as well as Dog sitting, please ask the reception. We can organize for transportation to and from the two major airports of Pisa and Firenze.",
    "detail_rating": {
        "cleanliness": null,
        "location": null,
        "rooms": null,
        "service": null,
        "sleep": null,
        "value": null
    },
    "location": {
        "city": null,
        "continent": "Europe",
        "country": "Italy",
        "proposed_city": "Pisa",
        "province": null,
        "region": "Tuscany"
    },
    "name": "Bed & Breakfast La Romea",
    "places": {
        "aka": [],
        "hotel_description": [
            "Pisa"
        ],
        "hotel_name": []
    },
    "review_count": 194,
    "review_count_current": 20,
    "reviews": [
        {
            "date": "August 4, 2008",
            "detail_rating": {
                "business": null,
                "cleanliness": 5.0,
                "desk": null,
                "front_desk": 5.0,
                "location": 5.0,
                "pool": null,
                "restaurant": null,
                "rooms": 5.0,
                "service": 5.0,
                "sleep": null,
                "value": null
            },
            "helpfulness": null,
            "id": 18595282,
            "likes": {
                "disliked": null,
                "liked": "\u2014 everything"
            },
            "rating": 5.0,
            "stay_parameters": "Stayed July 2008, traveled as a couple",
            "text": "A truly unique hotel. The rooms were fabulous as was the breakfast.",
            "title": "A beautiful hotel, hospitality could not be faulted.",
            "user": "rosemarymartin"
        },
        {
            "date": "July 29, 2008",
            "detail_rating": {
                "business": 5.0,
                "cleanliness": 5.0,
                "desk": null,
                "front_desk": 5.0,
                "location": 5.0,
                "pool": null,
                "restaurant": null,
                "rooms": 5.0,
                "service": 5.0,
                "sleep": null,
                "value": 5.0
            },
            "helpfulness": null,
            "id": 18373514,
            "likes": {
                "disliked": null,
                "liked": null
            },
            "rating": 5.0,
            "stay_parameters": "Stayed July 2008",
            "text": "Ideally situated in the centre of the old town Would definitely recommend",
            "title": "Delightful Stay",
            "user": "sandwichfamily"
        },
        {
            "date": "July 19, 2008",
            "detail_rating": {
                "business": null,
                "cleanliness": 5.0,
                "desk": null,
                "front_desk": 5.0,
                "location": 5.0,
                "pool": null,
                "restaurant": null,
                "rooms": 5.0,
                "service": 5.0,
                "sleep": null,
                "value": 5.0
            },
            "helpfulness": null,
            "id": 18048490,
            "likes": {
                "disliked": "\u2014 nothing",
                "liked": "\u2014 everything"
            },
            "rating": 5.0,
            "stay_parameters": "Stayed July 2008, traveled as a couple",
            "text": "We stayed 3 nights here in Lucca and have no complaints. The breakfasts were fabulous (fresh fruit, breads, and even eggs to order) and the hospitality was excellent. They also have wireless internet reception from the room, which was excellent. The AC worked well and the room was spacious for all our suitcases. The small refrigerator had room for us to store our own bottles of water and juice. The location is near shops and restaurants. The owners helped us get our train connections and taxis when we needed them. Beautiful place and delightful town!",
            "title": "great location",
            "user": "Molly50"
        },
        {
            "date": "July 16, 2008",
            "detail_rating": {
                "business": 5.0,
                "cleanliness": 5.0,
                "desk": null,
                "front_desk": 3.0,
                "location": 5.0,
                "pool": null,
                "restaurant": null,
                "rooms": 4.0,
                "service": 2.0,
                "sleep": null,
                "value": 4.0
            },
            "helpfulness": null,
            "id": 17953557,
            "likes": {
                "disliked": "\u2014 The lack of customer service",
                "liked": "\u2014 The internet connection"
            },
            "rating": 4.0,
            "stay_parameters": "Stayed December 2007, traveled as a couple",
            "text": "my husband and i stayed here for 3 nights last weekend after spending 4 nights in hotel carignano just outside lucca to attend a family wedding. la romeo is lovely and we stayed in the ivory room which was really beautiful. the owners guillo and gaia are so helpfull with advice on restaurants, getting us timetables for trains and buses to florence which we went to and really enjoyed but we were glad to get back to lucca . it is a beautiful city with so much to do and the narrow streets full of tuscan character. we will be back and wud stay in la romeo again, oh and not forgetting the gorgeous breakfasts and the two lovely ladies who served them, gaias mam and friend, we say thank you so much.",
            "title": "Clean, charming B&B but could use a little better customer service",
            "user": "wittliz"
        },
        {
            "date": "July 11, 2008",
            "detail_rating": {
                "business": null,
                "cleanliness": 5.0,
                "desk": null,
                "location": 5.0,
                "pool": null,
                "restaurant": null,
                "rooms": 5.0,
                "service": 5.0,
                "sleep": null,
                "value": 5.0
            },
            "helpfulness": null,
            "id": 17779261,
            "likes": {
                "disliked": "\u2014 The breakfast Room",
                "liked": "\u2014 The antiquity and location"
            },
            "rating": 5.0,
            "stay_parameters": "Stayed June 2008",
            "text": "La Romea is a cute little B&B in the wonderful town of Lucca. Lucca is a great hub for exploring Florence, Cinque Terre and Pisa by day trips.",
            "title": "A Lovely Time",
            "user": "Ellie_May_8"
        },
        {
            "date": "November 2, 2008",
            "detail_rating": {
                "business": null,
                "cleanliness": 4.0,
                "desk": null,
                "front_desk": 3.0,
                "location": 5.0,
                "pool": null,
                "restaurant": null,
                "rooms": 3.0,
                "service": 3.0,
                "sleep": null,
                "value": 3.0
            },
            "helpfulness": null,
            "id": 21477061,
            "likes": {
                "disliked": null,
                "liked": null
            },
            "rating": 3.0,
            "stay_parameters": "Stayed October 2008",
            "text": "We spent 3 nights in Lucca at La Romea in the Red Room. It was a lovely B&B, although one must remember that it is a B&B and not a hotel. The breakfast was the highlight - much more than offered at most hotels we stayed in throughout Italy. The owners met us at the entrance to Lucca and helped us park our car and drove us to the B&B. There are several stairs to climb to reach the main door, which could be difficult for some. The Red Room was nice - although not as wonderful as I expected (given previous reviews here). We left the windows open for air during the day and were kept awake most nights by flies buzzing around. We also could have used additional pillows - there was not anyone around to ask, except in the morning (we were out during the daytime hours). We did not like the floor of the shower - we bring this up because it has been mentioned by many previous guests - and after walking all day, it was hard to find 2 stones of equal size to balance on and sooth our tired feet. The area restaurants were delicious and the nightly opera was wonderful.",
            "title": "Lovely B&B",
            "user": "jmnra5"
        },
        {
            "date": "October 7, 2008",
            "detail_rating": {
                "business": 4.0,
                "cleanliness": 5.0,
                "desk": null,
                "front_desk": 5.0,
                "location": 5.0,
                "pool": null,
                "restaurant": null,
                "rooms": 5.0,
                "service": 5.0,
                "sleep": null,
                "value": 5.0
            },
            "helpfulness": 1,
            "id": 20701892,
            "likes": {
                "disliked": "\u2014 No complaints at all.",
                "liked": "\u2014 Beautiful, clean, comfortable, hospitable, individual, central, Italian"
            },
            "rating": 5.0,
            "stay_parameters": "Stayed September 2008, traveled on business",
            "text": "We researched long and hard to find a very special B&B in Lucca for a week's stay for our wedding trip in September this year. La Romea looked good and had good reviews... but nothing prepared us for the welcome, hospitality, love and care that we received.",
            "title": "1st class special Italian hospitality",
            "user": "Happy_Lucca_Bride"
        },
        {
            "date": "September 18, 2008",
            "detail_rating": {
                "business": null,
                "cleanliness": 5.0,
                "desk": null,
                "front_desk": 5.0,
                "location": 5.0,
                "pool": null,
                "restaurant": null,
                "rooms": 5.0,
                "service": 4.0,
                "sleep": null,
                "value": 4.0
            },
            "helpfulness": 1,
            "id": 20164901,
            "likes": {
                "disliked": "\u2014 The noise from the outdoor cinema in a nearby square.",
                "liked": "\u2014 History combined with comfort and style."
            },
            "rating": 5.0,
            "stay_parameters": "Stayed August 2007, traveled as a couple",
            "text": "I cannot recommend them highly enough...our hosts, the young Italian owners, Gaia and her husband, Giulio are not only charming and friendly, but also totally professional and experienced in their business. They have that special knack of knowing what you might need before you ask... it is something that only true hospitality people know how to do. Never intrusive, but always attentive.",
            "title": "A gem of a B&B",
            "user": "DivaCaledonia"
        },
        {
            "date": "September 13, 2008",
            "detail_rating": {
                "business": null,
                "cleanliness": 5.0,
                "desk": null,
                "front_desk": 5.0,
                "location": 5.0,
                "pool": null,
                "restaurant": null,
                "rooms": 5.0,
                "service": 5.0,
                "sleep": null,
                "value": 5.0
            },
            "helpfulness": null,
            "id": 20041011,
            "likes": {
                "disliked": "\u2014 Nothing",
                "liked": "\u2014 Eerything"
            },
            "rating": 5.0,
            "stay_parameters": "Stayed September 2008, traveled as a couple",
            "text": "The B&B has only 5 rooms, but each one is so carefully and beautifully decorated and serviced, and always immaculately clean, they are all lovely. We stayed in both the Red room (for 2 nights) and the Blue room (the suite for another 4 nights), both are lovely, but the Blue room is a wonderful suite with extra space and a fabulously interesting and unusual bathroom on a split level. Very comfortable (firm) mattresses for a great night's sleep.",
            "title": "A view from the ivory room",
            "user": "doognlol"
        },
        {
            "date": "August 13, 2008",
            "detail_rating": {
                "business": null,
                "cleanliness": null,
                "desk": null,
                "location": null,
                "pool": null,
                "restaurant": null,
                "rooms": null,
                "service": null,
                "sleep": null,
                "value": null
            },
            "helpfulness": null,
            "id": 18921322,
            "likes": {
                "disliked": null,
                "liked": null
            },
            "rating": 5.0,
            "stay_parameters": null,
            "text": "The location is perfect - right in the centre of Lucca, in the middle of everything you need to see and all within walking distance. The taxi can even get to the front door with your luggage. It's ideally situated and your hosts will give you a map and tell you where to go and what you might like to see. (and Lucca is fabulous - there's LOTS to see!)",
            "title": "La Brilliant Boheme in lovely Lucca",
            "user": "Rich-du-Monde"
        },
        {
            "date": "October 26, 2007",
            "detail_rating": {
                "business": null,
                "cleanliness": 5.0,
                "desk": null,
                "front_desk": 4.0,
                "location": 5.0,
                "pool": null,
                "restaurant": null,
                "rooms": 5.0,
                "service": 5.0,
                "sleep": null,
                "value": 5.0
            },
            "helpfulness": 1,
            "id": 10361043,
            "likes": {
                "disliked": "\u2014 Not long enough there",
                "liked": "\u2014 Location, Food, Room"
            },
            "rating": 5.0,
            "stay_parameters": "Stayed September 2007, traveled with friends",
            "text": "We arrived to a very warm welcome from both Giulio and Gaia the owners of this former 14th century palace. No lifts back then and none now but dont let that bother you at all as its only 1 floor up.",
            "title": "Eggs and Coffee mmmmmmmmmmmmm",
            "user": "DaPope"
        },
        {
            "date": "August 30, 2007",
            "detail_rating": {
                "business": null,
                "cleanliness": 4.0,
                "desk": null,
                "front_desk": 5.0,
                "location": 4.0,
                "pool": null,
                "restaurant": null,
                "rooms": 4.0,
                "service": 5.0,
                "sleep": null,
                "value": 4.0
            },
            "helpfulness": 2,
            "id": 8550661,
            "likes": {
                "disliked": "\u2014 the neighbour's air conditioning was a little noisy...",
                "liked": "\u2014 breakfast, the staff"
            },
            "rating": 5.0,
            "stay_parameters": "Stayed August 2007, traveled as a couple",
            "text": "The room was airy and spacious tastfully decorated, clean and complete with tv, mini bar and lovely en suite.",
            "title": "wonderful",
            "user": "mario33"
        },
        {
            "date": "August 27, 2007",
            "detail_rating": {
                "business": null,
                "cleanliness": 5.0,
                "desk": null,
                "front_desk": 4.0,
                "location": 5.0,
                "pool": null,
                "restaurant": null,
                "rooms": 4.0,
                "service": 5.0,
                "sleep": null,
                "value": 5.0
            },
            "helpfulness": 1,
            "id": 8518070,
            "likes": {
                "disliked": "\u2014 Sometimes street noise at night",
                "liked": "\u2014 Exceptional service"
            },
            "rating": 5.0,
            "stay_parameters": "Stayed August 2007, traveled as a couple",
            "text": "Location is wonderful, only 2 mins walk to the Guinigi Tower and less",
            "title": "Exceptional service",
            "user": "dianefino"
        },
        {
            "date": "July 27, 2007",
            "detail_rating": {
                "business": null,
                "cleanliness": 5.0,
                "desk": null,
                "front_desk": 5.0,
                "location": 5.0,
                "pool": null,
                "restaurant": null,
                "rooms": 4.0,
                "service": 5.0,
                "sleep": null,
                "value": 4.0
            },
            "helpfulness": 1,
            "id": 8241187,
            "likes": {
                "disliked": "\u2014 The AC was a little noisy and a remote for it would have been brilliant",
                "liked": "\u2014 CHaracter and location"
            },
            "rating": 5.0,
            "stay_parameters": "Stayed July 2007, traveled on business",
            "text": "to the main shopping street. Despite its central location the hotel was quiet and relaxing.",
            "title": "Brilliant",
            "user": "nairb356"
        },
        {
            "date": "June 26, 2007",
            "detail_rating": {
                "business": null,
                "cleanliness": 5.0,
                "desk": null,
                "front_desk": 5.0,
                "location": 5.0,
                "pool": null,
                "restaurant": null,
                "rooms": 5.0,
                "service": 5.0,
                "sleep": null,
                "value": 5.0
            },
            "helpfulness": 3,
            "id": 7997944,
            "likes": {
                "disliked": "\u2014 Nothing",
                "liked": "\u2014 The location - right in the heart of town"
            },
            "rating": 5.0,
            "stay_parameters": "Stayed June 2007, traveled as a couple",
            "text": "Now on to the best bit, if you like eggs you will love this place. How do you like them? Just say and they will do them for you, alongside breakfast buffet of cereal, breads, meats, fresh fruit and the best coffee in Lucca.",
            "title": "Excellent!",
            "user": "blackeyes"
        },
        {
            "date": "July 7, 2008",
            "detail_rating": {
                "business": null,
                "cleanliness": 5.0,
                "desk": null,
                "front_desk": 5.0,
                "location": 5.0,
                "pool": null,
                "restaurant": null,
                "rooms": 5.0,
                "service": 5.0,
                "sleep": null,
                "value": 5.0
            },
            "helpfulness": 1,
            "id": 17613238,
            "likes": {
                "disliked": "\u2014 No negative comments",
                "liked": "\u2014 Location"
            },
            "rating": 5.0,
            "stay_parameters": "Stayed July 2008, traveled as a couple",
            "text": "We have just returned from a week at the La Romea B&B in Lucca, Tuscany. The accommodation was found by looking at the Trip Advisor Hotels and B&Bs for Lucca. Our own reflections more than match the excellent comments that we had seen on the Trip Advisor reports. This is indeed excellent accomodation.",
            "title": "A Crown in the Jewel",
            "user": "PeterandJenn"
        },
        {
            "date": "May 18, 2008",
            "detail_rating": {
                "business": null,
                "cleanliness": 5.0,
                "desk": null,
                "front_desk": 5.0,
                "location": 5.0,
                "pool": null,
                "restaurant": null,
                "rooms": 5.0,
                "service": 5.0,
                "sleep": null,
                "value": 5.0
            },
            "helpfulness": 1,
            "id": 16160570,
            "likes": {
                "disliked": null,
                "liked": null
            },
            "rating": 5.0,
            "stay_parameters": "Stayed May 2008, traveled as a couple",
            "text": "Our room ( The yellow room) was large and with King Size comfortable bed, the room was air conditioned ( needed because average outside temp during our stay was 34%). Large en-suite shower room. The La Romea is ideally situated in the heart of the town and is on the second floor of a converted Palace building. The buffet style breakfasts are exceptional and provide a real glow to the start of your day. The owners are a married couple with a young family who cannot do enough to help you enjoy your stay. Lucca itself is a magical place within easy reach of both Pisa and Florence. If we return to the area as I am sure we will,then La Romea will certainly be our first choice accommodation.",
            "title": "La Romea - a great choice for Lucca",
            "user": "Ranald M"
        },
        {
            "date": "March 25, 2008",
            "detail_rating": {
                "business": null,
                "cleanliness": 5.0,
                "desk": null,
                "front_desk": 5.0,
                "location": 4.0,
                "pool": null,
                "restaurant": null,
                "rooms": 4.0,
                "service": 5.0,
                "sleep": null,
                "value": 4.0
            },
            "helpfulness": null,
            "id": 14529889,
            "likes": {
                "disliked": null,
                "liked": "\u2014 Lovely inn with a very friendly and helpful staff"
            },
            "rating": 4.0,
            "stay_parameters": "Stayed March 2008, traveled with family",
            "text": "La Romea is a very good choice if you are looking for quality accommodation at a reasonable price in Lucca.",
            "title": "Charming Inn!",
            "user": "Hannahanna"
        },
        {
            "date": "February 12, 2008",
            "detail_rating": {
                "business": null,
                "cleanliness": 5.0,
                "desk": null,
                "front_desk": 5.0,
                "location": 5.0,
                "pool": null,
                "restaurant": null,
                "rooms": 5.0,
                "service": 5.0,
                "sleep": null,
                "value": 3.0
            },
            "helpfulness": null,
            "id": 13504304,
            "likes": {
                "disliked": null,
                "liked": "\u2014 large room, quiet, cleanliness, breakfast"
            },
            "rating": 5.0,
            "stay_parameters": "Stayed June 2007, traveled with family",
            "text": "The hosts are charming & friendly & go out of their way to help.",
            "title": "Blue Sky room was perfect",
            "user": "travelmagic"
        },
        {
            "date": "December 12, 2007",
            "detail_rating": {
                "business": 3.0,
                "cleanliness": 5.0,
                "desk": null,
                "front_desk": 5.0,
                "location": 5.0,
                "pool": null,
                "restaurant": null,
                "rooms": 5.0,
                "service": 3.0,
                "sleep": null,
                "value": 5.0
            },
            "helpfulness": 4,
            "id": 11500442,
            "likes": {
                "disliked": "\u2014 The owners telling me I should call the Visitor Center when I asked them to recommend a tour guide--a major no-no in the hospitality business.",
                "liked": "\u2014 The perfect location and wonderful breakfasts"
            },
            "rating": 4.0,
            "stay_parameters": "Stayed November 2007, traveled with family",
            "text": "Our bedroom (ivory room) was nicely furnished & had a large modern bathroom. It was also very quiet.",
            "title": "Incredible Location, Great Breakfasts in Italy's Best-Kept Secret---Lucca!!",
            "user": "USAconcierge"
        }
    ],
    "slim_ranking": 0.0431034482759,
    "stars": null,
    "tripadvisor": {
        "VISITED": false,
        "country_name": null,
        "locality": null,
        "pic_link": null,
        "street_address": null
    },
    "user_rating": 5.0,
    "variance": {
        "average": 2,
        "excellent": 163,
        "poor": 1,
        "terrible": 0,
        "very good": 28
    }
}