{
    "aka": "Macdonald Manchester Hotel And Spa",
    "description": "The 4-star Macdonald Manchester hotel sits in the heart of Manchester, within walking distance of Piccadilly train station and close to major motorways. Setting a new standard in luxury accommodation, our landmark hotel blends sophisticated meeting and conference facilities with delicious food and drink, stylish bedrooms, a fitness suite and spa. The Macdonald standard of personal service and hospitality completes the package, making the Manchester hotel a clear leader for business and leisure.",
    "detail_rating": {
        "cleanliness": 4.5,
        "location": 4.5,
        "rooms": 4.5,
        "service": 4.0,
        "sleep": 4.5,
        "value": 4.0
    },
    "location": {
        "city": null,
        "continent": "Europe",
        "country": "United Kingdom (UK)",
        "proposed_city": "Manchester",
        "province": null,
        "region": null
    },
    "name": "Macdonald Manchester Hotel & Spa",
    "places": {
        "aka": [
            "Manchester"
        ],
        "hotel_description": [
            "Manchester"
        ],
        "hotel_name": [
            "Manchester"
        ]
    },
    "review_count": 1561,
    "review_count_current": 20,
    "reviews": [
        {
            "date": "December 13, 2013",
            "detail_rating": {
                "business": null,
                "cleanliness": 5.0,
                "desk": null,
                "location": 5.0,
                "pool": null,
                "restaurant": null,
                "rooms": 5.0,
                "service": 5.0,
                "sleep": 5.0,
                "value": 4.0
            },
            "helpfulness": null,
            "id": 187572505,
            "likes": {
                "disliked": null,
                "liked": null
            },
            "rating": 5.0,
            "stay_parameters": "Stayed November 2013, traveled as a couple",
            "text": "We chose this hotel due to it being so close to train station, and was only staying one night (8th Nov) to go to a concert. We very delighted with our choice, the staff were very attentive, there was a large event going on, but the front desk still managed to get us a taxi swiftly... The barman was very helpfull, sorting our drinks out, even though my room card wasn't scanned correctly, unusual to find any level of trust these days... The room was large and had a great view of the city, the bathroom was first class. The only thing that looked odd was that the TV looked small, because of the size of the room.. Breakfast was not cheap, but that is ok so long as it is of a very high standard, which it was...",
            "title": "Large room with great view..",
            "user": "Louise P"
        },
        {
            "date": "December 13, 2013",
            "detail_rating": {
                "business": null,
                "cleanliness": 5.0,
                "desk": null,
                "location": 5.0,
                "pool": null,
                "restaurant": null,
                "rooms": 5.0,
                "service": 5.0,
                "sleep": 5.0,
                "value": 5.0
            },
            "helpfulness": null,
            "id": 187564204,
            "likes": {
                "disliked": null,
                "liked": null
            },
            "rating": 5.0,
            "stay_parameters": "Stayed December 2013, traveled with family",
            "text": "100% the best hotel",
            "title": "best hotel in manchester",
            "user": "btq1"
        },
        {
            "date": "December 13, 2013",
            "detail_rating": {
                "business": null,
                "cleanliness": 5.0,
                "desk": null,
                "location": 3.0,
                "pool": null,
                "restaurant": null,
                "rooms": 5.0,
                "service": 4.0,
                "sleep": 5.0,
                "value": 5.0
            },
            "helpfulness": null,
            "id": 187558687,
            "likes": {
                "disliked": null,
                "liked": null
            },
            "rating": 5.0,
            "stay_parameters": "Stayed November 2013, traveled as a couple",
            "text": "nothing is too much bother for the staff who are friendly and helpful",
            "title": "Like it",
            "user": "Matthew C"
        },
        {
            "date": "December 12, 2013",
            "detail_rating": {
                "business": null,
                "cleanliness": null,
                "desk": null,
                "location": null,
                "pool": null,
                "restaurant": null,
                "rooms": null,
                "service": null,
                "sleep": null,
                "value": null
            },
            "helpfulness": null,
            "id": 187422608,
            "likes": {
                "disliked": null,
                "liked": null
            },
            "rating": 5.0,
            "stay_parameters": null,
            "text": "met by Nial ,a very pleasant and efficient person",
            "title": "Weekend of fun in Manchester",
            "user": "Angelakerr"
        },
        {
            "date": "December 12, 2013",
            "detail_rating": {
                "business": null,
                "cleanliness": 5.0,
                "desk": null,
                "location": 3.0,
                "pool": null,
                "restaurant": null,
                "rooms": 5.0,
                "service": 5.0,
                "sleep": 5.0,
                "value": 4.0
            },
            "helpfulness": null,
            "id": 187419994,
            "likes": {
                "disliked": null,
                "liked": null
            },
            "rating": 5.0,
            "stay_parameters": "Stayed October 2013, traveled as a couple",
            "text": "would be going back to this hotel",
            "title": "Great rooms!",
            "user": "Den J"
        },
        {
            "date": "December 11, 2013",
            "detail_rating": {
                "business": null,
                "cleanliness": 5.0,
                "desk": null,
                "location": 5.0,
                "pool": null,
                "restaurant": null,
                "rooms": 5.0,
                "service": 5.0,
                "sleep": 5.0,
                "value": 5.0
            },
            "helpfulness": null,
            "id": 187346609,
            "likes": {
                "disliked": null,
                "liked": null
            },
            "rating": 5.0,
            "stay_parameters": "Stayed November 2013, traveled with family",
            "text": "Stayed there in September, Rooms are very clean and nice Specially double bedrooms, Staff are very helpful and their service is 5 star. Wide variety of meals served at their restaurant and taste of meals is second to none. would recommend it to anyone who want enjoy excellent hoteling experience.",
            "title": "\"Nice Rooms Excellent Service\"",
            "user": "Fayyaz99"
        },
        {
            "date": "December 11, 2013",
            "detail_rating": {
                "business": null,
                "cleanliness": 5.0,
                "desk": null,
                "location": 5.0,
                "pool": null,
                "restaurant": null,
                "rooms": 5.0,
                "service": 5.0,
                "sleep": 5.0,
                "value": 5.0
            },
            "helpfulness": null,
            "id": 187343415,
            "likes": {
                "disliked": null,
                "liked": null
            },
            "rating": 5.0,
            "stay_parameters": "Stayed November 2013, traveled as a couple",
            "text": "Fayyaz Ahmad",
            "title": "Icing on the Cake",
            "user": "Jaygee8017"
        },
        {
            "date": "December 11, 2013",
            "detail_rating": {
                "business": null,
                "cleanliness": 5.0,
                "desk": null,
                "location": 5.0,
                "pool": null,
                "restaurant": null,
                "rooms": 5.0,
                "service": 5.0,
                "sleep": 5.0,
                "value": 5.0
            },
            "helpfulness": null,
            "id": 187332086,
            "likes": {
                "disliked": null,
                "liked": null
            },
            "rating": 5.0,
            "stay_parameters": "Stayed December 2013, traveled with friends",
            "text": "I booked this venue after recomendations from friends. I needed a special place to celebrate a special weekend with my partner. Well I can honeslty say that every little deatil of our stay was met, and more.",
            "title": "Fantastic Place to Staty",
            "user": "Sarah J"
        },
        {
            "date": "December 10, 2013",
            "detail_rating": {
                "business": null,
                "cleanliness": 5.0,
                "desk": null,
                "location": 5.0,
                "pool": null,
                "restaurant": null,
                "rooms": 5.0,
                "service": 5.0,
                "sleep": 5.0,
                "value": 5.0
            },
            "helpfulness": null,
            "id": 187279544,
            "likes": {
                "disliked": null,
                "liked": null
            },
            "rating": 5.0,
            "stay_parameters": "Stayed November 2013, traveled solo",
            "text": "Not commented on pool as didnt use it.",
            "title": "Great Place To Stay",
            "user": "Ian C"
        },
        {
            "date": "December 10, 2013",
            "detail_rating": {
                "business": null,
                "cleanliness": 5.0,
                "desk": null,
                "location": 5.0,
                "pool": null,
                "restaurant": null,
                "rooms": 5.0,
                "service": 5.0,
                "sleep": 5.0,
                "value": 5.0
            },
            "helpfulness": null,
            "id": 187273059,
            "likes": {
                "disliked": null,
                "liked": null
            },
            "rating": 5.0,
            "stay_parameters": "Stayed November 2013, traveled with friends",
            "text": "Thank you, and highly recommended.",
            "title": "Excellent",
            "user": "Martin K"
        },
        {
            "date": "December 16, 2013",
            "detail_rating": {
                "business": null,
                "cleanliness": null,
                "desk": null,
                "location": null,
                "pool": null,
                "restaurant": null,
                "rooms": null,
                "service": null,
                "sleep": null,
                "value": null
            },
            "helpfulness": 1,
            "id": 187752234,
            "likes": {
                "disliked": null,
                "liked": null
            },
            "rating": 5.0,
            "stay_parameters": null,
            "text": "Stayed on a Sunday after had come back from a long flight and needed to be at work the next day. Booked through the hotel website where you get a \u00a310 room spend, which was a nice touch.",
            "title": "Excellent hotel ",
            "user": "sootystravel2"
        },
        {
            "date": "December 15, 2013",
            "detail_rating": {
                "business": null,
                "cleanliness": 5.0,
                "desk": null,
                "location": 4.0,
                "pool": null,
                "restaurant": null,
                "rooms": 5.0,
                "service": 5.0,
                "sleep": 5.0,
                "value": 5.0
            },
            "helpfulness": null,
            "id": 187719211,
            "likes": {
                "disliked": null,
                "liked": null
            },
            "rating": 4.0,
            "stay_parameters": "Stayed December 2013, traveled with friends",
            "text": "Bed is roomy and pillows fluffy. Given the large size if the bed the tv did seem miles away and almost a little small. However i was sleeping off jet lag and i wasn't there just ti watch the goggle box.",
            "title": "Lovely hotel once we found the car park",
            "user": "jayne p"
        },
        {
            "date": "December 15, 2013",
            "detail_rating": {
                "business": null,
                "cleanliness": 5.0,
                "desk": null,
                "location": 5.0,
                "pool": null,
                "restaurant": null,
                "rooms": 5.0,
                "service": 5.0,
                "sleep": 5.0,
                "value": 5.0
            },
            "helpfulness": 1,
            "id": 187699462,
            "likes": {
                "disliked": null,
                "liked": null
            },
            "rating": 5.0,
            "stay_parameters": "Stayed December 2013, traveled with family",
            "text": "Bathroom = gorgeous. Usual complimentary toiletries and fantastic shower. It is only albeit spacious cubicle - no bath. Thus wasn't an issue for me though.",
            "title": "Classy modern Hotel",
            "user": "Adrian S"
        },
        {
            "date": "December 15, 2013",
            "detail_rating": {
                "business": null,
                "cleanliness": null,
                "desk": null,
                "location": null,
                "pool": null,
                "restaurant": null,
                "rooms": null,
                "service": null,
                "sleep": null,
                "value": null
            },
            "helpfulness": 1,
            "id": 187668016,
            "likes": {
                "disliked": null,
                "liked": null
            },
            "rating": 5.0,
            "stay_parameters": null,
            "text": "Please note this is a hotel near piccadilly station so there is a slight bit of residual noise from the station. It didn't stop me sleeping but if you are a light sleeper make sure you get on the non station side.",
            "title": "Fantastic service",
            "user": "ss19800317"
        },
        {
            "date": "December 14, 2013",
            "detail_rating": {
                "business": null,
                "cleanliness": 5.0,
                "desk": null,
                "location": 4.0,
                "pool": null,
                "restaurant": null,
                "rooms": 4.0,
                "service": 4.0,
                "sleep": 5.0,
                "value": 4.0
            },
            "helpfulness": 1,
            "id": 187644037,
            "likes": {
                "disliked": null,
                "liked": null
            },
            "rating": 4.0,
            "stay_parameters": "Stayed December 2013, traveled on business",
            "text": "The spa is quite small- only 2 loungers (although are heated so really soothed my aching joints) in the thermal suite but the sauna and steam room are spacious.",
            "title": "Convenient and Good Value",
            "user": "jhh2ogeo"
        },
        {
            "date": "December 19, 2013",
            "detail_rating": {
                "business": null,
                "cleanliness": 5.0,
                "desk": null,
                "location": 5.0,
                "pool": null,
                "restaurant": null,
                "rooms": 5.0,
                "service": 5.0,
                "sleep": 5.0,
                "value": 5.0
            },
            "helpfulness": null,
            "id": 188063908,
            "likes": {
                "disliked": null,
                "liked": null
            },
            "rating": 5.0,
            "stay_parameters": "Stayed December 2013, traveled with family",
            "text": "Just a stop over for the one night.",
            "title": "Only the one night",
            "user": "cabby289"
        },
        {
            "date": "December 18, 2013",
            "detail_rating": {
                "business": null,
                "cleanliness": null,
                "desk": null,
                "location": null,
                "pool": null,
                "restaurant": null,
                "rooms": null,
                "service": null,
                "sleep": null,
                "value": null
            },
            "helpfulness": null,
            "id": 187951701,
            "likes": {
                "disliked": null,
                "liked": null
            },
            "rating": 4.0,
            "stay_parameters": null,
            "text": "Should have stayed longer into the weekend.",
            "title": "Bit out of the way but very good",
            "user": "Craig M"
        },
        {
            "date": "December 17, 2013",
            "detail_rating": {
                "business": null,
                "cleanliness": 5.0,
                "desk": null,
                "location": 5.0,
                "pool": null,
                "restaurant": null,
                "rooms": 5.0,
                "service": 5.0,
                "sleep": 5.0,
                "value": 5.0
            },
            "helpfulness": 1,
            "id": 187895782,
            "likes": {
                "disliked": null,
                "liked": null
            },
            "rating": 5.0,
            "stay_parameters": "Stayed December 2013, traveled on business",
            "text": "Looks good from the outside and very close to the station.",
            "title": "Amazing hotel",
            "user": "Tony S"
        },
        {
            "date": "December 17, 2013",
            "detail_rating": {
                "business": null,
                "cleanliness": 5.0,
                "desk": null,
                "location": 5.0,
                "pool": null,
                "restaurant": null,
                "rooms": 5.0,
                "service": 5.0,
                "sleep": 4.0,
                "value": 4.0
            },
            "helpfulness": 1,
            "id": 187880575,
            "likes": {
                "disliked": null,
                "liked": null
            },
            "rating": 5.0,
            "stay_parameters": "Stayed December 2013, traveled as a couple",
            "text": "Go through the doors and just what you expect everything you want staff all over the place and then up to the rooms and plenty of space to move around.",
            "title": "Great hotel",
            "user": "julia c"
        },
        {
            "date": "December 16, 2013",
            "detail_rating": {
                "business": null,
                "cleanliness": 4.0,
                "desk": null,
                "location": 4.0,
                "pool": null,
                "restaurant": null,
                "rooms": 3.0,
                "service": 2.0,
                "sleep": 3.0,
                "value": 3.0
            },
            "helpfulness": 1,
            "id": 187826792,
            "likes": {
                "disliked": null,
                "liked": null
            },
            "rating": 2.0,
            "stay_parameters": "Stayed December 2013, traveled as a couple",
            "text": "Un fortunately had to leave in the morning and out into the Manchester weather. Rain of course.",
            "title": "Disappointing compared to other Macdonald Hotels",
            "user": "MarkDebbie2326"
        }
    ],
    "slim_ranking": 0.203389830508,
    "stars": 4,
    "tripadvisor": {
        "VISITED": false,
        "country_name": null,
        "locality": null,
        "pic_link": null,
        "street_address": null
    },
    "user_rating": 4.0,
    "variance": {
        "average": 210,
        "excellent": 630,
        "poor": 93,
        "terrible": 31,
        "very good": 597
    }
}