{
    "aka": null,
    "description": null,
    "detail_rating": {
        "cleanliness": null,
        "location": null,
        "rooms": null,
        "service": null,
        "sleep": null,
        "value": null
    },
    "location": {
        "city": "Bendigo",
        "continent": "South Pacific",
        "country": "Australia",
        "proposed_city": null,
        "province": null,
        "region": null
    },
    "name": "The Foundry Hotel",
    "places": {
        "aka": [],
        "hotel_description": [],
        "hotel_name": []
    },
    "review_count": 16,
    "review_count_current": 6,
    "reviews": [
        {
            "date": "November 16, 2011",
            "detail_rating": {
                "business": null,
                "cleanliness": 4.0,
                "desk": null,
                "location": 3.0,
                "pool": null,
                "restaurant": null,
                "rooms": null,
                "service": 3.0,
                "sleep": null,
                "value": 2.0
            },
            "helpfulness": 1,
            "id": 120653136,
            "likes": {
                "disliked": null,
                "liked": null
            },
            "rating": 2.0,
            "stay_parameters": "Stayed November 2011, traveled with family",
            "text": "This was our second visit to the Foundry, having recently moved to Bendigo. The first time was for lunch & I had salmon patties which were dry and mostly potato with the odd fleck of salmon. Overall unappetising, however, after a comment to the waitress, the meal was quickly changed to whiting fillets which were fine.",
            "title": "Very ordinary",
            "user": "Australians_Abroad"
        },
        {
            "date": "March 9, 2011",
            "detail_rating": {
                "business": null,
                "cleanliness": null,
                "desk": null,
                "location": null,
                "pool": null,
                "restaurant": null,
                "rooms": null,
                "service": null,
                "sleep": null,
                "value": null
            },
            "helpfulness": 4,
            "id": 99483143,
            "likes": {
                "disliked": null,
                "liked": null
            },
            "rating": 3.0,
            "stay_parameters": null,
            "text": "The second visit was for dinner and again, the overall experience was very ordinary. There were 6 of us, and while I don't usually buy softdrinks, I purchased a jug of lemonade for the table which cost $12 - I consider this a bit over the top for postmix that would cost about $0.50, but maybe this is normal price. I ordered the steak and much like the previous posting it came swimming in sauce, which was pretty bland for a green peppercorn sauce. The steak itself was requested as medium and wasn't even close, being significantly over-cooked to a well-done. I ordered the Banana & Sticky Date pudding with icecream and caramel sauce for dessert and the dessert itself wasn't very moist but ok. What was surprising was the iceream flavour was \"cherry ripe\". Not what I expected as you would normally get vanilla. Let me assure you the flavours do not go together. My wife ended up with Chocolate Mousse with Kahlua sauce plus the cherry ripe ice cream. Not a recommended combination either.",
            "title": "One great meal, One not so great",
            "user": "fouraussies"
        },
        {
            "date": "June 26, 2010",
            "detail_rating": {
                "business": null,
                "cleanliness": null,
                "desk": null,
                "location": null,
                "pool": null,
                "restaurant": null,
                "rooms": null,
                "service": null,
                "sleep": null,
                "value": null
            },
            "helpfulness": 2,
            "id": 68717395,
            "likes": {
                "disliked": null,
                "liked": null
            },
            "rating": 5.0,
            "stay_parameters": null,
            "text": "Other minor things which made the dinner even less enjoyable were - group booking standing around the tables, everyone talking made it very difficult for us to talk amongst ourselves.",
            "title": "Best Bistro Meal in a Long Long while",
            "user": "dave0_1963"
        },
        {
            "date": "May 23, 2010",
            "detail_rating": {
                "business": null,
                "cleanliness": 5.0,
                "desk": null,
                "location": 5.0,
                "pool": null,
                "restaurant": null,
                "rooms": null,
                "service": 4.0,
                "sleep": null,
                "value": 5.0
            },
            "helpfulness": 1,
            "id": 65032492,
            "likes": {
                "disliked": null,
                "liked": null
            },
            "rating": 5.0,
            "stay_parameters": "Stayed May 2010, traveled as a couple",
            "text": "The drinks bar does not accept card payment (either eftpos or credit), and I had to set up a tab (for softdrink). When it comes time to pay, I had to again join the long queue at the food counter.",
            "title": "Fab!",
            "user": "surlamer_10"
        },
        {
            "date": "January 8, 2009",
            "detail_rating": {
                "business": null,
                "cleanliness": 5.0,
                "desk": null,
                "location": null,
                "pool": null,
                "restaurant": null,
                "rooms": null,
                "service": 5.0,
                "sleep": null,
                "value": 5.0
            },
            "helpfulness": 1,
            "id": 23366220,
            "likes": {
                "disliked": null,
                "liked": null
            },
            "rating": 5.0,
            "stay_parameters": "Stayed January 2009, traveled with family",
            "text": "Finally paying for the drinks with cash and cashier tried to short change me.",
            "title": "Delicious. Outstanding service.",
            "user": "lollysmum"
        },
        {
            "date": "April 4, 2004",
            "detail_rating": {
                "business": null,
                "cleanliness": null,
                "desk": null,
                "location": null,
                "pool": null,
                "restaurant": null,
                "rooms": null,
                "service": null,
                "sleep": null,
                "value": null
            },
            "helpfulness": 7,
            "id": 1763811,
            "likes": {
                "disliked": null,
                "liked": null
            },
            "rating": 5.0,
            "stay_parameters": null,
            "text": "If you are anywhere near Bendigo, Golden Square, or Kangaroo Flat and want a cold beer and a sample of country Victoria hospitality make sure you stop at the Foundry Arms Hotel. Located on the just off the main street directly across from Safeway and just down the road from the South Deborah gold mine tour",
            "title": "Foundry Arms Hotel",
            "user": "A TripAdvisor user"
        }
    ],
    "slim_ranking": 0.612903225806,
    "stars": null,
    "tripadvisor": {
        "VISITED": false,
        "country_name": null,
        "locality": null,
        "pic_link": null,
        "street_address": null
    },
    "user_rating": 4.0,
    "variance": {
        "average": 1,
        "excellent": 10,
        "poor": 2,
        "terrible": 2,
        "very good": 1
    }
}