{
    "aka": "Chateau Beauvallon Mont Tremblant Hotel Mont Tremblant",
    "description": "Located just five minutes -3km (2mi.) from the Tremblant ski resort, on a vast, private, lakeside property where guests can relax and enjoy indoor, outdoor pool & hot tub, cross country skiing & snow showing right from our door step. Whether a romantic retreat, ladies-only getaway or enjoyable family vacations, we take care of every little detail. We have a charming restaurant & bar with a menu of epicurean delights.",
    "detail_rating": {
        "cleanliness": 4.5,
        "location": 4.5,
        "rooms": 4.5,
        "service": 4.0,
        "sleep": 4.5,
        "value": 4.0
    },
    "location": {
        "city": "Mont Tremblant",
        "continent": null,
        "country": "Canada",
        "proposed_city": null,
        "province": null,
        "region": null
    },
    "name": "Chateau Beauvallon Mont Tremblant",
    "places": {
        "aka": [],
        "hotel_description": [],
        "hotel_name": []
    },
    "review_count": 372,
    "review_count_current": 25,
    "reviews": [
        {
            "date": "January 18, 2008",
            "detail_rating": {
                "business": 5.0,
                "cleanliness": 5.0,
                "desk": null,
                "front_desk": 4.0,
                "location": 4.0,
                "pool": null,
                "restaurant": null,
                "rooms": 5.0,
                "service": 5.0,
                "sleep": null,
                "value": 4.0
            },
            "helpfulness": 4,
            "id": 12771000,
            "likes": {
                "disliked": "\u2014 maid service did come a bit late in the day",
                "liked": "\u2014 unpretentious, but very nice"
            },
            "rating": 5.0,
            "stay_parameters": "Stayed January 2008, traveled with family",
            "text": "I am so pleased that we took a chance and decided to stay at a property near, but not in the pedestrian village. We have been visiting Mont Tremblant for a number of years and have always stayed in the village in the past.",
            "title": "Great way to start the New Year",
            "user": "Windwardmom"
        },
        {
            "date": "January 16, 2008",
            "detail_rating": {
                "business": null,
                "cleanliness": 4.0,
                "desk": null,
                "front_desk": 4.0,
                "location": 2.0,
                "pool": null,
                "restaurant": null,
                "rooms": 5.0,
                "service": 4.0,
                "sleep": null,
                "value": 4.0
            },
            "helpfulness": 4,
            "id": 12701159,
            "likes": {
                "disliked": "\u2014 Closed restaurants, bar, hot tub, no shuttle",
                "liked": "\u2014 Superb room design"
            },
            "rating": 3.0,
            "stay_parameters": "Stayed November 2007, traveled as a couple",
            "text": "First, the hotel is lovely as you pull up, and the bell staff/valet are welcoming, polite, friendly,and capable. The front desk staff is as well. The first thing I noticed upon entering our suite ( 2 bedroom/2 baths also with a pull out couch and Murphy bed-- fit 4 comfortably, and up to 6 would be fine if you get along well) was how utterly pristine it was-- understated, cozy, not too fussy, modern,and very nice. The kitchen area is well appointed and looked as though it had never been used.",
            "title": "Disaster turned Good",
            "user": "BritIt"
        },
        {
            "date": "January 9, 2008",
            "detail_rating": {
                "business": 5.0,
                "cleanliness": 5.0,
                "desk": null,
                "front_desk": 5.0,
                "location": 5.0,
                "pool": null,
                "restaurant": null,
                "rooms": 5.0,
                "service": 5.0,
                "sleep": null,
                "value": 5.0
            },
            "helpfulness": 2,
            "id": 12479289,
            "likes": {
                "disliked": "\u2014 nothing",
                "liked": "\u2014 comfort, style, spacious,convenience"
            },
            "rating": 5.0,
            "stay_parameters": "Stayed December 2007, traveled with family",
            "text": "The bathrooms were equally immaculate-- I thought the radiant heat under the slate tile floors was a very nice touch.",
            "title": "Loved the sincere, effortless service at the Chateau",
            "user": "Vioka"
        },
        {
            "date": "January 3, 2008",
            "detail_rating": {
                "business": 5.0,
                "cleanliness": 5.0,
                "desk": null,
                "front_desk": 5.0,
                "location": 5.0,
                "pool": null,
                "restaurant": null,
                "rooms": 5.0,
                "service": 5.0,
                "sleep": null,
                "value": 5.0
            },
            "helpfulness": 1,
            "id": 12303367,
            "likes": {
                "disliked": "\u2014 nothing",
                "liked": "\u2014 The service, the rooms"
            },
            "rating": 5.0,
            "stay_parameters": "Stayed December 2007, traveled as a couple",
            "text": "I had been concerned that the shuttle would be inconvenient, but I have to say that the shuttle service was extremely well run. I cannot overstate how wonderful the shuttle staff was. They were available at all hours; we never had to wait more than a moment or so for a pick-up, and it is within a five minute drive to the pedestrian village.",
            "title": "Chateau Beauvallon - Execellent all around",
            "user": "IcarusNYC"
        },
        {
            "date": "January 2, 2008",
            "detail_rating": {
                "business": 5.0,
                "cleanliness": 5.0,
                "desk": null,
                "front_desk": 5.0,
                "location": 4.0,
                "pool": null,
                "restaurant": null,
                "rooms": 5.0,
                "service": 5.0,
                "sleep": null,
                "value": 5.0
            },
            "helpfulness": 2,
            "id": 12272524,
            "likes": {
                "disliked": "\u2014 Distance from restaurants",
                "liked": "\u2014 Great ambiance!"
            },
            "rating": 5.0,
            "stay_parameters": "Stayed December 2007, traveled with family",
            "text": "Breakfast for us was not included( though for some it was- you may want to ask ), but it was not terribly expensive and it was well prepared- again, clean, cozy, great staff, understated and very nice.",
            "title": "Magical Christmas",
            "user": "Katsandcards"
        },
        {
            "date": "February 26, 2008",
            "detail_rating": {
                "business": 3.0,
                "cleanliness": 5.0,
                "desk": null,
                "front_desk": 5.0,
                "location": 5.0,
                "pool": null,
                "restaurant": null,
                "rooms": 5.0,
                "service": 5.0,
                "sleep": null,
                "value": 5.0
            },
            "helpfulness": null,
            "id": 13868994,
            "likes": {
                "disliked": "\u2014 Nothing comes to mind",
                "liked": "\u2014 Staff"
            },
            "rating": 5.0,
            "stay_parameters": "Stayed February 2008, traveled with family",
            "text": "Imagine visiting a postcard straight from a holiday set with staff that all seem to love their jobs! We had a family ski vacation and stayed at the Chateau Beauvallon and I can't say enough good things.",
            "title": "Best Customer Service in a beautiful setting!",
            "user": "Leabro"
        },
        {
            "date": "February 24, 2008",
            "detail_rating": {
                "business": null,
                "cleanliness": 5.0,
                "desk": null,
                "front_desk": 5.0,
                "location": 5.0,
                "pool": null,
                "restaurant": null,
                "rooms": 5.0,
                "service": 5.0,
                "sleep": null,
                "value": 5.0
            },
            "helpfulness": null,
            "id": 13817048,
            "likes": {
                "disliked": null,
                "liked": null
            },
            "rating": 5.0,
            "stay_parameters": "Stayed February 2008",
            "text": "The Chateau is very picturesque and the rooms are beautifully appointed. The gas fireplace added the right touch of cosiness and the beds were super comfortable. Our room overlooked the garden and it looked like a winter wonderland with trees that were lit up and a hot tub that was warm and very inviting.",
            "title": "Great stay!",
            "user": "Janie_pooh"
        },
        {
            "date": "February 18, 2008",
            "detail_rating": {
                "business": null,
                "cleanliness": null,
                "desk": null,
                "location": null,
                "pool": null,
                "restaurant": null,
                "rooms": null,
                "service": null,
                "sleep": null,
                "value": null
            },
            "helpfulness": null,
            "id": 13644522,
            "likes": {
                "disliked": null,
                "liked": null
            },
            "rating": 5.0,
            "stay_parameters": null,
            "text": "We had the continental breakfast each morning and it was what I came to expect from the hotel. Coffee was strong and hot, croissants were fresh and flakey, fruit was fresh and plentiful... always a great start to the day.",
            "title": "Wow!",
            "user": "AZuraw"
        },
        {
            "date": "February 16, 2008",
            "detail_rating": {
                "business": 5.0,
                "cleanliness": 5.0,
                "desk": null,
                "front_desk": 5.0,
                "location": 5.0,
                "pool": null,
                "restaurant": null,
                "rooms": 5.0,
                "service": 5.0,
                "sleep": null,
                "value": 5.0
            },
            "helpfulness": null,
            "id": 13606121,
            "likes": {
                "disliked": "\u2014 nothing",
                "liked": "\u2014 Spacious, beautiful suites and GREAT service."
            },
            "rating": 5.0,
            "stay_parameters": "Stayed February 2008, traveled with family",
            "text": "We ate in the restaurant on our last evening there if I could find one flaw it was they didn't have enough wait staff to serve the packed house. The food was excellent but took a while to get served. All in all, it certainly wasn't enough of a complaint to bring the rating down at all.",
            "title": "Loved the Chateau Beauvallon Mont Tremblant",
            "user": "Liz F"
        },
        {
            "date": "February 11, 2008",
            "detail_rating": {
                "business": 5.0,
                "cleanliness": 5.0,
                "desk": null,
                "front_desk": 5.0,
                "location": 5.0,
                "pool": null,
                "restaurant": null,
                "rooms": 5.0,
                "service": 5.0,
                "sleep": null,
                "value": 5.0
            },
            "helpfulness": null,
            "id": 13457433,
            "likes": {
                "disliked": null,
                "liked": null
            },
            "rating": 5.0,
            "stay_parameters": "Stayed February 2008, traveled as a couple",
            "text": "I'll definitely be back there!",
            "title": "Amazing stay",
            "user": "TorontoAvery"
        },
        {
            "date": "October 27, 2007",
            "detail_rating": {
                "business": 5.0,
                "cleanliness": 5.0,
                "desk": null,
                "front_desk": 5.0,
                "location": 5.0,
                "pool": null,
                "restaurant": null,
                "rooms": 5.0,
                "service": 5.0,
                "sleep": null,
                "value": 5.0
            },
            "helpfulness": 1,
            "id": 10370042,
            "likes": {
                "disliked": "\u2014 Nothing",
                "liked": "\u2014 The overall quality of the hotel"
            },
            "rating": 5.0,
            "stay_parameters": "Stayed January 2007, traveled with friends",
            "text": "Went for a long weekend skiing, Thurs - Sun, and from the time we arrived to the time we left we had a fantastic time.",
            "title": "Excellent!",
            "user": "Geordie_blerk"
        },
        {
            "date": "September 24, 2007",
            "detail_rating": {
                "business": 5.0,
                "cleanliness": null,
                "desk": null,
                "front_desk": 5.0,
                "location": 5.0,
                "pool": null,
                "restaurant": null,
                "rooms": 5.0,
                "service": 5.0,
                "sleep": null,
                "value": 5.0
            },
            "helpfulness": 1,
            "id": 8875652,
            "likes": {
                "disliked": null,
                "liked": "\u2014 The hotel staff made the difference as well as the location"
            },
            "rating": 5.0,
            "stay_parameters": "Stayed September 2007, traveled as a couple",
            "text": "The hotel is excellent, room was very high quality and the bed was the most comfortable bed I've ever slept in.",
            "title": "Can't do it better",
            "user": "restlessmind"
        },
        {
            "date": "August 29, 2007",
            "detail_rating": {
                "business": 4.0,
                "cleanliness": 5.0,
                "desk": null,
                "front_desk": 5.0,
                "location": 3.0,
                "pool": null,
                "restaurant": null,
                "rooms": 5.0,
                "service": 4.0,
                "sleep": null,
                "value": 4.0
            },
            "helpfulness": 1,
            "id": 8526082,
            "likes": {
                "disliked": null,
                "liked": null
            },
            "rating": 4.0,
            "stay_parameters": "Stayed August 2007",
            "text": "The staff were very friendly and the atmosphere was very relaxed - we like to enjoy ourselves on our nights out and so the hotel's shuttle bus to and from the mountain was very useful...",
            "title": "Excellent room but location not in village",
            "user": "TheCooksSaltLakeCity"
        },
        {
            "date": "August 24, 2007",
            "detail_rating": {
                "business": 4.0,
                "cleanliness": 5.0,
                "desk": null,
                "front_desk": 4.0,
                "location": 4.0,
                "pool": null,
                "restaurant": null,
                "rooms": 5.0,
                "service": 4.0,
                "sleep": null,
                "value": 5.0
            },
            "helpfulness": null,
            "id": 8499001,
            "likes": {
                "disliked": "\u2014 The pool was small",
                "liked": "\u2014 The rooms"
            },
            "rating": 5.0,
            "stay_parameters": "Stayed August 2007, traveled with family",
            "text": "We are planning on going back this december to see what the snow is like earlier in the season.",
            "title": "relaxing and beautiful",
            "user": "moose112"
        },
        {
            "date": "August 24, 2007",
            "detail_rating": {
                "business": null,
                "cleanliness": 5.0,
                "desk": null,
                "front_desk": 5.0,
                "location": 5.0,
                "pool": null,
                "restaurant": null,
                "rooms": 5.0,
                "service": 5.0,
                "sleep": null,
                "value": 5.0
            },
            "helpfulness": 1,
            "id": 8494847,
            "likes": {
                "disliked": null,
                "liked": null
            },
            "rating": 5.0,
            "stay_parameters": "Stayed August 2007, traveled as a couple",
            "text": "Stayed from Sep 21-Sep23/07 for our anniversary and we had a great time. The rooms were immaculate. The service was attentive and welcoming. The in-house restaurant was to die for; best lamb shank I have ever tasted. It is close enough to the village and other activities. We supplemented our stay with 1 hour horse back riding(we should of done the 3 hour option up through the mountains) and a day at the spa. Both of the activities were great. We enjoyed every minute of it. Be prepared for good, wholesome Quebecois hospitality.",
            "title": "Great Stay",
            "user": "Ogy"
        },
        {
            "date": "August 19, 2007",
            "detail_rating": {
                "business": 5.0,
                "cleanliness": 5.0,
                "desk": null,
                "front_desk": 5.0,
                "location": 5.0,
                "pool": null,
                "restaurant": null,
                "rooms": 5.0,
                "service": 5.0,
                "sleep": null,
                "value": 5.0
            },
            "helpfulness": 1,
            "id": 8453447,
            "likes": {
                "disliked": "\u2014 Nothing",
                "liked": "\u2014 Everything"
            },
            "rating": 5.0,
            "stay_parameters": "Stayed August 2007, traveled as a couple",
            "text": "We just returned from having spent 3 nights at Chateau Beauvallon. It could not have been more perfect! The suite was beautiful and spotless, and the bed was extremely comfortable. The staff were warm and knowledgeable, and sent us to outstanding restaurants in the Tremblant area. We would love to return for another stay!",
            "title": "Perfect!",
            "user": "jsandnj"
        },
        {
            "date": "July 16, 2007",
            "detail_rating": {
                "business": 5.0,
                "cleanliness": 5.0,
                "desk": null,
                "front_desk": 5.0,
                "location": 5.0,
                "pool": null,
                "restaurant": null,
                "rooms": 5.0,
                "service": 5.0,
                "sleep": null,
                "value": 5.0
            },
            "helpfulness": 3,
            "id": 8126153,
            "likes": {
                "disliked": "\u2014 Bathrooms would benefit by having magnifying mirrors in the bathrooms.",
                "liked": "\u2014 While the people made the experience, the location (beside an exquisite lake looking at mountain vista's) and the well appointed units made the stay relaxing."
            },
            "rating": 5.0,
            "stay_parameters": "Stayed July 2007, traveled as a couple",
            "text": "After searching for the perfect place to spend a week in the Laurentians, we arrived at Chateau Beauvallon and immediately proceeded to fall in love with everything about it!",
            "title": "So impressed we are coming back!!!",
            "user": "MalkaThornhill"
        },
        {
            "date": "March 31, 2007",
            "detail_rating": {
                "business": 5.0,
                "cleanliness": 5.0,
                "desk": null,
                "front_desk": 5.0,
                "location": 5.0,
                "pool": null,
                "restaurant": null,
                "rooms": 5.0,
                "service": 5.0,
                "sleep": null,
                "value": 4.0
            },
            "helpfulness": 2,
            "id": 7259991,
            "likes": {
                "disliked": "\u2014 Not being a toaster in the room",
                "liked": "\u2014 The overall look of the hotel and very frendly staff"
            },
            "rating": 5.0,
            "stay_parameters": "Stayed March 2007, traveled with family",
            "text": "The first class accommodations were gorgeous, well appointed and comfortable. The views from sunrise to sunset were spectacular. The desk staff were warm and responsive (special kudo's to Catherine). The sensational food was as gorgeous as it was delicious. Meals were served with aplomb by top notch staff who sincerely care that everything is perfect and to your taste. Friendly and efficient shuttle drivers made our stay effortless and enjoyable (thank you David, Pablo and Ian).",
            "title": "Best ever holiday",
            "user": "FrostyCheddleton"
        },
        {
            "date": "March 19, 2007",
            "detail_rating": {
                "business": 5.0,
                "cleanliness": 5.0,
                "desk": null,
                "front_desk": 5.0,
                "location": 5.0,
                "pool": null,
                "restaurant": null,
                "rooms": 5.0,
                "service": 5.0,
                "sleep": null,
                "value": 5.0
            },
            "helpfulness": 7,
            "id": 7188613,
            "likes": {
                "disliked": "\u2014 That I didn't know about the slippers before I ran to the hottub in bare feet!",
                "liked": "\u2014 Service, value, location"
            },
            "rating": 5.0,
            "stay_parameters": "Stayed March 2007, traveled with family",
            "text": "Elegant yet casual, Chateau Beauvallon is exceptional...a place that will be indelibly marked in your memories. Our high standards were not only met, they were exceeded. We were so comfortable and so impressed that we are already planning our return to this little piece of heaven!",
            "title": "Beautiful Beauvallon",
            "user": "zebra"
        },
        {
            "date": "March 15, 2007",
            "detail_rating": {
                "business": null,
                "cleanliness": null,
                "desk": null,
                "location": null,
                "pool": null,
                "restaurant": null,
                "rooms": null,
                "service": null,
                "sleep": null,
                "value": null
            },
            "helpfulness": 1,
            "id": 7164959,
            "likes": {
                "disliked": null,
                "liked": null
            },
            "rating": 3.0,
            "stay_parameters": null,
            "text": "Sherry and Joel Clodman",
            "title": "It's okay",
            "user": "horsesforsure"
        },
        {
            "date": "March 30, 2008",
            "detail_rating": {
                "business": 5.0,
                "cleanliness": 5.0,
                "desk": null,
                "front_desk": 4.0,
                "location": 4.0,
                "pool": null,
                "restaurant": null,
                "rooms": 5.0,
                "service": 4.0,
                "sleep": null,
                "value": 5.0
            },
            "helpfulness": null,
            "id": 14656980,
            "likes": {
                "disliked": "\u2014 Nothing comes to mind",
                "liked": "\u2014 The very nice rooms"
            },
            "rating": 5.0,
            "stay_parameters": "Stayed March 2008, traveled with family",
            "text": "Booked at this Hotel because it was rated so highly on Tripadvisor. Truly a nice place, very nicely appointed rooms with Kitchenette, 2 bathrooms, 2 TV's. Outdoor Jacuzzi, small pool (more for kids than adults). A large common room where you can just hang out and meet fellow travellers. Shop around for prices since they varied widely but I think we had a true bargain, spending $ 820 for 6 nights, 2 adults and 2 kids. Shuttle to the mountain, which is only 5 minutes away.",
            "title": "Truly a nice place",
            "user": "920dm66"
        },
        {
            "date": "March 29, 2008",
            "detail_rating": {
                "business": null,
                "cleanliness": null,
                "desk": null,
                "location": null,
                "pool": null,
                "restaurant": null,
                "rooms": null,
                "service": null,
                "sleep": null,
                "value": null
            },
            "helpfulness": null,
            "id": 14638613,
            "likes": {
                "disliked": null,
                "liked": null
            },
            "rating": 5.0,
            "stay_parameters": null,
            "text": "This place is a must stay! We had a beautiful 2 bedroom unit that was huge.. beds were comfy with big duvets, each room and the living room had a flat screen tv, there was a kitchenette with dishwasher, cooktop, fridge and all utensils...super quiet.",
            "title": "What a gem!",
            "user": "snarkee"
        },
        {
            "date": "March 18, 2008",
            "detail_rating": {
                "business": null,
                "cleanliness": 5.0,
                "desk": null,
                "front_desk": 4.0,
                "location": 4.0,
                "pool": null,
                "restaurant": null,
                "rooms": 5.0,
                "service": 4.0,
                "sleep": null,
                "value": 5.0
            },
            "helpfulness": null,
            "id": 14376151,
            "likes": {
                "disliked": "\u2014 average service",
                "liked": "\u2014 room"
            },
            "rating": 5.0,
            "stay_parameters": "Stayed March 2008, traveled as a couple",
            "text": "Beautifully appointed and large 2 bathrooms...Everything just top-knotch!!",
            "title": "nice hotel",
            "user": "kakow"
        },
        {
            "date": "March 16, 2008",
            "detail_rating": {
                "business": 5.0,
                "cleanliness": 5.0,
                "desk": null,
                "front_desk": 5.0,
                "location": 5.0,
                "pool": null,
                "restaurant": null,
                "rooms": 5.0,
                "service": 5.0,
                "sleep": null,
                "value": 4.0
            },
            "helpfulness": null,
            "id": 14321744,
            "likes": {
                "disliked": "\u2014 nothing!",
                "liked": "\u2014 quiet retreat away from the main village"
            },
            "rating": 4.0,
            "stay_parameters": "Stayed March 2008, traveled with family",
            "text": "The staff was outstanding, extremely accomodating and super-friendly. No problem with shuttles to the village at any time I requested.. The restaurant food was delicious and the hot tub superb.",
            "title": "Fantastic hotel for family",
            "user": "fab4ski"
        },
        {
            "date": "March 2, 2008",
            "detail_rating": {
                "business": 5.0,
                "cleanliness": 5.0,
                "desk": null,
                "front_desk": 4.0,
                "location": 5.0,
                "pool": null,
                "restaurant": null,
                "rooms": 5.0,
                "service": 4.0,
                "sleep": null,
                "value": 4.0
            },
            "helpfulness": null,
            "id": 13986997,
            "likes": {
                "disliked": "\u2014 It wasn't free",
                "liked": "\u2014 room"
            },
            "rating": 5.0,
            "stay_parameters": "Stayed February 2008, traveled with family",
            "text": "This place is a definite gem and we will most definitely be back!!",
            "title": "Wonderful",
            "user": "usmovers01"
        }
    ],
    "slim_ranking": 0.21875,
    "stars": 4,
    "tripadvisor": {
        "VISITED": false,
        "country_name": null,
        "locality": null,
        "pic_link": null,
        "street_address": null
    },
    "user_rating": 4.5,
    "variance": {
        "average": 42,
        "excellent": 235,
        "poor": 17,
        "terrible": 14,
        "very good": 64
    }
}