{
    "aka": "Club Nergis Beach Hotel Marmaris",
    "description": null,
    "detail_rating": {
        "cleanliness": 4.0,
        "location": 4.5,
        "rooms": 3.0,
        "service": 3.5,
        "sleep": 3.0,
        "value": 3.5
    },
    "location": {
        "city": null,
        "continent": "Europe",
        "country": "Turkey",
        "proposed_city": "Marmaris",
        "province": null,
        "region": "Turkish Aegean Coast"
    },
    "name": "Noa Hotel Club Nergis Beach",
    "places": {
        "aka": [
            "Marmaris"
        ],
        "hotel_description": [],
        "hotel_name": []
    },
    "review_count": 477,
    "review_count_current": 5,
    "reviews": [
        {
            "date": "December 6, 2013",
            "detail_rating": {
                "business": null,
                "cleanliness": 4.0,
                "desk": null,
                "location": 4.0,
                "pool": null,
                "restaurant": null,
                "rooms": 3.0,
                "service": 4.0,
                "sleep": 3.0,
                "value": 4.0
            },
            "helpfulness": null,
            "id": 186923589,
            "likes": {
                "disliked": null,
                "liked": null
            },
            "rating": 4.0,
            "stay_parameters": "Stayed August 2013, traveled with family",
            "text": "Fantastic hotel. Great choice of food. Activities through the day including aqua aerobics.",
            "title": "Bargain of the year",
            "user": "cookiejar28"
        },
        {
            "date": "November 21, 2013",
            "detail_rating": {
                "business": null,
                "cleanliness": 3.0,
                "desk": null,
                "location": 5.0,
                "pool": null,
                "restaurant": null,
                "rooms": 3.0,
                "service": 2.0,
                "sleep": 4.0,
                "value": 3.0
            },
            "helpfulness": null,
            "id": 185426326,
            "likes": {
                "disliked": null,
                "liked": null
            },
            "rating": 3.0,
            "stay_parameters": "Stayed October 2013, traveled as a couple",
            "text": "Will visit again :)",
            "title": "Cheap & Cheerful !!!",
            "user": "Alex A"
        },
        {
            "date": "November 3, 2013",
            "detail_rating": {
                "business": null,
                "cleanliness": 5.0,
                "desk": null,
                "location": 5.0,
                "pool": null,
                "restaurant": null,
                "rooms": 4.0,
                "service": 5.0,
                "sleep": 4.0,
                "value": 4.0
            },
            "helpfulness": null,
            "id": 183352154,
            "likes": {
                "disliked": null,
                "liked": null
            },
            "rating": 4.0,
            "stay_parameters": "Stayed October 2013, traveled as a couple",
            "text": "Close to the beach.",
            "title": "great location, lovely staff",
            "user": "redlady49"
        },
        {
            "date": "October 15, 2013",
            "detail_rating": {
                "business": null,
                "cleanliness": 3.0,
                "desk": null,
                "location": 5.0,
                "pool": null,
                "restaurant": null,
                "rooms": 2.0,
                "service": 1.0,
                "sleep": 2.0,
                "value": 1.0
            },
            "helpfulness": null,
            "id": 181162354,
            "likes": {
                "disliked": null,
                "liked": null
            },
            "rating": 1.0,
            "stay_parameters": "Stayed October 2013, traveled as a couple",
            "text": "Only downside was you have to get up early for a good sunbed.",
            "title": "good location . but thats all . stay away",
            "user": "jacko757"
        },
        {
            "date": "October 11, 2013",
            "detail_rating": {
                "business": null,
                "cleanliness": 3.0,
                "desk": null,
                "location": 5.0,
                "pool": null,
                "restaurant": null,
                "rooms": 4.0,
                "service": 3.0,
                "sleep": null,
                "value": 2.0
            },
            "helpfulness": 1,
            "id": 180554399,
            "likes": {
                "disliked": null,
                "liked": null
            },
            "rating": 2.0,
            "stay_parameters": "Stayed October 2013",
            "text": "On the plus side they didn't run out of alcohol like some all inclusives do.",
            "title": "Great location.... Food disgusting !!!!!",
            "user": "Karfhcdkhfdh"
        }
    ],
    "slim_ranking": 0.519434628975,
    "stars": 3.5,
    "tripadvisor": {
        "VISITED": false,
        "country_name": null,
        "locality": null,
        "pic_link": null,
        "street_address": null
    },
    "user_rating": 3.0,
    "variance": {
        "average": 83,
        "excellent": 90,
        "poor": 74,
        "terrible": 90,
        "very good": 140
    }
}