{
    "aka": "Plattsburgh Microtel Hotel Plattsburgh",
    "description": null,
    "detail_rating": {
        "cleanliness": null,
        "location": null,
        "rooms": null,
        "service": null,
        "sleep": null,
        "value": null
    },
    "location": {
        "city": "Plattsburgh",
        "continent": null,
        "country": "United States",
        "proposed_city": "Plattsburgh",
        "province": null,
        "region": null
    },
    "name": "Microtel Inn & Suites by Wyndham Plattsburgh",
    "places": {
        "aka": [
            "Plattsburgh"
        ],
        "hotel_description": [],
        "hotel_name": [
            "Plattsburgh"
        ]
    },
    "review_count": 339,
    "review_count_current": 21,
    "reviews": [
        {
            "date": "February 18, 2009",
            "detail_rating": {
                "business": null,
                "cleanliness": 2.0,
                "desk": null,
                "location": 3.0,
                "pool": null,
                "restaurant": null,
                "rooms": 1.0,
                "service": 2.0,
                "sleep": null,
                "value": 2.0
            },
            "helpfulness": null,
            "id": 24764287,
            "likes": {
                "disliked": null,
                "liked": null
            },
            "rating": 1.0,
            "stay_parameters": "Stayed February 2009, traveled on business",
            "text": "I was recommended to stay at this hotel as \"the nicest option in Plattsburgh.\" If true, don't stay in a hotel in Plattsburgh. Do yourself a favor and drive the extra hour into Montreal or convince your child that a different SUNY school would be a better choice. Despite a reservation guarantee, my room type was not available when I arrived in the late afternoon for check-in. Though I was given a non-smoking room as I requested, it was on a mixed smoking / non-smoking floor and the non-smoking policy was not enforced in the non-smoking rooms around mine. I requested a transfer as adjacent rooms were loud and smoke-filled (despite the alleged \"smoke-free environment\"). Front desk staff was unwilling to remedy any of the problems during my stay.",
            "title": "Horrible experience. Stay away!",
            "user": "JPCJR"
        },
        {
            "date": "February 11, 2009",
            "detail_rating": {
                "business": 5.0,
                "cleanliness": 5.0,
                "desk": null,
                "front_desk": 5.0,
                "location": 3.0,
                "pool": null,
                "restaurant": null,
                "rooms": 5.0,
                "service": 5.0,
                "sleep": null,
                "value": 4.0
            },
            "helpfulness": null,
            "id": 24471679,
            "likes": {
                "disliked": "\u2014 That I had to leave.",
                "liked": "\u2014 The modern, bright, and airy room"
            },
            "rating": 5.0,
            "stay_parameters": "Stayed August 2006, traveled on business",
            "text": "This hotel is a gem. The rooms are so interestingly laid out - we had a suite-let, as it were, with an efficiently laid out kitchenette, a very comfortable dining table, and a very comfortable bed. I loved the blonde wood and modernity - almost a boutique atmosphere at these prices and at this unexpected location. I was racing up to Montreal on business and I was so tired so I appreciated the efficient front-desk personnel (a handsome young French-Canadian, I think).",
            "title": "Bright and Modern",
            "user": "AngloAm"
        },
        {
            "date": "August 26, 2008",
            "detail_rating": {
                "business": 4.0,
                "cleanliness": 5.0,
                "desk": null,
                "front_desk": 5.0,
                "location": 5.0,
                "pool": null,
                "restaurant": null,
                "rooms": 5.0,
                "service": 5.0,
                "sleep": null,
                "value": 5.0
            },
            "helpfulness": null,
            "id": 19402585,
            "likes": {
                "disliked": "\u2014 Can't think of anything",
                "liked": "\u2014 Clean, quiet, good value, friendly"
            },
            "rating": 5.0,
            "stay_parameters": "Stayed August 2008, traveled with family",
            "text": "We stayed here for one night. The hotel seems new and the room was a nice size with comfortable beds and a small refrigerator and microwave. We had 2 beds but there's also a window seat with cushion and a child could sleep there. The staff was very friendly and helpful. Typical continental breakfast but the coffee was better...Green Mt coffee. We'd definitely stay here again.",
            "title": "Very nice place to stay",
            "user": "corinascot"
        },
        {
            "date": "August 24, 2008",
            "detail_rating": {
                "business": 5.0,
                "cleanliness": 5.0,
                "desk": null,
                "front_desk": 5.0,
                "location": 5.0,
                "pool": null,
                "restaurant": null,
                "rooms": 5.0,
                "service": 5.0,
                "sleep": null,
                "value": 5.0
            },
            "helpfulness": null,
            "id": 19307529,
            "likes": {
                "disliked": null,
                "liked": "\u2014 The people at the front desk, the staff in general. They went out of their way for us."
            },
            "rating": 5.0,
            "stay_parameters": "Stayed August 2008, traveled with friends",
            "text": "We had left another hotel, becasue its deplorable condition and the Microtel accomodated us on the busiest weekend of the year. They moved us from one room to another the next day, and made sure we could just transfer easily.",
            "title": "Excellent service",
            "user": "coda31"
        },
        {
            "date": "August 23, 2008",
            "detail_rating": {
                "business": 5.0,
                "cleanliness": 5.0,
                "desk": null,
                "front_desk": 5.0,
                "location": 5.0,
                "pool": null,
                "restaurant": null,
                "rooms": 5.0,
                "service": 5.0,
                "sleep": null,
                "value": 4.0
            },
            "helpfulness": null,
            "id": 19282432,
            "likes": {
                "disliked": "\u2014 More variety in vending machines",
                "liked": "\u2014 The cleanliness of the room and friendly and accommodating front desk person"
            },
            "rating": 4.0,
            "stay_parameters": "Stayed August 2008, traveled with family",
            "text": "They were kind, accomodating and generous with their time and advise.",
            "title": "Very accommodating hotel!",
            "user": "Momof2collegesons"
        },
        {
            "date": "June 14, 2009",
            "detail_rating": {
                "business": null,
                "cleanliness": 5.0,
                "desk": null,
                "location": 5.0,
                "pool": null,
                "restaurant": null,
                "rooms": 5.0,
                "service": 5.0,
                "sleep": null,
                "value": 5.0
            },
            "helpfulness": null,
            "id": 32331225,
            "likes": {
                "disliked": null,
                "liked": null
            },
            "rating": 5.0,
            "stay_parameters": "Stayed May 2009, traveled with family",
            "text": "The suite we had for three of us provided ample room, complete with two tv's, a microwave, refrig and granite counter that served as a room divider. The concept was very good. The staff were friendly, helpful and accessible. The green mountain coffee in the lobby was great and the breakfast selection each morning was just right. This is a hotel I would recommend to anyone and look forward to staying here again.",
            "title": "Definitely exceeded our expectations",
            "user": "Liz1953"
        },
        {
            "date": "May 21, 2009",
            "detail_rating": {
                "business": null,
                "cleanliness": 5.0,
                "desk": null,
                "location": 5.0,
                "pool": null,
                "restaurant": null,
                "rooms": 3.0,
                "service": 5.0,
                "sleep": null,
                "value": 3.0
            },
            "helpfulness": 1,
            "id": 30477145,
            "likes": {
                "disliked": null,
                "liked": null
            },
            "rating": 4.0,
            "stay_parameters": "Stayed May 2009, traveled as a couple",
            "text": "The decor in most modern hotels reminds me of the inside of an envelope, but I really found the Microtel quite nice. And whatever my biases against bland builder-beige styling, this place more than makes up for it by remaining super clean, super nice, and super helpful.",
            "title": "Neat, Tidy, Gets the Job Done Nicely",
            "user": "NYCADK"
        },
        {
            "date": "April 9, 2009",
            "detail_rating": {
                "business": null,
                "cleanliness": 5.0,
                "desk": null,
                "location": 5.0,
                "pool": null,
                "restaurant": null,
                "rooms": 5.0,
                "service": 5.0,
                "sleep": null,
                "value": 5.0
            },
            "helpfulness": null,
            "id": 27711570,
            "likes": {
                "disliked": null,
                "liked": null
            },
            "rating": 5.0,
            "stay_parameters": "Stayed April 2009, traveled with family",
            "text": "The extras are really quite wonderful - A computer in the lobby for free guest use, a nice sitting room downstairs, a far-better-than-average continental breakfast, and Green Mountain coffee available all day long.",
            "title": "Im not complaining",
            "user": "vreardon"
        },
        {
            "date": "February 27, 2009",
            "detail_rating": {
                "business": null,
                "cleanliness": 5.0,
                "desk": null,
                "location": 5.0,
                "pool": null,
                "restaurant": null,
                "rooms": 5.0,
                "service": 5.0,
                "sleep": null,
                "value": 5.0
            },
            "helpfulness": null,
            "id": 25296401,
            "likes": {
                "disliked": null,
                "liked": null
            },
            "rating": 5.0,
            "stay_parameters": "Stayed February 2009, traveled as a couple",
            "text": "The staff was very kind, and not in a creepy way. Even after checkout when we called to ask if we had left some keys in the room, they checked a second time without being asked. Other perks include great beds and that fact that the parking lot is easy to get into and out of ... a rare feature in the chain store and big box area of Plattsburgh.",
            "title": "I don't think that you can get better value for the price!",
            "user": "Kiko-01"
        },
        {
            "date": "February 19, 2009",
            "detail_rating": {
                "business": null,
                "cleanliness": 5.0,
                "desk": null,
                "location": 4.0,
                "pool": null,
                "restaurant": null,
                "rooms": 5.0,
                "service": 5.0,
                "sleep": null,
                "value": 5.0
            },
            "helpfulness": null,
            "id": 24817632,
            "likes": {
                "disliked": null,
                "liked": null
            },
            "rating": 5.0,
            "stay_parameters": "Stayed February 2009, traveled as a couple",
            "text": "You go, Microtel. Awesome.",
            "title": "Everything we want in a reasonably priced hotel",
            "user": "Lupinsan"
        },
        {
            "date": "June 24, 2008",
            "detail_rating": {
                "business": 5.0,
                "cleanliness": 5.0,
                "desk": null,
                "front_desk": 4.0,
                "location": 4.0,
                "pool": null,
                "restaurant": null,
                "rooms": 5.0,
                "service": 4.0,
                "sleep": null,
                "value": 5.0
            },
            "helpfulness": null,
            "id": 17191605,
            "likes": {
                "disliked": "\u2014 location to event that we went to",
                "liked": "\u2014 very clean"
            },
            "rating": 5.0,
            "stay_parameters": "Stayed June 2008, traveled on business",
            "text": "We stayed at the Microtel for two nights in a queen suite. The room was very clean, bright, and large. The staff seemed friendly and helpful. It was a great value for our money and will stay again if we are in the area.",
            "title": "Very comfortable stay at Microtel",
            "user": "CedarRaleigh_NC"
        },
        {
            "date": "April 17, 2008",
            "detail_rating": {
                "business": null,
                "cleanliness": 5.0,
                "desk": null,
                "front_desk": 5.0,
                "location": 4.0,
                "pool": null,
                "restaurant": null,
                "rooms": 4.0,
                "service": 5.0,
                "sleep": null,
                "value": 5.0
            },
            "helpfulness": null,
            "id": 15094111,
            "likes": {
                "disliked": "\u2014 bathtub size & towels",
                "liked": "\u2014 clean room at a good price"
            },
            "rating": 4.0,
            "stay_parameters": "Stayed June 2008, traveled as a couple",
            "text": "Stayed on a Saturday night. Small rooms, but exceptionally clean, modern and comfortable. Friendly, courteous staff. We previously stayed at the Comfort Inn in Plattsburgh for twice the price. Close by to restaurants and stores. Nice breakfast in the morning although we only had time for coffee.If I had any complaints, it would be that the tub in the bathroom was extremely small and narrow, barely enough room to sit and not really able to soak, as is my first priority after a long day traveling. Also there were just enough towels in the bathroom, and not extremely large or plush. I would, however recommend this hotel and would definitely stay there again.",
            "title": "clean room,great price",
            "user": "NancyO61"
        },
        {
            "date": "March 30, 2008",
            "detail_rating": {
                "business": 5.0,
                "cleanliness": 5.0,
                "desk": null,
                "front_desk": 5.0,
                "location": 5.0,
                "pool": null,
                "restaurant": null,
                "rooms": 4.0,
                "service": 5.0,
                "sleep": null,
                "value": 5.0
            },
            "helpfulness": null,
            "id": 14659767,
            "likes": {
                "disliked": null,
                "liked": "\u2014 Clean"
            },
            "rating": 5.0,
            "stay_parameters": "Stayed March 2008, traveled solo",
            "text": "I was referred to this hotel by a friend and although I didn't have great expectations, I was very pleasantly surprised!",
            "title": "Perfect!",
            "user": "LeopardLatte"
        },
        {
            "date": "July 24, 2007",
            "detail_rating": {
                "business": 5.0,
                "cleanliness": 5.0,
                "desk": null,
                "front_desk": 5.0,
                "location": 3.0,
                "pool": null,
                "restaurant": null,
                "rooms": 5.0,
                "service": 5.0,
                "sleep": null,
                "value": 5.0
            },
            "helpfulness": null,
            "id": 8228355,
            "likes": {
                "disliked": "\u2014 Hour from Lake Placid (where the event was)",
                "liked": "\u2014 Great price"
            },
            "rating": 5.0,
            "stay_parameters": "Stayed July 2007, traveled as a couple",
            "text": "The staff were so welcoming and helpful with directions and suggestions.",
            "title": "Great Hotel",
            "user": "bwgreen"
        },
        {
            "date": "November 11, 2006",
            "detail_rating": {
                "business": 5.0,
                "cleanliness": 5.0,
                "desk": null,
                "front_desk": 5.0,
                "location": 5.0,
                "pool": null,
                "restaurant": null,
                "rooms": 5.0,
                "service": 5.0,
                "sleep": null,
                "value": null
            },
            "helpfulness": 2,
            "id": 6106721,
            "likes": {
                "disliked": "\u2014 Nothing",
                "liked": "\u2014 Clean"
            },
            "rating": 5.0,
            "stay_parameters": "Stayed November 2006, traveled solo",
            "text": "Although small, my room was clean and well appointed. The bathroom was stocked with everything you need, including bath towels of a nice size.",
            "title": "Great hotel!!!!",
            "user": "Frequent"
        },
        {
            "date": "October 2, 2006",
            "detail_rating": {
                "business": 5.0,
                "cleanliness": 5.0,
                "desk": null,
                "front_desk": 5.0,
                "location": 5.0,
                "pool": null,
                "restaurant": null,
                "rooms": 5.0,
                "service": 5.0,
                "sleep": null,
                "value": 5.0
            },
            "helpfulness": 2,
            "id": 5900990,
            "likes": {
                "disliked": "\u2014 N/A",
                "liked": "\u2014 The cleanliness and courteous staff"
            },
            "rating": 5.0,
            "stay_parameters": "Stayed September 2006, traveled on business",
            "text": "The hotel was clean, the staff was courteous and had everything ready for you. I have stayed at this hotel multiple times and is the hotel of choice.",
            "title": "Excellent affordable and clean",
            "user": "biz_travelr"
        },
        {
            "date": "September 21, 2009",
            "detail_rating": {
                "business": null,
                "cleanliness": 5.0,
                "desk": null,
                "location": 5.0,
                "pool": null,
                "restaurant": null,
                "rooms": 5.0,
                "service": 5.0,
                "sleep": null,
                "value": 5.0
            },
            "helpfulness": null,
            "id": 43456860,
            "likes": {
                "disliked": null,
                "liked": null
            },
            "rating": 5.0,
            "stay_parameters": "Stayed September 2009, traveled with family",
            "text": "My husband & I along with about 5 other families stayed at the Microtel last weekend for a family party and were very happy with our choice. Our room was immaculate as was the entire hotel. The staff was very friendly and helpful. The location is great, within walking distance to restaurants and stores. The rates were very reasonable and even included a continental breakfast. The only negative is that the walls are very thin - I could actually hear the person in the next room to us snoring at night. Other than that, I would definitely recommend staying here.",
            "title": "Very happy with the Microtel in Plattsburgh",
            "user": "SuzanneE"
        },
        {
            "date": "August 22, 2009",
            "detail_rating": {
                "business": null,
                "cleanliness": null,
                "desk": null,
                "location": null,
                "pool": null,
                "restaurant": null,
                "rooms": null,
                "service": null,
                "sleep": null,
                "value": null
            },
            "helpfulness": null,
            "id": 38487674,
            "likes": {
                "disliked": null,
                "liked": null
            },
            "rating": 3.0,
            "stay_parameters": null,
            "text": "Hi, i have stayed at the Microtel twice before. My son will be a freshman at Plattsburgh, and each of the two times I came up to visit the campus with him, I relied on tripadvisor rankings and was thoroughly satisfied.",
            "title": "Repeat visitor disappointed this time!",
            "user": "mchgh"
        },
        {
            "date": "August 2, 2009",
            "detail_rating": {
                "business": null,
                "cleanliness": 3.0,
                "desk": null,
                "location": 4.0,
                "pool": null,
                "restaurant": null,
                "rooms": 2.0,
                "service": 2.0,
                "sleep": null,
                "value": 2.0
            },
            "helpfulness": 2,
            "id": 36529730,
            "likes": {
                "disliked": null,
                "liked": null
            },
            "rating": 3.0,
            "stay_parameters": "Stayed August 2009, traveled as a couple",
            "text": "When my son came up in July for orientation, I booked at the front desk two further stays: check-in in August and parent's weekend in September. I liked the hotel and wanted to make sure we could stay there during those designated dates.",
            "title": "Not sure why it was #1",
            "user": "turcos333"
        },
        {
            "date": "July 14, 2009",
            "detail_rating": {
                "business": null,
                "cleanliness": 5.0,
                "desk": null,
                "location": 5.0,
                "pool": null,
                "restaurant": null,
                "rooms": 5.0,
                "service": 5.0,
                "sleep": null,
                "value": 5.0
            },
            "helpfulness": null,
            "id": 34734475,
            "likes": {
                "disliked": null,
                "liked": null
            },
            "rating": 5.0,
            "stay_parameters": "Stayed May 2009, traveled with friends",
            "text": "When I called 10 days before freshmen move-in to confirm, I was told by the hotel that they did not have my reservation. Yet, when I called the Microtel 1-800 customer service number, they had my reservation for 2 nights in a queen suite. When I called the Plattsburgh Microtel back, i spoke to Kristy numerous times and also their manager, they could see my reservations on the 1-800 site, but not on their Plattsburgh site. Utlimately , what happened was, we got I queen room, no suite for 1 Friday night. No apologies, no explanations, even though the manager could see the reservation on the 1-800 general customer service screen. I will say that everyone I spoke to was exceedingly polite!",
            "title": "The best",
            "user": "dgidgilolo"
        },
        {
            "date": "June 22, 2009",
            "detail_rating": {
                "business": null,
                "cleanliness": 5.0,
                "desk": null,
                "location": 5.0,
                "pool": null,
                "restaurant": null,
                "rooms": 5.0,
                "service": 5.0,
                "sleep": null,
                "value": 5.0
            },
            "helpfulness": null,
            "id": 32914115,
            "likes": {
                "disliked": null,
                "liked": null
            },
            "rating": 5.0,
            "stay_parameters": "Stayed June 2009, traveled on business",
            "text": "Pleasant room, except for the 10-12 15-18 year old females that inhabited the room next to us and down the hall. I believe I am being graceful in saying that I got 3 hours of sleep that night. The walls are paper thin, the girls were screaming, slamming doors, going back and forth. I knew every detail of their social life!",
            "title": "Fabulous hospitality, safe and friendly hotel",
            "user": "Fiat5cento"
        }
    ],
    "slim_ranking": 0.142857142857,
    "stars": 2,
    "tripadvisor": {
        "VISITED": false,
        "country_name": null,
        "locality": null,
        "pic_link": null,
        "street_address": null
    },
    "user_rating": 4.5,
    "variance": {
        "average": 28,
        "excellent": 191,
        "poor": 5,
        "terrible": 4,
        "very good": 111
    }
}