{
    "aka": "Tarrytown House Estate On The Hudson Hotel",
    "description": "Just 25 miles from Midtown Manhattan this estate blends historical charm with modern conveniences. Residing on 26-acres overlooking the Lower Hudson River Valley, well-appointed lodging is found at Tarrytown House Estate, featuring impressive 19th-century mansions - King Mansion and Biddle Mansion - a Carriage House and The Cottage. A Perfect getaway for a weekend escape from the city or a destination wedding, Tarrytown House Estate offers luxurious Hudson Valley lodging and amenities. This landmark hotel in Westchester, NY features extensive leisure and recreational facilities such as a fitness center, indoor and outdoor swimming pools, seasonal basketball, volleyball, bocce, horse-shoes and tennis courts. Historic Westchester County proves to enhance a visitor's Hudson Valley lodging experience with incredible opportunities for Hudson River Valley antiquing, boating, hiking and sightseeing. Enjoy any or all of these activities among the rich and historic atmosphere known as home to Westchester, New York's famous sites including the Washington Irving's Sunnyside, Philipsburg Manor and the spectacular Rockefeller estate, Kykuit. While staying at Tarrytown House Estate, guests can experience the many attractions that the Hudson Valley has to offer including the scenic Hudson Park, Neuberger Museum of Art, Grand Prix New York Racing, and the Cortlandt Heritage Museum. The hotel is also located only 5 miles away from Stone Barns Center for Food and Agriculture where guests can enjoy various dishes made from locally grown produce and ingredients at the center's restaurant, Blue Hill at Stone Barns. The hotel is also near the United States Military Academy at West Point, offering convenient accommodations during graduation or family events at the academy.",
    "detail_rating": {
        "cleanliness": 4.5,
        "location": 4.5,
        "rooms": 4.5,
        "service": 4.5,
        "sleep": 4.5,
        "value": 4.5
    },
    "location": {
        "city": null,
        "continent": null,
        "country": "United States",
        "proposed_city": "Hudson",
        "province": null,
        "region": null
    },
    "name": "Tarrytown House Estate & Conference Center",
    "places": {
        "aka": [
            "Hudson"
        ],
        "hotel_description": [
            "Manhattan",
            "Hudson",
            "Westchester",
            "York",
            "Washington",
            "Irving",
            "Sunnyside",
            "Philipsburg"
        ],
        "hotel_name": []
    },
    "review_count": 614,
    "review_count_current": 20,
    "reviews": [
        {
            "date": "June 7, 2012",
            "detail_rating": {
                "business": null,
                "cleanliness": 5.0,
                "desk": null,
                "location": 5.0,
                "pool": null,
                "restaurant": null,
                "rooms": 5.0,
                "service": 5.0,
                "sleep": 5.0,
                "value": 5.0
            },
            "helpfulness": 1,
            "id": 131483338,
            "likes": {
                "disliked": null,
                "liked": null
            },
            "rating": 5.0,
            "stay_parameters": "Stayed June 2012, traveled with family",
            "text": "The opulence of the gardens and the stately mansion was an oasis of relaxation after an",
            "title": "\"Its out of the great Gastby\"",
            "user": "Goldie73_11"
        },
        {
            "date": "June 6, 2012",
            "detail_rating": {
                "business": null,
                "cleanliness": 5.0,
                "desk": null,
                "location": 5.0,
                "pool": null,
                "restaurant": null,
                "rooms": 5.0,
                "service": 5.0,
                "sleep": 5.0,
                "value": 4.0
            },
            "helpfulness": 2,
            "id": 131446106,
            "likes": {
                "disliked": null,
                "liked": null
            },
            "rating": 5.0,
            "stay_parameters": "Stayed May 2012, traveled as a couple",
            "text": "eight hour Trek.",
            "title": "Tarrytown House estate in NY",
            "user": "Norma310"
        },
        {
            "date": "June 4, 2012",
            "detail_rating": {
                "business": null,
                "cleanliness": 5.0,
                "desk": null,
                "location": 5.0,
                "pool": null,
                "restaurant": null,
                "rooms": 5.0,
                "service": 5.0,
                "sleep": 5.0,
                "value": 5.0
            },
            "helpfulness": 1,
            "id": 131260564,
            "likes": {
                "disliked": null,
                "liked": null
            },
            "rating": 5.0,
            "stay_parameters": "Stayed June 2012, traveled with family",
            "text": "The staff was were very professional and accomodating. The rooms were spotless.",
            "title": "Exceptional.",
            "user": "jonesjosephr"
        },
        {
            "date": "June 3, 2012",
            "detail_rating": {
                "business": null,
                "cleanliness": 3.0,
                "desk": null,
                "location": null,
                "pool": null,
                "restaurant": null,
                "rooms": 3.0,
                "service": null,
                "sleep": null,
                "value": 2.0
            },
            "helpfulness": 6,
            "id": 131189953,
            "likes": {
                "disliked": null,
                "liked": null
            },
            "rating": 3.0,
            "stay_parameters": "Stayed May 2012, traveled with family",
            "text": "We enjoyed a pleasant diner. Also a marvelous Buffet breakfast served in a solarium facing rolling gardens.",
            "title": "Disappointed",
            "user": "Carrie R"
        },
        {
            "date": "May 28, 2012",
            "detail_rating": {
                "business": null,
                "cleanliness": 5.0,
                "desk": null,
                "location": 5.0,
                "pool": null,
                "restaurant": null,
                "rooms": 5.0,
                "service": 5.0,
                "sleep": 5.0,
                "value": 5.0
            },
            "helpfulness": 1,
            "id": 130824171,
            "likes": {
                "disliked": null,
                "liked": null
            },
            "rating": 5.0,
            "stay_parameters": "Stayed May 2012, traveled with family",
            "text": "The aura of peace and quiet was all around,even with a large wedding party,there were no disturbance.",
            "title": "Tarrytown House Estate is Tops",
            "user": "playfellow"
        },
        {
            "date": "June 25, 2012",
            "detail_rating": {
                "business": null,
                "cleanliness": 5.0,
                "desk": null,
                "location": 5.0,
                "pool": null,
                "restaurant": null,
                "rooms": 5.0,
                "service": 5.0,
                "sleep": null,
                "value": 5.0
            },
            "helpfulness": 1,
            "id": 132777758,
            "likes": {
                "disliked": null,
                "liked": null
            },
            "rating": 5.0,
            "stay_parameters": "Stayed June 2012",
            "text": "We were very quickly and warmly greeted. All staff, from the front desk to housekeeping, were friendly and helpful. The rooms were clean and comfortable. We will definitely come back to Tarrytown House Estate again.",
            "title": "Great weekend getaway.",
            "user": "adoptforlove"
        },
        {
            "date": "June 22, 2012",
            "detail_rating": {
                "business": null,
                "cleanliness": 4.0,
                "desk": null,
                "location": 4.0,
                "pool": null,
                "restaurant": null,
                "rooms": 3.0,
                "service": 2.0,
                "sleep": 5.0,
                "value": 3.0
            },
            "helpfulness": 2,
            "id": 132564993,
            "likes": {
                "disliked": null,
                "liked": null
            },
            "rating": 3.0,
            "stay_parameters": "Stayed March 2012, traveled as a couple",
            "text": "There was nothing really wrong with the standard room we had (for $109 via Sniqueaway), but several issues are keeping me from giving a better rating.",
            "title": "Good option to stay in NYC on a budget if you can get a deal around $100",
            "user": "albgardis"
        },
        {
            "date": "June 22, 2012",
            "detail_rating": {
                "business": null,
                "cleanliness": 5.0,
                "desk": null,
                "location": 5.0,
                "pool": null,
                "restaurant": null,
                "rooms": 5.0,
                "service": 5.0,
                "sleep": 5.0,
                "value": 5.0
            },
            "helpfulness": 2,
            "id": 132525431,
            "likes": {
                "disliked": null,
                "liked": null
            },
            "rating": 5.0,
            "stay_parameters": "Stayed June 2012, traveled with family",
            "text": "First: the check in issues we had with the front desk. I had made booking via Snq before, and as usually I had put my online name in when asked for my name, my legal name is not shared online. Never before was that an issue in any other hotel, because they only cared for the OTHER name, the name on the credit card which paid for the booking.",
            "title": "Great place",
            "user": "STEVE S"
        },
        {
            "date": "June 21, 2012",
            "detail_rating": {
                "business": null,
                "cleanliness": 3.0,
                "desk": null,
                "location": 4.0,
                "pool": null,
                "restaurant": null,
                "rooms": 3.0,
                "service": 2.0,
                "sleep": 3.0,
                "value": 2.0
            },
            "helpfulness": 2,
            "id": 132484636,
            "likes": {
                "disliked": null,
                "liked": null
            },
            "rating": 2.0,
            "stay_parameters": "Stayed July 2011, traveled with friends",
            "text": "Now that other name is Hubby's, and I had put in his (real) name, like I always do, because he is the one showing ID and credit card at check in (not me!!), and I am just standing there trying to look pretty...",
            "title": "poor management",
            "user": "54toast"
        },
        {
            "date": "June 19, 2012",
            "detail_rating": {
                "business": null,
                "cleanliness": 2.0,
                "desk": null,
                "location": 5.0,
                "pool": null,
                "restaurant": null,
                "rooms": 2.0,
                "service": 3.0,
                "sleep": null,
                "value": 2.0
            },
            "helpfulness": 5,
            "id": 132285278,
            "likes": {
                "disliked": null,
                "liked": null
            },
            "rating": 3.0,
            "stay_parameters": "Stayed June 2012",
            "text": "Now THIS TIME it was different: they wanted to see an ID for the online name I used (my Snq username), which (of course) does not exist. I explained the concept of an online identity verses the real life (legal) identity and why they should never meet each other.",
            "title": "Totally Disappointing.",
            "user": "GMoney74"
        },
        {
            "date": "June 18, 2012",
            "detail_rating": {
                "business": null,
                "cleanliness": 4.0,
                "desk": null,
                "location": 4.0,
                "pool": null,
                "restaurant": null,
                "rooms": 3.0,
                "service": 5.0,
                "sleep": 4.0,
                "value": 3.0
            },
            "helpfulness": 1,
            "id": 132216202,
            "likes": {
                "disliked": null,
                "liked": null
            },
            "rating": 4.0,
            "stay_parameters": "Stayed June 2012, traveled as a couple",
            "text": "If you lead busy lives in Manhattan, the Tarrytown Estate offers the perfect weekend getaway. The hotel however is not quite as luxurious as the photos would make it out to be. Yes, the pool and the grounds are a delight but the rooms are in need of updating. The vast majority are NOT located in either of the two mansion houses on the estate but in purpose-built blocks. As such, they are more functional than attractive. It's clearly a hotel that makes its money from hosting conferences and hospitality events. I would not recommend it for a romantic weekend - too impersonal. I used the 'sports center' - again, a facility that looks a little tired but all the machines worked so I got my work-out! Nice to step out of the gym and straight into the pool area! Our bed was very comfortable, the towels fluffy and the toiletries of a good standard even if they didn't provide any shower gel, just shampoo and conditioner. The hotel's location means it is not really suitable for those without a car. You would end up spending a lot of money on cab fares.",
            "title": "A Little Tired At The Edges",
            "user": "BrightonBN1"
        },
        {
            "date": "June 16, 2012",
            "detail_rating": {
                "business": null,
                "cleanliness": 4.0,
                "desk": null,
                "location": 3.0,
                "pool": null,
                "restaurant": null,
                "rooms": 4.0,
                "service": 3.0,
                "sleep": 4.0,
                "value": 3.0
            },
            "helpfulness": 3,
            "id": 132124610,
            "likes": {
                "disliked": null,
                "liked": null
            },
            "rating": 3.0,
            "stay_parameters": "Stayed June 2012, traveled solo",
            "text": "Room was impeccable, although it was a LONG walk & 4 flights of stairs to get anywhere in the hotel. Noisy vents outside my room forced me to run air cond when I would have enjoyed the fresh air..They told me there was no elevator in the hotel....untrue. Nice toiletries & immaculate bathroom, but the door handle fell off in my hand. Multiple TV stations advertised but not available. Discounted (50%) $20 breakfast was mediocre. Helpful staff....a little hard to find the hotel, even with GPS . I would stay again at a discounted rate but never for the full rate.",
            "title": "Not QUITE a 4*",
            "user": "nursely"
        },
        {
            "date": "June 15, 2012",
            "detail_rating": {
                "business": null,
                "cleanliness": 5.0,
                "desk": null,
                "location": 4.0,
                "pool": null,
                "restaurant": null,
                "rooms": 5.0,
                "service": 5.0,
                "sleep": 5.0,
                "value": 4.0
            },
            "helpfulness": 1,
            "id": 132064059,
            "likes": {
                "disliked": null,
                "liked": null
            },
            "rating": 5.0,
            "stay_parameters": "Stayed May 2012, traveled on business",
            "text": "Facility was beautiful, and the room was so comfortable (I want to buy the bed I slept in). Very clean as well. The customer service from the moment I walked through the door and after the two dress I left were returned to me (Thank You Rita!!!!!) was the best I have ever experience. Take time to stop at the bar, wonderful atmosphere, and once again very good service!",
            "title": "Superior customer service",
            "user": "Amyd158"
        },
        {
            "date": "June 11, 2012",
            "detail_rating": {
                "business": null,
                "cleanliness": 5.0,
                "desk": null,
                "location": 5.0,
                "pool": null,
                "restaurant": null,
                "rooms": 5.0,
                "service": 5.0,
                "sleep": 5.0,
                "value": 5.0
            },
            "helpfulness": 2,
            "id": 131786594,
            "likes": {
                "disliked": null,
                "liked": null
            },
            "rating": 5.0,
            "stay_parameters": "Stayed June 2012, traveled with family",
            "text": "It was an excellent experience and offered our family there for a wedding an opportunity to relax and enjoy.",
            "title": "fabulous",
            "user": "Susie C"
        },
        {
            "date": "June 11, 2012",
            "detail_rating": {
                "business": null,
                "cleanliness": 3.0,
                "desk": null,
                "location": 4.0,
                "pool": null,
                "restaurant": null,
                "rooms": 4.0,
                "service": 4.0,
                "sleep": 4.0,
                "value": 4.0
            },
            "helpfulness": 2,
            "id": 131784950,
            "likes": {
                "disliked": null,
                "liked": null
            },
            "rating": 4.0,
            "stay_parameters": "Stayed June 2012, traveled with friends",
            "text": "Went for a friend's wedding. Location was amazing. Wonderful views. Food and drink and service were all wonderful. Great place to celebrate!",
            "title": "Great location!",
            "user": "PiscesV"
        },
        {
            "date": "May 27, 2012",
            "detail_rating": {
                "business": null,
                "cleanliness": 3.0,
                "desk": null,
                "location": 3.0,
                "pool": null,
                "restaurant": null,
                "rooms": 2.0,
                "service": 2.0,
                "sleep": 2.0,
                "value": 2.0
            },
            "helpfulness": 3,
            "id": 130673660,
            "likes": {
                "disliked": null,
                "liked": null
            },
            "rating": 2.0,
            "stay_parameters": "Stayed May 2012, traveled as a couple",
            "text": "You have to be physically fit to get to your room.We checked in late, no one there to offer to help with the luggage and then our journey began...iit took about 20 minutes to walk a maze of stairs, elevators and hallways to get to our room.Once there, we were unimpressed.",
            "title": "the maze hotel",
            "user": "codybeardc"
        },
        {
            "date": "May 23, 2012",
            "detail_rating": {
                "business": null,
                "cleanliness": null,
                "desk": null,
                "location": null,
                "pool": null,
                "restaurant": null,
                "rooms": null,
                "service": null,
                "sleep": null,
                "value": null
            },
            "helpfulness": 2,
            "id": 130496522,
            "likes": {
                "disliked": null,
                "liked": null
            },
            "rating": 2.0,
            "stay_parameters": null,
            "text": "There was nothing special about the room, we could have been in a Hampton Inn, which by the way is sooooo much better. I LOVE Hampton Inns.",
            "title": "New York Driving and Sightseeing adventure after the Grand Fondo",
            "user": "Upski"
        },
        {
            "date": "May 23, 2012",
            "detail_rating": {
                "business": null,
                "cleanliness": 5.0,
                "desk": null,
                "location": 5.0,
                "pool": null,
                "restaurant": null,
                "rooms": 5.0,
                "service": 5.0,
                "sleep": 5.0,
                "value": 5.0
            },
            "helpfulness": 1,
            "id": 130482251,
            "likes": {
                "disliked": null,
                "liked": null
            },
            "rating": 5.0,
            "stay_parameters": "Stayed May 2012, traveled as a couple",
            "text": "This hotel shared the following:",
            "title": "- A great place to stay, with wonderful history all around. -",
            "user": "Brooklyn1954_12"
        },
        {
            "date": "May 23, 2012",
            "detail_rating": {
                "business": null,
                "cleanliness": 5.0,
                "desk": null,
                "location": 5.0,
                "pool": null,
                "restaurant": null,
                "rooms": 5.0,
                "service": 5.0,
                "sleep": 5.0,
                "value": 4.0
            },
            "helpfulness": null,
            "id": 130462754,
            "likes": {
                "disliked": null,
                "liked": null
            },
            "rating": 5.0,
            "stay_parameters": "Stayed May 2012, traveled on business",
            "text": "No Bell service for luggage even though they ask that you move your car a fair distance from your room. Great landscaping while you move your luggage. TV had controls were fixed so you could not hear the TV and we chose several movies to watch with no luck. Had a $50. food credit and told a 9 am the kitchen was closed and we could only order room service which took 45 minutes for oatmeal and cold coffee. Oatmeal was the largest bowl I have ever see and would have feed 4 people at ($11.00 a bowl). This experience was less than special and we will not return or recommend.",
            "title": "Great Conference Hotel",
            "user": "ChiT0wnTravelers"
        },
        {
            "date": "May 21, 2012",
            "detail_rating": {
                "business": null,
                "cleanliness": 5.0,
                "desk": null,
                "location": 5.0,
                "pool": null,
                "restaurant": null,
                "rooms": 5.0,
                "service": 5.0,
                "sleep": 5.0,
                "value": 5.0
            },
            "helpfulness": 1,
            "id": 130340168,
            "likes": {
                "disliked": null,
                "liked": null
            },
            "rating": 5.0,
            "stay_parameters": "Stayed May 2012, traveled as a couple",
            "text": "- Best place to stay in upstate, NY. Wonderful grounds. Great Hotel (Conference Center). Quiet. Peaceful. Beautiful. Surrounded by wonderful history and stores to shop at, and lots of little places to eat and relax. Plenty of activities for you. - I've stayed there many times over the years. - You can't beat it!! -",
            "title": "All-around wonderful stay!",
            "user": "MaineCoastLover38"
        }
    ],
    "slim_ranking": 0.166666666667,
    "stars": 3.5,
    "tripadvisor": {
        "VISITED": false,
        "country_name": null,
        "locality": null,
        "pic_link": null,
        "street_address": null
    },
    "user_rating": 4.5,
    "variance": {
        "average": 59,
        "excellent": 387,
        "poor": 28,
        "terrible": 12,
        "very good": 128
    }
}