{
    "aka": "Courtyard By Marriott Tampa Oldsmar Hotel",
    "description": null,
    "detail_rating": {
        "cleanliness": null,
        "location": null,
        "rooms": null,
        "service": null,
        "sleep": null,
        "value": null
    },
    "location": {
        "city": "Oldsmar",
        "continent": null,
        "country": "United States",
        "proposed_city": "Tampa",
        "province": null,
        "region": null
    },
    "name": "Courtyard by Marriott Tampa Oldsmar",
    "places": {
        "aka": [
            "Tampa"
        ],
        "hotel_description": [],
        "hotel_name": [
            "Tampa"
        ]
    },
    "review_count": 63,
    "review_count_current": 4,
    "reviews": [
        {
            "date": "January 14, 2007",
            "detail_rating": {
                "business": null,
                "cleanliness": 5.0,
                "desk": null,
                "front_desk": 1.0,
                "location": 3.0,
                "pool": null,
                "restaurant": null,
                "rooms": 4.0,
                "service": 2.0,
                "sleep": null,
                "value": 4.0
            },
            "helpfulness": 1,
            "id": 6596668,
            "likes": {
                "disliked": "\u2014 Front desk staff",
                "liked": "\u2014 The large rooms and cleanliness"
            },
            "rating": 3.0,
            "stay_parameters": "Stayed January 2007, traveled on business",
            "text": "The hotel was very clean- lots to do. There are about four restaurants right in front of it (walk to) and the best is City Fish- the best Sea Bass I have ever had!!!",
            "title": "Great hotel- staff needs improvement",
            "user": "LaurenEk77"
        },
        {
            "date": "April 25, 2006",
            "detail_rating": {
                "business": null,
                "cleanliness": 5.0,
                "desk": null,
                "location": null,
                "pool": null,
                "restaurant": null,
                "rooms": 5.0,
                "service": 5.0,
                "sleep": null,
                "value": 4.0
            },
            "helpfulness": 1,
            "id": 5008805,
            "likes": {
                "disliked": null,
                "liked": null
            },
            "rating": 4.0,
            "stay_parameters": "Stayed April 2006",
            "text": "The hotel is nice, decorated nicely and clean. The front desk however, is non existant. I have never walked up and had someone there. I always have to ring the bell. We stayed here two nights while looking for a home. I called the front desk twice and no one anwswered. The store in the lobby was out of a lot incoluding wine. We forgot our toothpaste, and they had none for us. Breakfast was good. We paid $109 first night and $129 the second.",
            "title": "New, friendly, in newer area in Tampa",
            "user": "markotoole"
        },
        {
            "date": "July 12, 2005",
            "detail_rating": {
                "business": null,
                "cleanliness": 5.0,
                "desk": null,
                "location": null,
                "pool": null,
                "restaurant": null,
                "rooms": 5.0,
                "service": 4.0,
                "sleep": null,
                "value": 4.0
            },
            "helpfulness": 8,
            "id": 3661816,
            "likes": {
                "disliked": null,
                "liked": null
            },
            "rating": 5.0,
            "stay_parameters": "Stayed July 2005",
            "text": "Long story short- great room, great location for business or Westchase area, but lobby service needs a little help!",
            "title": "Courtyard Marriot - but better!",
            "user": "AlecRI"
        },
        {
            "date": "July 28, 2004",
            "detail_rating": {
                "business": null,
                "cleanliness": null,
                "desk": null,
                "location": null,
                "pool": null,
                "restaurant": null,
                "rooms": null,
                "service": null,
                "sleep": null,
                "value": null
            },
            "helpfulness": 10,
            "id": 2329117,
            "likes": {
                "disliked": null,
                "liked": null
            },
            "rating": 5.0,
            "stay_parameters": null,
            "text": "Stayed for two nights. Oldsmar, from what I could tell, is a newer area (near Westchase) with new stores opening, but not much around the general hotel area besides the race track and flea market.",
            "title": "Chic hotel, fabulous service, great rates",
            "user": "birder"
        }
    ],
    "slim_ranking": 0.8,
    "stars": 3,
    "tripadvisor": {
        "VISITED": false,
        "country_name": null,
        "locality": null,
        "pic_link": null,
        "street_address": null
    },
    "user_rating": 4.0,
    "variance": {
        "average": 10,
        "excellent": 26,
        "poor": 7,
        "terrible": 1,
        "very good": 19
    }
}