{
    "aka": "Melia White Hotel",
    "description": "The Melia White House hotel was built in 1936 and was originally launched as The White House luxury apartments. The hotel\u2019s building still preserves its architectural value as a prime example of art d\u00e9cor style in late 1930s. After a recent refurbishment, guests can now have a more pleasant and unique experience when sating in London. This 4-star deluxe hotel includes 581 rooms, 112 apartments, 9 meeting rooms, 2 restaurants and a bar including a terrace, fitness centre and an executive lounge. The hotel\u2019s unique location, award winning food offering and true passion for service will make of your stay in London a pleasant and unique experience.",
    "detail_rating": {
        "cleanliness": 4.0,
        "location": 4.5,
        "rooms": 3.5,
        "service": 4.0,
        "sleep": 4.0,
        "value": 4.0
    },
    "location": {
        "city": "London",
        "continent": "Europe",
        "country": "United Kingdom (UK)",
        "proposed_city": "London",
        "province": null,
        "region": null
    },
    "name": "Melia White House",
    "places": {
        "aka": [],
        "hotel_description": [
            "London"
        ],
        "hotel_name": []
    },
    "review_count": 2378,
    "review_count_current": 40,
    "reviews": [
        {
            "date": "November 19, 2006",
            "detail_rating": {
                "business": null,
                "cleanliness": 4.0,
                "desk": null,
                "front_desk": 4.0,
                "location": 5.0,
                "pool": null,
                "restaurant": null,
                "rooms": 4.0,
                "service": 4.0,
                "sleep": null,
                "value": 4.0
            },
            "helpfulness": 1,
            "id": 6152690,
            "likes": {
                "disliked": "\u2014 The bar area is slightly under lit",
                "liked": "\u2014 The Royal Service Lounge and the lifts"
            },
            "rating": 4.0,
            "stay_parameters": "Stayed October 2006, traveled as a couple",
            "text": "This hotel is situated a few yards from a tube station, you can also walk to regents park & London Zoo.",
            "title": "Excellent location, good service",
            "user": "appleacre"
        },
        {
            "date": "November 6, 2006",
            "detail_rating": {
                "business": null,
                "cleanliness": 5.0,
                "desk": null,
                "front_desk": 4.0,
                "location": 4.0,
                "pool": null,
                "restaurant": null,
                "rooms": 4.0,
                "service": 4.0,
                "sleep": null,
                "value": 5.0
            },
            "helpfulness": 2,
            "id": 6062669,
            "likes": {
                "disliked": "\u2014 That smoking was allowed",
                "liked": "\u2014 Great value and location"
            },
            "rating": 5.0,
            "stay_parameters": "Stayed October 2006, traveled with friends",
            "text": "It is definately worth up grading to a Royal Service room as the guest lounge is excellent, free breakfast, snacks and drinks.",
            "title": "Great deal for three girlfriends",
            "user": "Travelling_Swede"
        },
        {
            "date": "November 5, 2006",
            "detail_rating": {
                "business": 5.0,
                "cleanliness": 4.0,
                "desk": null,
                "front_desk": 3.0,
                "location": 5.0,
                "pool": null,
                "restaurant": null,
                "rooms": 3.0,
                "service": 3.0,
                "sleep": null,
                "value": 4.0
            },
            "helpfulness": 2,
            "id": 6058890,
            "likes": {
                "disliked": "\u2014 A little Small Room",
                "liked": "\u2014 Location and Staff"
            },
            "rating": 4.0,
            "stay_parameters": "Stayed October 2006, traveled with family",
            "text": "I stayed at this hotel together with my sister-in-law and a friend of ours. We were very happy with the hotel. Since there were three of us we booked a junior suite and this was really a great deal. Altogether we paid \u00a3160 for three nights which included a very big breakfast buffet and free drinks and tapas in the lounge in the evening. As you know, London is very expensive and by eating and drinking in the lounge we could put all that money in our shopping accounts instead!",
            "title": "Experiences from other point of view",
            "user": "eur2005"
        },
        {
            "date": "October 29, 2006",
            "detail_rating": {
                "business": null,
                "cleanliness": null,
                "desk": null,
                "location": null,
                "pool": null,
                "restaurant": null,
                "rooms": null,
                "service": null,
                "sleep": null,
                "value": null
            },
            "helpfulness": 2,
            "id": 6025774,
            "likes": {
                "disliked": null,
                "liked": null
            },
            "rating": 4.0,
            "stay_parameters": null,
            "text": "The hotel itself was fine, the room quite big and the bathroom very clean. We all liked the area and that it was so close to the Regent's Park.",
            "title": "Great hotel, fantastic breakfast!",
            "user": "TPost"
        },
        {
            "date": "October 3, 2006",
            "detail_rating": {
                "business": null,
                "cleanliness": 3.0,
                "desk": null,
                "front_desk": 3.0,
                "location": 4.0,
                "pool": null,
                "restaurant": null,
                "rooms": 2.0,
                "service": 2.0,
                "sleep": null,
                "value": 3.0
            },
            "helpfulness": 4,
            "id": 5903458,
            "likes": {
                "disliked": "\u2014 Smoky reception!",
                "liked": "\u2014 Closeness to the tube station"
            },
            "rating": 3.0,
            "stay_parameters": "Stayed September 2006, traveled with friends",
            "text": "The only thing we can complain about was that the Underground station Great Portland Street was closed during the weekend and it was a real hassle getting from and to the hotel because of this. ;-)",
            "title": "Hotel was OK if you paid reduced cost!",
            "user": "Helen K"
        },
        {
            "date": "September 12, 2007",
            "detail_rating": {
                "business": null,
                "cleanliness": 5.0,
                "desk": null,
                "front_desk": 5.0,
                "location": 5.0,
                "pool": null,
                "restaurant": null,
                "rooms": 5.0,
                "service": 4.0,
                "sleep": null,
                "value": 5.0
            },
            "helpfulness": 3,
            "id": 8699451,
            "likes": {
                "disliked": "\u2014 Price of Breakfast",
                "liked": "\u2014 Cleanliness"
            },
            "rating": 5.0,
            "stay_parameters": "Stayed September 2007, traveled as a couple",
            "text": "As part of our Honeymoon theatre break, my wife and I stayed at the Melia White House and cannot praise it highly enough,",
            "title": "Delightful Hotel",
            "user": "RickyK72"
        },
        {
            "date": "September 3, 2007",
            "detail_rating": {
                "business": null,
                "cleanliness": 4.0,
                "desk": null,
                "front_desk": 5.0,
                "location": 5.0,
                "pool": null,
                "restaurant": null,
                "rooms": 4.0,
                "service": 4.0,
                "sleep": null,
                "value": 4.0
            },
            "helpfulness": 2,
            "id": 8611888,
            "likes": {
                "disliked": null,
                "liked": null
            },
            "rating": 5.0,
            "stay_parameters": "Stayed September 2007, traveled as a couple",
            "text": "The Melia is part of a Spanish leisure group, so natch the majority of staff were Spanish. The Reception was immaculate and clean.",
            "title": "excellent service and location",
            "user": "Gem02"
        },
        {
            "date": "September 3, 2007",
            "detail_rating": {
                "business": null,
                "cleanliness": 3.0,
                "desk": null,
                "front_desk": 1.0,
                "location": 4.0,
                "pool": null,
                "restaurant": null,
                "rooms": 2.0,
                "service": 1.0,
                "sleep": null,
                "value": null
            },
            "helpfulness": 1,
            "id": 8611324,
            "likes": {
                "disliked": "\u2014 service (or lack thereof)",
                "liked": "\u2014 location"
            },
            "rating": 1.0,
            "stay_parameters": "Stayed August 2007, traveled as a couple",
            "text": "Our room was fantastic, Air conditioning and a huge King Size bed, ideal for a chunky chap like myself. The standard of housekeeping in the bedroom was very high.",
            "title": "why does anyone stay here???",
            "user": "travellingbug26"
        },
        {
            "date": "September 1, 2007",
            "detail_rating": {
                "business": null,
                "cleanliness": 5.0,
                "desk": null,
                "front_desk": 5.0,
                "location": 5.0,
                "pool": null,
                "restaurant": null,
                "rooms": 5.0,
                "service": 4.0,
                "sleep": null,
                "value": 5.0
            },
            "helpfulness": null,
            "id": 8602491,
            "likes": {
                "disliked": "\u2014 Size of room",
                "liked": "\u2014 A little bit of 4 star comfort"
            },
            "rating": 5.0,
            "stay_parameters": "Stayed August 2007, traveled as a couple",
            "text": "We loved this hotel as it was close to Warren St and Great Portland St underground stations so travel to the west end was very easy.",
            "title": "An oasis",
            "user": "countess"
        },
        {
            "date": "August 31, 2007",
            "detail_rating": {
                "business": 4.0,
                "cleanliness": 5.0,
                "desk": null,
                "front_desk": 4.0,
                "location": 4.0,
                "pool": null,
                "restaurant": null,
                "rooms": 4.0,
                "service": 4.0,
                "sleep": null,
                "value": 5.0
            },
            "helpfulness": 1,
            "id": 8589930,
            "likes": {
                "disliked": "\u2014 Price of any hotel services is very expensive",
                "liked": "\u2014 Clean and comfortable"
            },
            "rating": 4.0,
            "stay_parameters": "Stayed August 2007, traveled as a couple",
            "text": "Our only gripe was the price of the Breakfasts at nearly \u00a320 a head it was a bit excessive.",
            "title": "Lovely relaxing hotel",
            "user": "fiona200980"
        },
        {
            "date": "January 24, 2007",
            "detail_rating": {
                "business": null,
                "cleanliness": 5.0,
                "desk": null,
                "front_desk": 4.0,
                "location": 4.0,
                "pool": null,
                "restaurant": null,
                "rooms": 4.0,
                "service": 4.0,
                "sleep": null,
                "value": null
            },
            "helpfulness": 2,
            "id": 6655121,
            "likes": {
                "disliked": "\u2014 Food in the restaurants",
                "liked": "\u2014 Hotel cleanliness and location to where I wanted to be"
            },
            "rating": 4.0,
            "stay_parameters": "Stayed January 2007, traveled as a couple",
            "text": "We booked a deluxe room which had a 6ft bed, double glazing and was slightly bigger and nicer decorated than the standard rooms. The room was very stuffy and the aircon didnt appear to work so we had to have the windows open all the time which did tend to get a bit cold at times, but not long after you closed them the room was too stuffy again.",
            "title": "Very pleasant stay, would stay here again",
            "user": "Karen48"
        },
        {
            "date": "January 22, 2007",
            "detail_rating": {
                "business": null,
                "cleanliness": null,
                "desk": null,
                "location": null,
                "pool": null,
                "restaurant": null,
                "rooms": null,
                "service": null,
                "sleep": null,
                "value": null
            },
            "helpfulness": 3,
            "id": 6642208,
            "likes": {
                "disliked": null,
                "liked": null
            },
            "rating": 3.0,
            "stay_parameters": null,
            "text": "The bathroom was not very well lit, no light over the shower or toilet the only light was above the sink.",
            "title": "Watch the VAT!!!",
            "user": "bethngar"
        },
        {
            "date": "January 15, 2007",
            "detail_rating": {
                "business": null,
                "cleanliness": 5.0,
                "desk": null,
                "front_desk": 4.0,
                "location": 5.0,
                "pool": null,
                "restaurant": null,
                "rooms": 5.0,
                "service": 5.0,
                "sleep": null,
                "value": 5.0
            },
            "helpfulness": 2,
            "id": 6597600,
            "likes": {
                "disliked": "\u2014 Doesn't have it's own parking, but there is plenty of street parking around",
                "liked": "\u2014 The free evening bar and our lovely waitress"
            },
            "rating": 5.0,
            "stay_parameters": "Stayed January 2007, traveled as a couple",
            "text": "The food in the hotel I thought was disappointing, we ate in both of the restaurants and didnt really enjoy the food and thought it was expensive for what it was.",
            "title": "Surprisingly good",
            "user": "Tom-LouCheshire"
        },
        {
            "date": "January 12, 2007",
            "detail_rating": {
                "business": 5.0,
                "cleanliness": 5.0,
                "desk": null,
                "front_desk": 5.0,
                "location": 5.0,
                "pool": null,
                "restaurant": null,
                "rooms": 4.0,
                "service": 5.0,
                "sleep": null,
                "value": 4.0
            },
            "helpfulness": 4,
            "id": 6583902,
            "likes": {
                "disliked": "\u2014 Shower was a bit dangerous to step in and out of.",
                "liked": "\u2014 Friendly Staff, Overall a positive experience."
            },
            "rating": 4.0,
            "stay_parameters": "Stayed January 2007, traveled as a couple",
            "text": "The hotel itself was very clean, staff were courteous and friendly, most of them were Spanish or other foreign nationality and the only time there was a language problem was with one of the waitresses in the restaurant.",
            "title": "Very Surprised!",
            "user": "Keino"
        },
        {
            "date": "January 2, 2007",
            "detail_rating": {
                "business": 4.0,
                "cleanliness": 5.0,
                "desk": null,
                "front_desk": 5.0,
                "location": 5.0,
                "pool": null,
                "restaurant": null,
                "rooms": 5.0,
                "service": 5.0,
                "sleep": null,
                "value": 5.0
            },
            "helpfulness": null,
            "id": 6539118,
            "likes": {
                "disliked": "\u2014 Nothing",
                "liked": "\u2014 Service"
            },
            "rating": 5.0,
            "stay_parameters": "Stayed December 2006, traveled on business",
            "text": "I would definitely stay here again, location is good and overall cost of hotel room is very competitive against other hotels of the same standard.",
            "title": "Fantastic!!",
            "user": "markalexanderdegroot"
        },
        {
            "date": "October 2, 2006",
            "detail_rating": {
                "business": null,
                "cleanliness": 2.0,
                "desk": null,
                "front_desk": 2.0,
                "location": 4.0,
                "pool": null,
                "restaurant": null,
                "rooms": 1.0,
                "service": null,
                "sleep": null,
                "value": 2.0
            },
            "helpfulness": 4,
            "id": 5899583,
            "likes": {
                "disliked": "\u2014 room",
                "liked": "\u2014 breakfast"
            },
            "rating": 2.0,
            "stay_parameters": "Stayed September 2006, traveled with family",
            "text": "booked with last minute.com secret hotels. Shared twin with my daughter, very small , uncomfortable single beds with old-fashioned sheets and blankets. Very dated decor, only one chair in the room, very basic. Tiny Bathroom, only one hand towel. paid \u00a399 incl breakfast. Normal price is \u00a3240 plus \u00a325 for room upgrade. Certainly not worth it. Large Buffett breakfast with lots of choice, but slow service. Would not book this again or recommed to anyone, stayed in the Marriot before, 10 times better.",
            "title": "certainly not 4 star",
            "user": "renifos"
        },
        {
            "date": "October 1, 2006",
            "detail_rating": {
                "business": 3.0,
                "cleanliness": 4.0,
                "desk": null,
                "front_desk": 1.0,
                "location": 4.0,
                "pool": null,
                "restaurant": null,
                "rooms": 1.0,
                "service": 4.0,
                "sleep": null,
                "value": 1.0
            },
            "helpfulness": 8,
            "id": 5897153,
            "likes": {
                "disliked": "\u2014 Front Desk, Terrible Customer Service, Junior Suites are not all the same size (quite a big difference in size in fact)",
                "liked": "\u2014 breakfast"
            },
            "rating": 2.0,
            "stay_parameters": "Stayed September 2006, traveled with friends",
            "text": "Pluspoint: Good public transport nearby, lots of bus stops, and three tube stations. Fairly quite area.",
            "title": "OK - but beware of the different junior suite room size!",
            "user": "crazyformo"
        },
        {
            "date": "September 28, 2006",
            "detail_rating": {
                "business": 4.0,
                "cleanliness": 5.0,
                "desk": null,
                "front_desk": 5.0,
                "location": 5.0,
                "pool": null,
                "restaurant": null,
                "rooms": 5.0,
                "service": 5.0,
                "sleep": null,
                "value": 5.0
            },
            "helpfulness": 1,
            "id": 5888958,
            "likes": {
                "disliked": "\u2014 room",
                "liked": "\u2014 Their door stoppers"
            },
            "rating": 5.0,
            "stay_parameters": "Stayed September 2006, traveled as a couple",
            "text": "We just came back from London at the end of August and stayed at the Melia White House Hotel for 5 nights.",
            "title": "Very professionnal",
            "user": "fnadon59"
        },
        {
            "date": "September 28, 2006",
            "detail_rating": {
                "business": 1.0,
                "cleanliness": 3.0,
                "desk": null,
                "front_desk": 2.0,
                "location": 3.0,
                "pool": null,
                "restaurant": null,
                "rooms": 1.0,
                "service": 2.0,
                "sleep": null,
                "value": 2.0
            },
            "helpfulness": 6,
            "id": 5884762,
            "likes": {
                "disliked": "\u2014 room",
                "liked": "\u2014 Hard to say - it was close to Regent's Park and the tube, but that's about all."
            },
            "rating": 2.0,
            "stay_parameters": "Stayed September 2006, traveled as a couple",
            "text": "We got to the hotel around 2:30pm and we got checked in right away. Got to our room and was quite surprised at how tiny the room is for a supposed \"Junior Suite\" that we paid for. It didn't look like a junior suite but I took that as it's simply because rooms in Europe are typically smaller. But anyhow, it looked a lot smaller from the pictures and virtual tours shown for junior suite rooms. Our room had a king size bed and a sofa bed. The room was too cramped for 3 skinny people and our luggage. You can bounce from one wall to the other.",
            "title": "Two classes of rooms",
            "user": "Tosher"
        },
        {
            "date": "September 24, 2006",
            "detail_rating": {
                "business": 4.0,
                "cleanliness": 5.0,
                "desk": null,
                "front_desk": 4.0,
                "location": 3.0,
                "pool": null,
                "restaurant": null,
                "rooms": 4.0,
                "service": 4.0,
                "sleep": null,
                "value": 4.0
            },
            "helpfulness": null,
            "id": 5832878,
            "likes": {
                "disliked": "\u2014 Hard bed",
                "liked": "\u2014 Clean"
            },
            "rating": 4.0,
            "stay_parameters": "Stayed September 2006, traveled as a couple",
            "text": "We didn't take the upgrade simply because we were already supposed to be in a Junior Suite and our deal already included breakfast so whatever deal came with the upgrade was worth paying for more.",
            "title": "Good Value for London at $140",
            "user": "Durbanguy"
        },
        {
            "date": "August 29, 2007",
            "detail_rating": {
                "business": 3.0,
                "cleanliness": 3.0,
                "desk": null,
                "front_desk": 2.0,
                "location": 3.0,
                "pool": null,
                "restaurant": null,
                "rooms": 3.0,
                "service": 2.0,
                "sleep": null,
                "value": 2.0
            },
            "helpfulness": 1,
            "id": 8538899,
            "likes": {
                "disliked": "\u2014 The staff was unhelpful and unintelligent.",
                "liked": "\u2014 Every cab driver knew it; the breakfast was very good."
            },
            "rating": 2.0,
            "stay_parameters": "Stayed July 2007, traveled with family",
            "text": "We stayed at the Melia White House for four nights and thought it was all presentation. The positives were that it was somewhat conveniently located, every cab driver knew where it was, it was very close to a tube station, and the breakfast was very good. The main negative was that for an expensive hotel, the service was not very good. The staff was nice but completely unhelpful and unintelligent. For example, we were meeting up with my sister-in-law who had arrived at the hotel the day before and were expecting to meet her when we got to the hotel. She had left a handwritten note for us at the front desk, and the front desk failed to give us that message when we checked in. Instead they gave us the message hours after we checked in, explaining that they could not give us the note earlier because they did not have a room number to match the note to. I.e., they could not figure out how to leave a note for us to give us when we checked in. Thus, we sat in the hotel lobby for an hour just waiting for my sister-in-law, not knowing that she'd be late because the hotel front desk didn't give us any messages when we asked if there were any. That's just one example of their complete unhelpfulness. In addition, we reserved a king sized bed and instead got two twin beds pushed together. We were told that there were no more rooms with an actual king sized bed, even though we checked in early. All in all, I would say that the fact that this hotel was convenient to get to was the ONLY reason worth staying there.",
            "title": "Overpriced for the value",
            "user": "mwkka"
        },
        {
            "date": "August 29, 2007",
            "detail_rating": {
                "business": 5.0,
                "cleanliness": 5.0,
                "desk": null,
                "front_desk": 4.0,
                "location": 5.0,
                "pool": null,
                "restaurant": null,
                "rooms": 4.0,
                "service": 4.0,
                "sleep": null,
                "value": 5.0
            },
            "helpfulness": 1,
            "id": 8538097,
            "likes": {
                "disliked": "\u2014 the room was a bit small",
                "liked": "\u2014 the hall and the restaurant"
            },
            "rating": 5.0,
            "stay_parameters": "Stayed August 2007, traveled as a couple",
            "text": "I can simply say I enjoyed my stay in this hotel. I would recommend it for special occasions and for romantic weekends in London.",
            "title": "Highly recommended with the right offer",
            "user": "LAPO76"
        },
        {
            "date": "August 22, 2007",
            "detail_rating": {
                "business": null,
                "cleanliness": null,
                "desk": null,
                "location": null,
                "pool": null,
                "restaurant": null,
                "rooms": null,
                "service": null,
                "sleep": null,
                "value": null
            },
            "helpfulness": 1,
            "id": 8472429,
            "likes": {
                "disliked": null,
                "liked": null
            },
            "rating": 5.0,
            "stay_parameters": null,
            "text": "We stayed at the Melia Whitehouse for our anniversary on 19/20th August and can't fault the hotel, we had noted on our booking that it was a special occasion and can honestly say the hotel made it even better for us, we were allowed to check in early, we were upgraded to a superior room and all the staff from the check in staff to the cleaning staff were courteous and pleasant.",
            "title": "Excellent Hotel",
            "user": "helen67"
        },
        {
            "date": "August 19, 2007",
            "detail_rating": {
                "business": null,
                "cleanliness": 5.0,
                "desk": null,
                "front_desk": 5.0,
                "location": 5.0,
                "pool": null,
                "restaurant": null,
                "rooms": 4.0,
                "service": 4.0,
                "sleep": null,
                "value": 4.0
            },
            "helpfulness": 3,
            "id": 8452055,
            "likes": {
                "disliked": null,
                "liked": null
            },
            "rating": 4.0,
            "stay_parameters": "Stayed July 2007, traveled as a couple",
            "text": "Facilities and location were excellent, the selection at breakfast great, they were very busy on our first day for breakfast but rather than allow anyone to wait they redirected us to the Royal Lounge to prevent queuing.",
            "title": "Enjoyed a weekend at the Melia",
            "user": "JaM2338"
        },
        {
            "date": "August 9, 2007",
            "detail_rating": {
                "business": null,
                "cleanliness": null,
                "desk": null,
                "location": null,
                "pool": null,
                "restaurant": null,
                "rooms": null,
                "service": null,
                "sleep": null,
                "value": null
            },
            "helpfulness": 4,
            "id": 8378499,
            "likes": {
                "disliked": null,
                "liked": null
            },
            "rating": 5.0,
            "stay_parameters": null,
            "text": "In all we can't wait to return and I hope to take my Mum for her birthday later in the year.",
            "title": "Superb Hotel",
            "user": "Lorelei3"
        },
        {
            "date": "October 17, 2007",
            "detail_rating": {
                "business": null,
                "cleanliness": 5.0,
                "desk": null,
                "front_desk": 3.0,
                "location": 4.0,
                "pool": null,
                "restaurant": null,
                "rooms": 4.0,
                "service": 2.0,
                "sleep": null,
                "value": 5.0
            },
            "helpfulness": 4,
            "id": 10097818,
            "likes": {
                "disliked": "\u2014 Poor response to problems",
                "liked": "\u2014 Exceptional value for price paid"
            },
            "rating": 2.0,
            "stay_parameters": "Stayed September 2007, traveled as a couple",
            "text": "I'm so sorry to give this hotel 2 stars; it really deserves more, but this is an example of how 2 negative experiences can ruin a rating.",
            "title": "Great hotel with problems---what a shame",
            "user": "islington3164"
        },
        {
            "date": "October 16, 2007",
            "detail_rating": {
                "business": 5.0,
                "cleanliness": 5.0,
                "desk": null,
                "front_desk": 5.0,
                "location": 5.0,
                "pool": null,
                "restaurant": null,
                "rooms": 5.0,
                "service": 5.0,
                "sleep": null,
                "value": 5.0
            },
            "helpfulness": 1,
            "id": 10087693,
            "likes": {
                "disliked": null,
                "liked": "\u2014 Breakfast and the bed"
            },
            "rating": 5.0,
            "stay_parameters": "Stayed July 2007, traveled as a couple",
            "text": "For one thing, we got an exceptional deal through Priceline at $200 a night. For central London in September and this type of hotel, this is a great, great bargain. The hotel is centrally located with the Great Portland Street tube right across the street and the Regents Park tube down the block. We walked from the hotel to Oxford Street in about 20 minutes. It's not Soho, Covent Garden, but it's still a great location.",
            "title": "Great hotel, comfy room and amazing breakfast!",
            "user": "HayFace"
        },
        {
            "date": "September 23, 2007",
            "detail_rating": {
                "business": 5.0,
                "cleanliness": 5.0,
                "desk": null,
                "front_desk": 5.0,
                "location": 5.0,
                "pool": null,
                "restaurant": null,
                "rooms": 5.0,
                "service": 5.0,
                "sleep": null,
                "value": 5.0
            },
            "helpfulness": 1,
            "id": 8865137,
            "likes": {
                "disliked": null,
                "liked": null
            },
            "rating": 5.0,
            "stay_parameters": "Stayed September 2007, traveled as a couple",
            "text": "The lobby is busy, clean and impressive. The staff at the front desk is all Spanish and were in general, courteous. Our room, which consisted of two double beds, two bed tables, mini-bar, a large tv and two desk was very small and cluttered. The hotel should consider eliminating one of the desks to give a little more space. However, small rooms are typical in London so we really weren't expecting anything big and were satisfied. Beside, the bathroom, in turn, was large and everything, in usual Melia style, was well decorated and impeccably clean. Melia might also consider flat-panel tvs as the set was bulky and took up lots of space.",
            "title": "A very ncie hotel in the heart of London",
            "user": "magical_matt"
        },
        {
            "date": "September 16, 2007",
            "detail_rating": {
                "business": 4.0,
                "cleanliness": 4.0,
                "desk": null,
                "front_desk": 3.0,
                "location": 5.0,
                "pool": null,
                "restaurant": null,
                "rooms": 2.0,
                "service": 2.0,
                "sleep": null,
                "value": 2.0
            },
            "helpfulness": 3,
            "id": 8725751,
            "likes": {
                "disliked": "\u2014 Small room over-priced food/drinks (even by London standards)",
                "liked": "\u2014 Location"
            },
            "rating": 3.0,
            "stay_parameters": "Stayed September 2007, traveled as a couple",
            "text": "We had breakfast the following morning at \u00a320 per person. $40 might seem a lot to US travellers, but for what was served and considering we were in London, I found the price acceptable. It is quite an impressive buffet with lots of meats, pastries, hot items, fruits and an omelette station. For London, it's a good deal to really fill up here and then have a heavy dinner later on.",
            "title": "Be Very Selective!",
            "user": "keneyke"
        },
        {
            "date": "September 15, 2007",
            "detail_rating": {
                "business": null,
                "cleanliness": 5.0,
                "desk": null,
                "front_desk": 5.0,
                "location": 5.0,
                "pool": null,
                "restaurant": null,
                "rooms": 5.0,
                "service": 5.0,
                "sleep": null,
                "value": 4.0
            },
            "helpfulness": 5,
            "id": 8719588,
            "likes": {
                "disliked": "\u2014 small bathroom",
                "liked": "\u2014 big bed, location, breakfast"
            },
            "rating": 5.0,
            "stay_parameters": "Stayed September 2007, traveled as a couple",
            "text": "Now, about those two experiences which made me drop my rating: When we arrived at our room, the room was extremely hot (and it was hot outside as well). We turned on the a/c and waited a bit for the room to cool off but the temperature stayed the same and we noticed that no air was blowing from the air ducts. We called the front desk and were transferred to maintenance. The maintenance person told us she would send a technician to the room immediately. After waiting 15 minutes in a steaming room with the hallway door open to let in a breeze, we called the front desk again and rather than receiving an apology, were transferred again to maintenance. This time, we were told that the technician could not be located but as soon as one appeared, they would send him/her to the room. I found this excuse unacceptable as given a hotel this size and of this quality, I can't imagine how a technician can't be located (at least tell me he/she is busy). After waiting another 10 minutes, I went to the front desk to complain and was told that there was nothing to be done but wait for the technician. This really upset me. I am a MaS Card member (Melia's reward program) and have over 60,000 points in my bank. I didn't expect special treatment because of this, but given my loyalty to the chain, they could have easily switched my room or at least been more attentive. We had engagements in London and after an hour, decided to leave; fortunately, the a/c was fixed when we returned later that night.",
            "title": "Very nice hotel, great location!",
            "user": "WellTravelled1984"
        },
        {
            "date": "July 31, 2007",
            "detail_rating": {
                "business": null,
                "cleanliness": 5.0,
                "desk": null,
                "front_desk": 5.0,
                "location": 5.0,
                "pool": null,
                "restaurant": null,
                "rooms": 5.0,
                "service": 5.0,
                "sleep": null,
                "value": 5.0
            },
            "helpfulness": 4,
            "id": 8265750,
            "likes": {
                "disliked": "\u2014 None! all perfect!",
                "liked": "\u2014 everything!"
            },
            "rating": 5.0,
            "stay_parameters": "Stayed July 2007, traveled on business",
            "text": "We decided to have a weekend break to pamper ourselves from work stress and tension. We decided to choose this hotel based on its very good price value. We book directly from hotel's website a superior deluxe room with a \u00a3140 per room per nite including breakfast",
            "title": "Splendid!!",
            "user": "lyana"
        },
        {
            "date": "July 30, 2007",
            "detail_rating": {
                "business": null,
                "cleanliness": null,
                "desk": null,
                "location": null,
                "pool": null,
                "restaurant": null,
                "rooms": null,
                "service": null,
                "sleep": null,
                "value": null
            },
            "helpfulness": 6,
            "id": 8260684,
            "likes": {
                "disliked": null,
                "liked": null
            },
            "rating": 4.0,
            "stay_parameters": null,
            "text": "The room is marvelous! It has a huge bed - a king bed with a very stylish and classy deco. Very comfortable. Tv cabinet with refrigrator and mini bar, coffee & tea facility. Large in size and all marble bedroom. Iron and ironing board, safe box. Internet access, a coffee table and 2 chair for tea. Beautiful bathroom with decent size, bath with great shower, all over tiles",
            "title": "Nice, but with a few catches",
            "user": "Kirikiri"
        },
        {
            "date": "July 15, 2007",
            "detail_rating": {
                "business": 5.0,
                "cleanliness": 5.0,
                "desk": null,
                "front_desk": 5.0,
                "location": 5.0,
                "pool": null,
                "restaurant": null,
                "rooms": 5.0,
                "service": 5.0,
                "sleep": null,
                "value": 5.0
            },
            "helpfulness": 2,
            "id": 8123808,
            "likes": {
                "disliked": null,
                "liked": null
            },
            "rating": 4.0,
            "stay_parameters": "Stayed July 2007",
            "text": "The breakfast is the best breakfast we've ever seen in any hotels in Europe! It has everyhting....from pancakes to waffles to all kind of muffins, danish and bread, cook from order omelletes and full english breakfast with all kind of sausages!!",
            "title": "Wonderful hotel!",
            "user": "dbasha"
        },
        {
            "date": "July 15, 2007",
            "detail_rating": {
                "business": null,
                "cleanliness": null,
                "desk": null,
                "location": null,
                "pool": null,
                "restaurant": null,
                "rooms": null,
                "service": null,
                "sleep": null,
                "value": null
            },
            "helpfulness": 3,
            "id": 8122694,
            "likes": {
                "disliked": null,
                "liked": null
            },
            "rating": 4.0,
            "stay_parameters": null,
            "text": "The lobby is very stylish, all marble and very posh in decoration",
            "title": "A nice hotel if you can get a good rate.",
            "user": "shaftesburygym"
        },
        {
            "date": "July 5, 2007",
            "detail_rating": {
                "business": 4.0,
                "cleanliness": 5.0,
                "desk": null,
                "front_desk": 5.0,
                "location": 5.0,
                "pool": null,
                "restaurant": null,
                "rooms": 4.0,
                "service": 5.0,
                "sleep": null,
                "value": 3.0
            },
            "helpfulness": null,
            "id": 8065073,
            "likes": {
                "disliked": null,
                "liked": null
            },
            "rating": 4.0,
            "stay_parameters": "Stayed July 2007, traveled on business",
            "text": "It just 4 stop tube from victoria station if you stop in warren street tube station via victoria line and walk just 10 mins to the hotel. The hotel is just opposite the great portland street tube station",
            "title": "Nice hotel",
            "user": "anonrockville"
        },
        {
            "date": "December 11, 2006",
            "detail_rating": {
                "business": 2.0,
                "cleanliness": 4.0,
                "desk": null,
                "front_desk": 4.0,
                "location": 4.0,
                "pool": null,
                "restaurant": null,
                "rooms": 3.0,
                "service": 5.0,
                "sleep": null,
                "value": 3.0
            },
            "helpfulness": 5,
            "id": 6363119,
            "likes": {
                "disliked": null,
                "liked": null
            },
            "rating": 3.0,
            "stay_parameters": "Stayed November 2006, traveled on business",
            "text": "Good stay close to Regent's Park.",
            "title": "Good stay in London",
            "user": "Hsrada"
        },
        {
            "date": "December 5, 2006",
            "detail_rating": {
                "business": null,
                "cleanliness": 5.0,
                "desk": null,
                "front_desk": 5.0,
                "location": 5.0,
                "pool": null,
                "restaurant": null,
                "rooms": 5.0,
                "service": 5.0,
                "sleep": null,
                "value": 5.0
            },
            "helpfulness": 1,
            "id": 6334471,
            "likes": {
                "disliked": null,
                "liked": "\u2014 The location and the peace and quiet."
            },
            "rating": 5.0,
            "stay_parameters": "Stayed May 2002, traveled with family",
            "text": "Spanish staff are more friendly than most london hotel staff.",
            "title": "Top Service",
            "user": "Gramercy97"
        },
        {
            "date": "December 5, 2006",
            "detail_rating": {
                "business": 4.0,
                "cleanliness": 4.0,
                "desk": null,
                "front_desk": 4.0,
                "location": 4.0,
                "pool": null,
                "restaurant": null,
                "rooms": 4.0,
                "service": 4.0,
                "sleep": null,
                "value": 3.0
            },
            "helpfulness": 2,
            "id": 6334312,
            "likes": {
                "disliked": "\u2014 Lifts - You select the floor you want before you are told which left to enter - quite confusing!",
                "liked": "\u2014 Clean and well decorated"
            },
            "rating": 4.0,
            "stay_parameters": "Stayed November 2006, traveled solo",
            "text": "Gym is larger than it appears, with around 20 excercise machines (albeit no weight machines) and free weights ranging from 2 - 10 kgs (around 4 to 22 lbs).",
            "title": "Overall very good",
            "user": "AFCW"
        },
        {
            "date": "December 5, 2006",
            "detail_rating": {
                "business": null,
                "cleanliness": 5.0,
                "desk": null,
                "front_desk": 5.0,
                "location": 4.0,
                "pool": null,
                "restaurant": null,
                "rooms": 4.0,
                "service": 4.0,
                "sleep": null,
                "value": 4.0
            },
            "helpfulness": 2,
            "id": 6333020,
            "likes": {
                "disliked": "\u2014 Bathroom was tiny",
                "liked": "\u2014 It was very clean and very quiet"
            },
            "rating": 4.0,
            "stay_parameters": "Stayed November 2006, traveled as a couple",
            "text": "Room: small, but this is typical of any London hotel. Comfortable (medium) bed with down pillows. In-room electronic safe provided. Internet access is a pay as you go service, it is far cheaper to use a cybercafe on Oxford Street. Minibar is also provided (though do not plan on using it as a personal fridge, an electronic sensor detects this and charges 15 pounds a day). My only major complaint is that there are only 2 electical outlets with easy access.",
            "title": "Very Good Hotel",
            "user": "Sitges2006"
        },
        {
            "date": "November 21, 2006",
            "detail_rating": {
                "business": 4.0,
                "cleanliness": 5.0,
                "desk": null,
                "front_desk": 3.0,
                "location": 3.0,
                "pool": null,
                "restaurant": null,
                "rooms": 4.0,
                "service": 5.0,
                "sleep": null,
                "value": 4.0
            },
            "helpfulness": null,
            "id": 6162567,
            "likes": {
                "disliked": "\u2014 N/A",
                "liked": "\u2014 Comfortable and huge bed"
            },
            "rating": 5.0,
            "stay_parameters": "Stayed November 2006, traveled as a couple",
            "text": "Bathroom equipped with hairdryer. Bathtubs are deeper than average (a plus) though it is fairly difficult to get in and out without slipping. Lotion, shampoo and bath gel (generic Melia brand) are provided. Also available (for 4 pounds and up) is a menu of bath salts from the dead sea.",
            "title": "Relaxing, warm and friendly",
            "user": "Weekend"
        }
    ],
    "slim_ranking": 0.245353159851,
    "stars": 4,
    "tripadvisor": {
        "VISITED": false,
        "country_name": null,
        "locality": null,
        "pic_link": null,
        "street_address": null
    },
    "user_rating": 4.0,
    "variance": {
        "average": 321,
        "excellent": 858,
        "poor": 173,
        "terrible": 93,
        "very good": 933
    }
}