{
    "aka": "Canciones Del Mar Boutique Hotel Costa Rica/Jaco",
    "description": "This small 15-room hotel is a classic! The sea, the surf, the beach, the palm grove, the hotel-it is just as you might imagine a small unique tropical beachfront resort should be. The \u201cSongs of the sea\u201d is a quiet and cool oasis amidst the busy Jaco town scene, with each room\u2019s small deck looking out over the ocean or on the lush gardens surrounding the pool. The hotel is built in Tropical Spanish Colonial style and the fully equipped rooms are spacious and quiet. It is the one place in Playa Jaco that combines the convenience of central location with beachfront location. Wake up to a delicious fresh fruit and buffet breakfast under the thatched roof of the beach side restaurant, then wander down to the beach for some sun and surf. If it gets too hot, retreat and cool off by the pool and Jacuzzi or catch up on your reading in the breezy elevated thatched roof tree house while you enjoy the view below. We have a small gourmet restaurant for lunch and dinner, and our Costa Rican chef serves international gourmet and or local food. Also enjoy our Tapas Bar terrace and Jacuzzi on the third floor with a spectacular view over the ocean and green mountains where you can enjoy the spectacular sunsets of the Pacific Ocean. We also do weddings and special events. We are committed with national sustainability programs and protecting the environment.",
    "detail_rating": {
        "cleanliness": null,
        "location": null,
        "rooms": null,
        "service": null,
        "sleep": null,
        "value": null
    },
    "location": {
        "city": "Jaco",
        "continent": "Central America",
        "country": "Costa Rica",
        "proposed_city": "Bar",
        "province": null,
        "region": null
    },
    "name": "Canciones del Mar Boutique Hotel",
    "places": {
        "aka": [],
        "hotel_description": [
            "Bar"
        ],
        "hotel_name": []
    },
    "review_count": 87,
    "review_count_current": 14,
    "reviews": [
        {
            "date": "August 31, 2006",
            "detail_rating": {
                "business": 5.0,
                "cleanliness": 5.0,
                "desk": null,
                "front_desk": 4.0,
                "location": 5.0,
                "pool": null,
                "restaurant": null,
                "rooms": 5.0,
                "service": 5.0,
                "sleep": null,
                "value": 5.0
            },
            "helpfulness": 4,
            "id": 5730774,
            "likes": {
                "disliked": null,
                "liked": null
            },
            "rating": 5.0,
            "stay_parameters": "Stayed May 2006, traveled with friends",
            "text": "My roommate and I (women in our late 20's) stayed at Canciones Del Mar in for 3 nights in May and loved it! We were nervous as we drove down the dirt road that you need to take to get to the hotel, but were delighted to find this jem hiding at the end of the road. The staff were very courteous and professional. Our suite was huge and very clean..and priced very economically. We had a beautiful balcony overlooking the pool area. The pool area was also great - very comfortable lounge chairs, shady and sunny spots and very secluded from the beach. Since the hotel only has about 10 rooms, you get to know the other people staying at the hotel (especially since you all eat breakfast together in the morning) and it's a great communal atmosphere. It made us feel a little safer in Jaco, especially at night. The only thing I would caution for women traveling on their own is to be careful walking down the dirt road at night - I wouldn't walk down it by myself at night. Other than that, we were very happy with our stay at Canciones Del Mar - I will stay there again if I'm ever back to Jaco Beach!",
            "title": "Great place to stay in Jaco",
            "user": "Amps"
        },
        {
            "date": "July 9, 2006",
            "detail_rating": {
                "business": null,
                "cleanliness": 5.0,
                "desk": null,
                "location": null,
                "pool": null,
                "restaurant": null,
                "rooms": 4.0,
                "service": 5.0,
                "sleep": null,
                "value": 5.0
            },
            "helpfulness": 5,
            "id": 5443323,
            "likes": {
                "disliked": null,
                "liked": null
            },
            "rating": 5.0,
            "stay_parameters": "Stayed June 2006",
            "text": "My wife and I stayed at Canciones del Mar for 8 days in June and fell in love with the hotel and staff. Most of the rooms are very spacious suites, with separate living room, kitchen, bedroom and bathroom. The decor is tropical and the rooms are very clean with air conditioning and ceiling fans. The landscaping around the grounds is absolutely enchanting, with the pool area feeling like your own private tropical paradise with lush gardens, coconut palms overhead and thatched huts surrrounding the area. The breakfast (included w/room) is excellent, with cooked to order eggs, rice and beans, tortillas or toast, salsa, fresh papaya and mango, freshly made fruit juices and coffee. The lunches are also excellent and very reasonable ($2 for a monster burger, $5 for a plate of fajitas that could feed two).",
            "title": "Great Hotel, Great Staff",
            "user": "nellall"
        },
        {
            "date": "June 14, 2006",
            "detail_rating": {
                "business": null,
                "cleanliness": null,
                "desk": null,
                "location": null,
                "pool": null,
                "restaurant": null,
                "rooms": null,
                "service": null,
                "sleep": null,
                "value": null
            },
            "helpfulness": 3,
            "id": 5342960,
            "likes": {
                "disliked": null,
                "liked": null
            },
            "rating": 5.0,
            "stay_parameters": null,
            "text": "The staff, however, are what really gives this hotel its charm. Marco the manager, and Naoma his assistant, are very friendly and helpful and just a pleasure to talk to. Lilliana, the cook, always has smile and a pleasant greeting to go with the great food she prepares. Lourdes, who cleaned our room, was very sweet and sincere and made very artful creations on our bed with the fresh towels she brought every morning. And Peter, the owner, is quite a character himself - we really enjoyed visitng with him during breakfast each morning.",
            "title": "The best deal in Jaco",
            "user": "A TripAdvisor user"
        },
        {
            "date": "April 24, 2006",
            "detail_rating": {
                "business": null,
                "cleanliness": 4.0,
                "desk": null,
                "location": null,
                "pool": null,
                "restaurant": null,
                "rooms": 3.0,
                "service": 5.0,
                "sleep": null,
                "value": 4.0
            },
            "helpfulness": 3,
            "id": 5003317,
            "likes": {
                "disliked": null,
                "liked": null
            },
            "rating": 4.0,
            "stay_parameters": "Stayed April 2006",
            "text": "The hotel is right on the beach and a short, 5-minute walk from Jaco. Jaco itself is very touristy, a bit seedy at times, and crowded on the weekends, but there are several good restaurants and it's located close to some beautiful destinations (Manuel Antonio State Park is 45 minutes south) and beautiful beaches.",
            "title": "Learned to love it",
            "user": "EJA"
        },
        {
            "date": "August 28, 2005",
            "detail_rating": {
                "business": null,
                "cleanliness": 4.0,
                "desk": null,
                "location": null,
                "pool": null,
                "restaurant": null,
                "rooms": 4.0,
                "service": 4.0,
                "sleep": null,
                "value": 4.0
            },
            "helpfulness": 10,
            "id": 3813041,
            "likes": {
                "disliked": null,
                "liked": null
            },
            "rating": 4.0,
            "stay_parameters": "Stayed August 2005",
            "text": "We had a great time and will definately stay at Canciones del Mar again the next time we visit Costa Rica.",
            "title": "Very nicely done!",
            "user": "Blizzard1000"
        },
        {
            "date": "June 22, 2007",
            "detail_rating": {
                "business": 3.0,
                "cleanliness": 5.0,
                "desk": null,
                "front_desk": 4.0,
                "location": 5.0,
                "pool": null,
                "restaurant": null,
                "rooms": 5.0,
                "service": 5.0,
                "sleep": null,
                "value": 4.0
            },
            "helpfulness": 1,
            "id": 7966935,
            "likes": {
                "disliked": "\u2014 dogs next door",
                "liked": "\u2014 lots of room"
            },
            "rating": 4.0,
            "stay_parameters": "Stayed June 2007, traveled with family",
            "text": "Family of 5 stayed here in June 2007. Lots of space, nice having the kitchen. Great breakfast, pool and beach. Would stay here again.",
            "title": "lots of space",
            "user": "LaurieChris"
        },
        {
            "date": "March 30, 2007",
            "detail_rating": {
                "business": 4.0,
                "cleanliness": 4.0,
                "desk": null,
                "front_desk": 4.0,
                "location": 4.0,
                "pool": null,
                "restaurant": null,
                "rooms": 5.0,
                "service": 5.0,
                "sleep": null,
                "value": 5.0
            },
            "helpfulness": 4,
            "id": 7252766,
            "likes": {
                "disliked": "\u2014 The access road at night",
                "liked": "\u2014 Staff, food, rooms, pool, beach, other travellers"
            },
            "rating": 5.0,
            "stay_parameters": "Stayed March 2007, traveled as a couple",
            "text": "My husband and I just returned from our honeymoon in Jaco and we couldn't have asked for a better place to stay. The value certainly cannot be beat.",
            "title": "The best place to stay in Jaco!",
            "user": "JustinandAmanda"
        },
        {
            "date": "March 27, 2007",
            "detail_rating": {
                "business": null,
                "cleanliness": null,
                "desk": null,
                "location": null,
                "pool": null,
                "restaurant": null,
                "rooms": null,
                "service": null,
                "sleep": null,
                "value": null
            },
            "helpfulness": 2,
            "id": 7230270,
            "likes": {
                "disliked": null,
                "liked": null
            },
            "rating": 5.0,
            "stay_parameters": null,
            "text": "The rooms were very clean and spacious. There\u2019s a nice pool surrounded by lush trees and gardens. Not a good place to go if you\u2019re afraid of lizards, geckos, and iguanas\u2026 there was rarely a time where we didn\u2019t see one lounging on the pool or restaurant deck. However, if these things scare you, then you really shouldn\u2019t go to Costa Rica at all! :)",
            "title": "Beachfront charm and cheap! ....When in Costa Rica, do not skip Jaco",
            "user": "InSearchOfSurf"
        },
        {
            "date": "February 21, 2007",
            "detail_rating": {
                "business": 5.0,
                "cleanliness": 5.0,
                "desk": null,
                "front_desk": 5.0,
                "location": 5.0,
                "pool": null,
                "restaurant": null,
                "rooms": 5.0,
                "service": 5.0,
                "sleep": null,
                "value": 5.0
            },
            "helpfulness": 1,
            "id": 6822324,
            "likes": {
                "disliked": null,
                "liked": "\u2014 location,privacy,quality"
            },
            "rating": 5.0,
            "stay_parameters": "Stayed February 2007, traveled as a couple",
            "text": "There\u2019s a surf break right in front of the hotel which you can hear all night long. The hotel really is aptly named (Song of the Sea). Not all rooms have an ocean view, but you can have breakfast/ lunch on the beach if you wish.",
            "title": "Paradise in Jaco",
            "user": "Lilliann M"
        },
        {
            "date": "November 15, 2006",
            "detail_rating": {
                "business": null,
                "cleanliness": 3.0,
                "desk": null,
                "front_desk": 4.0,
                "location": 2.0,
                "pool": null,
                "restaurant": null,
                "rooms": 3.0,
                "service": 3.0,
                "sleep": null,
                "value": 2.0
            },
            "helpfulness": null,
            "id": 6135117,
            "likes": {
                "disliked": "\u2014 condoms left on porch.",
                "liked": "\u2014 large rooms and nice breakfast"
            },
            "rating": 2.0,
            "stay_parameters": "Stayed November 2006, traveled as a couple",
            "text": "The staff was amazing!!! It often seemed that they went out of their way to make our holiday special. The food was spectacular... make sure you take advantage of the free breakfast; it\u2019s very good. And, don't leave without having tried the beef fajitas at lunch!",
            "title": "Skip Jaco!",
            "user": "joenjoan"
        },
        {
            "date": "July 22, 2005",
            "detail_rating": {
                "business": null,
                "cleanliness": 4.0,
                "desk": null,
                "location": null,
                "pool": null,
                "restaurant": null,
                "rooms": 4.0,
                "service": 4.0,
                "sleep": null,
                "value": 3.0
            },
            "helpfulness": 5,
            "id": 3693562,
            "likes": {
                "disliked": null,
                "liked": null
            },
            "rating": 5.0,
            "stay_parameters": "Stayed July 2005",
            "text": "We stayed for two days and thought it was great. It was beautiful and the rooms were large. The manager was very nice and so was the staff. The free breakfast was great and we had some excellent hamburgers there for lunch. The manager arranged a canopy tour for us at the Waterfalls Canopy tour. We had a blast. We ate a delicious tuna/shrimp/lobster dinner at the El Bohio on the beach about a block or two away.",
            "title": "Great Hotel",
            "user": "tailwhipped"
        },
        {
            "date": "June 30, 2005",
            "detail_rating": {
                "business": null,
                "cleanliness": null,
                "desk": null,
                "location": null,
                "pool": null,
                "restaurant": null,
                "rooms": null,
                "service": null,
                "sleep": null,
                "value": null
            },
            "helpfulness": 3,
            "id": 3622858,
            "likes": {
                "disliked": null,
                "liked": null
            },
            "rating": 4.0,
            "stay_parameters": null,
            "text": "My husband and I took our first trip to C.R. this year. We took our two children and a babysitter (for my three year old). We decided to stay at Jaco because of its close proximity to the San Jose Airport and to various activities. We were very pleased for several reasons. First, the hotel was right on the beach with a great view. The pool and gardens were absolutely beautiful. Although Jaco itself was somewhat dirty, the staff at the hotel went to great lengths to keep the grounds clean. The managers at the hotel were very helpful, even when we waited to the last minute to schedule a tour. Marco, the manager, even shopped around for the best price for a taxi to Tarcoles for the Crocodile Safari. The housekeepers were absolutely wonderful. They even straigtened our shoes and folded our clothes. They did much more than our American housekeepers, who usually only change the towels and make the bed. The housekeepers at the C.d.M. really take pride in what they do. The breakfast, which is included in the price of the room, was absolutely delicious. It was traditional Costa Rican, and Lillianna, the cook, was wonderful. The snack bar stayed opened until two o'clock. Lillianna made hamburgers, hot dogs, fajitas, etc. We were able to charge the lunches to our rooms. They also sold sodas and beer. I needed laundry done, and for a very small fee, my clothes were washed, dried, folded and returned to me in about three hours. I highly recommend this hotel. Anyone who writes a negative review about it is probably extremely picky. I know that anyone can have a bad experience at any hotel, but I find it hard to believe that bad experiences are the norm at this one.",
            "title": "The Caniones del Mar Was Nice",
            "user": "A TripAdvisor user"
        },
        {
            "date": "March 17, 2005",
            "detail_rating": {
                "business": null,
                "cleanliness": null,
                "desk": null,
                "location": null,
                "pool": null,
                "restaurant": null,
                "rooms": null,
                "service": null,
                "sleep": null,
                "value": null
            },
            "helpfulness": 7,
            "id": 3281899,
            "likes": {
                "disliked": null,
                "liked": null
            },
            "rating": 1.0,
            "stay_parameters": null,
            "text": "First off the hotel is on the beach but only two rooms face the beach. The office for the hotel is only open from 8 am to 8 pm so when the electricity went out we had no one to tell. We were told about a jet ski tour and they called on our behalf. We were told we had to pay in cash by the owner of the jet ski company. Unfortuanetly we did not have that much cash so the owner of the hotel offered to put the charge on our room so we could pay with credit card. Well when we checked out the owner had added a 15% charge for using a credit card for the jet ski tour without letting us know. The problem is that we would not have cared if he had just been honest and told us up front that there would be a service charge for using our credit card for the jet ski tour. Then every night I was there I woke to a bug crawling on my face and my legs had benn eaten by bugs. But figured we are just in the rain forest what do you expect.",
            "title": "Not very honest...",
            "user": "A TripAdvisor user"
        },
        {
            "date": "February 23, 2005",
            "detail_rating": {
                "business": null,
                "cleanliness": 1.0,
                "desk": null,
                "location": null,
                "pool": null,
                "restaurant": null,
                "rooms": 2.0,
                "service": 3.0,
                "sleep": null,
                "value": 3.0
            },
            "helpfulness": 13,
            "id": 3224141,
            "likes": {
                "disliked": null,
                "liked": null
            },
            "rating": 3.0,
            "stay_parameters": "Stayed February 2005",
            "text": "Okay, I went to this hotel based solely upon what I read on their website. The biggest dissapointment about this hotel is that every unit does NOT have an ocean view as advertised on their site. They have two units with a partial ocean view and the other nine have no ocean view. The units themselves have some problems. We were overrun with ants and small insects all over the bathroom and kitchen. There was mold growing on the bathroom and living room walls. I found hair on the linen in the bed. We were hugely dissapointed about all of this and only stayed one night before moving to the Tangeri. On a positive note, this place is very quiet and has a wonderful atmosphere. The pool, gardens, and grounds are excellent. The breakfast is good and the staff are very polite. I just feel like their web site misrepresents what you really get, but oh well, lesson learned. We met many nice people who love this place for a peaceful relaxing time and come back year after year. Now you have the facts.",
            "title": "The Facts",
            "user": "Lance_L"
        }
    ],
    "slim_ranking": 0.434782608696,
    "stars": 3,
    "tripadvisor": {
        "VISITED": false,
        "country_name": null,
        "locality": null,
        "pic_link": null,
        "street_address": null
    },
    "user_rating": 3.5,
    "variance": {
        "average": 10,
        "excellent": 29,
        "poor": 10,
        "terrible": 9,
        "very good": 29
    }
}