{
    "aka": "Hotel Villamarina",
    "description": "The Villa Marina is a friendly family orientated hotel offering all inclusive holidays for families to enjoy and not have to worry about entertainment, food and drink for the duration of your stay. Everyone can relax and enjoy the facilities of 2 swimming pools, one with child section, adults only rooftop solarium with Jacuzzis, buffet style restaurant, snack bar, Play Park for the children, outside cinema screen, large terrace and bar area. Our resident English Speaking Entertainers are here for you 7 days a week keeping all the family entertained day and night, and to give you that little bit extra in your evening entertainment we have external, professional shows, to add to your all inclusive package. To ensure our customers have a relaxing and enjoyable holiday the entertainment and bar finish at 00.00 This friendly 3* all inclusive hotel is only 15 minutes away from Reus Airport, 10 minutes away from the Port Aventura theme park and a 10 minute walk to the beach giving you the ideal holiday base.",
    "detail_rating": {
        "cleanliness": 4.0,
        "location": 3.5,
        "rooms": 3.5,
        "service": 4.5,
        "sleep": 3.5,
        "value": 4.5
    },
    "location": {
        "city": null,
        "continent": "Europe",
        "country": "Spain",
        "proposed_city": null,
        "province": null,
        "region": "Catalonia"
    },
    "name": "Hotel Villamarina Club",
    "places": {
        "aka": [],
        "hotel_description": [
            "Marina",
            "Reus",
            "Aventura"
        ],
        "hotel_name": []
    },
    "review_count": 1538,
    "review_count_current": 20,
    "reviews": [
        {
            "date": "July 20, 2008",
            "detail_rating": {
                "business": null,
                "cleanliness": 4.0,
                "desk": null,
                "front_desk": 5.0,
                "location": 3.0,
                "pool": null,
                "restaurant": null,
                "rooms": 3.0,
                "service": 3.0,
                "sleep": null,
                "value": 4.0
            },
            "helpfulness": 1,
            "id": 18068118,
            "likes": {
                "disliked": "\u2014 distance from beach",
                "liked": "\u2014 entertainment"
            },
            "rating": 3.0,
            "stay_parameters": "Stayed June 2004, traveled with friends",
            "text": "I stayed in this hotel 4 years ago but it always sticks in my mind. The entertainment was the best ive ever seen, ideal for families, couples, kids everyone. The food was fine, i was all inclusive and enjoyed the whole experience. I would go back to this hotel as i didnt see much of Salou, due to being so entertained at the hotel! Room were absolutely fine, standard accomodation but clean and well looked after. a perfect cheapy holiday",
            "title": "perfect family holiday",
            "user": "donnyroo"
        },
        {
            "date": "July 19, 2008",
            "detail_rating": {
                "business": 5.0,
                "cleanliness": 5.0,
                "desk": null,
                "front_desk": 4.0,
                "location": 5.0,
                "pool": null,
                "restaurant": null,
                "rooms": 3.0,
                "service": 4.0,
                "sleep": null,
                "value": 5.0
            },
            "helpfulness": 2,
            "id": 18047465,
            "likes": {
                "disliked": "\u2014 Rooms very basic -need refurb",
                "liked": "\u2014 entertainment"
            },
            "rating": 5.0,
            "stay_parameters": "Stayed July 2008, traveled with family",
            "text": "Arrived at the villamarina on July 2nd to the 9th.",
            "title": "excellent 3 star all inclusive",
            "user": "ChesterEverton"
        },
        {
            "date": "July 18, 2008",
            "detail_rating": {
                "business": 5.0,
                "cleanliness": 5.0,
                "desk": null,
                "front_desk": 5.0,
                "location": 3.0,
                "pool": null,
                "restaurant": null,
                "rooms": 4.0,
                "service": 5.0,
                "sleep": null,
                "value": 4.0
            },
            "helpfulness": 2,
            "id": 18016297,
            "likes": {
                "disliked": "\u2014 Jaccuzzi area",
                "liked": "\u2014 Swimming pools and friendly staff"
            },
            "rating": 4.0,
            "stay_parameters": "Stayed June 2008, traveled with family",
            "text": "Had a wonderful time, definately very good food, always good choice for adults and children, one of ours is just 1, and there was plenty for him to eat as well.",
            "title": "Hulla Balou in Salou",
            "user": "kawacking"
        },
        {
            "date": "July 13, 2008",
            "detail_rating": {
                "business": null,
                "cleanliness": 1.0,
                "desk": null,
                "front_desk": 1.0,
                "location": 3.0,
                "pool": null,
                "restaurant": null,
                "rooms": 1.0,
                "service": 1.0,
                "sleep": null,
                "value": 2.0
            },
            "helpfulness": null,
            "id": 17845349,
            "likes": {
                "disliked": null,
                "liked": "\u2014 nothing"
            },
            "rating": 2.0,
            "stay_parameters": "Stayed July 2008, traveled with friends",
            "text": "All inclusive drinks very good, and soft drinks for the kids the same, no watered down/cheap fizzy drinks etc.",
            "title": "Not so much of a bargain break",
            "user": "sun_seeker096"
        },
        {
            "date": "July 12, 2008",
            "detail_rating": {
                "business": 5.0,
                "cleanliness": 5.0,
                "desk": null,
                "front_desk": 5.0,
                "location": 2.0,
                "pool": null,
                "restaurant": null,
                "rooms": 3.0,
                "service": 5.0,
                "sleep": null,
                "value": 3.0
            },
            "helpfulness": null,
            "id": 17809814,
            "likes": {
                "disliked": null,
                "liked": "\u2014 cleanliness of rooms"
            },
            "rating": 2.0,
            "stay_parameters": "Stayed July 2008, traveled as a couple",
            "text": "Rooms very basic and could do with modernising, although there were 2 adults and 2 small kids we managed as after all you only use the room to sleep, change etc",
            "title": "Not what we expected after reading the reviews!!",
            "user": "buster077"
        },
        {
            "date": "May 18, 2008",
            "detail_rating": {
                "business": 3.0,
                "cleanliness": 4.0,
                "desk": null,
                "front_desk": 4.0,
                "location": 2.0,
                "pool": null,
                "restaurant": null,
                "rooms": 4.0,
                "service": 4.0,
                "sleep": null,
                "value": 3.0
            },
            "helpfulness": 2,
            "id": 16175105,
            "likes": {
                "disliked": "\u2014 the food and noise levels",
                "liked": "\u2014 the clean rooms and friendly staff"
            },
            "rating": 2.0,
            "stay_parameters": "Stayed May 2008, traveled with family",
            "text": "Four of us went at the start of may 2008 sharing two rooms. The rooms were clean and cleaned daily.",
            "title": "its not all bad",
            "user": "bigjock69"
        },
        {
            "date": "April 5, 2008",
            "detail_rating": {
                "business": 3.0,
                "cleanliness": 4.0,
                "desk": null,
                "front_desk": 4.0,
                "location": null,
                "pool": null,
                "restaurant": null,
                "rooms": 3.0,
                "service": 4.0,
                "sleep": null,
                "value": 5.0
            },
            "helpfulness": 7,
            "id": 14814714,
            "likes": {
                "disliked": "\u2014 pools could of been bigger!",
                "liked": "\u2014 Area and value for money"
            },
            "rating": 5.0,
            "stay_parameters": "Stayed August 2007, traveled with family",
            "text": "There were 2 days of constant rain (not the hotels fault i know) and the rooms were extremely cold the heating in the hotel did not work.",
            "title": "Time of Our Lives!",
            "user": "holidaybluesx"
        },
        {
            "date": "March 3, 2008",
            "detail_rating": {
                "business": null,
                "cleanliness": 1.0,
                "desk": null,
                "front_desk": 2.0,
                "location": 1.0,
                "pool": null,
                "restaurant": null,
                "rooms": 1.0,
                "service": 1.0,
                "sleep": null,
                "value": 1.0
            },
            "helpfulness": null,
            "id": 14012237,
            "likes": {
                "disliked": "\u2014 the filthy mess !!!!!",
                "liked": "\u2014 it was an hour waay from barcelona"
            },
            "rating": 1.0,
            "stay_parameters": "Stayed July 2005, traveled with family",
            "text": "The food at the hotel was cold and very repetitive and not good,the snack bar food was a lot better ie burgers, hot dogs, pizza and chip's.",
            "title": "of all the hotels in the world to choose from i had to choose this one!",
            "user": "braddyLiverpool"
        },
        {
            "date": "February 18, 2008",
            "detail_rating": {
                "business": 3.0,
                "cleanliness": 5.0,
                "desk": null,
                "front_desk": 4.0,
                "location": 3.0,
                "pool": null,
                "restaurant": null,
                "rooms": 4.0,
                "service": 4.0,
                "sleep": null,
                "value": 4.0
            },
            "helpfulness": 1,
            "id": 13650148,
            "likes": {
                "disliked": "\u2014 how cold and dirty the pools were",
                "liked": "\u2014 the kids entertainment"
            },
            "rating": 4.0,
            "stay_parameters": "Stayed October 2004, traveled with family",
            "text": "Entertainment was aimed at children and bingo lovers one good night when they got other singers in.",
            "title": "Loved it",
            "user": "DerbyMichele"
        },
        {
            "date": "November 29, 2007",
            "detail_rating": {
                "business": 3.0,
                "cleanliness": 2.0,
                "desk": null,
                "front_desk": 4.0,
                "location": 3.0,
                "pool": null,
                "restaurant": null,
                "rooms": 3.0,
                "service": 3.0,
                "sleep": null,
                "value": 4.0
            },
            "helpfulness": 3,
            "id": 11138274,
            "likes": {
                "disliked": "\u2014 entertainment",
                "liked": "\u2014 food and bar"
            },
            "rating": 4.0,
            "stay_parameters": "Stayed August 2007, traveled with family",
            "text": "Noisiest hotel i have ever stayed children running up and down the corridors to 1am every night children everywhere unattended no parents to be seen.",
            "title": "would go back",
            "user": "aliceNorthants"
        },
        {
            "date": "June 29, 2008",
            "detail_rating": {
                "business": 4.0,
                "cleanliness": 5.0,
                "desk": null,
                "front_desk": 5.0,
                "location": 4.0,
                "pool": null,
                "restaurant": null,
                "rooms": 4.0,
                "service": 5.0,
                "sleep": null,
                "value": 5.0
            },
            "helpfulness": 3,
            "id": 17332707,
            "likes": {
                "disliked": "\u2014 nothing",
                "liked": "\u2014 clean, great hotel staff, great food, great entertainment/activities"
            },
            "rating": 5.0,
            "stay_parameters": "Stayed June 2008, traveled with family",
            "text": "This hotel certainly exceeded my expectations, and my expectations were quite high as I had read a lot reviews (some bad but mainly good). I have only been on 2 all inclusive holidays before and both were a disaster (food barely edible and very limited choice, entertainment awful etc.etc...). The Villamarina was the total opposite. The hotel itself is very clean and well maintained as are the two pools and outside areas. The room was big enough (2 adult,2 children) and again very clean (the maids came EVERY day). The food was excellent (and hot) with plenty of choice. beef, veal, chicken, thai curry, chicken madras, chicken masala, salmon, spag bol, chilli con carne, roast spuds broccolli cauliflower cheese to name but a few of the meals witnessed on my 1 week stay..... the list goes on, even the snack bar had a choice of pizza,hotdog,chips,hamburger,nuggetts and even fishfingers. The all inclusive drinks included a choice of 8 alcoholic cocktails and 3 kiddie cocktails as well as the usual lager and spirits. Now for the good bit!!!! lol . The entertainment team (Hello Tiny and Liz - sorry we didnt say goodbye) they always greeted with a smile and worked tirelessly to make sure that the guests were never bored. From quizzes and sports activities like volleyball,football,rifle shooting, water polo etc.. to entertaining the guests in the evening. There was also a park and an outside cinema screen showing the latest children and family films (both within site of the outside terrace) so the adults could watch the entertainment and their children at the same time........great!! All in all a great family hotel and a great holiday had by all. Would DEFO go back.",
            "title": "Excellent couldn't have asked for more!!!!",
            "user": "theholidaybugs"
        },
        {
            "date": "June 25, 2008",
            "detail_rating": {
                "business": 4.0,
                "cleanliness": 4.0,
                "desk": null,
                "front_desk": 4.0,
                "location": 4.0,
                "pool": null,
                "restaurant": null,
                "rooms": 4.0,
                "service": 4.0,
                "sleep": null,
                "value": 5.0
            },
            "helpfulness": 4,
            "id": 17204925,
            "likes": {
                "disliked": "\u2014 n/a",
                "liked": "\u2014 It was comfortable, clean and large"
            },
            "rating": 4.0,
            "stay_parameters": "Stayed June 2008, traveled with family",
            "text": "THANKS TO ALL AT THE VILLAMARINA",
            "title": "A good hotel and a great base for exploring the Salou area",
            "user": "Annie220"
        },
        {
            "date": "June 10, 2008",
            "detail_rating": {
                "business": null,
                "cleanliness": 5.0,
                "desk": null,
                "front_desk": 5.0,
                "location": 5.0,
                "pool": null,
                "restaurant": null,
                "rooms": 4.0,
                "service": 5.0,
                "sleep": null,
                "value": 5.0
            },
            "helpfulness": 3,
            "id": 16823272,
            "likes": {
                "disliked": "\u2014 nothing",
                "liked": "\u2014 The food and the manager she was so helpful"
            },
            "rating": 5.0,
            "stay_parameters": "Stayed May 2008, traveled with friends",
            "text": "Gary, nicola, brandon and kayley",
            "title": "Fabulous time",
            "user": "diamond100"
        },
        {
            "date": "June 5, 2008",
            "detail_rating": {
                "business": 5.0,
                "cleanliness": 5.0,
                "desk": null,
                "front_desk": 5.0,
                "location": 5.0,
                "pool": null,
                "restaurant": null,
                "rooms": 4.0,
                "service": 4.0,
                "sleep": null,
                "value": 4.0
            },
            "helpfulness": 2,
            "id": 16695711,
            "likes": {
                "disliked": null,
                "liked": "\u2014 cleanliness"
            },
            "rating": 4.0,
            "stay_parameters": "Stayed May 2008, traveled with family",
            "text": "We booked our holiday via holidayhotels.com and flew from Luton to Reus with Ryanair.",
            "title": "Good time had by all",
            "user": "bonny51"
        },
        {
            "date": "June 4, 2008",
            "detail_rating": {
                "business": null,
                "cleanliness": null,
                "desk": null,
                "location": null,
                "pool": null,
                "restaurant": null,
                "rooms": null,
                "service": null,
                "sleep": null,
                "value": null
            },
            "helpfulness": 2,
            "id": 16669665,
            "likes": {
                "disliked": null,
                "liked": null
            },
            "rating": 4.0,
            "stay_parameters": null,
            "text": "Taxis were waiting at Reus airport along with buses so we had no problem transferring to the hotel. The taxi to the hotel cost 28 euros, which was a set price. The bus would have been a bit cheaper but would have taken half an hour longer.",
            "title": "Fab!",
            "user": "rebeccadepp"
        },
        {
            "date": "June 2, 2008",
            "detail_rating": {
                "business": 5.0,
                "cleanliness": 5.0,
                "desk": null,
                "front_desk": 5.0,
                "location": 5.0,
                "pool": null,
                "restaurant": null,
                "rooms": 4.0,
                "service": 5.0,
                "sleep": null,
                "value": 5.0
            },
            "helpfulness": 2,
            "id": 16618181,
            "likes": {
                "disliked": "\u2014 the only thing i could find fault with is the room was on the small side but you only need it to sleep in it",
                "liked": "\u2014 every one was so helpful and nothing was to much trouble"
            },
            "rating": 5.0,
            "stay_parameters": "Stayed June 2008, traveled with family",
            "text": "our flight was to reus airport from stansted with ryanair and was very good and the hotel was only a 15 minutes transfer which was ready and waiting for us on arrival.the hotel staff were excellent and very helpful we were all inclusive and the variety of the food & drinks was good and there was always plenty of it.the night entertainment was very good and caters for all.the hotel does alot of excursions to different places but we used the plana buses as it did not commit us to a certain day and time.",
            "title": "superb",
            "user": "bighmark"
        },
        {
            "date": "May 31, 2008",
            "detail_rating": {
                "business": 3.0,
                "cleanliness": 3.0,
                "desk": null,
                "front_desk": 3.0,
                "location": 1.0,
                "pool": null,
                "restaurant": null,
                "rooms": 2.0,
                "service": 3.0,
                "sleep": null,
                "value": 2.0
            },
            "helpfulness": null,
            "id": 16535816,
            "likes": {
                "disliked": "\u2014 The Entertainment",
                "liked": "\u2014 It was Clean"
            },
            "rating": 2.0,
            "stay_parameters": "Stayed May 2008, traveled as a couple",
            "text": "the beach was about 1 mile from the hotel and what a loverly beach it is.",
            "title": "Good if it was a Bargain!!",
            "user": "Wendoo"
        },
        {
            "date": "May 28, 2008",
            "detail_rating": {
                "business": null,
                "cleanliness": 5.0,
                "desk": null,
                "front_desk": 5.0,
                "location": 4.0,
                "pool": null,
                "restaurant": null,
                "rooms": 5.0,
                "service": 5.0,
                "sleep": null,
                "value": 5.0
            },
            "helpfulness": 4,
            "id": 16457003,
            "likes": {
                "disliked": "\u2014 Lots of children running about",
                "liked": "\u2014 LOCATION"
            },
            "rating": 5.0,
            "stay_parameters": "Stayed May 2008, traveled as a couple",
            "text": "this was our first time abroad and we had no problem with travel republic's booking it was very easy and every thing was taken care of for us at a very reasonable price we would highly recommend them and would like to say thank you.",
            "title": "Could not fault it",
            "user": "ilovestars1234"
        },
        {
            "date": "May 27, 2008",
            "detail_rating": {
                "business": null,
                "cleanliness": null,
                "desk": null,
                "location": null,
                "pool": null,
                "restaurant": null,
                "rooms": null,
                "service": null,
                "sleep": null,
                "value": null
            },
            "helpfulness": 1,
            "id": 16442620,
            "likes": {
                "disliked": null,
                "liked": null
            },
            "rating": 4.0,
            "stay_parameters": null,
            "text": "Stayed here for 1 week, and that was long enough!",
            "title": "had a ball",
            "user": "bronagh00"
        },
        {
            "date": "May 26, 2008",
            "detail_rating": {
                "business": 5.0,
                "cleanliness": 5.0,
                "desk": null,
                "front_desk": 5.0,
                "location": 4.0,
                "pool": null,
                "restaurant": null,
                "rooms": 5.0,
                "service": 5.0,
                "sleep": null,
                "value": 5.0
            },
            "helpfulness": 2,
            "id": 16413067,
            "likes": {
                "disliked": "\u2014 only two toilets in bar, not enough",
                "liked": "\u2014 friendly atmosphere, entertainment staff, clean"
            },
            "rating": 5.0,
            "stay_parameters": "Stayed May 2008",
            "text": "Hotel was ok your standard 3 star. Food was nice the first few",
            "title": "great family holiday",
            "user": "bellaannFlintshire"
        }
    ],
    "slim_ranking": 0.121212121212,
    "stars": 3,
    "tripadvisor": {
        "VISITED": false,
        "country_name": null,
        "locality": null,
        "pic_link": null,
        "street_address": null
    },
    "user_rating": 4.0,
    "variance": {
        "average": 190,
        "excellent": 694,
        "poor": 101,
        "terrible": 97,
        "very good": 456
    }
}