{
    "aka": "Belludi 37 Padua",
    "description": "The hotel takes its name Belludi37 from the central via Belludi, which links the Basilica of Sant'Anthony, the icon of the city, to one of the most fascinating squares in Europe, Prato della Valle. The building is early twentieth century, with interiors recently renewed and enriched with d\u00e8cor of contemporary design. The rooms, cared for every detail, reflect the concept of our hospitality: \"refined but accessible, sophisticated but cosy, for everyone but not just anyone\". At a short distance from the most important artistic and cultural attractions of this wonderful city, Hotel Belludi37 will surprise and enthral you on each visit.",
    "detail_rating": {
        "cleanliness": 4.5,
        "location": 5.0,
        "rooms": 4.5,
        "service": 5.0,
        "sleep": 4.5,
        "value": 5.0
    },
    "location": {
        "city": null,
        "continent": "Europe",
        "country": "Italy",
        "proposed_city": "Prato",
        "province": null,
        "region": "Veneto"
    },
    "name": "Belludi 37",
    "places": {
        "aka": [],
        "hotel_description": [
            "Prato"
        ],
        "hotel_name": []
    },
    "review_count": 534,
    "review_count_current": 20,
    "reviews": [
        {
            "date": "August 24, 2010",
            "detail_rating": {
                "business": null,
                "cleanliness": null,
                "desk": null,
                "location": null,
                "pool": null,
                "restaurant": null,
                "rooms": null,
                "service": null,
                "sleep": null,
                "value": null
            },
            "helpfulness": null,
            "id": 76654983,
            "likes": {
                "disliked": null,
                "liked": null
            },
            "rating": 5.0,
            "stay_parameters": null,
            "text": "We found Padua to be a wonderful city and the Belludi 37 hotel couldn't have been better! We arrived late (due to train problems) and the hotel staff quickly checked us in, got us settled and made us dinner reservations at a delicious restaurant a few minutes walk away.",
            "title": "A Perfect Time in Padua",
            "user": "TeachinCa"
        },
        {
            "date": "August 18, 2010",
            "detail_rating": {
                "business": null,
                "cleanliness": 5.0,
                "desk": null,
                "location": 5.0,
                "pool": null,
                "restaurant": null,
                "rooms": 4.0,
                "service": 5.0,
                "sleep": 5.0,
                "value": 5.0
            },
            "helpfulness": 1,
            "id": 75779067,
            "likes": {
                "disliked": null,
                "liked": null
            },
            "rating": 5.0,
            "stay_parameters": "Stayed August 2010, traveled as a couple",
            "text": "The room was spacious and comfortable - lots of storage, great bed... and a view of St. Anthony's that was spectacular. Breakfast was perfect. We used the bikes to tour the town and had a wonderful day biking all over town.",
            "title": "7* Service!!! Just \"WOW\"!!!",
            "user": "HONkiev"
        },
        {
            "date": "July 30, 2010",
            "detail_rating": {
                "business": null,
                "cleanliness": 5.0,
                "desk": null,
                "location": 5.0,
                "pool": null,
                "restaurant": null,
                "rooms": 4.0,
                "service": 5.0,
                "sleep": 4.0,
                "value": 5.0
            },
            "helpfulness": 1,
            "id": 72943125,
            "likes": {
                "disliked": null,
                "liked": null
            },
            "rating": 5.0,
            "stay_parameters": "Stayed May 2010, traveled as a couple",
            "text": "This was one of our favorite stays in Italy! Thanks Belludi 37 for everything!!",
            "title": "Owner Magnificent Mauro will treat you like royalty...look no further!",
            "user": "slocharmer"
        },
        {
            "date": "July 17, 2010",
            "detail_rating": {
                "business": null,
                "cleanliness": 5.0,
                "desk": null,
                "location": 5.0,
                "pool": null,
                "restaurant": null,
                "rooms": 5.0,
                "service": 5.0,
                "sleep": 5.0,
                "value": 5.0
            },
            "helpfulness": null,
            "id": 71299186,
            "likes": {
                "disliked": null,
                "liked": null
            },
            "rating": 5.0,
            "stay_parameters": "Stayed June 2010, traveled as a couple",
            "text": "I really didn't know if I should stay at this hotel - because it rates itself 2*. But due to the perfect rating in tripadviser I decided to take the risk.",
            "title": "outstanding boutique hotel in terrific location",
            "user": "John255100"
        },
        {
            "date": "July 16, 2010",
            "detail_rating": {
                "business": null,
                "cleanliness": 4.0,
                "desk": null,
                "location": 4.0,
                "pool": null,
                "restaurant": null,
                "rooms": 4.0,
                "service": 5.0,
                "sleep": 4.0,
                "value": 3.0
            },
            "helpfulness": null,
            "id": 71168592,
            "likes": {
                "disliked": null,
                "liked": null
            },
            "rating": 4.0,
            "stay_parameters": "Stayed June 2010, traveled as a couple",
            "text": "Normally I'm staying at 4* or 5* hotels, such as W, Four Seasons, Oberoi, Taj... - but such a good service as at the \"Belludi37\" I didn't receive even at the Luxury Hotels in India.",
            "title": "What a delight",
            "user": "LucyPie"
        },
        {
            "date": "June 26, 2010",
            "detail_rating": {
                "business": null,
                "cleanliness": 4.0,
                "desk": null,
                "location": 4.0,
                "pool": null,
                "restaurant": null,
                "rooms": 4.0,
                "service": 4.0,
                "sleep": 4.0,
                "value": 4.0
            },
            "helpfulness": null,
            "id": 68767934,
            "likes": {
                "disliked": null,
                "liked": null
            },
            "rating": 4.0,
            "stay_parameters": "Stayed April 2010, traveled as a couple",
            "text": "My wife and I recently stayed here. The hotel is a charming, small hotel but most importantly of all , it is run by good, caring people. I wasn't feeling well when we arrived and the owner and her staff went out of their way to assist me in obtaining medical attention. The hotel is located in the heart of Padua and we hope to stay there again on some future vacation.",
            "title": "Friendly People",
            "user": "SpartaTom"
        },
        {
            "date": "June 24, 2010",
            "detail_rating": {
                "business": null,
                "cleanliness": 5.0,
                "desk": null,
                "location": 4.0,
                "pool": null,
                "restaurant": null,
                "rooms": 4.0,
                "service": 5.0,
                "sleep": 4.0,
                "value": 4.0
            },
            "helpfulness": null,
            "id": 68567216,
            "likes": {
                "disliked": null,
                "liked": null
            },
            "rating": 4.0,
            "stay_parameters": "Stayed June 2010, traveled as a couple",
            "text": "Excellent location, fantastic staff, nothing too much, wonderful breakfast - best we had in Italy. Modern decor but with ancient window shutters, great combination. Free internet access. Very helpful restaurant suggestions. Definitely would return next time we are in Padua.",
            "title": "Ideal mid price in Padua",
            "user": "Rocks_Water_Ice"
        },
        {
            "date": "June 21, 2010",
            "detail_rating": {
                "business": null,
                "cleanliness": 5.0,
                "desk": null,
                "location": 5.0,
                "pool": null,
                "restaurant": null,
                "rooms": 4.0,
                "service": 5.0,
                "sleep": 5.0,
                "value": 5.0
            },
            "helpfulness": null,
            "id": 68145958,
            "likes": {
                "disliked": null,
                "liked": null
            },
            "rating": 5.0,
            "stay_parameters": "Stayed June 2010, traveled with friends",
            "text": "We had an excellent stay at this charming small \u201chip hotel\u201d in a great location.",
            "title": "Excellent small hotel with great attention to detail",
            "user": "edinburghtraveller7"
        },
        {
            "date": "June 20, 2010",
            "detail_rating": {
                "business": null,
                "cleanliness": 5.0,
                "desk": null,
                "location": 5.0,
                "pool": null,
                "restaurant": null,
                "rooms": 5.0,
                "service": 5.0,
                "sleep": 5.0,
                "value": 5.0
            },
            "helpfulness": 1,
            "id": 68062245,
            "likes": {
                "disliked": null,
                "liked": null
            },
            "rating": 5.0,
            "stay_parameters": "Stayed June 2010, traveled as a couple",
            "text": "The hotel is well located in an historic building in the centre of the city. The rooms were clean and designed along the lines of more expensive hotels, with the kind of furniture you might put into a modern apartment. It felt a little like staying with stylish friends \u2013 and what more could you want! This was supplemented by the friendly welcome and, in our case, help with parking the car.",
            "title": "Exceptional Service - Highly Recommended!",
            "user": "Bessmount"
        },
        {
            "date": "June 10, 2010",
            "detail_rating": {
                "business": null,
                "cleanliness": 5.0,
                "desk": null,
                "location": 5.0,
                "pool": null,
                "restaurant": null,
                "rooms": 5.0,
                "service": 5.0,
                "sleep": 5.0,
                "value": 5.0
            },
            "helpfulness": 1,
            "id": 67096138,
            "likes": {
                "disliked": null,
                "liked": null
            },
            "rating": 5.0,
            "stay_parameters": "Stayed June 2010, traveled with friends",
            "text": "Padua has a wealth of coffee shops, restaurants and bars and there are many choices within a five minute radius of the hotel.",
            "title": "Great Small Hotel!",
            "user": "RSW42"
        },
        {
            "date": "June 8, 2010",
            "detail_rating": {
                "business": null,
                "cleanliness": 5.0,
                "desk": null,
                "location": 5.0,
                "pool": null,
                "restaurant": null,
                "rooms": 5.0,
                "service": 5.0,
                "sleep": 5.0,
                "value": 5.0
            },
            "helpfulness": 1,
            "id": 66842294,
            "likes": {
                "disliked": null,
                "liked": null
            },
            "rating": 5.0,
            "stay_parameters": "Stayed May 2010",
            "text": "I was traveling with my 76 yo mother. it was the beginning of a 30 days trip to Italy and we just had arrived from Milano. Since the beginning we felt a huge difference as we were received with smiles, an espresso and cookies. The hotel do not have an elevator and my mother have a bad knee, but we stayed at the first floor ,rooms facing the main street, but no noise at all during the night.",
            "title": "Spectacular little hotel",
            "user": "andr123"
        },
        {
            "date": "May 26, 2010",
            "detail_rating": {
                "business": null,
                "cleanliness": 5.0,
                "desk": null,
                "location": 5.0,
                "pool": null,
                "restaurant": null,
                "rooms": 4.0,
                "service": 5.0,
                "sleep": 4.0,
                "value": 5.0
            },
            "helpfulness": 1,
            "id": 65393584,
            "likes": {
                "disliked": null,
                "liked": null
            },
            "rating": 5.0,
            "stay_parameters": "Stayed May 2010, traveled as a couple",
            "text": "They didn`t had any room with double beds, and iI took another room for me with an special low fare. The rooms were airy, spacious and furnished with taste. The hotel stands in a old house completely renovated and quite near from the St Antonio Basilica. The reception team was amazing on provide info and everything we needed. The restaurant they indicated was the BEST and one of the CHEAPEST we had in the whole trip.",
            "title": "SUPERIOR customer service!",
            "user": "ynselr"
        },
        {
            "date": "May 24, 2010",
            "detail_rating": {
                "business": null,
                "cleanliness": 5.0,
                "desk": null,
                "location": 5.0,
                "pool": null,
                "restaurant": null,
                "rooms": 5.0,
                "service": 5.0,
                "sleep": 5.0,
                "value": 5.0
            },
            "helpfulness": 1,
            "id": 65130780,
            "likes": {
                "disliked": null,
                "liked": null
            },
            "rating": 5.0,
            "stay_parameters": "Stayed May 2010, traveled as a couple",
            "text": "At the end we received a bottle of excellent wine as a gift.",
            "title": "Belludi 37 - best choice in Padova",
            "user": "bawamba"
        },
        {
            "date": "May 15, 2010",
            "detail_rating": {
                "business": null,
                "cleanliness": 5.0,
                "desk": null,
                "location": 4.0,
                "pool": null,
                "restaurant": null,
                "rooms": 3.0,
                "service": 5.0,
                "sleep": 5.0,
                "value": 3.0
            },
            "helpfulness": 1,
            "id": 64240028,
            "likes": {
                "disliked": null,
                "liked": null
            },
            "rating": 4.0,
            "stay_parameters": "Stayed April 2010, traveled with family",
            "text": "As a Brazilian I`m used to warmth and coziness.",
            "title": "Very nearly perfect",
            "user": "Kiwifamily0f4"
        },
        {
            "date": "April 27, 2010",
            "detail_rating": {
                "business": null,
                "cleanliness": 5.0,
                "desk": null,
                "location": 5.0,
                "pool": null,
                "restaurant": null,
                "rooms": 5.0,
                "service": 5.0,
                "sleep": 5.0,
                "value": 5.0
            },
            "helpfulness": null,
            "id": 62571649,
            "likes": {
                "disliked": null,
                "liked": null
            },
            "rating": 5.0,
            "stay_parameters": "Stayed April 2010, traveled as a couple",
            "text": "I received everything there.",
            "title": "Friendly, Modern, Clean, Quiet, Centrally Located, Reasonable Rates",
            "user": "cachry"
        },
        {
            "date": "July 14, 2010",
            "detail_rating": {
                "business": null,
                "cleanliness": 5.0,
                "desk": null,
                "location": 5.0,
                "pool": null,
                "restaurant": null,
                "rooms": 5.0,
                "service": 5.0,
                "sleep": 5.0,
                "value": 5.0
            },
            "helpfulness": null,
            "id": 70924472,
            "likes": {
                "disliked": null,
                "liked": null
            },
            "rating": 5.0,
            "stay_parameters": "Stayed July 2010, traveled solo",
            "text": "I didn't want to leave the hotel. The directions from the train station were easy to follow. The greeting from the staff was incredible- served a cold beverage of my choice as they showed me the sites of Padua. They were also very helpful about recommending restaurants that were good, not too expensive.",
            "title": "Loved it!",
            "user": "Starred_Sneetch"
        },
        {
            "date": "July 14, 2010",
            "detail_rating": {
                "business": null,
                "cleanliness": 5.0,
                "desk": null,
                "location": 5.0,
                "pool": null,
                "restaurant": null,
                "rooms": 5.0,
                "service": 5.0,
                "sleep": 5.0,
                "value": 5.0
            },
            "helpfulness": null,
            "id": 70858345,
            "likes": {
                "disliked": null,
                "liked": null
            },
            "rating": 5.0,
            "stay_parameters": "Stayed July 2010, traveled as a couple",
            "text": "They upgraded my room at no additional cost, so my room was great, although I am sure all the rooms are nice and well designed, as is the entire hotel.",
            "title": "Stunning and Hip Room/Could Sleep All Day",
            "user": "CarrabbaUS"
        },
        {
            "date": "July 9, 2010",
            "detail_rating": {
                "business": null,
                "cleanliness": 5.0,
                "desk": null,
                "location": 5.0,
                "pool": null,
                "restaurant": null,
                "rooms": 4.0,
                "service": 4.0,
                "sleep": 5.0,
                "value": 4.0
            },
            "helpfulness": null,
            "id": 70304390,
            "likes": {
                "disliked": null,
                "liked": null
            },
            "rating": 4.0,
            "stay_parameters": "Stayed July 2010, traveled as a couple",
            "text": "Breakfast was another 7E, but well worth it.",
            "title": "nice, cosy and ideally located",
            "user": "Robertomazowiecki"
        },
        {
            "date": "July 8, 2010",
            "detail_rating": {
                "business": null,
                "cleanliness": 5.0,
                "desk": null,
                "location": 5.0,
                "pool": null,
                "restaurant": null,
                "rooms": 5.0,
                "service": 5.0,
                "sleep": 5.0,
                "value": 5.0
            },
            "helpfulness": null,
            "id": 70166623,
            "likes": {
                "disliked": null,
                "liked": null
            },
            "rating": 5.0,
            "stay_parameters": "Stayed July 2010, traveled on business",
            "text": "Best hotel I've stayed in Italy. I'll be back!",
            "title": "Perfect. I wish I could find a hotel like this wherever I go.",
            "user": "Italia4sempre"
        },
        {
            "date": "July 5, 2010",
            "detail_rating": {
                "business": null,
                "cleanliness": 5.0,
                "desk": null,
                "location": 5.0,
                "pool": null,
                "restaurant": null,
                "rooms": 5.0,
                "service": 5.0,
                "sleep": 5.0,
                "value": 5.0
            },
            "helpfulness": null,
            "id": 69808126,
            "likes": {
                "disliked": null,
                "liked": null
            },
            "rating": 5.0,
            "stay_parameters": "Stayed June 2010, traveled as a couple",
            "text": "The staff at the Hotel Belludi are amazing. We were welcomed with an espresso. Note when you arrive it is just past the Church of St. Anthony. To park (if you have reserved) pull in to the small street behind first. Be careful not to go past their marked gate as it's a restricted area for cars. The staff assisted us in bringing our luggage to to room. The room was clean and comfortable. The shower does take a few minutes to get warm but other then that no complaints. After a long day of sight seeing we were even greated with a satchel of lavender (I think that's what's in it) on our bed. There is a complimentary fridge with cold water and sodas upon arrival. Great value. Splended hotel.",
            "title": "We Loved this Hotel!",
            "user": "panettone2"
        }
    ],
    "slim_ranking": 0.0172413793103,
    "stars": 2,
    "tripadvisor": {
        "VISITED": false,
        "country_name": null,
        "locality": null,
        "pic_link": null,
        "street_address": null
    },
    "user_rating": 4.5,
    "variance": {
        "average": 10,
        "excellent": 403,
        "poor": 7,
        "terrible": 3,
        "very good": 111
    }
}