{
    "aka": "Novotel Moscow Sheremetyevo Hotel",
    "description": "The Novotel Moscow Sheremetyevo is located at Sheremetyevo International Airport, 30 km from the centre of Moscow. This 4 star hotel with refurbished rooms caters to business travelers with six conference rooms and WiFi internet. Relax at the hotel bar and enjoy international and Russian cuisine at Fusion Grill&Bar. Unwind with our pool, gym and sauna. Free airport shuttle and secure parking. 15 km from the Crocus Expo exhibition centre.",
    "detail_rating": {
        "cleanliness": null,
        "location": null,
        "rooms": null,
        "service": null,
        "sleep": null,
        "value": null
    },
    "location": {
        "city": null,
        "continent": "Europe",
        "country": "Russia",
        "proposed_city": "Moscow",
        "province": null,
        "region": "Central Russia"
    },
    "name": "Hotel Novotel Moscow Sheremetyevo Airport",
    "places": {
        "aka": [
            "Moscow"
        ],
        "hotel_description": [
            "Moscow",
            "Bar"
        ],
        "hotel_name": [
            "Moscow"
        ]
    },
    "review_count": 344,
    "review_count_current": 3,
    "reviews": [
        {
            "date": "August 2, 2007",
            "detail_rating": {
                "business": 3.0,
                "cleanliness": 3.0,
                "desk": null,
                "front_desk": 4.0,
                "location": 5.0,
                "pool": null,
                "restaurant": null,
                "rooms": 2.0,
                "service": 1.0,
                "sleep": null,
                "value": null
            },
            "helpfulness": 5,
            "id": 8282146,
            "likes": {
                "disliked": "\u2014 Service",
                "liked": "\u2014 Proximity to the airport"
            },
            "rating": 2.0,
            "stay_parameters": "Stayed July 2007, traveled with family",
            "text": "After reading some of the reviews of the Novotel, I was very apprehensive about staying in this hotel, but it was not as bad as the previous reviewer's review....",
            "title": "Not Bad",
            "user": "PVmomontherun"
        },
        {
            "date": "June 27, 2006",
            "detail_rating": {
                "business": null,
                "cleanliness": null,
                "desk": null,
                "location": null,
                "pool": null,
                "restaurant": null,
                "rooms": null,
                "service": null,
                "sleep": null,
                "value": null
            },
            "helpfulness": 22,
            "id": 5393356,
            "likes": {
                "disliked": null,
                "liked": null
            },
            "rating": 4.0,
            "stay_parameters": null,
            "text": "We stayed on the 8th floor where I suppose most of the superior rooms are.... Our room was very basic and sparsely furnished with a king size bed and a sofa bed that could accomodate one person. We were a family of four but there were only 2 towels in the bathroom and three uncomfortable pillows ... We called to ask for extra pillows and towels but after 45 minutes gave up as it was already 12:30AM by then and we wanted to go to sleep.",
            "title": "Novatel is very nice",
            "user": "A TripAdvisor user"
        },
        {
            "date": "April 26, 2005",
            "detail_rating": {
                "business": null,
                "cleanliness": null,
                "desk": null,
                "location": null,
                "pool": null,
                "restaurant": null,
                "rooms": null,
                "service": null,
                "sleep": null,
                "value": null
            },
            "helpfulness": 14,
            "id": 3416362,
            "likes": {
                "disliked": null,
                "liked": null
            },
            "rating": 1.0,
            "stay_parameters": null,
            "text": "The service of the hotel is not the best as you could glean form our experience with the towels and pillow....and their shuttle drivers were the most unfriendly shuttle drivers we have ever encountered...they don't smile and they do not help you with your luggage. However the Check in service was okay.",
            "title": "Rip off hotel in Moscow",
            "user": "cmac555"
        }
    ],
    "slim_ranking": 0.142857142857,
    "stars": 4,
    "tripadvisor": {
        "VISITED": false,
        "country_name": null,
        "locality": null,
        "pic_link": null,
        "street_address": null
    },
    "user_rating": 3.5,
    "variance": {
        "average": 71,
        "excellent": 59,
        "poor": 48,
        "terrible": 37,
        "very good": 129
    }
}