{
    "aka": "Hilton Garden Inn Florence Novoli Hotel",
    "description": null,
    "detail_rating": {
        "cleanliness": null,
        "location": null,
        "rooms": null,
        "service": null,
        "sleep": null,
        "value": null
    },
    "location": {
        "city": null,
        "continent": "Europe",
        "country": "Italy",
        "proposed_city": "Florence",
        "province": null,
        "region": "Tuscany"
    },
    "name": "Hilton Garden Inn Florence Novoli",
    "places": {
        "aka": [
            "Florence"
        ],
        "hotel_description": [],
        "hotel_name": [
            "Florence"
        ]
    },
    "review_count": 486,
    "review_count_current": 12,
    "reviews": [
        {
            "date": "November 26, 2007",
            "detail_rating": {
                "business": 5.0,
                "cleanliness": 5.0,
                "desk": null,
                "front_desk": 5.0,
                "location": 5.0,
                "pool": null,
                "restaurant": null,
                "rooms": 5.0,
                "service": 5.0,
                "sleep": null,
                "value": 5.0
            },
            "helpfulness": null,
            "id": 11085806,
            "likes": {
                "disliked": "\u2014 Loved it all",
                "liked": "\u2014 Beds"
            },
            "rating": 5.0,
            "stay_parameters": "Stayed October 2007, traveled as a couple",
            "text": "This was almost my favorite hotel in Rome. The amenities were excellent. The location is a little way out but you can get bus tickets for 1Euro at the front desk to get into town.",
            "title": "Loved this hotel",
            "user": "strollingtrini"
        },
        {
            "date": "October 19, 2007",
            "detail_rating": {
                "business": 3.0,
                "cleanliness": 5.0,
                "desk": null,
                "front_desk": 5.0,
                "location": 3.0,
                "pool": null,
                "restaurant": null,
                "rooms": 5.0,
                "service": 4.0,
                "sleep": null,
                "value": 4.0
            },
            "helpfulness": 1,
            "id": 10129392,
            "likes": {
                "disliked": null,
                "liked": null
            },
            "rating": 4.0,
            "stay_parameters": "Stayed June 2007, traveled as a couple",
            "text": "The hotel was clean, Staff - well they got me a same day reservation into the museums - wonder of wonder. Food was good.. Ok I really enjoyed it, as a matter of fact I enjoyed it so much I stayed 3 days in stead of 1.",
            "title": "Pretty good hotel but a little far from the attractions",
            "user": "balajivk"
        },
        {
            "date": "September 26, 2007",
            "detail_rating": {
                "business": 4.0,
                "cleanliness": 5.0,
                "desk": null,
                "front_desk": 4.0,
                "location": 2.0,
                "pool": null,
                "restaurant": null,
                "rooms": 5.0,
                "service": 3.0,
                "sleep": null,
                "value": 5.0
            },
            "helpfulness": 1,
            "id": 10005033,
            "likes": {
                "disliked": null,
                "liked": null
            },
            "rating": 5.0,
            "stay_parameters": "Stayed August 2007",
            "text": "This area is building up with I think the court of justice is being built next to it and let me tell you soon it wont be as cheap as it is.",
            "title": "Stay here while the rate is still low",
            "user": "gettinaround"
        },
        {
            "date": "September 14, 2007",
            "detail_rating": {
                "business": 5.0,
                "cleanliness": 5.0,
                "desk": null,
                "front_desk": 5.0,
                "location": 5.0,
                "pool": null,
                "restaurant": null,
                "rooms": 5.0,
                "service": 5.0,
                "sleep": null,
                "value": 5.0
            },
            "helpfulness": 1,
            "id": 8711615,
            "likes": {
                "disliked": "\u2014 in a new part of town near contstruction - views not nice",
                "liked": "\u2014 airport proximity, clean, lovely design elements"
            },
            "rating": 5.0,
            "stay_parameters": "Stayed September 2007, traveled solo",
            "text": "BTW - did I mention the dial up beds - the most comfortable of all I stayed in in Italy.",
            "title": "Fabulous way to spend the night before an early flight home",
            "user": "tulipina"
        },
        {
            "date": "June 20, 2007",
            "detail_rating": {
                "business": 4.0,
                "cleanliness": 5.0,
                "desk": null,
                "front_desk": 3.0,
                "location": 2.0,
                "pool": null,
                "restaurant": null,
                "rooms": 5.0,
                "service": 3.0,
                "sleep": null,
                "value": 4.0
            },
            "helpfulness": 1,
            "id": 7951804,
            "likes": {
                "disliked": "\u2014 Location and management",
                "liked": "\u2014 Spacious and clean"
            },
            "rating": 2.0,
            "stay_parameters": "Stayed June 2007, traveled with family",
            "text": "YOu will really enjoy this hotel - first class.",
            "title": "Nice Hotel, Okay location, Beware the Luggage Racks!",
            "user": "HonorsKing"
        },
        {
            "date": "May 20, 2008",
            "detail_rating": {
                "business": 5.0,
                "cleanliness": 5.0,
                "desk": null,
                "front_desk": 5.0,
                "location": 2.0,
                "pool": null,
                "restaurant": null,
                "rooms": 5.0,
                "service": 5.0,
                "sleep": null,
                "value": 5.0
            },
            "helpfulness": null,
            "id": 16260378,
            "likes": {
                "disliked": "\u2014 Not exactly least like. Simply I thought it was a good value BUSINESS hotel.",
                "liked": "\u2014 Its close location to the airport, spacious bathroom and convenient facilities."
            },
            "rating": 5.0,
            "stay_parameters": "Stayed May 2008, traveled as a couple",
            "text": "We stayed here only one night on our last day in Italy.",
            "title": "Excellent value for business travellers",
            "user": "humble_drinker"
        },
        {
            "date": "May 6, 2008",
            "detail_rating": {
                "business": 5.0,
                "cleanliness": 5.0,
                "desk": null,
                "front_desk": 5.0,
                "location": 3.0,
                "pool": null,
                "restaurant": null,
                "rooms": 4.0,
                "service": 5.0,
                "sleep": null,
                "value": 5.0
            },
            "helpfulness": 1,
            "id": 15696026,
            "likes": {
                "disliked": null,
                "liked": "\u2014 hospitality and friendliness of hotel staff"
            },
            "rating": 5.0,
            "stay_parameters": "Stayed May 2008, traveled with family",
            "text": "We chose this hotel because it's a stone's throw away from the airport of Florence. We had to catch a morning flight, so we wanted to be close from the airport to avoid the rush.",
            "title": "Excellent service and affordable rates",
            "user": "tolex3"
        },
        {
            "date": "March 24, 2008",
            "detail_rating": {
                "business": 1.0,
                "cleanliness": 5.0,
                "desk": null,
                "front_desk": 1.0,
                "location": 2.0,
                "pool": null,
                "restaurant": null,
                "rooms": 4.0,
                "service": 2.0,
                "sleep": null,
                "value": 2.0
            },
            "helpfulness": null,
            "id": 14494427,
            "likes": {
                "disliked": null,
                "liked": null
            },
            "rating": 2.0,
            "stay_parameters": "Stayed March 2008, traveled as a couple",
            "text": "We found this hotel refreshing, maybe because it was strikingly different from the houses where we stayed for the previous two weeks.",
            "title": "Our worst hotel of the week",
            "user": "nashvillbnd"
        },
        {
            "date": "February 19, 2008",
            "detail_rating": {
                "business": 5.0,
                "cleanliness": 5.0,
                "desk": null,
                "front_desk": 5.0,
                "location": 5.0,
                "pool": null,
                "restaurant": null,
                "rooms": 5.0,
                "service": 5.0,
                "sleep": null,
                "value": 5.0
            },
            "helpfulness": 1,
            "id": 13669870,
            "likes": {
                "disliked": "\u2014 n/a",
                "liked": "\u2014 attentive staff"
            },
            "rating": 5.0,
            "stay_parameters": "Stayed February 2008, traveled as a couple",
            "text": "The hotel is full of up-to-date gadgets you can expect from a business hotel in US, and offers convenient facilities such as 24/7 free internet and business center, and self-service pantry shop.",
            "title": "Terrific Staff, Gorgeous Property",
            "user": "RaithWych"
        },
        {
            "date": "January 1, 2008",
            "detail_rating": {
                "business": 5.0,
                "cleanliness": 5.0,
                "desk": null,
                "front_desk": 5.0,
                "location": 3.0,
                "pool": null,
                "restaurant": null,
                "rooms": 5.0,
                "service": 5.0,
                "sleep": null,
                "value": 5.0
            },
            "helpfulness": null,
            "id": 12203720,
            "likes": {
                "disliked": null,
                "liked": null
            },
            "rating": 5.0,
            "stay_parameters": "Stayed November 2007, traveled with family",
            "text": "Everything is shiny and bright. Modern and tasteful decoration. The staffs were kind and efficient, and the room and the bathroom SPACIOUS.",
            "title": "Great Hotel",
            "user": "Akrontravelman"
        },
        {
            "date": "May 11, 2007",
            "detail_rating": {
                "business": 5.0,
                "cleanliness": 5.0,
                "desk": null,
                "front_desk": 4.0,
                "location": 2.0,
                "pool": null,
                "restaurant": null,
                "rooms": 4.0,
                "service": 4.0,
                "sleep": null,
                "value": 4.0
            },
            "helpfulness": 1,
            "id": 7587207,
            "likes": {
                "disliked": "\u2014 Location",
                "liked": "\u2014 amenities"
            },
            "rating": 4.0,
            "stay_parameters": "Stayed April 2007, traveled with family",
            "text": "This hotel is modern, but not bleak like most modern decor hotel rooms. Rooms had some warmth to it and furnished nicely. Nice bathroom about the size of the US hotel bathrooms. (not small like European bathrooms) Good breakfast. A real plus to have free wifi (internet). The room was decent size, Very clean. Nice amenities. Only negetative was finding it using hotel's directions. Spent 3 + hours trying to find the hotel per their directions. Also not near the historical district but we were able to get a bus about 3 min. from hotel. Bus took about 10 to 15 min. to get to train station and bus was very easy to use both coming and going. I would definitely recommend this hotel",
            "title": "Enjoyed our stay",
            "user": "SeabeckTraveler"
        },
        {
            "date": "February 11, 2007",
            "detail_rating": {
                "business": 5.0,
                "cleanliness": 5.0,
                "desk": null,
                "front_desk": 5.0,
                "location": 3.0,
                "pool": null,
                "restaurant": null,
                "rooms": 5.0,
                "service": 5.0,
                "sleep": null,
                "value": 5.0
            },
            "helpfulness": 6,
            "id": 6779887,
            "likes": {
                "disliked": "\u2014 It is not in or very near to the center of town",
                "liked": "\u2014 Clean, comfort, modern appearance"
            },
            "rating": 5.0,
            "stay_parameters": "Stayed February 2007, traveled on business",
            "text": "I have been several times at the Hilton garden Inn Novoli now and with pleasure. It is the ideal business-hotel in Florence and this at reasonable rates. It is new (sinc Oct 2006), modern, light. clean, and extremely friendly staffed.",
            "title": "The ideal modern business-hotel in Florence (Novoli/Rifredi)",
            "user": "Pyra"
        }
    ],
    "slim_ranking": 0.208695652174,
    "stars": 4,
    "tripadvisor": {
        "VISITED": false,
        "country_name": null,
        "locality": null,
        "pic_link": null,
        "street_address": null
    },
    "user_rating": 4.0,
    "variance": {
        "average": 66,
        "excellent": 214,
        "poor": 7,
        "terrible": 7,
        "very good": 192
    }
}