{
    "aka": "Down Town Hostel Malaga, Spain - Costa Del Sol",
    "description": null,
    "detail_rating": {
        "cleanliness": null,
        "location": null,
        "rooms": null,
        "service": null,
        "sleep": null,
        "value": null
    },
    "location": {
        "city": null,
        "continent": "Europe",
        "country": "Spain",
        "proposed_city": null,
        "province": null,
        "region": "Andalucia"
    },
    "name": "Down Town Hostel",
    "places": {
        "aka": [],
        "hotel_description": [],
        "hotel_name": []
    },
    "review_count": 9,
    "review_count_current": 2,
    "reviews": [
        {
            "date": "December 5, 2009",
            "detail_rating": {
                "business": null,
                "cleanliness": 5.0,
                "desk": null,
                "location": 3.0,
                "pool": null,
                "restaurant": null,
                "rooms": 3.0,
                "service": 5.0,
                "sleep": null,
                "value": 5.0
            },
            "helpfulness": null,
            "id": 50677558,
            "likes": {
                "disliked": null,
                "liked": null
            },
            "rating": 3.0,
            "stay_parameters": "Stayed December 2009, traveled solo",
            "text": "This was a first time I experienced stay in hostel dorms. The experience is not so bad. Everything is very bright and clean. In each dorm there are 8 beds, during my stay only 2 were occupied, bathrooms are ensuite. And for as little as 12 EUR a night you get all of the following - laundry, internet access, fully equiped kitchen, huge terrace for sunbathing or just spending a good time and even breakfast (some tosts, cereals, jam, milk, butter). Hostel is located in the downtown Malaga, close to attractions like Gibralfaro Castle, Plaza de la Merced (area famous with it\u00b4s nightlife), casa natal de Picasso. Good beaches are quite far, but are easy reachable with local bus services.",
            "title": "My first experience in real hostel",
            "user": "Lexx_Naxxx"
        },
        {
            "date": "August 2, 2009",
            "detail_rating": {
                "business": null,
                "cleanliness": 4.0,
                "desk": null,
                "location": 4.0,
                "pool": null,
                "restaurant": null,
                "rooms": 4.0,
                "service": 3.0,
                "sleep": null,
                "value": 5.0
            },
            "helpfulness": null,
            "id": 36532154,
            "likes": {
                "disliked": null,
                "liked": null
            },
            "rating": 4.0,
            "stay_parameters": "Stayed July 2009, traveled solo",
            "text": "I stayed here for about 4 nights in July '09. The first dorm was an 8-bed and was very small, but very clean and well maintained. For the last night I moved to another 8-bed dorm, but the room was more than twice the size and had a balcony. The second room was 15\u20ac as opposed to 14\u20ac, but I would advise anyone to pay the extra Euro for the extra comfort and airiness of the larger room.",
            "title": "Excellent hostel and great prices!",
            "user": "MrSwampy"
        }
    ],
    "slim_ranking": 0.766233766234,
    "stars": null,
    "tripadvisor": {
        "VISITED": false,
        "country_name": null,
        "locality": null,
        "pic_link": null,
        "street_address": null
    },
    "user_rating": 3.0,
    "variance": {
        "average": 3,
        "excellent": 0,
        "poor": 1,
        "terrible": 2,
        "very good": 3
    }
}