{
    "aka": "Hilton Grand Vacations At The Flamingo Hotel",
    "description": "Hilton Grand Vacations at the Flamingo is perfect for the traveler who enjoys being on the Strip and appreciates being able to retreat to the quiet comfort of luxury living. Studios, one and two-bedroom suites allow business and leisure travelers an opportunity to relax while also enjoying the swimming complex, free Internet, fitness center, deli and more.",
    "detail_rating": {
        "cleanliness": 4.5,
        "location": 4.5,
        "rooms": 4.5,
        "service": 4.0,
        "sleep": 4.5,
        "value": 4.0
    },
    "location": {
        "city": "Las Vegas",
        "continent": null,
        "country": "United States",
        "proposed_city": null,
        "province": null,
        "region": null
    },
    "name": "Hilton Grand Vacations at the Flamingo",
    "places": {
        "aka": [],
        "hotel_description": [],
        "hotel_name": []
    },
    "review_count": 614,
    "review_count_current": 20,
    "reviews": [
        {
            "date": "April 4, 2009",
            "detail_rating": {
                "business": null,
                "cleanliness": 5.0,
                "desk": null,
                "location": 5.0,
                "pool": null,
                "restaurant": null,
                "rooms": 5.0,
                "service": 4.0,
                "sleep": null,
                "value": 5.0
            },
            "helpfulness": 4,
            "id": 27407019,
            "likes": {
                "disliked": null,
                "liked": null
            },
            "rating": 4.0,
            "stay_parameters": "Stayed March 2009, traveled as a couple",
            "text": "Just back from a 6 day stay at HGVC @ the Flamingo. We found the location to be excellent - it is only a few minutes walk past the pool and through the Flamingo casino and you are right in the middle of the strip opposite Caesers Palace. Being set back from the strip meant that the hotel felt more peaceful, so it was nice to come back to after a busy day.",
            "title": "Great location and comfortable hotel",
            "user": "Holiday_needed_now"
        },
        {
            "date": "March 28, 2009",
            "detail_rating": {
                "business": null,
                "cleanliness": 4.0,
                "desk": null,
                "location": 4.0,
                "pool": null,
                "restaurant": null,
                "rooms": 4.0,
                "service": 5.0,
                "sleep": null,
                "value": 4.0
            },
            "helpfulness": 12,
            "id": 26958133,
            "likes": {
                "disliked": null,
                "liked": null
            },
            "rating": 4.0,
            "stay_parameters": "Stayed March 2009, traveled on business",
            "text": "I used the pool area once and found it well equipped with comfortable sunbeds, plenty of towels, a small bar and a big jacuzzi as well as the pool. The pool area felt quite luxurious in comparison to the Flamingo's pool, which was much bigger but felt crowded and noisy.",
            "title": "Good rooms, great location, doof for business or pleasure",
            "user": "auroraclubjazz"
        },
        {
            "date": "March 16, 2009",
            "detail_rating": {
                "business": null,
                "cleanliness": 5.0,
                "desk": null,
                "location": 5.0,
                "pool": null,
                "restaurant": null,
                "rooms": 5.0,
                "service": 5.0,
                "sleep": null,
                "value": null
            },
            "helpfulness": 2,
            "id": 26278746,
            "likes": {
                "disliked": null,
                "liked": null
            },
            "rating": 5.0,
            "stay_parameters": "Stayed March 2009, traveled as a couple",
            "text": "We had a one bed apartment, with a jacuzzi which was great. The apartment was comfortable and well equipped (eg well stocked kitchen, coffee machine, useful washer and dryer). Our room was refurbished room and not at all pink which was a relief!",
            "title": "Perfect Location!",
            "user": "joceylou"
        },
        {
            "date": "March 16, 2009",
            "detail_rating": {
                "business": null,
                "cleanliness": 5.0,
                "desk": null,
                "location": 5.0,
                "pool": null,
                "restaurant": null,
                "rooms": 5.0,
                "service": 5.0,
                "sleep": null,
                "value": 5.0
            },
            "helpfulness": 4,
            "id": 26276598,
            "likes": {
                "disliked": null,
                "liked": null
            },
            "rating": 5.0,
            "stay_parameters": "Stayed March 2009, traveled on business",
            "text": "The only downside was that the place is fairly anonymous, and you're not staying in a recreation of Venice, New York etc as in some of the other hotels. However we had a really comfortable stay, and enjoyed the relative peace of HGVC. The great location would particularly encourage us to return here.",
            "title": "I LOVE this property",
            "user": "jean8239"
        },
        {
            "date": "February 22, 2009",
            "detail_rating": {
                "business": null,
                "cleanliness": 5.0,
                "desk": null,
                "location": 5.0,
                "pool": null,
                "restaurant": null,
                "rooms": 5.0,
                "service": 5.0,
                "sleep": null,
                "value": 5.0
            },
            "helpfulness": 5,
            "id": 24964032,
            "likes": {
                "disliked": null,
                "liked": null
            },
            "rating": 5.0,
            "stay_parameters": "Stayed February 2009, traveled as a couple",
            "text": "I stayed at the HGVC Flamingo 3/22 - 3/27 2009. I had a studio room on the 16th floor. the room was very spacious. I enjoyed having a small fridge, microwave and coffee maker. there is an excellent whirlpool bath set up - there is a large opening between the bathtub and the main room, so you can have a good soak and watch TV if you want. There is a separate private shower and toilet area. The TV was a flat screen of decent size (42\" ?) and the channel selection was good. service was good - daily maid service and friendly staff all around. Small grocery store and deli on the premises was useful, fair prices and good food and excellent coffee.",
            "title": "Love the renovations!",
            "user": "lesilek48"
        },
        {
            "date": "February 14, 2009",
            "detail_rating": {
                "business": 4.0,
                "cleanliness": 4.0,
                "desk": null,
                "front_desk": 4.0,
                "location": 4.0,
                "pool": null,
                "restaurant": null,
                "rooms": 4.0,
                "service": 4.0,
                "sleep": null,
                "value": 4.0
            },
            "helpfulness": 3,
            "id": 24568047,
            "likes": {
                "disliked": "\u2014 No covered way to get to the Flamingo next door,",
                "liked": "\u2014 The room was comfortable."
            },
            "rating": 4.0,
            "stay_parameters": "Stayed February 2009, traveled with family",
            "text": "Spent 5 nights with my family at a two bedroom suite at the Hilton Grand Vacations Club at the Flamingo. The two bedroom suite is really a one bedroom and a studio with a combined entry way. The staff was helpful - including the pn-site concierge who got us some good deals for shows. The property is \"off the strip\" and shares the pool area with the Flamingo. The weather was junk while we were there - cold but the HGVC pool and hot tub were heated and open, while the Flamingo pool was closed. Valet parking is $9 a day but there is free parking in a parking garage shared with O'shea's and the Imperial Palace. We self parked and had no problems finding space. The property does not have a casino which is a nice respite from some of the casino hotels. There is a small but well stocked canteen but there were groceries nearby (~3 miles) if you planned to cook. The kitchen in the one bedroom was well fixed - full size stove and refrigerator, plus a microwave. We cooked breakfasts to keep the costs down. We'd go back.",
            "title": "Enjoyable, convenient location",
            "user": "heybrah"
        },
        {
            "date": "January 9, 2009",
            "detail_rating": {
                "business": 5.0,
                "cleanliness": 5.0,
                "desk": null,
                "front_desk": 5.0,
                "location": 5.0,
                "pool": null,
                "restaurant": null,
                "rooms": 5.0,
                "service": 4.0,
                "sleep": null,
                "value": 4.0
            },
            "helpfulness": 4,
            "id": 23404930,
            "likes": {
                "disliked": "\u2014 Nothing really, except non-charging privilages with Flamingo",
                "liked": "\u2014 Location & Own Entrance to the hotel"
            },
            "rating": 4.0,
            "stay_parameters": "Stayed December 2008, traveled on business",
            "text": "Stayed at this hotel for a business convention for 3 nights.",
            "title": "Good Stay at this Non-Casino Hotel",
            "user": "caneshockey31"
        },
        {
            "date": "November 25, 2008",
            "detail_rating": {
                "business": null,
                "cleanliness": null,
                "desk": null,
                "location": null,
                "pool": null,
                "restaurant": null,
                "rooms": null,
                "service": null,
                "sleep": null,
                "value": null
            },
            "helpfulness": 2,
            "id": 22164379,
            "likes": {
                "disliked": null,
                "liked": null
            },
            "rating": 5.0,
            "stay_parameters": null,
            "text": "Had a very nice corner 1 bedroom suite on the 8th floor facing the east and the airport.",
            "title": "splendid",
            "user": "hot4travelLasVegas"
        },
        {
            "date": "November 4, 2008",
            "detail_rating": {
                "business": 5.0,
                "cleanliness": 5.0,
                "desk": null,
                "front_desk": 5.0,
                "location": 5.0,
                "pool": null,
                "restaurant": null,
                "rooms": 5.0,
                "service": 5.0,
                "sleep": null,
                "value": 5.0
            },
            "helpfulness": 8,
            "id": 21544489,
            "likes": {
                "disliked": "\u2014 Can't think of anything",
                "liked": "\u2014 Size of suites and amenities"
            },
            "rating": 5.0,
            "stay_parameters": "Stayed October 2008, traveled with family",
            "text": "Check-in was very efficient and felt very secure when you have to enter your key 24 hours a day to get to your floor.",
            "title": "A Grand Time at the Hilton Grand @ Flamingo",
            "user": "LuvLVEdmonton"
        },
        {
            "date": "September 30, 2008",
            "detail_rating": {
                "business": null,
                "cleanliness": 5.0,
                "desk": null,
                "front_desk": 5.0,
                "location": 5.0,
                "pool": null,
                "restaurant": null,
                "rooms": 5.0,
                "service": 5.0,
                "sleep": null,
                "value": 5.0
            },
            "helpfulness": 7,
            "id": 20502046,
            "likes": {
                "disliked": "\u2014 That the flamingo pool closed early.. no control by HGVC though...",
                "liked": "\u2014 Location and newly renovated rooms"
            },
            "rating": 5.0,
            "stay_parameters": "Stayed September 2008, traveled with family",
            "text": "Pros:",
            "title": "Excellent Location Location Location",
            "user": "letsgetgoing"
        },
        {
            "date": "July 26, 2009",
            "detail_rating": {
                "business": null,
                "cleanliness": 5.0,
                "desk": null,
                "location": 5.0,
                "pool": null,
                "restaurant": null,
                "rooms": 5.0,
                "service": 5.0,
                "sleep": null,
                "value": 5.0
            },
            "helpfulness": 4,
            "id": 35878806,
            "likes": {
                "disliked": null,
                "liked": null
            },
            "rating": 5.0,
            "stay_parameters": "Stayed July 2009, traveled with friends",
            "text": "We had a one bedroom on the 2nd floor overlooking the pool. We had a full kitchen, nicely stock with cooking necessities. I only would suggest they replace some of the well-used utensils. There was a stacked washer and dryer, fold out sofa bed and plenty of fresh towels. The bathroom has two separate counters with sinks and plenty of counter space. The jetted tub is huge and circular; made for two but could fit more if you want to. No complaints about the room. The entire interior was recently updated so all is nice, clean and new.",
            "title": "Excellent Vegas Location!!!",
            "user": "Rndthewrld"
        },
        {
            "date": "July 16, 2009",
            "detail_rating": {
                "business": null,
                "cleanliness": 5.0,
                "desk": null,
                "location": 5.0,
                "pool": null,
                "restaurant": null,
                "rooms": 5.0,
                "service": 5.0,
                "sleep": null,
                "value": 4.0
            },
            "helpfulness": 2,
            "id": 34957731,
            "likes": {
                "disliked": null,
                "liked": null
            },
            "rating": 5.0,
            "stay_parameters": "Stayed July 2009, traveled as a couple",
            "text": "The pool is small but quiet and relaxing with a full bar and misters. The Flamingo pool, which Hilton guests have full access to is a very crowded, mostly young scene. It is nice to be able to choose between the two pools. On weekdays the Go Pool at the Flamingo is not at all crowded. There is loud music and a bar with plenty of free lounges. It is $10 for men to get in and bikini tops are optional. There were very few who went topless.",
            "title": "Fantastic Flamingo",
            "user": "jacobh"
        },
        {
            "date": "July 13, 2009",
            "detail_rating": {
                "business": null,
                "cleanliness": 5.0,
                "desk": null,
                "location": 5.0,
                "pool": null,
                "restaurant": null,
                "rooms": 5.0,
                "service": 4.0,
                "sleep": null,
                "value": 5.0
            },
            "helpfulness": null,
            "id": 34662176,
            "likes": {
                "disliked": null,
                "liked": null
            },
            "rating": 4.0,
            "stay_parameters": "Stayed July 2009, traveled with family",
            "text": "The small mini-mart and deli at the Hilton is convenient and has good Starbucks espresso drinks. The center strip location is excellent! It is a short walk over LV Blvd to Cesars and Bellagio. THe Venetian also isn't too bad a walk. To walk much further in the summer Vegas heat isn't fun. We took the monorail from Flamingo/HGVC a lot. There is an elevator right to the monorail stop outside the main lobby of Hilton or there's a bridge that goes from the Flamingo alongside the pool area to the monorail. It will take you as far as MGM Grand and Sahara. There is a free monorail if you walk across the street from the MGM to Excalibur. This one goes from Excalibur to Luxor and Mandalay Bay. If you want to be on the strip for some Vegas action this is the perfect spot!",
            "title": "Very comfortable",
            "user": "ElaineT1"
        },
        {
            "date": "July 11, 2009",
            "detail_rating": {
                "business": null,
                "cleanliness": 3.0,
                "desk": null,
                "location": 2.0,
                "pool": null,
                "restaurant": null,
                "rooms": 1.0,
                "service": 1.0,
                "sleep": null,
                "value": 1.0
            },
            "helpfulness": 2,
            "id": 34502137,
            "likes": {
                "disliked": null,
                "liked": null
            },
            "rating": 2.0,
            "stay_parameters": "Stayed July 2009, traveled with family",
            "text": "There is an Albertson's a short ($10 ?) cab ride away and a liquor and convenience store just behind the Hilton. We really enjoyed Pure at Cesars, dinner at the Voodoo Lounge on top of the Rio (excellent steaks! and view!), and the Thunder from Down Under show at the Excalibur. The show was perfect for a bachelorette party. Its a little cheesy but definitely a fun time. If you have a large group (6 or more people) the limos can be cheaper than cabs. They will negotiate on weeknights.",
            "title": "Poor service and poor room at HGVC. Go elsewhere.",
            "user": "unclerob"
        },
        {
            "date": "July 2, 2009",
            "detail_rating": {
                "business": null,
                "cleanliness": 5.0,
                "desk": null,
                "location": 5.0,
                "pool": null,
                "restaurant": null,
                "rooms": 5.0,
                "service": 5.0,
                "sleep": null,
                "value": 5.0
            },
            "helpfulness": null,
            "id": 33752532,
            "likes": {
                "disliked": null,
                "liked": null
            },
            "rating": 5.0,
            "stay_parameters": "Stayed June 2009, traveled with family",
            "text": "In case you haven't already heard tell the cab driver to take Paradise Road to and from the airport and not the freeway. It is about the same amount of time and about $12-$15 instead of $25. Also, it is illegal for cabs and limos to stop on the strip to pick people up. It is well enforced so don't bother. Go to a hotel taxi stand for a cab or limo.",
            "title": "Fabulous staff and accommodation",
            "user": "mom5Oceanside"
        },
        {
            "date": "May 30, 2009",
            "detail_rating": {
                "business": null,
                "cleanliness": 5.0,
                "desk": null,
                "location": 5.0,
                "pool": null,
                "restaurant": null,
                "rooms": 5.0,
                "service": 5.0,
                "sleep": null,
                "value": 5.0
            },
            "helpfulness": 2,
            "id": 31176045,
            "likes": {
                "disliked": null,
                "liked": null
            },
            "rating": 5.0,
            "stay_parameters": "Stayed May 2009, traveled as a couple",
            "text": "We really liked the location of this hotel. It\u2019s right behind the Flamingo, so we just had to walk around the pool area and through the Flamingo casino to get to the Strip. Our room was a king studio suite with a nice view of the pool and gardens. It was a good size with a kitchenette, Jacuzzi, sofa bed and flat screen TV. The hotel was very quiet. There were people staying in the next room, and we never heard them at all. There\u2019s a fee to use the computers, but it\u2019s free to print out an airline boarding pass. The front desk staff was extremely nice. We asked if we could have a late check out since our plane wasn\u2019t leaving until the afternoon, and they gave it to us without a problem. There was a deli that sold sandwiches and snacks, along with various sundry items. Self parking was free in a garage across the street, but there was a charge for valet parking.",
            "title": "Quiet and Calm Yet Close to the Action",
            "user": "Saluga"
        },
        {
            "date": "May 21, 2009",
            "detail_rating": {
                "business": null,
                "cleanliness": 5.0,
                "desk": null,
                "location": 5.0,
                "pool": null,
                "restaurant": null,
                "rooms": 5.0,
                "service": 5.0,
                "sleep": null,
                "value": 5.0
            },
            "helpfulness": 3,
            "id": 30468028,
            "likes": {
                "disliked": null,
                "liked": null
            },
            "rating": 5.0,
            "stay_parameters": "Stayed May 2009, traveled as a couple",
            "text": "We have just returned from a 5-night stay here and would certainly return there the next time we go to Las Vegas.",
            "title": "Highly Recommend",
            "user": "LAT10258"
        },
        {
            "date": "April 26, 2009",
            "detail_rating": {
                "business": null,
                "cleanliness": 4.0,
                "desk": null,
                "location": 4.0,
                "pool": null,
                "restaurant": null,
                "rooms": 4.0,
                "service": 4.0,
                "sleep": null,
                "value": 4.0
            },
            "helpfulness": 3,
            "id": 28779390,
            "likes": {
                "disliked": null,
                "liked": null
            },
            "rating": 4.0,
            "stay_parameters": "Stayed April 2009, traveled with family",
            "text": "We arrived at midday and despite check-in being 4pm we were given our room straight away. Check-in was very quick and efficient. We were in the North Tower which was smaller and were told also quieter than the main building - it was ideal for us. We were on the 8th floor so had great view from our window, over the pool area.",
            "title": "Great location with large rooms for families.",
            "user": "Izzy14"
        },
        {
            "date": "April 21, 2009",
            "detail_rating": {
                "business": null,
                "cleanliness": 5.0,
                "desk": null,
                "location": 5.0,
                "pool": null,
                "restaurant": null,
                "rooms": 5.0,
                "service": 4.0,
                "sleep": null,
                "value": 5.0
            },
            "helpfulness": 5,
            "id": 28476643,
            "likes": {
                "disliked": null,
                "liked": null
            },
            "rating": 5.0,
            "stay_parameters": "Stayed March 2009, traveled with family",
            "text": "When we arrived there was coffee etc in our room. Bathroom amenities were shampoo, conditioner, body lotion and soap, all replaced daily.",
            "title": "Outstanding Vacation",
            "user": "4inwhitby"
        },
        {
            "date": "April 16, 2009",
            "detail_rating": {
                "business": null,
                "cleanliness": 5.0,
                "desk": null,
                "location": 5.0,
                "pool": null,
                "restaurant": null,
                "rooms": 5.0,
                "service": 5.0,
                "sleep": null,
                "value": 5.0
            },
            "helpfulness": 5,
            "id": 28159833,
            "likes": {
                "disliked": null,
                "liked": null
            },
            "rating": 5.0,
            "stay_parameters": "Stayed March 2009, traveled with friends",
            "text": "We booked a King bed studio room and this was very spacious and ideal for us. As there is so much to do in LV you don't spend much time in your room. The room had a large jacuzzi bath and wash hand basin open onto main area with a separate shower and WC.",
            "title": "Spacious elegant accomodations in a great location",
            "user": "Kimborob"
        }
    ],
    "slim_ranking": 0.233333333333,
    "stars": 3,
    "tripadvisor": {
        "VISITED": false,
        "country_name": null,
        "locality": null,
        "pic_link": null,
        "street_address": null
    },
    "user_rating": 4.0,
    "variance": {
        "average": 68,
        "excellent": 288,
        "poor": 32,
        "terrible": 22,
        "very good": 204
    }
}