{
    "aka": null,
    "description": "Certified with the Silver Green Key.",
    "detail_rating": {
        "cleanliness": null,
        "location": null,
        "rooms": null,
        "service": null,
        "sleep": null,
        "value": null
    },
    "location": {
        "city": "Enschede",
        "continent": "Europe",
        "country": "The Netherlands",
        "proposed_city": null,
        "province": null,
        "region": null
    },
    "name": "Hampshire Hotel - De Broeierd Enschede",
    "places": {
        "aka": [],
        "hotel_description": [
            "Green"
        ],
        "hotel_name": [
            "Enschede"
        ]
    },
    "review_count": 99,
    "review_count_current": 3,
    "reviews": [
        {
            "date": "December 7, 2009",
            "detail_rating": {
                "business": 3.0,
                "cleanliness": 5.0,
                "desk": null,
                "front_desk": 4.0,
                "location": 4.0,
                "pool": null,
                "restaurant": null,
                "rooms": 5.0,
                "service": 4.0,
                "sleep": null,
                "value": 3.0
            },
            "helpfulness": null,
            "id": 50781812,
            "likes": {
                "disliked": null,
                "liked": null
            },
            "rating": 4.0,
            "stay_parameters": "Stayed November 2009, traveled on business",
            "text": "This is a nice old building with a lot of wood, cozy seating areas, even a wooden staircase and split-level rooms on the top floors. My room had the living area and bathroom downstairs and the bed one level above.",
            "title": "Classic-style hotel with quaint rooms",
            "user": "sankar"
        },
        {
            "date": "September 2, 2009",
            "detail_rating": {
                "business": null,
                "cleanliness": null,
                "desk": null,
                "location": null,
                "pool": null,
                "restaurant": null,
                "rooms": null,
                "service": null,
                "sleep": null,
                "value": null
            },
            "helpfulness": null,
            "id": 39581446,
            "likes": {
                "disliked": null,
                "liked": null
            },
            "rating": 3.0,
            "stay_parameters": null,
            "text": "Rooms have been renovated to a good standard and the hotel is overall very comfortable.",
            "title": "Maybe best hotel in Enschede, but ...",
            "user": "Value4Price-Seeker"
        },
        {
            "date": "July 1, 2006",
            "detail_rating": {
                "business": null,
                "cleanliness": 4.0,
                "desk": null,
                "location": null,
                "pool": null,
                "restaurant": null,
                "rooms": 4.0,
                "service": 3.0,
                "sleep": null,
                "value": 4.0
            },
            "helpfulness": 3,
            "id": 5414520,
            "likes": {
                "disliked": null,
                "liked": null
            },
            "rating": 4.0,
            "stay_parameters": "Stayed June 2006, traveled on business",
            "text": "The restaurant was pretty expensive and though the setting is nice, the food was average.",
            "title": "Best choice in Enschede",
            "user": "gravitas"
        }
    ],
    "slim_ranking": 0.142857142857,
    "stars": 4,
    "tripadvisor": {
        "VISITED": false,
        "country_name": null,
        "locality": null,
        "pic_link": null,
        "street_address": null
    },
    "user_rating": 4.0,
    "variance": {
        "average": 19,
        "excellent": 23,
        "poor": 6,
        "terrible": 1,
        "very good": 50
    }
}