{
    "aka": null,
    "description": "Forrest Hotel and Apartments is a wonderful family owned and operated hotel in the heart of Canberra. Located just behind Parliament House in the leafy suburb of Forrest, we are ideally suited for government, business and leisure travel.We have 76 hotel rooms and 40 serviced apartments, with a conference room, restaurant and deck overlooking the beautiful parkland setting.Accommodation options:\u2022\u00a0Standard Room (sleeps 2):\u00a0Enjoy the cosy comfort of double or twin share rooms\u00a0\u2022\u00a0One Bedroom Apartment (sleeps 3):\u00a0Spacious and private with separate kitchen and lounge area\u2022\u00a0Family Two Bedroom Apartments (sleeps 5):\u00a0Private bedroom, 3 bed bunk room and kitchen/lounge/dining\u2022\u00a0Executive Two Bedroom Apartments (sleeps 4):\u00a0Stylish decor and ultimate comfort and facilities",
    "detail_rating": {
        "cleanliness": null,
        "location": null,
        "rooms": null,
        "service": null,
        "sleep": null,
        "value": null
    },
    "location": {
        "city": null,
        "continent": "South Pacific",
        "country": "Australia",
        "proposed_city": "Canberra",
        "province": null,
        "region": "Australian Capital Territory"
    },
    "name": "Forrest Hotel And Apartments",
    "places": {
        "aka": [],
        "hotel_description": [
            "Canberra"
        ],
        "hotel_name": []
    },
    "review_count": 186,
    "review_count_current": 1,
    "reviews": [
        {
            "date": "February 27, 2007",
            "detail_rating": {
                "business": null,
                "cleanliness": null,
                "desk": null,
                "location": null,
                "pool": null,
                "restaurant": null,
                "rooms": null,
                "service": null,
                "sleep": null,
                "value": null
            },
            "helpfulness": 10,
            "id": 6843537,
            "likes": {
                "disliked": null,
                "liked": null
            },
            "rating": 3.0,
            "stay_parameters": null,
            "text": "Forrest Inn and Apartments",
            "title": "Good Basic Hotel Room",
            "user": "Globetrottin_Grannie"
        }
    ],
    "slim_ranking": 0.557692307692,
    "stars": 3.5,
    "tripadvisor": {
        "VISITED": false,
        "country_name": null,
        "locality": null,
        "pic_link": null,
        "street_address": null
    },
    "user_rating": 3.0,
    "variance": {
        "average": 75,
        "excellent": 13,
        "poor": 22,
        "terrible": 16,
        "very good": 60
    }
}