{
    "aka": "Novotel Cardiff Centre Hotel Cardiff",
    "description": "The Novotel Cardiff Centre is a 4 star hotel perfect for your next break in Cardiff. Close to live sports action at Millennium Stadium and shops, restaurants and entertainment at Cardiff Bay. Enjoy our Elements Restaurant and Bar, superb indoor swimming pool, gym, sauna, steam bath and whirlpool. Guests on a business trip will find WiFi internet and nine meeting rooms at their disposal including The Warehouse, a fabulous venue for weddings and conferences alike. 120 parking spaces at GBP 8 per day.",
    "detail_rating": {
        "cleanliness": 4.5,
        "location": 4.0,
        "rooms": 4.0,
        "service": 4.0,
        "sleep": 4.0,
        "value": 4.0
    },
    "location": {
        "city": null,
        "continent": "Europe",
        "country": "United Kingdom (UK)",
        "proposed_city": "Cardiff",
        "province": null,
        "region": null
    },
    "name": "Novotel Cardiff Centre",
    "places": {
        "aka": [
            "Cardiff"
        ],
        "hotel_description": [
            "Cardiff",
            "Bay",
            "Bar"
        ],
        "hotel_name": [
            "Cardiff"
        ]
    },
    "review_count": 916,
    "review_count_current": 17,
    "reviews": [
        {
            "date": "February 18, 2008",
            "detail_rating": {
                "business": 4.0,
                "cleanliness": 4.0,
                "desk": null,
                "front_desk": 5.0,
                "location": 3.0,
                "pool": null,
                "restaurant": null,
                "rooms": 5.0,
                "service": 5.0,
                "sleep": null,
                "value": null
            },
            "helpfulness": 1,
            "id": 13639782,
            "likes": {
                "disliked": null,
                "liked": null
            },
            "rating": 5.0,
            "stay_parameters": "Stayed February 2008, traveled with family",
            "text": "I booked this hotel from reading other reviews and was glad I did. The service is excellent, car parking plentiful, swimming pool not big but lovely and the superior room we stayed in was more than adequate for us, our 9 year old and baby. Breakfast is good too with lots of choice.",
            "title": "Great Hotel!",
            "user": "mich1977"
        },
        {
            "date": "February 17, 2008",
            "detail_rating": {
                "business": 5.0,
                "cleanliness": 5.0,
                "desk": null,
                "front_desk": 5.0,
                "location": 5.0,
                "pool": null,
                "restaurant": null,
                "rooms": 5.0,
                "service": 5.0,
                "sleep": null,
                "value": 5.0
            },
            "helpfulness": 1,
            "id": 13628403,
            "likes": {
                "disliked": null,
                "liked": null
            },
            "rating": 5.0,
            "stay_parameters": "Stayed February 2008, traveled as a couple",
            "text": "The only minor point is that it is a bit far too walk to the bay, maybe in the summer you could but it was a bit too cold for us in feb, but nevertherless it was a small price to pay for such a good hotel and it is quite easy to park in the bay area anyway.",
            "title": "great stay",
            "user": "teenba"
        },
        {
            "date": "February 10, 2008",
            "detail_rating": {
                "business": 5.0,
                "cleanliness": 5.0,
                "desk": null,
                "front_desk": 5.0,
                "location": 4.0,
                "pool": null,
                "restaurant": null,
                "rooms": 4.0,
                "service": 5.0,
                "sleep": null,
                "value": 5.0
            },
            "helpfulness": null,
            "id": 13434393,
            "likes": {
                "disliked": "\u2014 no spa",
                "liked": "\u2014 the spacious rooms, the service"
            },
            "rating": 5.0,
            "stay_parameters": "Stayed January 2008, traveled on business",
            "text": "If you are planning to eat out don't bother with the Old Orleans at the Red Dragon Centre, cheap plastic food, was a real disappointment.",
            "title": "love this hotel - have been back already!",
            "user": "mckeggie"
        },
        {
            "date": "February 9, 2008",
            "detail_rating": {
                "business": 4.0,
                "cleanliness": 4.0,
                "desk": null,
                "front_desk": 5.0,
                "location": 5.0,
                "pool": null,
                "restaurant": null,
                "rooms": 4.0,
                "service": 4.0,
                "sleep": null,
                "value": 5.0
            },
            "helpfulness": 1,
            "id": 13406421,
            "likes": {
                "disliked": "\u2014 Small car park",
                "liked": "\u2014 The location and leaisure facilties"
            },
            "rating": 5.0,
            "stay_parameters": "Stayed October 2007, traveled as a couple",
            "text": "Got a great deal on this hotel \u00a366 for a room for the night with breakfast. Arrived at hotel on the saturday and got a room on floor 5 was expecting a small room but had a double bed and a double sofa bed Plenty of room Nice big bathroom with bath with shower over it and a seperate shower cubical Staff were very friendly and the breakfast was great loads of choice to suit all. also was served from 8 till 12 so no need to rush",
            "title": "Lovely hotel, very relaxing, brilliant location.",
            "user": "UkHappytripper"
        },
        {
            "date": "January 20, 2008",
            "detail_rating": {
                "business": 3.0,
                "cleanliness": 3.0,
                "desk": null,
                "front_desk": 3.0,
                "location": 2.0,
                "pool": null,
                "restaurant": null,
                "rooms": 4.0,
                "service": 3.0,
                "sleep": null,
                "value": 4.0
            },
            "helpfulness": null,
            "id": 12822525,
            "likes": {
                "disliked": "\u2014 Location - just a bit too far out from anywhere to eat/walk to comfortably",
                "liked": "\u2014 Clean, modern, funky accommodation."
            },
            "rating": 4.0,
            "stay_parameters": "Stayed January 2008, traveled with family",
            "text": "My husband and I and our 1 year old son have stayed twice at the Novotel since Jan 2008. He is relocating to Cardiff and the agency put us there for our first visit, and afterwards we requested it for the second one.",
            "title": "Nice, bug room",
            "user": "888travel"
        },
        {
            "date": "March 29, 2008",
            "detail_rating": {
                "business": null,
                "cleanliness": 4.0,
                "desk": null,
                "front_desk": 4.0,
                "location": 3.0,
                "pool": null,
                "restaurant": null,
                "rooms": 3.0,
                "service": 4.0,
                "sleep": null,
                "value": 1.0
            },
            "helpfulness": null,
            "id": 14635504,
            "likes": {
                "disliked": "\u2014 the cost",
                "liked": "\u2014 the bed"
            },
            "rating": 3.0,
            "stay_parameters": "Stayed March 2008, traveled as a couple",
            "text": "My Hubby and I stopped here on a Friday night as we going to a Wedding in Caerphilly.",
            "title": "Nice hotel but rather expensive we thought",
            "user": "Angie_Paul"
        },
        {
            "date": "March 28, 2008",
            "detail_rating": {
                "business": 5.0,
                "cleanliness": 5.0,
                "desk": null,
                "front_desk": 5.0,
                "location": 5.0,
                "pool": null,
                "restaurant": null,
                "rooms": 5.0,
                "service": 5.0,
                "sleep": null,
                "value": 5.0
            },
            "helpfulness": 2,
            "id": 14603242,
            "likes": {
                "disliked": "\u2014 nothing",
                "liked": "\u2014 close to city centre, good room service(nice food) and nice big rooms,comfy beds."
            },
            "rating": 5.0,
            "stay_parameters": "Stayed February 2008, traveled as a couple",
            "text": "We paid \u00a394. This included the room, breakfast and the car park and i must say we were quite disappointed!",
            "title": "Lovely hotel, great location, good food",
            "user": "Bebis83"
        },
        {
            "date": "March 25, 2008",
            "detail_rating": {
                "business": 3.0,
                "cleanliness": 4.0,
                "desk": null,
                "front_desk": 3.0,
                "location": 4.0,
                "pool": null,
                "restaurant": null,
                "rooms": 4.0,
                "service": 4.0,
                "sleep": null,
                "value": 2.0
            },
            "helpfulness": 1,
            "id": 14535663,
            "likes": {
                "disliked": "\u2014 Over priced, expensive pretender",
                "liked": "\u2014 Nice rooms"
            },
            "rating": 4.0,
            "stay_parameters": "Stayed March 2008, traveled as a couple",
            "text": "I booked direct with the hotel a few weeks ago and i was certain the price was only \u00a365, and i must have assumed this included breakfast... how silly i was.",
            "title": "Great Location",
            "user": "USVIRGINS"
        },
        {
            "date": "March 4, 2008",
            "detail_rating": {
                "business": 5.0,
                "cleanliness": 5.0,
                "desk": null,
                "front_desk": 3.0,
                "location": 5.0,
                "pool": null,
                "restaurant": null,
                "rooms": 5.0,
                "service": 5.0,
                "sleep": null,
                "value": 5.0
            },
            "helpfulness": 2,
            "id": 14047683,
            "likes": {
                "disliked": "\u2014 separate toilet 'room' from shower room/ bath - it had no sink to wash hands in",
                "liked": "\u2014 comfy beds, lovely accommodation, quiet room"
            },
            "rating": 5.0,
            "stay_parameters": "Stayed February 2008, traveled with family",
            "text": "The staff were nice, had a smoking room though and it did smell a bit but we did need to check in early (so much for the ban).",
            "title": "Lovely new hotel",
            "user": "AyrshireJaggy"
        },
        {
            "date": "February 25, 2008",
            "detail_rating": {
                "business": null,
                "cleanliness": 4.0,
                "desk": null,
                "front_desk": 5.0,
                "location": 5.0,
                "pool": null,
                "restaurant": null,
                "rooms": 4.0,
                "service": 4.0,
                "sleep": null,
                "value": 4.0
            },
            "helpfulness": 1,
            "id": 13827100,
            "likes": {
                "disliked": "\u2014 Noise in the morning",
                "liked": "\u2014 Location and Bed!"
            },
            "rating": 4.0,
            "stay_parameters": "Stayed December 2007, traveled as a couple",
            "text": "Apart from that the room was clean but basic, although the bed was lovely!",
            "title": "Good Stay!",
            "user": "slewis27"
        },
        {
            "date": "October 7, 2007",
            "detail_rating": {
                "business": null,
                "cleanliness": null,
                "desk": null,
                "location": null,
                "pool": null,
                "restaurant": null,
                "rooms": null,
                "service": null,
                "sleep": null,
                "value": null
            },
            "helpfulness": 2,
            "id": 10050964,
            "likes": {
                "disliked": null,
                "liked": null
            },
            "rating": 4.0,
            "stay_parameters": null,
            "text": "Hotel Novotel Quite expensive, but a very pleasant stay. Used the pool a number of times during my two day stay and exercise facilities also available. Breakfast excellent which was included in my rate. Snack food and meals expensive. Reception staff excellent. Very pleasant and helpful especially a young lady named Laila. If you want a quiet room ask for one facing the car park as many of the rooms face a busy road. It is easier to walk into the city centre than take a local bus as the buses (well those I found) only run approximately every 30 mins.",
            "title": "Pleasant short stay",
            "user": "Ystrady"
        },
        {
            "date": "September 12, 2007",
            "detail_rating": {
                "business": null,
                "cleanliness": 4.0,
                "desk": null,
                "front_desk": 5.0,
                "location": 5.0,
                "pool": null,
                "restaurant": null,
                "rooms": 4.0,
                "service": 5.0,
                "sleep": null,
                "value": 4.0
            },
            "helpfulness": 3,
            "id": 8703389,
            "likes": {
                "disliked": "\u2014 nothing",
                "liked": "\u2014 awesome location"
            },
            "rating": 5.0,
            "stay_parameters": "Stayed September 2007, traveled as a couple",
            "text": "This hotel was excellent, it's in a great location; 10-15mins walk to Mermaid Quay and same into the city centre. The staff were all exceptional and offered high service. The breakfast was wonderful- continental and cooked items.",
            "title": "Fabulous Hotel!",
            "user": "aussie_travelling07"
        },
        {
            "date": "August 21, 2007",
            "detail_rating": {
                "business": 3.0,
                "cleanliness": 5.0,
                "desk": null,
                "front_desk": 3.0,
                "location": 5.0,
                "pool": null,
                "restaurant": null,
                "rooms": 4.0,
                "service": 3.0,
                "sleep": null,
                "value": 5.0
            },
            "helpfulness": 3,
            "id": 8464143,
            "likes": {
                "disliked": "\u2014 room could have been bigger",
                "liked": "\u2014 decor, design, cleanliness, swimming pool"
            },
            "rating": 4.0,
            "stay_parameters": "Stayed August 2007, traveled with family",
            "text": "We had a wonderful time and would definately stay here again!!",
            "title": "nice hotel",
            "user": "Vicky33"
        },
        {
            "date": "August 20, 2007",
            "detail_rating": {
                "business": null,
                "cleanliness": 5.0,
                "desk": null,
                "front_desk": 5.0,
                "location": 4.0,
                "pool": null,
                "restaurant": null,
                "rooms": 4.0,
                "service": 5.0,
                "sleep": null,
                "value": 5.0
            },
            "helpfulness": 3,
            "id": 8460162,
            "likes": {
                "disliked": "\u2014 nothing",
                "liked": "\u2014 lovely view from terrace, comfy beds and tasty breakfasts"
            },
            "rating": 5.0,
            "stay_parameters": "Stayed August 2007, traveled with family",
            "text": "Stayed at the Novotel on 13th, check in was fine although we couldn't check in till 2pm, the receptionist staff could have been a bit more friendly, they weren't too bad though. We was expecting the room to be a bit bigger as there was 3 of us (1 child of 10yrs), and reading the last review they obviously had bigger room as we did not have a separate shower and bath, and it definately wasn't a big room. We had no proper cushions on our bed, just square ones that you have on a sofa, there was one on the pull out bed! The room was pleasant although I'm sure we should have had a bigger room, had booked 2 months in advance too.",
            "title": "Loved Cardiff Bay!",
            "user": "heroes_fan"
        },
        {
            "date": "August 16, 2007",
            "detail_rating": {
                "business": null,
                "cleanliness": 5.0,
                "desk": null,
                "front_desk": 4.0,
                "location": 5.0,
                "pool": null,
                "restaurant": null,
                "rooms": 5.0,
                "service": 4.0,
                "sleep": null,
                "value": 5.0
            },
            "helpfulness": 2,
            "id": 8435422,
            "likes": {
                "disliked": "\u2014 Nothing",
                "liked": "\u2014 Stylish, clean and comfortable with a central location"
            },
            "rating": 5.0,
            "stay_parameters": "Stayed August 2007, traveled with friends",
            "text": "Great location near to Cardiff Bay (Red Dragon Centre for Doctor Who) ten min walk and Cardiff Town Centre about 15min walk. Swimming Pool was very nice, very crowded as it is not big, so couldn't really enjoy it greatly.",
            "title": "Fantastic",
            "user": "sj55"
        },
        {
            "date": "August 2, 2007",
            "detail_rating": {
                "business": null,
                "cleanliness": 5.0,
                "desk": null,
                "front_desk": 4.0,
                "location": 4.0,
                "pool": null,
                "restaurant": null,
                "rooms": 5.0,
                "service": null,
                "sleep": null,
                "value": 5.0
            },
            "helpfulness": 2,
            "id": 8279171,
            "likes": {
                "disliked": "\u2014 Nothing",
                "liked": "\u2014 Lovely building and fantastic breakfast!"
            },
            "rating": 5.0,
            "stay_parameters": "Stayed July 2007, traveled with family",
            "text": "Having never stayed at a Novotel before I thought it would be nothing more than a step up from a Travel Lodge, a bland concrete box with no character. How wrong I was. The building has been dramatically converted from a warehouse to an ultra modern hotel with fantastic facilities.",
            "title": "A Nice Surprise!",
            "user": "matt78"
        },
        {
            "date": "June 29, 2007",
            "detail_rating": {
                "business": 4.0,
                "cleanliness": 5.0,
                "desk": null,
                "front_desk": 5.0,
                "location": 5.0,
                "pool": null,
                "restaurant": null,
                "rooms": 4.0,
                "service": 4.0,
                "sleep": null,
                "value": 3.0
            },
            "helpfulness": 2,
            "id": 8025637,
            "likes": {
                "disliked": "\u2014 No real ale",
                "liked": "\u2014 Very quiet, well insulated rooms and good leisure facilities"
            },
            "rating": 4.0,
            "stay_parameters": "Stayed June 2007, traveled on business",
            "text": "The rooms are spacious and tastefully decorated with all the usual amenities including air con, safe, laptop and MP3 connections and a clean and functional bathroom. The beds are really comfortable too - I could have slept forever!",
            "title": "Comfortable, conveniently situated hotel with pool and gym",
            "user": "morag1"
        }
    ],
    "slim_ranking": 0.0975609756098,
    "stars": 4,
    "tripadvisor": {
        "VISITED": false,
        "country_name": null,
        "locality": null,
        "pic_link": null,
        "street_address": null
    },
    "user_rating": 4.0,
    "variance": {
        "average": 102,
        "excellent": 367,
        "poor": 30,
        "terrible": 13,
        "very good": 404
    }
}