{
    "aka": "Hotel Nicolaas Witsen",
    "description": "Hotel Nicolaas Witsen is a recently renovated hotel in a quiet street in the city centre of Amsterdam. Most of Amsterdam attractions/ sightseeings are within walking distance from our hotel. All rooms and public area's have free WiFi.We are ready to welcome you and promise you a wonderfull stay!",
    "detail_rating": {
        "cleanliness": null,
        "location": null,
        "rooms": null,
        "service": null,
        "sleep": null,
        "value": null
    },
    "location": {
        "city": "Amsterdam",
        "continent": "Europe",
        "country": "The Netherlands",
        "proposed_city": null,
        "province": null,
        "region": null
    },
    "name": "Nicolaas Witsen Hotel",
    "places": {
        "aka": [],
        "hotel_description": [
            "Amsterdam",
            "Most"
        ],
        "hotel_name": []
    },
    "review_count": 172,
    "review_count_current": 6,
    "reviews": [
        {
            "date": "April 7, 2004",
            "detail_rating": {
                "business": null,
                "cleanliness": null,
                "desk": null,
                "location": null,
                "pool": null,
                "restaurant": null,
                "rooms": null,
                "service": null,
                "sleep": null,
                "value": null
            },
            "helpfulness": 6,
            "id": 1767148,
            "likes": {
                "disliked": null,
                "liked": null
            },
            "rating": 4.0,
            "stay_parameters": null,
            "text": "My fiancee and I spent two days there in March 2004. It was perfectly fine. Nothing special, but no faults either. The room was clean and verged on attractive, really. The breakfast that was included was more than we could eat. The location is fine. It's really not far to anything from there.",
            "title": "Totally fine",
            "user": "melvinPickles"
        },
        {
            "date": "March 5, 2004",
            "detail_rating": {
                "business": null,
                "cleanliness": null,
                "desk": null,
                "location": null,
                "pool": null,
                "restaurant": null,
                "rooms": null,
                "service": null,
                "sleep": null,
                "value": null
            },
            "helpfulness": 7,
            "id": 1709828,
            "likes": {
                "disliked": null,
                "liked": null
            },
            "rating": 4.0,
            "stay_parameters": null,
            "text": "We have just returned from a 4 night stay at this hotel. We found it to be in the best possible location : close enough to the night life without being intrusive and near to many museums and other such places of interest. The room was small but very clean and the staff were helpful and friendly. However.......if you are not keen on lifts, beware of the stairs! We will definitely return.",
            "title": "Loved the Location",
            "user": "A TripAdvisor user"
        },
        {
            "date": "February 11, 2004",
            "detail_rating": {
                "business": null,
                "cleanliness": null,
                "desk": null,
                "location": null,
                "pool": null,
                "restaurant": null,
                "rooms": null,
                "service": null,
                "sleep": null,
                "value": null
            },
            "helpfulness": 5,
            "id": 1645391,
            "likes": {
                "disliked": null,
                "liked": null
            },
            "rating": 4.0,
            "stay_parameters": null,
            "text": "Clean, good staff, nice location close to museums. We stayed here after three nights in the Piet Hein, and by comparison, our room at the Nicolaas Witsen was gigantic.",
            "title": "going back again",
            "user": "A TripAdvisor user"
        },
        {
            "date": "January 7, 2004",
            "detail_rating": {
                "business": null,
                "cleanliness": null,
                "desk": null,
                "location": null,
                "pool": null,
                "restaurant": null,
                "rooms": null,
                "service": null,
                "sleep": null,
                "value": null
            },
            "helpfulness": 5,
            "id": 1541370,
            "likes": {
                "disliked": null,
                "liked": null
            },
            "rating": 3.0,
            "stay_parameters": null,
            "text": "Just booked three nights again, if that says anything",
            "title": "OK if you're not in your room very much!",
            "user": "dustyroad52"
        },
        {
            "date": "December 26, 2003",
            "detail_rating": {
                "business": null,
                "cleanliness": null,
                "desk": null,
                "location": null,
                "pool": null,
                "restaurant": null,
                "rooms": null,
                "service": null,
                "sleep": null,
                "value": null
            },
            "helpfulness": 3,
            "id": 1530887,
            "likes": {
                "disliked": null,
                "liked": null
            },
            "rating": 5.0,
            "stay_parameters": null,
            "text": "The Nicolaas Witsen was not bad ... It's kind of modern and not in a bad location. Perhaps I just enjoy a different type of hotel (more cosy and smaller too). The staff were friendly and the breakfast was very good. So - there was nothing wrong with it, for the money it was good value.If you're not in your room overmuch it's not bad, it's just very small and rather plain, that's not a criticism per se just the facts.",
            "title": "hotel",
            "user": "A TripAdvisor user"
        },
        {
            "date": "December 5, 2003",
            "detail_rating": {
                "business": null,
                "cleanliness": null,
                "desk": null,
                "location": null,
                "pool": null,
                "restaurant": null,
                "rooms": null,
                "service": null,
                "sleep": null,
                "value": null
            },
            "helpfulness": 3,
            "id": 1508103,
            "likes": {
                "disliked": null,
                "liked": null
            },
            "rating": 4.0,
            "stay_parameters": null,
            "text": "we stayed here in december 2003 it was clean and comfortable.it is in a quiet location but the main attractions are easily reached either by foot or tram.the staff are very friendly and helpful .",
            "title": "clean and comfortable",
            "user": "A TripAdvisor user"
        }
    ],
    "slim_ranking": 0.294117647059,
    "stars": 3,
    "tripadvisor": {
        "VISITED": false,
        "country_name": null,
        "locality": null,
        "pic_link": null,
        "street_address": null
    },
    "user_rating": 4.0,
    "variance": {
        "average": 31,
        "excellent": 46,
        "poor": 12,
        "terrible": 3,
        "very good": 80
    }
}