{
    "aka": "St Christopher`s Paris Hotel Paris",
    "description": null,
    "detail_rating": {
        "cleanliness": null,
        "location": null,
        "rooms": null,
        "service": null,
        "sleep": null,
        "value": null
    },
    "location": {
        "city": "Paris",
        "continent": "Europe",
        "country": "France",
        "proposed_city": "Paris",
        "province": null,
        "region": "Ile-de-France"
    },
    "name": "St Christopher's Paris Hostel",
    "places": {
        "aka": [
            "Paris"
        ],
        "hotel_description": [],
        "hotel_name": [
            "Paris"
        ]
    },
    "review_count": 469,
    "review_count_current": 20,
    "reviews": [
        {
            "date": "June 29, 2011",
            "detail_rating": {
                "business": null,
                "cleanliness": 5.0,
                "desk": null,
                "location": null,
                "pool": null,
                "restaurant": null,
                "rooms": null,
                "service": 5.0,
                "sleep": 5.0,
                "value": 4.0
            },
            "helpfulness": 1,
            "id": 114861946,
            "likes": {
                "disliked": null,
                "liked": null
            },
            "rating": 4.0,
            "stay_parameters": "Stayed April 2011, traveled solo",
            "text": "The hostel seems quite new. It is kept very clean and tidy and is very comfortable to stay in. The staff were also quite friendly. The location of the the hostel isnt the greatest, but still not so bad. Also they have alot of big tourist groups like Top deck or something staying there which wasnt really to my taste. The internet was a bit iffy at times also. Overall not to bad though.",
            "title": "Nice hostel but big tourist groups stayin there.",
            "user": "Oscar_Trip1"
        },
        {
            "date": "June 13, 2011",
            "detail_rating": {
                "business": null,
                "cleanliness": 4.0,
                "desk": null,
                "location": null,
                "pool": null,
                "restaurant": null,
                "rooms": null,
                "service": 4.0,
                "sleep": 4.0,
                "value": 3.0
            },
            "helpfulness": 1,
            "id": 113265021,
            "likes": {
                "disliked": null,
                "liked": null
            },
            "rating": 4.0,
            "stay_parameters": "Stayed May 2011, traveled with friends",
            "text": "My cousins and I stayed at St. Christopher's Paris for three nights in May 2011. The best parts of this hostel are the cozy little bunks we slept in. They each had their own outlets (to charge your electronics), a nightlight (to keep from waking your neighbors) and a sliding curtain to pull across the bunk for privacy. The three of us slept in a room with five other people, but the curtains really gave us a lot of privacy and kept the light out when others were coming and out of the room.",
            "title": "Best hostel we stayed at entire trip.",
            "user": "MissGuidedTravel"
        },
        {
            "date": "June 13, 2011",
            "detail_rating": {
                "business": null,
                "cleanliness": 5.0,
                "desk": null,
                "location": null,
                "pool": null,
                "restaurant": null,
                "rooms": null,
                "service": 5.0,
                "sleep": 3.0,
                "value": 5.0
            },
            "helpfulness": 1,
            "id": 113172417,
            "likes": {
                "disliked": null,
                "liked": null
            },
            "rating": 4.0,
            "stay_parameters": "Stayed February 2011, traveled with friends",
            "text": "The security lockers (huge cages under each bed) were great. They fit most large suitcases! They're a little loud when you roll them out, but the security they offer you just can't find in most hostels. Bring your own lock!",
            "title": "Good experience in my first hostel",
            "user": "cymbalkatie"
        },
        {
            "date": "June 7, 2011",
            "detail_rating": {
                "business": null,
                "cleanliness": 1.0,
                "desk": null,
                "location": 1.0,
                "pool": null,
                "restaurant": null,
                "rooms": 1.0,
                "service": 1.0,
                "sleep": 1.0,
                "value": 1.0
            },
            "helpfulness": 2,
            "id": 112017150,
            "likes": {
                "disliked": null,
                "liked": null
            },
            "rating": 1.0,
            "stay_parameters": "Stayed June 2011, traveled solo",
            "text": "Most of the staff was friendly and helpful with directions, too!",
            "title": "Dorm in the Ghetto--outside Paris proper.",
            "user": "Owen_B77"
        },
        {
            "date": "June 6, 2011",
            "detail_rating": {
                "business": null,
                "cleanliness": 2.0,
                "desk": null,
                "location": null,
                "pool": null,
                "restaurant": null,
                "rooms": null,
                "service": 1.0,
                "sleep": 3.0,
                "value": 2.0
            },
            "helpfulness": 2,
            "id": 111763604,
            "likes": {
                "disliked": null,
                "liked": null
            },
            "rating": 1.0,
            "stay_parameters": "Stayed June 2011, traveled with friends",
            "text": "You can read more about our experience at http://missguidedtravel.blogspot.com",
            "title": "Do Not Stay Here",
            "user": "jterakita"
        },
        {
            "date": "July 21, 2011",
            "detail_rating": {
                "business": null,
                "cleanliness": 3.0,
                "desk": null,
                "location": null,
                "pool": null,
                "restaurant": null,
                "rooms": null,
                "service": 1.0,
                "sleep": 5.0,
                "value": 4.0
            },
            "helpfulness": null,
            "id": 115634374,
            "likes": {
                "disliked": null,
                "liked": null
            },
            "rating": 3.0,
            "stay_parameters": "Stayed June 2011, traveled with friends",
            "text": "I had a sudden change of plans and had to find a room near the Gard du Nord, St Christopher's came up.",
            "title": "OK for a Quickie One-Night Stay",
            "user": "Tahoep"
        },
        {
            "date": "July 13, 2011",
            "detail_rating": {
                "business": null,
                "cleanliness": 4.0,
                "desk": null,
                "location": 2.0,
                "pool": null,
                "restaurant": null,
                "rooms": 4.0,
                "service": 2.0,
                "sleep": null,
                "value": 1.0
            },
            "helpfulness": 3,
            "id": 115322813,
            "likes": {
                "disliked": null,
                "liked": null
            },
            "rating": 2.0,
            "stay_parameters": "Stayed June 2011",
            "text": "The good: Huge room for six people. There was a table, chairs, and a wash basin in the room. Room quite clean. Sheets already on the bed. Bed also good sized. Privacy curtain in front of bed. Own socket and lamp. Huge wire cage under bottom bed for storage. Big windows. Nice roommates.",
            "title": "Expensive, rude staff in terrible location",
            "user": "deathlyhellos"
        },
        {
            "date": "July 10, 2011",
            "detail_rating": {
                "business": null,
                "cleanliness": 5.0,
                "desk": null,
                "location": null,
                "pool": null,
                "restaurant": null,
                "rooms": null,
                "service": 4.0,
                "sleep": 5.0,
                "value": 3.0
            },
            "helpfulness": null,
            "id": 115203820,
            "likes": {
                "disliked": null,
                "liked": null
            },
            "rating": 4.0,
            "stay_parameters": "Stayed September 2010, traveled solo",
            "text": "The bad: Big city indifferent staff. Only two bathrooms for 40 people on one floor. Shower had no curtain, so, if not careful, can spray water over the entire bathroom when showering. Very sketchy neighborhood (I had to walk it late at night and very early in the morning! Really scare-wee! ) The cage-like lockers needed BIG locks, which I didn't have.",
            "title": "Great Place",
            "user": "anna2301"
        },
        {
            "date": "July 1, 2011",
            "detail_rating": {
                "business": null,
                "cleanliness": 5.0,
                "desk": null,
                "location": null,
                "pool": null,
                "restaurant": null,
                "rooms": null,
                "service": 4.0,
                "sleep": 5.0,
                "value": 5.0
            },
            "helpfulness": 1,
            "id": 114940233,
            "likes": {
                "disliked": null,
                "liked": null
            },
            "rating": 5.0,
            "stay_parameters": "Stayed June 2011, traveled solo",
            "text": "Conclusions: I stayed less than 6 hours, so my conclusions arise from just a limited stay. This hostel is convenient for the Gard du Nord and Gard de l\"Est train stations (two stops on the metro Line 7), if one had to catch a train from those stations or take the RER B train to Charles de Gaulle Airport. It's relatively inexpensive for Paris lodgings. For what little sleep I got, I slept quite well. If it weren't for the large room and the cleanliness, this would easily qualify as the worst hostel I've ever stayed in. It's a very large hostel (300 beds) so it's always a possibility for last-minute bookings, as in my case.",
            "title": "Best hostel of the trip.",
            "user": "arthad"
        },
        {
            "date": "June 30, 2011",
            "detail_rating": {
                "business": null,
                "cleanliness": 4.0,
                "desk": null,
                "location": null,
                "pool": null,
                "restaurant": null,
                "rooms": null,
                "service": 3.0,
                "sleep": 4.0,
                "value": 3.0
            },
            "helpfulness": null,
            "id": 114918149,
            "likes": {
                "disliked": null,
                "liked": null
            },
            "rating": 4.0,
            "stay_parameters": "Stayed June 2011, traveled with friends",
            "text": "Stayed for 4 nights in June 2011. Nice room, clean and spacious with a sink. However the staff are too busy with their own social agenda to bother with good service. Always talking and messing around when there are lines of people. Also very rude at times. The linen was scratchy and the pillows weren't even pillows, but instead bags filled with cotton wool. The location is terrible, both in terms of distance from key sights and in socio economic terms! Would never walk around at night! Bathrooms dirty (poo on floor) and showers low pressure and require constant holding of a button for hot water. All in all a terrible waste of money.",
            "title": "Much better than expected, would definitely stay again!!",
            "user": "travelcloak"
        },
        {
            "date": "May 1, 2011",
            "detail_rating": {
                "business": null,
                "cleanliness": 5.0,
                "desk": null,
                "location": 3.0,
                "pool": null,
                "restaurant": null,
                "rooms": 5.0,
                "service": 4.0,
                "sleep": 5.0,
                "value": 3.0
            },
            "helpfulness": null,
            "id": 106431296,
            "likes": {
                "disliked": null,
                "liked": null
            },
            "rating": 4.0,
            "stay_parameters": "Stayed August 2010, traveled solo",
            "text": "St Christopher's is an extremely large (and therefore somewhat impersonal) hostel, but it's run very professionally and I enjoyed my stay here. The rooms are very clean and modern looking, security is fine and there's a good balance between being able to meet other people and having your own space.",
            "title": "Good hostel",
            "user": "blank_frackis"
        },
        {
            "date": "April 24, 2011",
            "detail_rating": {
                "business": null,
                "cleanliness": 5.0,
                "desk": null,
                "location": 4.0,
                "pool": null,
                "restaurant": null,
                "rooms": 5.0,
                "service": 4.0,
                "sleep": null,
                "value": 5.0
            },
            "helpfulness": null,
            "id": 105284838,
            "likes": {
                "disliked": null,
                "liked": null
            },
            "rating": 5.0,
            "stay_parameters": "Stayed December 2010",
            "text": "There's a bar/cafe on the ground floor which is handy - it's far enough away from the rooms that you won't have any trouble with noise. The only potential downside is the location, as it's quite far away from any recognised tourist area, but it's still a decent area and the metro is close by. I've stayed in lots of places in Paris and, believe me, there are a lot worse areas than this one!",
            "title": "Legit place!",
            "user": "RJ011"
        },
        {
            "date": "April 18, 2011",
            "detail_rating": {
                "business": null,
                "cleanliness": 5.0,
                "desk": null,
                "location": 2.0,
                "pool": null,
                "restaurant": null,
                "rooms": 4.0,
                "service": 4.0,
                "sleep": 3.0,
                "value": 3.0
            },
            "helpfulness": null,
            "id": 104568161,
            "likes": {
                "disliked": null,
                "liked": null
            },
            "rating": 3.0,
            "stay_parameters": "Stayed May 2010, traveled with friends",
            "text": "Great place! The location is about a five to ten minute walk from the nearest metro, which is fine during the day, could be sketchy at night if alone. But don't let that discourage you. Once there, hostel is the jam!",
            "title": "get what you pay for!",
            "user": "bobbelina"
        },
        {
            "date": "April 15, 2011",
            "detail_rating": {
                "business": null,
                "cleanliness": 5.0,
                "desk": null,
                "location": 4.0,
                "pool": null,
                "restaurant": null,
                "rooms": 4.0,
                "service": 4.0,
                "sleep": 4.0,
                "value": 5.0
            },
            "helpfulness": 1,
            "id": 104168251,
            "likes": {
                "disliked": null,
                "liked": null
            },
            "rating": 4.0,
            "stay_parameters": "Stayed April 2011, traveled solo",
            "text": "Has a restaurant and bar with great food and you can watch football there too. Rooms are spacious and each bed has it's own spacious locker. (bring padlock)",
            "title": "Some things to know \u2013 like, bring ear plugs!",
            "user": "InspectorSands"
        },
        {
            "date": "April 9, 2011",
            "detail_rating": {
                "business": null,
                "cleanliness": 4.0,
                "desk": null,
                "location": 2.0,
                "pool": null,
                "restaurant": null,
                "rooms": 3.0,
                "service": 2.0,
                "sleep": 3.0,
                "value": 2.0
            },
            "helpfulness": 1,
            "id": 103403164,
            "likes": {
                "disliked": null,
                "liked": null
            },
            "rating": 2.0,
            "stay_parameters": "Stayed April 2011, traveled solo",
            "text": "Beds also have drapes that can be drawn so you can seclude yourself if you wish.",
            "title": "Too Much Business, Not Enough Hostel",
            "user": "Shready81"
        },
        {
            "date": "June 1, 2011",
            "detail_rating": {
                "business": null,
                "cleanliness": 4.0,
                "desk": null,
                "location": null,
                "pool": null,
                "restaurant": null,
                "rooms": null,
                "service": 4.0,
                "sleep": 5.0,
                "value": 5.0
            },
            "helpfulness": 1,
            "id": 111012361,
            "likes": {
                "disliked": null,
                "liked": null
            },
            "rating": 4.0,
            "stay_parameters": "Stayed July 2010, traveled solo",
            "text": "I stayed at St. Christopher's for 3 nights and was very pleased with my experience. The security key cards on the entrance, each floor, and individual rooms made me feel very secure as it restricted access to only those persons who needed to be in each area. I stayed in the female dorm and was glad I paid a little more (I think about $5) as it was clean and quiet.",
            "title": "Cleanest, Safest Hostel I've been to",
            "user": "sublimare"
        },
        {
            "date": "May 23, 2011",
            "detail_rating": {
                "business": null,
                "cleanliness": 3.0,
                "desk": null,
                "location": 3.0,
                "pool": null,
                "restaurant": null,
                "rooms": 4.0,
                "service": 4.0,
                "sleep": null,
                "value": 4.0
            },
            "helpfulness": null,
            "id": 109540529,
            "likes": {
                "disliked": null,
                "liked": null
            },
            "rating": 4.0,
            "stay_parameters": "Stayed May 2011",
            "text": "I really appreciated the lockable luggage cages below my bed. They are a bit squeaky however, so they sometimes disturb a sleeping neighbor. The next time I would not choose the bed nearest the door, as I had to close the luggage cage every time someone came or went. I loved the privacy curtain which fully covered the bed area, blocking out light in the morning and offering privacy. It was fairly easy to string a small cord from either end of the bunk so I was able to dry small laundry and my bath towel during the day. Having A/C in a hostel is a rare thing, and I so appreciated it after each day out in the July heat.",
            "title": "Good place to crash for a hostel traveller",
            "user": "jth39"
        },
        {
            "date": "May 14, 2011",
            "detail_rating": {
                "business": null,
                "cleanliness": 4.0,
                "desk": null,
                "location": 5.0,
                "pool": null,
                "restaurant": null,
                "rooms": 4.0,
                "service": 5.0,
                "sleep": 4.0,
                "value": 4.0
            },
            "helpfulness": null,
            "id": 108187925,
            "likes": {
                "disliked": null,
                "liked": null
            },
            "rating": 4.0,
            "stay_parameters": "Stayed May 2011, traveled as a couple",
            "text": "Cleanliness: Except for the bar downstairs, everything was very clean. Although so many travelers seem to wreak havoc on a place, the cleaning staff always seemed to restore the rooms and bathroom to a spotless state. The sheets were clean and crisp, the bathrooms were clean.",
            "title": "Oasis in The busy city",
            "user": "Duink"
        },
        {
            "date": "May 11, 2011",
            "detail_rating": {
                "business": null,
                "cleanliness": 5.0,
                "desk": null,
                "location": 3.0,
                "pool": null,
                "restaurant": null,
                "rooms": 5.0,
                "service": 4.0,
                "sleep": null,
                "value": 3.0
            },
            "helpfulness": null,
            "id": 107848418,
            "likes": {
                "disliked": null,
                "liked": null
            },
            "rating": 4.0,
            "stay_parameters": "Stayed May 2011",
            "text": "St. Christopher's has several additional features, such as free nightly concerts, a tv room, free self-serve breakfast, inexpensive dinners, an internet cafe (be prepared to wait in line) and a luggage room where you can stow your gear while waiting for a room or if you have time between checking out and heading to the airport.",
            "title": "Overall no huge complaints.",
            "user": "kal_87"
        },
        {
            "date": "May 4, 2011",
            "detail_rating": {
                "business": null,
                "cleanliness": 4.0,
                "desk": null,
                "location": 3.0,
                "pool": null,
                "restaurant": null,
                "rooms": 3.0,
                "service": 3.0,
                "sleep": 3.0,
                "value": 5.0
            },
            "helpfulness": null,
            "id": 106907130,
            "likes": {
                "disliked": null,
                "liked": null
            },
            "rating": 3.0,
            "stay_parameters": "Stayed July 2010, traveled solo",
            "text": "Belushi's Bar is a happening spot for visitors and 20-30 something locals, but beware the middle aged man trolling for young females. Great for a drink, but they cannot boast about the quality of their food or cleanliness. Breakfast is typically basic rolls with spread or jam, boxed cereal, fruit, and rough coffee. They view the idea of \"dishwashing\" used breakfast dishes very loosely. (i.e. I picked up a coffee cup that still had a thick residue of unmelted sugar in the bottom, and rarely encountered clean silverware.) The dinner specials are a joke, and I think you could do better eating at McDo's. I opted for it the first night and for about $10 managed to choke down leftover breakfast rolls and clumpy fettucine alfredo that tasted like it came from a 99 cent packet at the grocery store.",
            "title": "Just what i needed!",
            "user": "rainydaytoast"
        }
    ],
    "slim_ranking": 0.207207207207,
    "stars": null,
    "tripadvisor": {
        "VISITED": false,
        "country_name": null,
        "locality": null,
        "pic_link": null,
        "street_address": null
    },
    "user_rating": 4.0,
    "variance": {
        "average": 84,
        "excellent": 120,
        "poor": 32,
        "terrible": 24,
        "very good": 209
    }
}