{
    "aka": "Holiday Inn Express Deer Lake Newfoundland",
    "description": null,
    "detail_rating": {
        "cleanliness": null,
        "location": null,
        "rooms": null,
        "service": null,
        "sleep": null,
        "value": null
    },
    "location": {
        "city": null,
        "continent": null,
        "country": "Canada",
        "proposed_city": "Holiday",
        "province": null,
        "region": null
    },
    "name": "Holiday Inn Express Deer Lake",
    "places": {
        "aka": [
            "Holiday"
        ],
        "hotel_description": [],
        "hotel_name": [
            "Holiday"
        ]
    },
    "review_count": 52,
    "review_count_current": 5,
    "reviews": [
        {
            "date": "October 8, 2013",
            "detail_rating": {
                "business": null,
                "cleanliness": 5.0,
                "desk": null,
                "location": 3.0,
                "pool": null,
                "restaurant": null,
                "rooms": 5.0,
                "service": 5.0,
                "sleep": 5.0,
                "value": 4.0
            },
            "helpfulness": null,
            "id": 180264232,
            "likes": {
                "disliked": null,
                "liked": null
            },
            "rating": 5.0,
            "stay_parameters": "Stayed September 2013, traveled as a couple",
            "text": "This is a recently opened, modern hotel, and convenient for those using the airport. The breakfast was extensive and the room very well laid out. We appreciated the large king-size bed. The location is not close to restaurants, and most of those offer fast food.",
            "title": "Best hotel of the trip",
            "user": "rnathan"
        },
        {
            "date": "October 5, 2013",
            "detail_rating": {
                "business": null,
                "cleanliness": 4.0,
                "desk": null,
                "location": 5.0,
                "pool": null,
                "restaurant": null,
                "rooms": 5.0,
                "service": 4.0,
                "sleep": 4.0,
                "value": 3.0
            },
            "helpfulness": null,
            "id": 179804024,
            "likes": {
                "disliked": null,
                "liked": null
            },
            "rating": 4.0,
            "stay_parameters": "Stayed September 2013, traveled on business",
            "text": "Stayed here for one night on way through the area. This is the newest place to stay in Deer Lake. It is very well designed and very clean. By far the most comfortable place around. It appears to be well maintained and offers a very nice morning breakfast. It is visible from the highway but you have to take a few side streets to get there which is not a problem to do. There prices seem higher that most in the area but is you want to stay in the nicest place in town I could find this is it.",
            "title": "Best place in town",
            "user": "MIFire"
        },
        {
            "date": "October 1, 2013",
            "detail_rating": {
                "business": null,
                "cleanliness": 5.0,
                "desk": null,
                "location": 5.0,
                "pool": null,
                "restaurant": null,
                "rooms": 5.0,
                "service": 4.0,
                "sleep": 5.0,
                "value": 3.0
            },
            "helpfulness": null,
            "id": 179329210,
            "likes": {
                "disliked": null,
                "liked": null
            },
            "rating": 4.0,
            "stay_parameters": "Stayed September 2013, traveled as a couple",
            "text": "Proximity to the airport is pretty much the only reason to stay in Deer Lake and this was of the standard, comfortable Holiday Inn genre with a modern facility and efficient and helpful service. So, maybe not much to get excited about except that this is Newfoundland and anything in the outports that ticks all these boxes is exceptional. The hotel seems well equipped to deal with flights in and out of Deer Lake at all hours - with a limited breakfast service available from 3:00AM.",
            "title": "An modern oasis in an ancient landscape",
            "user": "Tedstravelblogs"
        },
        {
            "date": "September 30, 2013",
            "detail_rating": {
                "business": null,
                "cleanliness": 4.0,
                "desk": null,
                "location": 4.0,
                "pool": null,
                "restaurant": null,
                "rooms": 3.0,
                "service": 3.0,
                "sleep": 4.0,
                "value": 1.0
            },
            "helpfulness": null,
            "id": 179179044,
            "likes": {
                "disliked": null,
                "liked": null
            },
            "rating": 3.0,
            "stay_parameters": "Stayed September 2013, traveled on business",
            "text": "This hotel was pretty much adequate, but definitely not worth the high rate which was charge ($145/night + tax). Only accepted that rate because there's nothing else near the Deer Lake Airport and I had an early flight.",
            "title": "Fine, but overpriced",
            "user": "v c"
        },
        {
            "date": "September 19, 2013",
            "detail_rating": {
                "business": null,
                "cleanliness": 5.0,
                "desk": null,
                "location": 5.0,
                "pool": null,
                "restaurant": null,
                "rooms": 4.0,
                "service": 5.0,
                "sleep": 5.0,
                "value": 3.0
            },
            "helpfulness": null,
            "id": 177819909,
            "likes": {
                "disliked": null,
                "liked": null
            },
            "rating": 4.0,
            "stay_parameters": "Stayed September 2013, traveled with friends",
            "text": "I requested a coffee mug to use in my room instead of disposibles and was told that they didn't have any on-site at all (a glaring oversight). In the morning, the woman managing breakfast happily provided me with one and said that the front desk should have been able to do the same the night before.",
            "title": "Holiday Inn Express, Deer Lake, Newfoundland",
            "user": "KandyZero"
        }
    ],
    "slim_ranking": 0.5,
    "stars": 2.5,
    "tripadvisor": {
        "VISITED": false,
        "country_name": null,
        "locality": null,
        "pic_link": null,
        "street_address": null
    },
    "user_rating": 4.0,
    "variance": {
        "average": 9,
        "excellent": 21,
        "poor": 0,
        "terrible": 0,
        "very good": 22
    }
}