{
    "aka": "Star Hotel Salzburg",
    "description": "We have four different room types for you to choose from:48 Standard Rooms 16 m\u00b2 / 172 ft\u00b2 in size, furnished with individually controllable thermostats, shower/toilet, and bath with hair dryer, LCD TV with satellite reception, telephone with analog modem, free WLAN access, and a large double bed. Two of these rooms are furnished handicapped accessible. The 17 Business Rooms, at around 20 m\u00b2 / 215 ft\u00b2 in size, also feature a comfortable leather sofa. Our 17 Family Rooms are also a good 20 m\u00b2 / 215 ft\u00b2 in size and are furnished with two double beds. The 4 suites, each around 50 m\u00b2 / 538 ft\u00b2 in size and located on the uppermost floor, furnished with living area, sleeping area, equipped kitchen, and a balcony overlooking the rooftops of the city, guarantee a fantastic stay.",
    "detail_rating": {
        "cleanliness": null,
        "location": null,
        "rooms": null,
        "service": null,
        "sleep": null,
        "value": null
    },
    "location": {
        "city": "Salzburg",
        "continent": "Europe",
        "country": "Austria",
        "proposed_city": "Salzburg",
        "province": null,
        "region": "Austrian Alps"
    },
    "name": "Star Inn Hotel Salzburg Zentrum",
    "places": {
        "aka": [
            "Salzburg"
        ],
        "hotel_description": [],
        "hotel_name": [
            "Salzburg"
        ]
    },
    "review_count": 263,
    "review_count_current": 2,
    "reviews": [
        {
            "date": "July 6, 2008",
            "detail_rating": {
                "business": 5.0,
                "cleanliness": 5.0,
                "desk": null,
                "front_desk": 5.0,
                "location": 5.0,
                "pool": null,
                "restaurant": null,
                "rooms": 5.0,
                "service": 5.0,
                "sleep": null,
                "value": 5.0
            },
            "helpfulness": 4,
            "id": 17570214,
            "likes": {
                "disliked": null,
                "liked": null
            },
            "rating": 5.0,
            "stay_parameters": "Stayed May 2008, traveled as a couple",
            "text": "We stayed in Star Inn Hotel Zentrum for two nights in May 2008. The hotel was professionally run with staff speaking excellent English.",
            "title": "Great Hotel",
            "user": "paultry"
        },
        {
            "date": "June 28, 2008",
            "detail_rating": {
                "business": null,
                "cleanliness": 5.0,
                "desk": null,
                "front_desk": 5.0,
                "location": 5.0,
                "pool": null,
                "restaurant": null,
                "rooms": 5.0,
                "service": 5.0,
                "sleep": null,
                "value": 5.0
            },
            "helpfulness": null,
            "id": 17321580,
            "likes": {
                "disliked": null,
                "liked": null
            },
            "rating": 4.0,
            "stay_parameters": "Stayed June 2008, traveled solo",
            "text": "The hotel was new with very modern decor and had the feel of a business hotel. We booked a standard double room but for some reason it was not available and we were upgraded to an executive room with no extra charge. The room was spotlessly clean, and although it was street-facing, with the double-glazed windows, the street noise was well muffled. Common with most European hotels, there was no tea/coffee making facility in the room, but hot drinks could be purchased at the reception desk/lobby.",
            "title": "very good hotel",
            "user": "AbdullahAltamimi"
        }
    ],
    "slim_ranking": 0.231884057971,
    "stars": 3,
    "tripadvisor": {
        "VISITED": false,
        "country_name": null,
        "locality": null,
        "pic_link": null,
        "street_address": null
    },
    "user_rating": 4.0,
    "variance": {
        "average": 36,
        "excellent": 58,
        "poor": 3,
        "terrible": 3,
        "very good": 163
    }
}