{
    "aka": "Hotel Du Cadran",
    "description": "The Cadran Hotel recently finished its full renovation and offers you an exclusive design look. Its modern aspects and its comfortable design enable our guests to enter into an ambience emphasised by a Zen spirit. In our chocolate bar, your taste-buds will be surprised by his varieties of macaroons, chocolates and especially his famous flavoured hot and cold chocolate with vanilla, spices, orange and raspberry to enjoy either in the bar or to take away.",
    "detail_rating": {
        "cleanliness": 4.5,
        "location": 5.0,
        "rooms": 4.0,
        "service": 4.5,
        "sleep": 4.5,
        "value": 4.5
    },
    "location": {
        "city": "Paris",
        "continent": "Europe",
        "country": "France",
        "proposed_city": null,
        "province": null,
        "region": "Ile-de-France"
    },
    "name": "Hotel du Cadran Tour Eiffel",
    "places": {
        "aka": [],
        "hotel_description": [],
        "hotel_name": []
    },
    "review_count": 968,
    "review_count_current": 60,
    "reviews": [
        {
            "date": "November 13, 2008",
            "detail_rating": {
                "business": 5.0,
                "cleanliness": 5.0,
                "desk": null,
                "front_desk": 5.0,
                "location": 5.0,
                "pool": null,
                "restaurant": null,
                "rooms": 5.0,
                "service": 5.0,
                "sleep": null,
                "value": 5.0
            },
            "helpfulness": null,
            "id": 21826594,
            "likes": {
                "disliked": "\u2014 the hold reception",
                "liked": "\u2014 rooms"
            },
            "rating": 5.0,
            "stay_parameters": "Stayed October 2008, traveled as a couple",
            "text": "We chose hotel cadan for ourhoneymoon followingthe lovely reviews we readand we had a great stay.we let them know on arrival that we were on honeymoon and they immediately upgraded us to a superior room with no extra charge (great!). they recently renovated aal the ooms and we were on the top floor with a little viewon the eiffel tower. the hotel is vey clean and staff was hepful during our stay.",
            "title": "wonderfull honeymoon in Paris !!!",
            "user": "ninoNew_york"
        },
        {
            "date": "November 11, 2008",
            "detail_rating": {
                "business": null,
                "cleanliness": null,
                "desk": null,
                "location": null,
                "pool": null,
                "restaurant": null,
                "rooms": null,
                "service": null,
                "sleep": null,
                "value": null
            },
            "helpfulness": null,
            "id": 21724590,
            "likes": {
                "disliked": null,
                "liked": null
            },
            "rating": 5.0,
            "stay_parameters": null,
            "text": "They booked 2 superb restaurantin the neighbor and helped us gething a shuttle back to the airport.",
            "title": "Charming hotel and good location",
            "user": "sawsawparis"
        },
        {
            "date": "November 4, 2008",
            "detail_rating": {
                "business": 1.0,
                "cleanliness": 5.0,
                "desk": null,
                "front_desk": 5.0,
                "location": 5.0,
                "pool": null,
                "restaurant": null,
                "rooms": 3.0,
                "service": 5.0,
                "sleep": null,
                "value": 2.0
            },
            "helpfulness": 1,
            "id": 21543202,
            "likes": {
                "disliked": "\u2014 Extremely slow Wi-Fi and too hot!",
                "liked": "\u2014 Cleanliness"
            },
            "rating": 2.0,
            "stay_parameters": "Stayed October 2008, traveled as a couple",
            "text": "Wifi was working fine and the temperature of the room was nice.",
            "title": "Clean but...",
            "user": "bambam775"
        },
        {
            "date": "November 1, 2008",
            "detail_rating": {
                "business": null,
                "cleanliness": 5.0,
                "desk": null,
                "front_desk": 4.0,
                "location": 5.0,
                "pool": null,
                "restaurant": null,
                "rooms": 5.0,
                "service": 4.0,
                "sleep": null,
                "value": 4.0
            },
            "helpfulness": null,
            "id": 21457311,
            "likes": {
                "disliked": null,
                "liked": "\u2014 Location"
            },
            "rating": 4.0,
            "stay_parameters": "Stayed October 2008, traveled as a couple",
            "text": "We really enjoyed our time in paris and have no problem recommending this hotel to our friends, we will be back.",
            "title": "Hotel du Cadran Tour Eiffel Wonderful",
            "user": "sandralynn589"
        },
        {
            "date": "October 31, 2008",
            "detail_rating": {
                "business": 3.0,
                "cleanliness": 5.0,
                "desk": null,
                "front_desk": 5.0,
                "location": 5.0,
                "pool": null,
                "restaurant": null,
                "rooms": 4.0,
                "service": 4.0,
                "sleep": null,
                "value": 5.0
            },
            "helpfulness": null,
            "id": 21438469,
            "likes": {
                "disliked": null,
                "liked": null
            },
            "rating": 4.0,
            "stay_parameters": "Stayed October 2008",
            "text": "This charming hotel is located near the metro station, Ecole Militaire. The size of the room is the average size of hotels in Paris (I mean it's small), but it is clean and comformtable.",
            "title": "Very Nice Hotel, great location",
            "user": "TerryOldAgeDancer"
        },
        {
            "date": "July 9, 2007",
            "detail_rating": {
                "business": 5.0,
                "cleanliness": 5.0,
                "desk": null,
                "front_desk": 4.0,
                "location": 5.0,
                "pool": null,
                "restaurant": null,
                "rooms": 4.0,
                "service": 5.0,
                "sleep": null,
                "value": 5.0
            },
            "helpfulness": 4,
            "id": 8086480,
            "likes": {
                "disliked": "\u2014 the small closet",
                "liked": "\u2014 the location"
            },
            "rating": 5.0,
            "stay_parameters": "Stayed May 2007, traveled with family",
            "text": "We stayed in this small but charming boutique hotel and were very satisfied with all the amenities. Our room was small but very clean and neat. The bathroom had plenty of hot water in the shower with good water pressure. The beds were comfortable - not luxurious. The staff cleaned and freshened up the room daily. The breakfast buffet in the lower level had plenty of choices and was well stocked. It was open early and late enough to accomodate eating any time of the morning. The staff was extremely friendly and helpful - from making a pot of tea for us in the afternoon, to resolving a booking problem with a tour we had scheduled, to suggesting sights to visit during our stay. They all spoke English very well. The location was perfect - 2 blocks to the Eiffel Tower, a few steps to the lively and well known market street, Rue Du Clef, with restaurants, a patisserie, an ATM machine, and other charming shops. The metro stop was a 5 minute walk away. The neighborhood was quiet and there were no disturbances at night even with the windows open. There is also access to the internet in the lobby. I would visit this hotel again.",
            "title": "Charming Boutique Hotel",
            "user": "Jerseytraveler19"
        },
        {
            "date": "June 3, 2007",
            "detail_rating": {
                "business": 3.0,
                "cleanliness": 5.0,
                "desk": null,
                "front_desk": 5.0,
                "location": 5.0,
                "pool": null,
                "restaurant": null,
                "rooms": 3.0,
                "service": 4.0,
                "sleep": null,
                "value": 4.0
            },
            "helpfulness": 2,
            "id": 7752898,
            "likes": {
                "disliked": null,
                "liked": "\u2014 Location"
            },
            "rating": 4.0,
            "stay_parameters": "Stayed May 2007, traveled as a couple",
            "text": "A nice 2** hotel in a great location. Upon arrival there was no water in the hotel and the elevator wasn't working due to repairs That inconvenience only lasted a few hours. We were given room 504 whcih is a very small corner room. The air conditioner wasn't working iand the room was extremely hot. We requested to be moved after the 1st night as the room was 27C. We were moved to a room on the 2nd floor that had air conditioning that worked. Once moved no further problems. Staff were friendly and assisted re transportaion, dinner reservations. Rooms were clean and the bed reasonably comfortable. Would recommend, but try not to stay on the 5th floor where the rooms are smaller.",
            "title": "Great location",
            "user": "Pickeringcouple"
        },
        {
            "date": "May 29, 2007",
            "detail_rating": {
                "business": 5.0,
                "cleanliness": 5.0,
                "desk": null,
                "front_desk": 4.0,
                "location": 5.0,
                "pool": null,
                "restaurant": null,
                "rooms": 4.0,
                "service": 5.0,
                "sleep": null,
                "value": 4.0
            },
            "helpfulness": 3,
            "id": 7714258,
            "likes": {
                "disliked": "\u2014 small room",
                "liked": "\u2014 friendly staff"
            },
            "rating": 4.0,
            "stay_parameters": "Stayed May 2007, traveled as a couple",
            "text": "I can only add what others have said regarding this small hotel. We just returned from a four night stay. First of all, the staff is etremely nice and polite and all requests are seriously considered and met. The rooms are small but then that's Europe, especially Paris where space is at a premium. Yes, the rooms are a bit worn but then there is a renovation in the works t according to the photo in the lobby and the room we saw(courtesy of housekeeping) it will be ultra contemporary (alas paris seems to be going that way). however, that's the slightly downside. The location is perfect, the rooms are clean with nice amenties and our room had a view of the top half of the Eifel Tower. For pricey Paris, thought we got an ok deal with breakfast (which is very good) and a two day museum pass. It is a slight walk from the metro but then don't even consider Paris if you don't like to walk. There are at least four excellent restaurants within a two minute walk from the front door of the hotel (We heartedly recommend the La Petite Nicose) All in all, a nice stay. Do have to add with a bit of a chuckle because it always seems to be the case, the rooms are not exaclt as they appear on the website.",
            "title": "Good Value",
            "user": "mavicat"
        },
        {
            "date": "May 29, 2007",
            "detail_rating": {
                "business": 3.0,
                "cleanliness": 5.0,
                "desk": null,
                "front_desk": 5.0,
                "location": 5.0,
                "pool": null,
                "restaurant": null,
                "rooms": 5.0,
                "service": 5.0,
                "sleep": null,
                "value": 5.0
            },
            "helpfulness": 2,
            "id": 7713941,
            "likes": {
                "disliked": "\u2014 Nothing",
                "liked": "\u2014 The hotel room"
            },
            "rating": 5.0,
            "stay_parameters": "Stayed May 2007, traveled as a couple",
            "text": "The hotel was brilliant, lovely room, staff were really helpful. They",
            "title": "Excellent hotel",
            "user": "eijoiner"
        },
        {
            "date": "May 16, 2007",
            "detail_rating": {
                "business": null,
                "cleanliness": 5.0,
                "desk": null,
                "front_desk": 5.0,
                "location": 5.0,
                "pool": null,
                "restaurant": null,
                "rooms": 5.0,
                "service": 5.0,
                "sleep": null,
                "value": 5.0
            },
            "helpfulness": null,
            "id": 7630745,
            "likes": {
                "disliked": null,
                "liked": "\u2014 location, helpful staff, well maintained hotel"
            },
            "rating": 5.0,
            "stay_parameters": "Stayed May 2007, traveled solo",
            "text": "made my boyfriends birthday a great weekend. Our room was over looking the eiffel tower. Breakfast was great. Strongly recommend this hotel.",
            "title": "excellent location, nice staff, clean hotel",
            "user": "ojasrege"
        },
        {
            "date": "October 7, 2008",
            "detail_rating": {
                "business": null,
                "cleanliness": 4.0,
                "desk": null,
                "front_desk": 5.0,
                "location": 5.0,
                "pool": null,
                "restaurant": null,
                "rooms": 4.0,
                "service": 4.0,
                "sleep": null,
                "value": 4.0
            },
            "helpfulness": null,
            "id": 20695791,
            "likes": {
                "disliked": "\u2014 Bed was smaller than mine (a King) at home.",
                "liked": "\u2014 Very modern decor and great location."
            },
            "rating": 5.0,
            "stay_parameters": "Stayed August 2008, traveled as a couple",
            "text": "My wife found the hotel online and based on other reviews decided to give it a chance. We could not have been more happy with our choice. The staff were friendly, very helpful and suggested several local places to dine, which all proved to be levels above the more touristy options. The room was a bit smaller than American standards, but fittingly sized considering the location. Everything was very modern, clean, and well up kept. We would and have recommended the Hotel du Cadran Tour Eiffel to people visiting Paris.",
            "title": "Great Room - Great Location",
            "user": "VegasandBust"
        },
        {
            "date": "October 7, 2008",
            "detail_rating": {
                "business": 5.0,
                "cleanliness": 5.0,
                "desk": null,
                "front_desk": 5.0,
                "location": 5.0,
                "pool": null,
                "restaurant": null,
                "rooms": 5.0,
                "service": 5.0,
                "sleep": null,
                "value": 4.0
            },
            "helpfulness": 1,
            "id": 20693698,
            "likes": {
                "disliked": null,
                "liked": null
            },
            "rating": 5.0,
            "stay_parameters": "Stayed September 2008, traveled as a couple",
            "text": "Nothing more we can ask for. The hotel is conveniently located with nice Cafe's nearby and just a block away from the Metro station. I never had to take a cab to visit the places in Paris. The staff were friendly and the rooms were very clean. not to mention the lights in the room were very well designed.",
            "title": "Nice Hotel, Conveniently located.",
            "user": "SKarri"
        },
        {
            "date": "October 7, 2008",
            "detail_rating": {
                "business": 4.0,
                "cleanliness": 5.0,
                "desk": null,
                "front_desk": 5.0,
                "location": 5.0,
                "pool": null,
                "restaurant": null,
                "rooms": 4.0,
                "service": 5.0,
                "sleep": null,
                "value": 5.0
            },
            "helpfulness": null,
            "id": 20690599,
            "likes": {
                "disliked": null,
                "liked": null
            },
            "rating": 5.0,
            "stay_parameters": "Stayed September 2008, traveled on business",
            "text": "The hotel is in an excellent, safe location just a few minutes walk from the Eiffel tower. There are restaurants right outside the hotel along with grocery stores,a post office, a few places to shop and about a block away from a metro station.",
            "title": "Love the Hotel du Cadran",
            "user": "USLouie"
        },
        {
            "date": "October 7, 2008",
            "detail_rating": {
                "business": null,
                "cleanliness": 5.0,
                "desk": null,
                "front_desk": 5.0,
                "location": 5.0,
                "pool": null,
                "restaurant": null,
                "rooms": 4.0,
                "service": 5.0,
                "sleep": null,
                "value": 5.0
            },
            "helpfulness": null,
            "id": 20687821,
            "likes": {
                "disliked": null,
                "liked": null
            },
            "rating": 5.0,
            "stay_parameters": "Stayed September 2008, traveled as a couple",
            "text": "We highly reccommend Cafe Central right outside the hotel for dinner, we had a some spectacular dinners here. Our waiter got to know us and would just bring out our usual drinks. The risotto with asparagus and chicken is great, the pan seared tuna and my husband had a duck entree that was out of this world!",
            "title": "Great Hotel in Paris",
            "user": "adventuregrrrl"
        },
        {
            "date": "October 7, 2008",
            "detail_rating": {
                "business": null,
                "cleanliness": 5.0,
                "desk": null,
                "front_desk": 5.0,
                "location": 4.0,
                "pool": null,
                "restaurant": null,
                "rooms": 5.0,
                "service": 5.0,
                "sleep": null,
                "value": null
            },
            "helpfulness": null,
            "id": 20686902,
            "likes": {
                "disliked": "\u2014 LIGHTING-TOO COMPLICATED",
                "liked": "\u2014 STAFF AND CLEANLINESS/COMFORT"
            },
            "rating": 5.0,
            "stay_parameters": "Stayed August 2008, traveled as a couple",
            "text": "The room we had, 505, was small but expected, newly decorated and clean. We could see the Eiffel at night from our room. They have hairdryers in each room and an iron you can borrow from the front desk. The hairdryer in the bathroom has an outlet fit for U.S wattage that we used to plug our cell phones into but you will need a converter for anything else. We only had two issues, the closet in this room was more like a cabinet without a bottom in it. The cabinet took up most of the wall space on one side of the bed and if you weren't careful could hurt yourself (which we did a couple of times). The other issue was the shower, there isn't a shower curtain so by the time your done water was everywhere and there isn't a shelf to put soap, shampoo, etc. All in all minor things we could live with and we would definately stay here again. I went in a friends room, 404, and it was a corner room with two windows, also with a view of the Eiffel. This room was much larger, has a bathtub with a shower and full sized closet. If we go back I'd probably opt for this type of room if available.",
            "title": "Second year of satisfaction",
            "user": "scrameric"
        },
        {
            "date": "October 30, 2008",
            "detail_rating": {
                "business": null,
                "cleanliness": null,
                "desk": null,
                "location": null,
                "pool": null,
                "restaurant": null,
                "rooms": null,
                "service": null,
                "sleep": null,
                "value": null
            },
            "helpfulness": null,
            "id": 21397586,
            "likes": {
                "disliked": null,
                "liked": null
            },
            "rating": 5.0,
            "stay_parameters": null,
            "text": "My girlfriend and me stayed at the hotel Cadran over the wekend.",
            "title": "Perfect hotel at a perfect location",
            "user": "Dieterj"
        },
        {
            "date": "October 28, 2008",
            "detail_rating": {
                "business": null,
                "cleanliness": 4.0,
                "desk": null,
                "front_desk": 3.0,
                "location": 4.0,
                "pool": null,
                "restaurant": null,
                "rooms": 3.0,
                "service": null,
                "sleep": null,
                "value": 4.0
            },
            "helpfulness": null,
            "id": 21333106,
            "likes": {
                "disliked": "\u2014 The night porter- not very friendly",
                "liked": "\u2014 Great location"
            },
            "rating": 5.0,
            "stay_parameters": "Stayed October 2008, traveled as a couple",
            "text": "The room we had was perfect. It was newly renovated, clean and had a modern design.",
            "title": "Good location, Nice Hotel",
            "user": "Liv_IRL"
        },
        {
            "date": "October 27, 2008",
            "detail_rating": {
                "business": null,
                "cleanliness": 5.0,
                "desk": null,
                "front_desk": 5.0,
                "location": 5.0,
                "pool": null,
                "restaurant": null,
                "rooms": 3.0,
                "service": 5.0,
                "sleep": null,
                "value": 4.0
            },
            "helpfulness": null,
            "id": 21313946,
            "likes": {
                "disliked": "\u2014 Lobby area",
                "liked": "\u2014 Location!"
            },
            "rating": 4.0,
            "stay_parameters": "Stayed October 2008, traveled as a couple",
            "text": "Also the location of the hotel is perfect. It is only a short walk away from the Eiffel tower. The metro station and lots of good restaurants are just around the corner. Even though the room was very quiet.",
            "title": "Great stay at the Hotel du Cadran",
            "user": "kg99"
        },
        {
            "date": "October 23, 2008",
            "detail_rating": {
                "business": null,
                "cleanliness": 5.0,
                "desk": null,
                "front_desk": 5.0,
                "location": 5.0,
                "pool": null,
                "restaurant": null,
                "rooms": 4.0,
                "service": 5.0,
                "sleep": null,
                "value": 5.0
            },
            "helpfulness": null,
            "id": 21136748,
            "likes": {
                "disliked": null,
                "liked": "\u2014 LOCATION"
            },
            "rating": 5.0,
            "stay_parameters": "Stayed October 2008, traveled on business",
            "text": "I highly recommend this hotel and I will definetly stay here again at my next Paris visit.",
            "title": "loved it",
            "user": "skylane9"
        },
        {
            "date": "October 17, 2008",
            "detail_rating": {
                "business": null,
                "cleanliness": null,
                "desk": null,
                "location": null,
                "pool": null,
                "restaurant": null,
                "rooms": null,
                "service": null,
                "sleep": null,
                "value": null
            },
            "helpfulness": null,
            "id": 20957577,
            "likes": {
                "disliked": null,
                "liked": null
            },
            "rating": 5.0,
            "stay_parameters": null,
            "text": "My Husband & I are just back from a 4 day visit to Paris. We stayed in this lovely, modern hotel. The staff at reception were very friendly & helpful. Our room was small, very clean & very modern. We had a view of the top of the Eiffle Tower. Each night our bed was turned down for us.",
            "title": "Recommend the Cadran",
            "user": "cathyAlberta"
        },
        {
            "date": "October 16, 2008",
            "detail_rating": {
                "business": 3.0,
                "cleanliness": 5.0,
                "desk": null,
                "front_desk": 5.0,
                "location": 5.0,
                "pool": null,
                "restaurant": null,
                "rooms": 5.0,
                "service": 5.0,
                "sleep": null,
                "value": 5.0
            },
            "helpfulness": null,
            "id": 20944235,
            "likes": {
                "disliked": "\u2014 Nothing...it was fantastic!",
                "liked": "\u2014 Staff made us feel really welcome!"
            },
            "rating": 5.0,
            "stay_parameters": "Stayed October 2008",
            "text": "My mom and I stayed at the Hotel du Cadran for four days in October. We had such a lovely time! The staff really made the stay so enjoyable and made us feel very welcome. From the time of check-in we were impressed. We arrived very early on the first day and had asked the hotel if we could leave our bags there. Instead they invited us to have breakfast, and then went out of their way to see if there was an open room that we could check into early. During breakfast there was a very nice young man that spoke perfect English. He was so friendly and talked with us about what sights we should see and gave us some inside tips of what to do while we were in Paris.",
            "title": "Loved Hotel du Cadran!",
            "user": "nicholeshirene"
        },
        {
            "date": "October 10, 2008",
            "detail_rating": {
                "business": null,
                "cleanliness": 5.0,
                "desk": null,
                "front_desk": 5.0,
                "location": 5.0,
                "pool": null,
                "restaurant": null,
                "rooms": 5.0,
                "service": 5.0,
                "sleep": null,
                "value": 5.0
            },
            "helpfulness": null,
            "id": 20790543,
            "likes": {
                "disliked": "\u2014 Average Breakfast at 13 euros",
                "liked": "\u2014 Modern Newly Remodeled Facilities"
            },
            "rating": 5.0,
            "stay_parameters": "Stayed September 2008, traveled as a couple",
            "text": "The room was very modern and chic, yet the hotel overall felt more like a quaint and inviting bed and breakfast. I highly recommend Hotel du Cadran. The staff, service, and location are fabulous! I can't wait to go back!",
            "title": "Great Choice Comfortable and Convenient",
            "user": "erfield5"
        },
        {
            "date": "October 8, 2008",
            "detail_rating": {
                "business": null,
                "cleanliness": null,
                "desk": null,
                "location": null,
                "pool": null,
                "restaurant": null,
                "rooms": null,
                "service": null,
                "sleep": null,
                "value": null
            },
            "helpfulness": null,
            "id": 20734081,
            "likes": {
                "disliked": null,
                "liked": null
            },
            "rating": 5.0,
            "stay_parameters": null,
            "text": "Newly remodeled, very comfortable beds and all the modern conveniences.",
            "title": "Live it, Love it.",
            "user": "Chez-OZ"
        },
        {
            "date": "October 8, 2008",
            "detail_rating": {
                "business": 5.0,
                "cleanliness": 5.0,
                "desk": null,
                "front_desk": 3.0,
                "location": 5.0,
                "pool": null,
                "restaurant": null,
                "rooms": 4.0,
                "service": 3.0,
                "sleep": null,
                "value": 5.0
            },
            "helpfulness": null,
            "id": 20726380,
            "likes": {
                "disliked": "\u2014 room was noisy",
                "liked": "\u2014 location"
            },
            "rating": 4.0,
            "stay_parameters": "Stayed October 2008, traveled as a couple",
            "text": "Wonderful location convenient to the charming small French- frequented restaurants.",
            "title": "Great boutique hotel in a perfect location",
            "user": "JWnEH"
        },
        {
            "date": "October 7, 2008",
            "detail_rating": {
                "business": null,
                "cleanliness": null,
                "desk": null,
                "location": null,
                "pool": null,
                "restaurant": null,
                "rooms": null,
                "service": null,
                "sleep": null,
                "value": null
            },
            "helpfulness": null,
            "id": 20708450,
            "likes": {
                "disliked": null,
                "liked": null
            },
            "rating": 5.0,
            "stay_parameters": null,
            "text": "Has it all and very reasonable rates. Enjoy.",
            "title": "Loved the Hotel du Cadran",
            "user": "Traveler08Utah"
        },
        {
            "date": "January 3, 2009",
            "detail_rating": {
                "business": null,
                "cleanliness": 4.0,
                "desk": null,
                "front_desk": 4.0,
                "location": 5.0,
                "pool": null,
                "restaurant": null,
                "rooms": 4.0,
                "service": 4.0,
                "sleep": null,
                "value": 4.0
            },
            "helpfulness": null,
            "id": 23228616,
            "likes": {
                "disliked": "\u2014 Renovations",
                "liked": "\u2014 Location"
            },
            "rating": 4.0,
            "stay_parameters": "Stayed December 2008, traveled as a couple",
            "text": "I stayed here with a friend just before Xmas 2008. We weren't at all disappointed, and in fact it was way above expectations. Location was absoloutely perfect and I would recommend it on that alone, if nothing else.",
            "title": "Great hotel, the best location by far",
            "user": "CHAND13R"
        },
        {
            "date": "January 2, 2009",
            "detail_rating": {
                "business": 4.0,
                "cleanliness": 5.0,
                "desk": null,
                "front_desk": 4.0,
                "location": 5.0,
                "pool": null,
                "restaurant": null,
                "rooms": 3.0,
                "service": 5.0,
                "sleep": null,
                "value": 4.0
            },
            "helpfulness": null,
            "id": 23174737,
            "likes": {
                "disliked": "\u2014 Small Room",
                "liked": "\u2014 Location"
            },
            "rating": 5.0,
            "stay_parameters": "Stayed December 2008, traveled as a couple",
            "text": "The room itself was immaculate, modern, reasonable size and had a view on to a beautiful, lively street. The service was very friendly. The only downside was that there were renovations taking place which meant there was no bar temporarily, but this didn't disturb our visit whatsoever.",
            "title": "Brilliant Hotel",
            "user": "IrelandOwl"
        },
        {
            "date": "December 29, 2008",
            "detail_rating": {
                "business": null,
                "cleanliness": 5.0,
                "desk": null,
                "front_desk": 5.0,
                "location": 5.0,
                "pool": null,
                "restaurant": null,
                "rooms": 4.0,
                "service": 5.0,
                "sleep": null,
                "value": 4.0
            },
            "helpfulness": null,
            "id": 23079287,
            "likes": {
                "disliked": "\u2014 noise level during early morning.",
                "liked": "\u2014 Location"
            },
            "rating": 4.0,
            "stay_parameters": "Stayed December 2008, traveled with family",
            "text": "The location was the best thing about the hotel. It's in Tour Eiffel, 5-10mins walk from the Eiffel Tower and easily walkable to the Champs Elysses, St Germain, and we walked to the other popular areas of Paris including the Latin Quarter and even Montmatre straight from the hotel (but we're not lazy, and don't mind the cold!). There's a metro station right by the hotel if you can't be bothered with that!",
            "title": "Great little hotel!",
            "user": "texasfm"
        },
        {
            "date": "December 27, 2008",
            "detail_rating": {
                "business": null,
                "cleanliness": null,
                "desk": null,
                "location": null,
                "pool": null,
                "restaurant": null,
                "rooms": null,
                "service": null,
                "sleep": null,
                "value": null
            },
            "helpfulness": 1,
            "id": 23035073,
            "likes": {
                "disliked": null,
                "liked": null
            },
            "rating": 5.0,
            "stay_parameters": null,
            "text": "Aside of the convenience of the location - the streets around the hotel are the best we came across in Paris. They were lively with Parisians doing their clothes shopping from nearby boutiques, buying their groceries, drinking expresso's in cafe's, drinking wine and eating dinner under heat lamps on the cobbled streets. We felt like we got a real picture of Parisian life - which is what we wanted, only a stones throw from the Eiffel Tower. The fact that it was Christmas made it even better. The streets were lit up beautifully and christmas tree sellers and german market-style stalls lined the streets.",
            "title": "Christmas at Cadran",
            "user": "DocNZ"
        },
        {
            "date": "December 8, 2008",
            "detail_rating": {
                "business": null,
                "cleanliness": null,
                "desk": null,
                "location": null,
                "pool": null,
                "restaurant": null,
                "rooms": null,
                "service": null,
                "sleep": null,
                "value": null
            },
            "helpfulness": null,
            "id": 22550799,
            "likes": {
                "disliked": null,
                "liked": null
            },
            "rating": 3.0,
            "stay_parameters": null,
            "text": "Although we walked all over Paris in the day - at night we didn't bother to go further than the surrounding streets, simply because we didn't need to. There are plenty of bars and restaurants nearby.",
            "title": "nice place",
            "user": "chirita47"
        },
        {
            "date": "March 11, 2007",
            "detail_rating": {
                "business": null,
                "cleanliness": 5.0,
                "desk": null,
                "front_desk": 5.0,
                "location": 5.0,
                "pool": null,
                "restaurant": null,
                "rooms": 3.0,
                "service": 5.0,
                "sleep": null,
                "value": 5.0
            },
            "helpfulness": 5,
            "id": 7011232,
            "likes": {
                "disliked": "\u2014 Nothing!",
                "liked": "\u2014 Close to transportation and Rue de Cler"
            },
            "rating": 4.0,
            "stay_parameters": "Stayed March 2007, traveled with friends",
            "text": "Hotel du Cadran is a great place for a long weekend holiday with husband or girlfriend. We especially liked being so close to the Metro, the wonderful markets on Rue de Cler (great olive oi store!) and the restaurants and bistros close by when we didn't want to venture out any further. Hotel is very easy to get to by Metro from Gard du Nord. The hotel has a very friendly staff who are eager to help you, breakfast fills you up, and it's a great place for women to stay who are traveling alone. I went with a girlfriend this time but my husband will come with me the next time so it's nice for couples, too. If you're not looking for a fancy place but clean (and a great shower!), close to restaurants and transportation, this is the place. I highly recommend!",
            "title": "Great hotel for a short weekend!",
            "user": "Mauigal2010"
        },
        {
            "date": "March 6, 2007",
            "detail_rating": {
                "business": null,
                "cleanliness": null,
                "desk": null,
                "location": null,
                "pool": null,
                "restaurant": null,
                "rooms": null,
                "service": null,
                "sleep": null,
                "value": null
            },
            "helpfulness": 4,
            "id": 6925240,
            "likes": {
                "disliked": null,
                "liked": null
            },
            "rating": 3.0,
            "stay_parameters": null,
            "text": "Nice hotel in a great location. The rooms were not large but clean and comfortable, we were out most of the time anyway. I noticed at reception that the rooms were due for renovation, the bedrooms were a little tired and out of date. The bathroom was very clean and there was lots of hot water and a great shower. We had asked for a room with a view and were a little disappointed not to get this. We were given Room 407 (superior, king size) which was at the back of the hotel with no view but it was very quiet- which was good. There was lots of choice at breakfast tea, coffee, fruit juice, various cereals, youghurt, fruit, jam,cheese and ham. There was also plenty of toast, french bread and of course fresh croissants. Our breakfast was included in the price of our stay. There are a few supermarkets nearby and lots of cafes and restaurants, though we mainly ate at night in the Latin Quarter which had lots of choice, nice food and cheaper menus than elsewhere. The only down side of our visit to Paris was the number of homeless people living rough, especially on the banks of the Seine. There seemed to be people begging at all the tourist spots and we were constantly warned about pick-pockets. Watch out for the \"oh, I have just found this gold ring, could you give me money for it if I give it to you\". You have been warned, please be very careful!",
            "title": "Hotel du Cadran, Paris",
            "user": "G-Carlin"
        },
        {
            "date": "February 17, 2007",
            "detail_rating": {
                "business": null,
                "cleanliness": 5.0,
                "desk": null,
                "front_desk": 5.0,
                "location": 5.0,
                "pool": null,
                "restaurant": null,
                "rooms": 5.0,
                "service": 5.0,
                "sleep": null,
                "value": 4.0
            },
            "helpfulness": 7,
            "id": 6804623,
            "likes": {
                "disliked": null,
                "liked": "\u2014 location"
            },
            "rating": 5.0,
            "stay_parameters": "Stayed January 2007, traveled as a couple",
            "text": "Fantastic weekend in Paris spent here. The hotel was very easy to locate from the map on website, within five minutes walk of the metro. The staff were all very friendly and welcoming and happy to assist.",
            "title": "Great location, few steps to the Eiffel Tower",
            "user": "stretch8674"
        },
        {
            "date": "February 5, 2007",
            "detail_rating": {
                "business": null,
                "cleanliness": null,
                "desk": null,
                "location": null,
                "pool": null,
                "restaurant": null,
                "rooms": null,
                "service": null,
                "sleep": null,
                "value": null
            },
            "helpfulness": 6,
            "id": 6748949,
            "likes": {
                "disliked": null,
                "liked": null
            },
            "rating": 4.0,
            "stay_parameters": null,
            "text": "The room was excellent, clean and well maintained, with a comfy bed. Breakfast room is very unique too.",
            "title": "No frills, just friendly service and clean room.",
            "user": "DCJh2007"
        },
        {
            "date": "February 3, 2007",
            "detail_rating": {
                "business": 5.0,
                "cleanliness": 5.0,
                "desk": null,
                "front_desk": 5.0,
                "location": 5.0,
                "pool": null,
                "restaurant": null,
                "rooms": 5.0,
                "service": 5.0,
                "sleep": null,
                "value": 5.0
            },
            "helpfulness": 2,
            "id": 6737276,
            "likes": {
                "disliked": null,
                "liked": null
            },
            "rating": 5.0,
            "stay_parameters": "Stayed February 2007, traveled on business",
            "text": "We chose this hotel for it's location and ease for visiting other Paris attractions and it didn't disappoint. Would recommend.",
            "title": "Great hotel",
            "user": "farEssen"
        },
        {
            "date": "March 8, 2009",
            "detail_rating": {
                "business": null,
                "cleanliness": 5.0,
                "desk": null,
                "location": 5.0,
                "pool": null,
                "restaurant": null,
                "rooms": 5.0,
                "service": 5.0,
                "sleep": null,
                "value": 5.0
            },
            "helpfulness": null,
            "id": 25839954,
            "likes": {
                "disliked": null,
                "liked": null
            },
            "rating": 5.0,
            "stay_parameters": "Stayed February 2009, traveled as a couple",
            "text": "My wife and I stayed for two nights recently and throughly enjoyed our selves, the hotel was very nice and I thought the rooms were very nice as well as the breakfast.",
            "title": "Great Hotel Great Location",
            "user": "RobertAustralia"
        },
        {
            "date": "February 13, 2009",
            "detail_rating": {
                "business": 4.0,
                "cleanliness": 5.0,
                "desk": null,
                "front_desk": 4.0,
                "location": 3.0,
                "pool": null,
                "restaurant": null,
                "rooms": 4.0,
                "service": 4.0,
                "sleep": null,
                "value": 5.0
            },
            "helpfulness": null,
            "id": 24524923,
            "likes": {
                "disliked": "\u2014 The heating",
                "liked": "\u2014 Cleanliness"
            },
            "rating": 4.0,
            "stay_parameters": "Stayed February 2009, traveled as a couple",
            "text": "There is even a small laudromat down the end of the side street the hotel stands on for convieniece.",
            "title": "Nice hotel, if a little warm!",
            "user": "DJ_Billy"
        },
        {
            "date": "February 10, 2009",
            "detail_rating": {
                "business": null,
                "cleanliness": 5.0,
                "desk": null,
                "location": 5.0,
                "pool": null,
                "restaurant": null,
                "rooms": 5.0,
                "service": 4.0,
                "sleep": null,
                "value": 5.0
            },
            "helpfulness": null,
            "id": 24439701,
            "likes": {
                "disliked": null,
                "liked": null
            },
            "rating": 5.0,
            "stay_parameters": "Stayed February 2009, traveled as a couple",
            "text": "I would reccomend this hotel for easy walking to the many things to see locally as well as close to the subway.",
            "title": "Very modern, great location",
            "user": "suealex9700"
        },
        {
            "date": "February 6, 2009",
            "detail_rating": {
                "business": null,
                "cleanliness": 4.0,
                "desk": null,
                "front_desk": 3.0,
                "location": 5.0,
                "pool": null,
                "restaurant": null,
                "rooms": 4.0,
                "service": 3.0,
                "sleep": null,
                "value": 4.0
            },
            "helpfulness": null,
            "id": 24322782,
            "likes": {
                "disliked": "\u2014 Noise from the street",
                "liked": "\u2014 Location"
            },
            "rating": 4.0,
            "stay_parameters": "Stayed January 2009, traveled with friends",
            "text": "The hotel is just off a bustling side street, between two main boulevards near the Eiffel Tower. The area is a little quieter than many other parts of central Paris so it\u2019s a bit more relaxed. This is quite an upmarket area and so the restaurants and cafes are somewhat more expensive than in, say, the Latin Quarter. However the cheaper areas can be easily accessed on the Metro from the nearby Ecole Militaire station, as can all of the main tourist attractions. This may not be the ideal place to stay however if you plan to return to your hotel before going out to eat in the evening.",
            "title": "Modern room and in a very convenient location",
            "user": "CY392YF"
        },
        {
            "date": "February 6, 2009",
            "detail_rating": {
                "business": 3.0,
                "cleanliness": 4.0,
                "desk": null,
                "front_desk": 4.0,
                "location": 5.0,
                "pool": null,
                "restaurant": null,
                "rooms": 5.0,
                "service": 4.0,
                "sleep": null,
                "value": 4.0
            },
            "helpfulness": null,
            "id": 24318124,
            "likes": {
                "disliked": "\u2014 Bedsheet don`t get change everyday",
                "liked": "\u2014 Location"
            },
            "rating": 4.0,
            "stay_parameters": "Stayed January 2009, traveled as a couple",
            "text": "The hotel is in the process of being renovated. The rooms are all completed and when we were there the lobby was being fitted out. This didn\u2019t cause too much inconvenience however and it looked like it was nearly done. The rooms were fairly small but nicely finished, with a minibar and large LCD TV. No tea/coffee making facilities or bath though. The one problem with the room was the heat. This was the middle of winter and yet the room was stuffily hot. The air-con didn\u2019t really do anything and opening the window let in a lot of noise. Other than that the hotel was fine. We didn\u2019t try the breakfast. It seemed expensive at 12 Euro and the local cafes bakeries and supermarkets were a much more reasonable prospect.",
            "title": "Very nice small and lovely just renovated hotel.",
            "user": "The_travel_kid"
        },
        {
            "date": "December 4, 2008",
            "detail_rating": {
                "business": 5.0,
                "cleanliness": 4.0,
                "desk": null,
                "front_desk": 4.0,
                "location": 5.0,
                "pool": null,
                "restaurant": null,
                "rooms": 4.0,
                "service": 4.0,
                "sleep": null,
                "value": 4.0
            },
            "helpfulness": null,
            "id": 22432500,
            "likes": {
                "disliked": "\u2014 Small rooms",
                "liked": "\u2014 Quirky Rooms"
            },
            "rating": 4.0,
            "stay_parameters": "Stayed November 2008, traveled as a couple",
            "text": "Great little hotel. Rooms are comfortable and have a great look. The location is amazing, 5 minute walk from the eiffel tower and behind the hotel is a street which has some great shops.",
            "title": "Great little hotel",
            "user": "DogWeasel"
        },
        {
            "date": "December 1, 2008",
            "detail_rating": {
                "business": 4.0,
                "cleanliness": 5.0,
                "desk": null,
                "front_desk": 4.0,
                "location": 5.0,
                "pool": null,
                "restaurant": null,
                "rooms": 4.0,
                "service": 5.0,
                "sleep": null,
                "value": 5.0
            },
            "helpfulness": null,
            "id": 22360755,
            "likes": {
                "disliked": null,
                "liked": null
            },
            "rating": 4.0,
            "stay_parameters": "Stayed October 2008, traveled as a couple",
            "text": "Hi, just wanted to tell you that we had a wonderful 5 nights at the du Cadran in Paris. The hotel looks like it has been recently totally refurbished and everything was new and funky. The actual room itself is small but adequate. Probably the only criticism is that there is insufficient shelf space - only a ledge. But the cupboard is good and the bathroom is fantastic. Flat screen TV and mini bar. We didn't take up the breakfast option - it looked pricey at e13 pp given that the hotel is 20m from Rue Clare where there are wonderful restaurants, bars, bakery etc. You can live like a local and it made Paris very reasonable for us. Bus and Metro access was simple and all in all du Cadran was excellent value especially by Paris standards. Highly recommended.",
            "title": "Loved du Cadran",
            "user": "fussyaussie"
        },
        {
            "date": "November 26, 2008",
            "detail_rating": {
                "business": 5.0,
                "cleanliness": 5.0,
                "desk": null,
                "front_desk": 5.0,
                "location": 5.0,
                "pool": null,
                "restaurant": null,
                "rooms": 5.0,
                "service": 5.0,
                "sleep": null,
                "value": 5.0
            },
            "helpfulness": null,
            "id": 22210026,
            "likes": {
                "disliked": null,
                "liked": "\u2014 The friendly service and the great location"
            },
            "rating": 5.0,
            "stay_parameters": "Stayed November 2008, traveled as a couple",
            "text": "We decided to spend a romantic weekend in Paris and to celebrate my girlfriends 30th birthday. The hotel met every one of my expectations and I didn't mind the superior room size at all. The bed was perfect and provided a very peaceful nights sleep.",
            "title": "Perfect stay in Paris",
            "user": "greywolf20k"
        },
        {
            "date": "November 23, 2008",
            "detail_rating": {
                "business": 2.0,
                "cleanliness": 5.0,
                "desk": null,
                "front_desk": 4.0,
                "location": 5.0,
                "pool": null,
                "restaurant": null,
                "rooms": 3.0,
                "service": 4.0,
                "sleep": null,
                "value": 4.0
            },
            "helpfulness": null,
            "id": 22115693,
            "likes": {
                "disliked": "\u2014 Bed too firm",
                "liked": "\u2014 Great location"
            },
            "rating": 4.0,
            "stay_parameters": "Stayed November 2008, traveled as a couple",
            "text": "The hotel staffs were extremely friendly and provided excellent recommendations for eating and we were not disappointed at all. It was very cold outside and the temperature of the rooms was at an acceptable level though the temperature in the room was not able to be changed (I think the thermostat was stuck on a pre defined setting), though it didn't matter as the setting was perfect for sleeping.",
            "title": "Excellent location, but...",
            "user": "HauntedMansion"
        },
        {
            "date": "November 19, 2008",
            "detail_rating": {
                "business": 3.0,
                "cleanliness": 5.0,
                "desk": null,
                "front_desk": 4.0,
                "location": 5.0,
                "pool": null,
                "restaurant": null,
                "rooms": 5.0,
                "service": 4.0,
                "sleep": null,
                "value": 4.0
            },
            "helpfulness": 1,
            "id": 22010851,
            "likes": {
                "disliked": "\u2014 Breakfast isn't included if you get a special rate",
                "liked": "\u2014 Location"
            },
            "rating": 5.0,
            "stay_parameters": "Stayed November 2008, traveled as a couple",
            "text": "I would definitely stay here again as the location and the fresh food markets around the corner made this hotel one of my favourite places to stay in Paris.",
            "title": "Location Location Location",
            "user": "JToce"
        },
        {
            "date": "May 9, 2007",
            "detail_rating": {
                "business": null,
                "cleanliness": null,
                "desk": null,
                "location": null,
                "pool": null,
                "restaurant": null,
                "rooms": null,
                "service": null,
                "sleep": null,
                "value": null
            },
            "helpfulness": 3,
            "id": 7568564,
            "likes": {
                "disliked": null,
                "liked": null
            },
            "rating": 4.0,
            "stay_parameters": null,
            "text": "My girlfriend and I stayed at the Cadran for a week in early March 2007. I have to say I was very impressed. The location was excellent. The hotel is situated within a two minute walk to L\u2019 Ecole Militaire metro station. You could walk to the Champ de Mars and get a great view of the Eiffel Tower within ten minutes. We would often walk to see it lit up at night. It was so good having this icon so close. In fact all the great sights were within about a 30 minute walk of the hotel. However my favourite and lasting memory was the Cadran\u2019s proximity to Rue Cler. The fresh food markets on Rue Cler were so fantastic. We sampled everything from crepes, to cheeses, wine and bread. I felt we had the ultimate Parisian experience right at our doorstep. There were also a number of nice bars and restaurants around the area. The staff at the Cadran were friendly (with one exception) and knowledgeable. The rooms were not enormous but I thought were good quality for the price. Unfortunately our bath plug was faulty so we couldn\u2019t have baths but that is a minor complaint. Another minor problem was the air-conditioning. The room was quite hot at night and the air-conditioning didn\u2019t seem to work. The stay was also somewhat marred by the arrogance of one staff member, a grumpy old man, who was on reception the night before we left. We had paid to use the internet for half an hour, however 5 minutes into our session the hotel computer crashed. When I went and told the grumpy old man what had happened his response was: \u201cSo what do you want me to do about it\u201d? I had never experienced such rudeness our entire stay and found his attitude very frustrating. We explained that we needed him to re-enter the password into the computer. However he was still too lazy to do his job, so he gave me the password, \u201cCADRAN\u201d. So if you do stay here give that password a try for some free internet time. Also on our final day, our stay was further marred by the airport pick up service that the hotel had arranged. Our car failed to turn up. This probably was not the fault of the hotel, but I remain slightly sceptical. But enough of the negatives. In all it was a very positive experience staying here. I loved it and would definitely stay again despite the minor problems.",
            "title": "Very Enjoyable!!!",
            "user": "Wakka"
        },
        {
            "date": "May 3, 2007",
            "detail_rating": {
                "business": null,
                "cleanliness": 4.0,
                "desk": null,
                "front_desk": 4.0,
                "location": 4.0,
                "pool": null,
                "restaurant": null,
                "rooms": 3.0,
                "service": 3.0,
                "sleep": null,
                "value": 4.0
            },
            "helpfulness": null,
            "id": 7543287,
            "likes": {
                "disliked": null,
                "liked": null
            },
            "rating": 4.0,
            "stay_parameters": "Stayed April 2007, traveled as a couple",
            "text": "We stayed here for 4 nights from 26th April 2007 and can only add to the glowing reviews with regards to the quality and location of the hotel but with the following proviso, of note particularly for visitors thinking of staying here before May next year. The amenities state that the hotel has air conditioning but does NOTsay that it is only on during the summer months - May to September! During our stay the room temperature never dropped below 28C but staff were adamant that it could not be turned on before the usual date as it was controlled via an external source. As there was a heatwave on we found the nights particularly uncomfortable and may not have stayed here had we known about the restrictions. Otherwise we would really recommend this place and would stay here again (between May and September!).",
            "title": "Great hotel but a word of warning...",
            "user": "Pat_Pending"
        },
        {
            "date": "April 27, 2007",
            "detail_rating": {
                "business": 4.0,
                "cleanliness": 4.0,
                "desk": null,
                "front_desk": 4.0,
                "location": 4.0,
                "pool": null,
                "restaurant": null,
                "rooms": 4.0,
                "service": 4.0,
                "sleep": null,
                "value": 4.0
            },
            "helpfulness": 1,
            "id": 7476978,
            "likes": {
                "disliked": null,
                "liked": "\u2014 The room was clean and compact"
            },
            "rating": 4.0,
            "stay_parameters": "Stayed April 2007, traveled with family",
            "text": "We stayed at the hotel du cadran between the 20 April- 23rd April for a long weekend. We had a lovely time in Paris visting all the famous landmarks. The hotel was above average for a 3 star hotel because everything was provided within the hotel. The hotel was within walking distance to the metro and local buses. Bus tickets and metro tickets are really cheap I would advice you to boy a carnet of 10 tickets. All famous landmarks are in close proximity to the hotel which is an advantage. It is situated within a quite area. There are plenty of places to choose to eat as well as a local market on your door step. The staff were really welcoming. The room was compact room and could have been a little bit larger. A large range of food is provided at breakfast for those staying bed and breakfast.",
            "title": "Weekend Break",
            "user": "NDRT"
        },
        {
            "date": "April 24, 2007",
            "detail_rating": {
                "business": 3.0,
                "cleanliness": 5.0,
                "desk": null,
                "front_desk": 5.0,
                "location": 5.0,
                "pool": null,
                "restaurant": null,
                "rooms": 4.0,
                "service": 5.0,
                "sleep": null,
                "value": 5.0
            },
            "helpfulness": 1,
            "id": 7429119,
            "likes": {
                "disliked": "\u2014 nothing!!",
                "liked": "\u2014 Cleanliness, attitude of staff, location"
            },
            "rating": 5.0,
            "stay_parameters": "Stayed April 2007, traveled as a couple",
            "text": "We have just returned from a mid-week stay at the Hotel Du Cadran in Paris.",
            "title": "The Best Parisien Experience!",
            "user": "JodieBath"
        },
        {
            "date": "April 21, 2007",
            "detail_rating": {
                "business": null,
                "cleanliness": 5.0,
                "desk": null,
                "front_desk": 5.0,
                "location": 5.0,
                "pool": null,
                "restaurant": null,
                "rooms": 5.0,
                "service": 5.0,
                "sleep": null,
                "value": 4.0
            },
            "helpfulness": 1,
            "id": 7406171,
            "likes": {
                "disliked": "\u2014 Compact room size",
                "liked": "\u2014 Location and Cleanliness"
            },
            "rating": 5.0,
            "stay_parameters": "Stayed April 2007, traveled as a couple",
            "text": "This hotel was absolutely fantastic. There was nothing particularly fancy about it, however the location was ABSOLUTELY SUPERB, the room was fantastically clean, the staff were so very helpful, nothing was too much trouble.",
            "title": "Great Stay",
            "user": "CornwallReviewer"
        },
        {
            "date": "April 10, 2007",
            "detail_rating": {
                "business": null,
                "cleanliness": 5.0,
                "desk": null,
                "front_desk": 5.0,
                "location": 5.0,
                "pool": null,
                "restaurant": null,
                "rooms": 3.0,
                "service": 5.0,
                "sleep": null,
                "value": 4.0
            },
            "helpfulness": 2,
            "id": 7326950,
            "likes": {
                "disliked": "\u2014 Romm size",
                "liked": "\u2014 Location"
            },
            "rating": 5.0,
            "stay_parameters": "Stayed April 2007, traveled as a couple",
            "text": "Spending Easter in Paris in itself is a wonderful experience. Adding to the Parisian delights is this delicate hotel, 10 mins walk from the Eiffel tower (which follows you wherever you go) and situated within easy reach of the metro meaning you have access to all areas!",
            "title": "Springtime In Paris",
            "user": "sarah3b"
        },
        {
            "date": "April 10, 2007",
            "detail_rating": {
                "business": null,
                "cleanliness": null,
                "desk": null,
                "location": null,
                "pool": null,
                "restaurant": null,
                "rooms": null,
                "service": null,
                "sleep": null,
                "value": null
            },
            "helpfulness": 2,
            "id": 7326912,
            "likes": {
                "disliked": null,
                "liked": null
            },
            "rating": 4.0,
            "stay_parameters": null,
            "text": "The hotel staff were fabulous, recommending places to go and are on hand 24/7.",
            "title": "no frills but good value",
            "user": "duff_gnash"
        },
        {
            "date": "April 2, 2007",
            "detail_rating": {
                "business": 3.0,
                "cleanliness": 5.0,
                "desk": null,
                "front_desk": 5.0,
                "location": 4.0,
                "pool": null,
                "restaurant": null,
                "rooms": 4.0,
                "service": 5.0,
                "sleep": null,
                "value": 5.0
            },
            "helpfulness": 2,
            "id": 7269163,
            "likes": {
                "disliked": null,
                "liked": null
            },
            "rating": 5.0,
            "stay_parameters": "Stayed March 2007, traveled with friends",
            "text": "The rooms, although small were immaculate with clean linen each day and a fully stocked, extremely reasonable mini-bar. They supply maps,",
            "title": "Excelent value",
            "user": "RFuk"
        },
        {
            "date": "April 1, 2007",
            "detail_rating": {
                "business": null,
                "cleanliness": 4.0,
                "desk": null,
                "front_desk": 5.0,
                "location": 5.0,
                "pool": null,
                "restaurant": null,
                "rooms": 2.0,
                "service": 5.0,
                "sleep": null,
                "value": 3.0
            },
            "helpfulness": null,
            "id": 7264077,
            "likes": {
                "disliked": "\u2014 beds were hard as a rock and very low to the floor.",
                "liked": "\u2014 Location"
            },
            "rating": 3.0,
            "stay_parameters": "Stayed March 2007, traveled with family",
            "text": "reading material and a corkscrew if you get stuck!",
            "title": "Just OK",
            "user": "StevenB33"
        },
        {
            "date": "March 18, 2007",
            "detail_rating": {
                "business": null,
                "cleanliness": null,
                "desk": null,
                "location": null,
                "pool": null,
                "restaurant": null,
                "rooms": null,
                "service": null,
                "sleep": null,
                "value": null
            },
            "helpfulness": 3,
            "id": 7184302,
            "likes": {
                "disliked": null,
                "liked": null
            },
            "rating": 4.0,
            "stay_parameters": null,
            "text": "There is a fabulous patisserie at the end of the street and the bar across the way serves ice cold, very welcome mojitos which at the end",
            "title": "I hope to stay here again...",
            "user": "carolm721"
        },
        {
            "date": "January 22, 2009",
            "detail_rating": {
                "business": null,
                "cleanliness": 5.0,
                "desk": null,
                "front_desk": 5.0,
                "location": 5.0,
                "pool": null,
                "restaurant": null,
                "rooms": 5.0,
                "service": 5.0,
                "sleep": null,
                "value": 5.0
            },
            "helpfulness": null,
            "id": 23790882,
            "likes": {
                "disliked": null,
                "liked": "\u2014 Location"
            },
            "rating": 5.0,
            "stay_parameters": "Stayed December 2008, traveled with family",
            "text": "My family of five stayed at the hotel from 12-24 to 12-27-08. We initially tried to book the Hotel Valadon but their family sweet was already taken and it did not have connecting rooms. They recommened this hotel to us. We booked connecting rooms which were located on the second floor. The hotel staff was brilliant and the location was excellent. My children loved walking to the \"crepes guy,\" the sushi places, and the cotton candy place on the lovely side street. They also loved being so close to the Eiffel Tower. I would stay there again.",
            "title": "Excellent Hotel",
            "user": "kukoo100"
        },
        {
            "date": "January 22, 2009",
            "detail_rating": {
                "business": 5.0,
                "cleanliness": 5.0,
                "desk": null,
                "front_desk": 5.0,
                "location": 5.0,
                "pool": null,
                "restaurant": null,
                "rooms": 4.0,
                "service": 5.0,
                "sleep": null,
                "value": 5.0
            },
            "helpfulness": null,
            "id": 23784419,
            "likes": {
                "disliked": null,
                "liked": null
            },
            "rating": 5.0,
            "stay_parameters": "Stayed January 2009, traveled as a couple",
            "text": "Hotel du Cadran was just/is being refurbished (mid-January 2009). The rooms are well-appointed and very modern, but course, small. The lobby is in the finishing stages of remodeling, but certainly did not give the feeling of being in a mess. The continental breakfast was great and the staff was very attentive. A wonderful place to stay in the Eiffel Tower area.",
            "title": "Hotel du Cadran - A Jewel",
            "user": "freqnttrvlr7"
        },
        {
            "date": "January 21, 2009",
            "detail_rating": {
                "business": null,
                "cleanliness": 5.0,
                "desk": null,
                "front_desk": 4.0,
                "location": 4.0,
                "pool": null,
                "restaurant": null,
                "rooms": 5.0,
                "service": 4.0,
                "sleep": null,
                "value": 4.0
            },
            "helpfulness": null,
            "id": 23746350,
            "likes": {
                "disliked": "\u2014 Nothing",
                "liked": "\u2014 Location"
            },
            "rating": 5.0,
            "stay_parameters": "Stayed January 2009, traveled solo",
            "text": "This is good standard hotel in an excellent location. I went to Paris to visit the Mussee d'Orsay for the 1st time and revisit the Louvre. This hotel was a covenient location for my purpose. I didn't bother with the metro and simply walked to the Mussee d'Orsay in about 25 minutes.",
            "title": "Quality Hotel in Good Location",
            "user": "MacMil"
        },
        {
            "date": "January 5, 2009",
            "detail_rating": {
                "business": null,
                "cleanliness": null,
                "desk": null,
                "location": null,
                "pool": null,
                "restaurant": null,
                "rooms": null,
                "service": null,
                "sleep": null,
                "value": null
            },
            "helpfulness": null,
            "id": 23280587,
            "likes": {
                "disliked": null,
                "liked": null
            },
            "rating": 4.0,
            "stay_parameters": null,
            "text": "The hotel itself is undergoing renovation but it was not a problem for me. The room I stayed in (206) was lovely and I have to say a lot of thought has gone into the overall design especially the use of space in the bathroom, lighting, decoration, quality of furniture and fixtures and fitting etc. The bed was very comfortable and the shower excellent.",
            "title": "OK hotel near Eiffel",
            "user": "citytraveller1976"
        },
        {
            "date": "January 5, 2009",
            "detail_rating": {
                "business": null,
                "cleanliness": 4.0,
                "desk": null,
                "front_desk": 3.0,
                "location": 4.0,
                "pool": null,
                "restaurant": null,
                "rooms": 4.0,
                "service": 3.0,
                "sleep": null,
                "value": 4.0
            },
            "helpfulness": null,
            "id": 23277003,
            "likes": {
                "disliked": null,
                "liked": "\u2014 Funky decor and location."
            },
            "rating": 4.0,
            "stay_parameters": "Stayed December 2008, traveled as a couple",
            "text": "I took the hotel's breakfast at 13Euros which seems a bit pricy until you realise that the cafes and bars in Paris are quite expensive. Another reason I ate the breakfast at the hotel was that they do good coffee (I drink 3 cups in the morning!) which is something hard to find in Paris.",
            "title": "Great locataion",
            "user": "Nirain"
        }
    ],
    "slim_ranking": 0.0546569994423,
    "stars": 3,
    "tripadvisor": {
        "VISITED": false,
        "country_name": null,
        "locality": null,
        "pic_link": null,
        "street_address": null
    },
    "user_rating": 4.5,
    "variance": {
        "average": 61,
        "excellent": 528,
        "poor": 16,
        "terrible": 8,
        "very good": 355
    }
}