{
    "aka": "Melia Lima Hotel Lima",
    "description": "The Meli\u00e1 Lima is located in the residential & financial area of San Isidro. It is the 5* Hotel closest to the International Airport \"Jorge Ch\u00e1vez\". The International Pacific Exhibition Center, the historical center of Lima and the commercial & leisure district of Miraflores are close by.",
    "detail_rating": {
        "cleanliness": null,
        "location": null,
        "rooms": null,
        "service": null,
        "sleep": null,
        "value": null
    },
    "location": {
        "city": "Lima",
        "continent": "South America",
        "country": "Peru",
        "proposed_city": "Lima",
        "province": null,
        "region": "Lima Region"
    },
    "name": "Melia Lima",
    "places": {
        "aka": [
            "Lima"
        ],
        "hotel_description": [
            "Lima",
            "San"
        ],
        "hotel_name": [
            "Lima"
        ]
    },
    "review_count": 232,
    "review_count_current": 20,
    "reviews": [
        {
            "date": "September 23, 2011",
            "detail_rating": {
                "business": null,
                "cleanliness": 3.0,
                "desk": null,
                "location": 3.0,
                "pool": null,
                "restaurant": null,
                "rooms": 2.0,
                "service": 4.0,
                "sleep": 3.0,
                "value": 3.0
            },
            "helpfulness": null,
            "id": 118469548,
            "likes": {
                "disliked": null,
                "liked": null
            },
            "rating": 3.0,
            "stay_parameters": "Stayed September 2011, traveled as a couple",
            "text": "We stayed here for one night before our Cuzco trip and two nights after. The 1st stay, we were offered and took an upgrade from our Junior Deluxe Suite to the Junior Deluxe Room (Level Floors) for $30 (which included internet in the room, cocktail hour & breakfast). Considering breakfast was $13 @ and internet was $12, it made sense for us to do it.",
            "title": "Acceptable hotel but there are probably better options out there",
            "user": "adelly"
        },
        {
            "date": "September 12, 2011",
            "detail_rating": {
                "business": null,
                "cleanliness": null,
                "desk": null,
                "location": 3.0,
                "pool": null,
                "restaurant": null,
                "rooms": 4.0,
                "service": 5.0,
                "sleep": null,
                "value": 5.0
            },
            "helpfulness": null,
            "id": 118029903,
            "likes": {
                "disliked": null,
                "liked": null
            },
            "rating": 5.0,
            "stay_parameters": "Stayed March 2011, traveled solo",
            "text": "The room was on the 12th floor and was not that big but was at least updated. Cocktail hour was actually good as they can make drinks for you for no extra cost and there are lots of available hors d'oeuvres. However, breakfast was bland and not really up to par.",
            "title": "Great hotel from service to food to accomodating staff.",
            "user": "Malone2"
        },
        {
            "date": "August 29, 2011",
            "detail_rating": {
                "business": null,
                "cleanliness": 3.0,
                "desk": null,
                "location": null,
                "pool": null,
                "restaurant": null,
                "rooms": null,
                "service": 3.0,
                "sleep": 3.0,
                "value": 3.0
            },
            "helpfulness": null,
            "id": 117401331,
            "likes": {
                "disliked": null,
                "liked": null
            },
            "rating": 3.0,
            "stay_parameters": "Stayed August 2011, traveled as a couple",
            "text": "On the 2nd stay, we decided not to spend $30/night on the upgrade as we really did not want to eat breakfast there again. The room we booked was again a Junior Deluxe Suite, but since it was not on the Level floors, it was not updated. The furniture looked like it was straight out of the early 80s; however, the room was huge! It must have been double the size of our Level floor room.",
            "title": "In the middle of nothing",
            "user": "SimRio"
        },
        {
            "date": "June 19, 2011",
            "detail_rating": {
                "business": null,
                "cleanliness": 5.0,
                "desk": null,
                "location": null,
                "pool": null,
                "restaurant": null,
                "rooms": null,
                "service": 5.0,
                "sleep": 5.0,
                "value": 5.0
            },
            "helpfulness": 1,
            "id": 114423111,
            "likes": {
                "disliked": null,
                "liked": null
            },
            "rating": 5.0,
            "stay_parameters": "Stayed March 2011, traveled as a couple",
            "text": "The hotel is located in an upper-class neighborhood so it's very safe, but there is nothing really around to walk to. We did discover that it is only a few blocks from the nice Miraflores area (near the casinos and nicer hotels), and it is an easy walk there.",
            "title": "Loved this hotel and would return",
            "user": "Travelchick1983"
        },
        {
            "date": "June 13, 2011",
            "detail_rating": {
                "business": null,
                "cleanliness": 5.0,
                "desk": null,
                "location": null,
                "pool": null,
                "restaurant": null,
                "rooms": null,
                "service": 5.0,
                "sleep": 4.0,
                "value": 3.0
            },
            "helpfulness": 1,
            "id": 113204192,
            "likes": {
                "disliked": null,
                "liked": null
            },
            "rating": 4.0,
            "stay_parameters": "Stayed April 2011, traveled on business",
            "text": "Service was good, especially the bellboy and valet. The front desk, however, didn't seem too knowledgeable about the rewards program. I wanted to make sure my stay was credited to my member # but I did not have it with me. I asked to search it by name and they said they didn't have the ability to do that but that I could call the 800# to request it. I found this quite inconvenient as I didn't want to pay for a phone call from the hotel.",
            "title": "Great location and kind staff",
            "user": "Felipe V"
        },
        {
            "date": "April 19, 2012",
            "detail_rating": {
                "business": null,
                "cleanliness": 5.0,
                "desk": null,
                "location": 4.0,
                "pool": null,
                "restaurant": null,
                "rooms": 5.0,
                "service": 4.0,
                "sleep": 5.0,
                "value": 4.0
            },
            "helpfulness": null,
            "id": 128187681,
            "likes": {
                "disliked": null,
                "liked": null
            },
            "rating": 4.0,
            "stay_parameters": "Stayed January 2012, traveled with friends",
            "text": "Nice, pretty, quite well located hotel. In general, very good impression.",
            "title": "Nice hotel to stay",
            "user": "Valentine_Kirik"
        },
        {
            "date": "February 25, 2012",
            "detail_rating": {
                "business": null,
                "cleanliness": 5.0,
                "desk": null,
                "location": 5.0,
                "pool": null,
                "restaurant": null,
                "rooms": 5.0,
                "service": 5.0,
                "sleep": 5.0,
                "value": 3.0
            },
            "helpfulness": null,
            "id": 125197884,
            "likes": {
                "disliked": null,
                "liked": null
            },
            "rating": 5.0,
            "stay_parameters": "Stayed October 2011, traveled solo",
            "text": "This was one of the best places I've ever stayed. The staff was awesome, helping us with everything we needed. Dinner was fantastic with a great array of food. The room was huge and cozy, and with a really nice bathroom. I simply have no complaints about it. It was fantastic.",
            "title": "Such a great place. Wish I had stayed longer.",
            "user": "jhonnysimoes"
        },
        {
            "date": "January 15, 2012",
            "detail_rating": {
                "business": null,
                "cleanliness": 4.0,
                "desk": null,
                "location": 3.0,
                "pool": null,
                "restaurant": null,
                "rooms": 4.0,
                "service": 4.0,
                "sleep": 3.0,
                "value": 3.0
            },
            "helpfulness": 1,
            "id": 123111347,
            "likes": {
                "disliked": null,
                "liked": null
            },
            "rating": 4.0,
            "stay_parameters": "Stayed October 2011, traveled on business",
            "text": "LOCATION: The hotel is in a corner between two very busy streets, which is probably bad for noise-sensitive people. Location was good for doing business, but it was far from the beach and Miraflores where most of the good restaurants are (I tried \"Brujas de Cachiche\" which was fantastic!). Yes, you can go back and forth with a taxi, but I would avoid if if on holidays. The hotel is right in front of a pharmacy, two supermarkets and several small restaurants and shops. It is also close to one of the big shopping malls in Lima.",
            "title": "Good for business, but not close to Miraflores",
            "user": "Globetrotter_Roy"
        },
        {
            "date": "November 24, 2011",
            "detail_rating": {
                "business": null,
                "cleanliness": 4.0,
                "desk": null,
                "location": 3.0,
                "pool": null,
                "restaurant": null,
                "rooms": 4.0,
                "service": 4.0,
                "sleep": 5.0,
                "value": 3.0
            },
            "helpfulness": null,
            "id": 120998045,
            "likes": {
                "disliked": null,
                "liked": null
            },
            "rating": 4.0,
            "stay_parameters": "Stayed September 2011, traveled solo",
            "text": "THE HOTEL: It felt safe and all staff were very friendly. The hotel doesn't feel tired, but it is not newly refurbished either. My company used the conference center and service given was very good. Perhaps one of the big pluses is that you can hire a car to take you back and forth to the airport: service was always on time, they had brand new and spacious cars, and driver drove decently for the Lima standards.",
            "title": "Nice hotel in Lima",
            "user": "LaGitana30"
        },
        {
            "date": "October 13, 2011",
            "detail_rating": {
                "business": null,
                "cleanliness": 4.0,
                "desk": null,
                "location": 3.0,
                "pool": null,
                "restaurant": null,
                "rooms": 3.0,
                "service": 5.0,
                "sleep": 4.0,
                "value": 4.0
            },
            "helpfulness": 1,
            "id": 119266227,
            "likes": {
                "disliked": null,
                "liked": null
            },
            "rating": 4.0,
            "stay_parameters": "Stayed October 2011, traveled on business",
            "text": "THE ROOM: Yes, it was noisy, but clean, spacious and perfectly adequate for my business needs. I had a large TV with cable, a safe and coffee maker. The bathroom was full of marble everywhere. A very important plus as a business traveler is that I got free Internet!",
            "title": "Great for the $$",
            "user": "NJFunTraveler"
        },
        {
            "date": "March 16, 2011",
            "detail_rating": {
                "business": null,
                "cleanliness": 5.0,
                "desk": null,
                "location": 2.0,
                "pool": null,
                "restaurant": null,
                "rooms": 4.0,
                "service": 4.0,
                "sleep": 4.0,
                "value": 3.0
            },
            "helpfulness": null,
            "id": 100406937,
            "likes": {
                "disliked": null,
                "liked": null
            },
            "rating": 4.0,
            "stay_parameters": "Stayed January 2011, traveled as a couple",
            "text": "Stayed there a couple nights as part of a tour. It met all our expectations, not super fancy but nice clean rooms, comfy beds and all the basic amenities. Staff were very friendly and helpful. Exchange rates at the front desk were a bit less favorable than the airport but the convenience made up for any minor difference. Great breakfast buffet and the restaurant was also good for lunch and dinner.",
            "title": "Nice Hotel - reasonable location",
            "user": "Roadees"
        },
        {
            "date": "January 24, 2011",
            "detail_rating": {
                "business": null,
                "cleanliness": null,
                "desk": null,
                "location": null,
                "pool": null,
                "restaurant": null,
                "rooms": null,
                "service": null,
                "sleep": null,
                "value": null
            },
            "helpfulness": 2,
            "id": 94232192,
            "likes": {
                "disliked": null,
                "liked": null
            },
            "rating": 1.0,
            "stay_parameters": null,
            "text": "The hotel is a bit out of the way to try and walk to much of the touristy type stuff but it's not too long a cab ride to the beach, shopping, great restaurants, etc. Hotel staff will get you a taxi no problem and confirm rates (we were warned against just flagging cabs off the street since many are unlicensed and uncontrolled).",
            "title": "Will not honor your reservation",
            "user": "pete186"
        },
        {
            "date": "October 28, 2010",
            "detail_rating": {
                "business": null,
                "cleanliness": 5.0,
                "desk": null,
                "location": 4.0,
                "pool": null,
                "restaurant": null,
                "rooms": 5.0,
                "service": 5.0,
                "sleep": 5.0,
                "value": 4.0
            },
            "helpfulness": null,
            "id": 85171915,
            "likes": {
                "disliked": null,
                "liked": null
            },
            "rating": 5.0,
            "stay_parameters": "Stayed May 2010, traveled on business",
            "text": "After a very long flight I made it to the Melia Hotel only to find out I had no room.",
            "title": "Great quality, both in room and service",
            "user": "Pispalalainen"
        },
        {
            "date": "September 14, 2010",
            "detail_rating": {
                "business": null,
                "cleanliness": 5.0,
                "desk": null,
                "location": 5.0,
                "pool": null,
                "restaurant": null,
                "rooms": 5.0,
                "service": 5.0,
                "sleep": 5.0,
                "value": 5.0
            },
            "helpfulness": null,
            "id": 79573774,
            "likes": {
                "disliked": null,
                "liked": null
            },
            "rating": 5.0,
            "stay_parameters": "Stayed December 2009, traveled with family",
            "text": "I was told some people staying there had a flight canceled so they were staying longer.",
            "title": "Super love it!",
            "user": "Yasmin S"
        },
        {
            "date": "November 17, 2009",
            "detail_rating": {
                "business": null,
                "cleanliness": 5.0,
                "desk": null,
                "location": 4.0,
                "pool": null,
                "restaurant": null,
                "rooms": 5.0,
                "service": 5.0,
                "sleep": null,
                "value": 5.0
            },
            "helpfulness": 1,
            "id": 49439482,
            "likes": {
                "disliked": null,
                "liked": null
            },
            "rating": 5.0,
            "stay_parameters": "Stayed November 2009, traveled on business",
            "text": "I made my reservation 4 weeks in advance. They changed my reservation to a different",
            "title": "5 star treatment, excellent beds, highly recommended",
            "user": "ekevitz"
        },
        {
            "date": "July 12, 2012",
            "detail_rating": {
                "business": null,
                "cleanliness": 4.0,
                "desk": null,
                "location": 3.0,
                "pool": null,
                "restaurant": null,
                "rooms": 4.0,
                "service": 5.0,
                "sleep": 4.0,
                "value": 4.0
            },
            "helpfulness": null,
            "id": 134223378,
            "likes": {
                "disliked": null,
                "liked": null
            },
            "rating": 4.0,
            "stay_parameters": "Stayed November 2011, traveled on business",
            "text": "The location is not ideal for sightseeing but it is quiet. I loved the breakfast buffet which had lots of Peruvian dishes to choose from. Staff was polite and very helpful even when I called numerous times at 4 am because of a failing Internet connection. Would go there again.",
            "title": "a bit out of the way but good service",
            "user": "grumpyguest"
        },
        {
            "date": "June 8, 2012",
            "detail_rating": {
                "business": null,
                "cleanliness": 4.0,
                "desk": null,
                "location": 3.0,
                "pool": null,
                "restaurant": null,
                "rooms": 3.0,
                "service": 5.0,
                "sleep": 3.0,
                "value": 3.0
            },
            "helpfulness": null,
            "id": 131568731,
            "likes": {
                "disliked": null,
                "liked": null
            },
            "rating": 3.0,
            "stay_parameters": "Stayed June 2012, traveled on business",
            "text": "Decent hotel but little less then what I expected.",
            "title": "Correct hotel - good service",
            "user": "PeterJLP"
        },
        {
            "date": "June 6, 2012",
            "detail_rating": {
                "business": null,
                "cleanliness": 3.0,
                "desk": null,
                "location": 2.0,
                "pool": null,
                "restaurant": null,
                "rooms": 3.0,
                "service": 3.0,
                "sleep": 3.0,
                "value": 3.0
            },
            "helpfulness": null,
            "id": 131448778,
            "likes": {
                "disliked": null,
                "liked": null
            },
            "rating": 3.0,
            "stay_parameters": "Stayed May 2012, traveled as a couple",
            "text": "Rooms could use a bit more modern furniture and some more power plugs without having to move that same heavy wooden 70\u00b4s furniture.",
            "title": "Very Average Hotel",
            "user": "Cara L"
        },
        {
            "date": "May 29, 2012",
            "detail_rating": {
                "business": null,
                "cleanliness": 5.0,
                "desk": null,
                "location": 3.0,
                "pool": null,
                "restaurant": null,
                "rooms": 4.0,
                "service": 4.0,
                "sleep": 5.0,
                "value": 5.0
            },
            "helpfulness": null,
            "id": 130830221,
            "likes": {
                "disliked": null,
                "liked": null
            },
            "rating": 4.0,
            "stay_parameters": "Stayed March 2012, traveled on business",
            "text": "Restaurant is OK but 2 first wines I choose from the menu where not available. Maybe then it would be better to change the menu ...",
            "title": "Very good ratio quality/price",
            "user": "jlamoros"
        },
        {
            "date": "April 20, 2012",
            "detail_rating": {
                "business": null,
                "cleanliness": 5.0,
                "desk": null,
                "location": 5.0,
                "pool": null,
                "restaurant": null,
                "rooms": 5.0,
                "service": 5.0,
                "sleep": null,
                "value": 4.0
            },
            "helpfulness": null,
            "id": 128254122,
            "likes": {
                "disliked": null,
                "liked": null
            },
            "rating": 5.0,
            "stay_parameters": "Stayed April 2012",
            "text": "Friendly staff and good service.",
            "title": "Nice smelling room.",
            "user": "ViviViviViviVivi"
        }
    ],
    "slim_ranking": 0.183673469388,
    "stars": 4,
    "tripadvisor": {
        "VISITED": false,
        "country_name": null,
        "locality": null,
        "pic_link": null,
        "street_address": null
    },
    "user_rating": 4.0,
    "variance": {
        "average": 35,
        "excellent": 79,
        "poor": 7,
        "terrible": 7,
        "very good": 104
    }
}