{
    "aka": "Gran Hotel Barcelona",
    "description": null,
    "detail_rating": {
        "cleanliness": 4.5,
        "location": 4.0,
        "rooms": 4.5,
        "service": 4.0,
        "sleep": 4.5,
        "value": 4.0
    },
    "location": {
        "city": null,
        "continent": "Europe",
        "country": "Spain",
        "proposed_city": null,
        "province": null,
        "region": "Catalonia"
    },
    "name": "Gran Hotel La Florida",
    "places": {
        "aka": [
            "Barcelona"
        ],
        "hotel_description": [],
        "hotel_name": [
            "Florida"
        ]
    },
    "review_count": 521,
    "review_count_current": 20,
    "reviews": [
        {
            "date": "July 4, 2007",
            "detail_rating": {
                "business": null,
                "cleanliness": null,
                "desk": null,
                "location": null,
                "pool": null,
                "restaurant": null,
                "rooms": null,
                "service": null,
                "sleep": null,
                "value": null
            },
            "helpfulness": 3,
            "id": 8054970,
            "likes": {
                "disliked": null,
                "liked": null
            },
            "rating": 5.0,
            "stay_parameters": null,
            "text": "Gran Hotel La Florida-",
            "title": "Magnificent Urban Oasis",
            "user": "Jumbotraveler"
        },
        {
            "date": "June 30, 2007",
            "detail_rating": {
                "business": 5.0,
                "cleanliness": 5.0,
                "desk": null,
                "front_desk": 5.0,
                "location": 5.0,
                "pool": null,
                "restaurant": null,
                "rooms": 5.0,
                "service": 4.0,
                "sleep": null,
                "value": 5.0
            },
            "helpfulness": 3,
            "id": 8029501,
            "likes": {
                "disliked": "\u2014 Food service slow, dining room inflexible",
                "liked": "\u2014 Everything"
            },
            "rating": 5.0,
            "stay_parameters": "Stayed June 2007, traveled with family",
            "text": "July 3,2007",
            "title": "Nicest hotel in 30 years of travel",
            "user": "fweeb"
        },
        {
            "date": "June 21, 2007",
            "detail_rating": {
                "business": 2.0,
                "cleanliness": 4.0,
                "desk": null,
                "front_desk": 5.0,
                "location": 5.0,
                "pool": null,
                "restaurant": null,
                "rooms": 5.0,
                "service": 5.0,
                "sleep": null,
                "value": 5.0
            },
            "helpfulness": 4,
            "id": 7958107,
            "likes": {
                "disliked": "\u2014 We had to pay for the Internet service and there was only a small room downstairs with one computer. It was a pain to use it.",
                "liked": "\u2014 The rooms, bathrooms, views, terraces near pool"
            },
            "rating": 5.0,
            "stay_parameters": "Stayed June 2007, traveled with family",
            "text": "Reviewer:Brooklyn NY",
            "title": "We loved it !",
            "user": "TheWorld&I"
        },
        {
            "date": "June 14, 2007",
            "detail_rating": {
                "business": 2.0,
                "cleanliness": 3.0,
                "desk": null,
                "front_desk": 1.0,
                "location": 2.0,
                "pool": null,
                "restaurant": null,
                "rooms": 2.0,
                "service": 2.0,
                "sleep": null,
                "value": 2.0
            },
            "helpfulness": 1,
            "id": 7848761,
            "likes": {
                "disliked": null,
                "liked": null
            },
            "rating": 2.0,
            "stay_parameters": "Stayed May 2007, traveled as a couple",
            "text": "\"Magnificant Urban Oasis\"",
            "title": "Great service...NOTTT!",
            "user": "tjigiii"
        },
        {
            "date": "April 23, 2007",
            "detail_rating": {
                "business": 5.0,
                "cleanliness": 5.0,
                "desk": null,
                "front_desk": 5.0,
                "location": 5.0,
                "pool": null,
                "restaurant": null,
                "rooms": 5.0,
                "service": 5.0,
                "sleep": null,
                "value": 5.0
            },
            "helpfulness": 1,
            "id": 7417973,
            "likes": {
                "disliked": null,
                "liked": null
            },
            "rating": 5.0,
            "stay_parameters": "Stayed April 2006, traveled on business",
            "text": ".",
            "title": "Do not go alone .",
            "user": "okyalos"
        },
        {
            "date": "April 22, 2007",
            "detail_rating": {
                "business": 5.0,
                "cleanliness": 5.0,
                "desk": null,
                "front_desk": 5.0,
                "location": 5.0,
                "pool": null,
                "restaurant": null,
                "rooms": 5.0,
                "service": 5.0,
                "sleep": null,
                "value": 5.0
            },
            "helpfulness": 3,
            "id": 7414704,
            "likes": {
                "disliked": "\u2014 Nothing- it was all perfect. Anyways, you will always have to make a drive to get to the top!",
                "liked": "\u2014 The views, the food, the pool, the decor... EVERYTHING!"
            },
            "rating": 5.0,
            "stay_parameters": "Stayed March 2007, traveled as a couple",
            "text": "The best thing since sliced bread. Seriously!",
            "title": "The perfect retreat",
            "user": "breathenow"
        },
        {
            "date": "February 2, 2007",
            "detail_rating": {
                "business": 3.0,
                "cleanliness": 4.0,
                "desk": null,
                "front_desk": 5.0,
                "location": 5.0,
                "pool": null,
                "restaurant": null,
                "rooms": 5.0,
                "service": 3.0,
                "sleep": null,
                "value": 5.0
            },
            "helpfulness": 2,
            "id": 6731678,
            "likes": {
                "disliked": "\u2014 the service",
                "liked": "\u2014 the view"
            },
            "rating": 4.0,
            "stay_parameters": "Stayed September 2006",
            "text": "Let me put it to you this way... it is the ONLY hotel that overlooks all of Barcelona. It is romantic and classy, yet modern- has breathtaking views, and they have thought of everything so that you don't have to.",
            "title": "Beautiful location",
            "user": "NinaMontreal"
        },
        {
            "date": "December 22, 2006",
            "detail_rating": {
                "business": 3.0,
                "cleanliness": 3.0,
                "desk": null,
                "front_desk": 4.0,
                "location": 3.0,
                "pool": null,
                "restaurant": null,
                "rooms": 3.0,
                "service": 4.0,
                "sleep": null,
                "value": 3.0
            },
            "helpfulness": 1,
            "id": 6482090,
            "likes": {
                "disliked": null,
                "liked": null
            },
            "rating": 4.0,
            "stay_parameters": "Stayed December 2006, traveled solo",
            "text": "Sure it is a trek from city center, costing roughly \u20ac14 for a one way trip... however, if you have the money to spend, and you are looking for something that will take your breath away, then I assure you, La Florida IS the place to be.",
            "title": "Nice for the swimming pool",
            "user": "PCK-LCK"
        },
        {
            "date": "December 13, 2006",
            "detail_rating": {
                "business": 2.0,
                "cleanliness": 4.0,
                "desk": null,
                "front_desk": 4.0,
                "location": 5.0,
                "pool": null,
                "restaurant": null,
                "rooms": 4.0,
                "service": 4.0,
                "sleep": null,
                "value": 5.0
            },
            "helpfulness": 4,
            "id": 6436578,
            "likes": {
                "disliked": "\u2014 hardly any disappointment",
                "liked": "\u2014 its location and staff"
            },
            "rating": 5.0,
            "stay_parameters": "Stayed November 2006, traveled as a couple",
            "text": "The hotel itself is beyond amazing. It is 5 stars- and yet it doesn't have that big, overwhelming feel of a five-star hotel. Second, it is unbelievably classy in every sense of the word. Whoever came up with this design - the concept of having a hotel such as this on the top of a mountain overlooking all of Barcelona, and whoever decorated the place, definitely deserve an award.",
            "title": "a great hotel with a great view",
            "user": "mundus"
        },
        {
            "date": "December 5, 2006",
            "detail_rating": {
                "business": 2.0,
                "cleanliness": 5.0,
                "desk": null,
                "front_desk": 5.0,
                "location": 2.0,
                "pool": null,
                "restaurant": null,
                "rooms": 5.0,
                "service": 5.0,
                "sleep": null,
                "value": 5.0
            },
            "helpfulness": 2,
            "id": 6333216,
            "likes": {
                "disliked": "\u2014 Finding it",
                "liked": "\u2014 Space and light"
            },
            "rating": 5.0,
            "stay_parameters": "Stayed September 2006, traveled on business",
            "text": "The architecture is top-knotch. Make sure that you reserve a room with a sea view because then you can see all of Barcelona. Also try to get a room with a terrace. Believe me, you WON'T be disappointed. While everyone else is riding the blue tram to get to this height and experience this view for a few hours- you will have it all day and all night long.",
            "title": "Fantasy Palace",
            "user": "Mosshot"
        },
        {
            "date": "September 13, 2007",
            "detail_rating": {
                "business": 5.0,
                "cleanliness": 5.0,
                "desk": null,
                "front_desk": 5.0,
                "location": 5.0,
                "pool": null,
                "restaurant": null,
                "rooms": 5.0,
                "service": 5.0,
                "sleep": null,
                "value": 5.0
            },
            "helpfulness": 3,
            "id": 8708107,
            "likes": {
                "disliked": "\u2014 The price of the food",
                "liked": "\u2014 The Luxury"
            },
            "rating": 5.0,
            "stay_parameters": "Stayed September 2007, traveled as a couple",
            "text": "I've travelled the world and stayed in a fair few luxury 5* hotels along the way (as well as a lot of not so luxury hotels!). After reading the reviews I expected La Florida to be a very nice 5* hotel, but it exceeded any expectation I could ever have had. 5* doesn't really hit the mark. From the moment we arrived, the service was impeccable. We arrived late at 11.30pm, pulled up outside reception, and got greeted, with our car keys being taken away, and the car being whisked off to be parked. We got seated in the little private reception area, and they opened a fresh bottle of Cava for us (this is normal for evening arrivals, no special occasion). Check in was smooth, and we had a tour of the hotel before being presented with our 4th floor sea view room, which was on the corner of the building which meant we had 2 balconies facing different sides of the hotel.",
            "title": "One of the best hotels I've experienced!",
            "user": "southmouth"
        },
        {
            "date": "September 12, 2007",
            "detail_rating": {
                "business": 4.0,
                "cleanliness": 5.0,
                "desk": null,
                "front_desk": 5.0,
                "location": 5.0,
                "pool": null,
                "restaurant": null,
                "rooms": 5.0,
                "service": 5.0,
                "sleep": null,
                "value": 4.0
            },
            "helpfulness": null,
            "id": 8703481,
            "likes": {
                "disliked": "\u2014 Lack of enough loungers",
                "liked": "\u2014 Design suites"
            },
            "rating": 5.0,
            "stay_parameters": "Stayed September 2007, traveled as a couple",
            "text": "This hotel is aimed at adults, who like to relax, and who like nice interiors. The rooms are tastefully furnished, and there's a wide choice of rooms available. The swimming pool is a beautiful stainless steel infinity pool which overlooks Barcelona. Unlike a lot of 5* hotels where the bar music extends to a cheesy pianist, La Florida has a low key resident DJ in the bar on Friday & Saturday night (think this may only be in the summer), who played relaxing chilled out tunes all night, similar to chilled Hed Kandi.",
            "title": "Great hotel",
            "user": "ChilternSkipper"
        },
        {
            "date": "September 10, 2007",
            "detail_rating": {
                "business": null,
                "cleanliness": null,
                "desk": null,
                "location": null,
                "pool": null,
                "restaurant": null,
                "rooms": null,
                "service": null,
                "sleep": null,
                "value": null
            },
            "helpfulness": 1,
            "id": 8686710,
            "likes": {
                "disliked": null,
                "liked": null
            },
            "rating": 4.0,
            "stay_parameters": null,
            "text": "The dress code in the evening was whatever you wanted to wear. I saw women in slinky long dresses, as well as women in shorts and flip flops. You can either sit at the bar, or at the table seats overlooking the terrace and the lights of Barcelona, or laze around on the sofas (literally laze horizontal) . This hotel felt like a home from home, where anything goes, and you feel like you can really relax if you want to. The food was nice, but fairly expensive for Barcelona. The service was slower than I'd normally expect, even for food that's cooked from scratch, but that's the only negative point that I would have with the hotel (and it's not a big negative, it just stood out from the rest of the hotel which was spot on).",
            "title": "Superb accommodation, but overpriced",
            "user": "JapersCapers"
        },
        {
            "date": "July 15, 2007",
            "detail_rating": {
                "business": 4.0,
                "cleanliness": 5.0,
                "desk": null,
                "front_desk": 5.0,
                "location": 5.0,
                "pool": null,
                "restaurant": null,
                "rooms": 5.0,
                "service": 5.0,
                "sleep": null,
                "value": 3.0
            },
            "helpfulness": 2,
            "id": 8122036,
            "likes": {
                "disliked": "\u2014 nothing",
                "liked": "\u2014 location, 5 star standard, food, Pool and Fitness"
            },
            "rating": 5.0,
            "stay_parameters": "Stayed August 2006, traveled as a couple",
            "text": "We chilled out in the steam rooms, which were very hot! They have a seperate female/male spa section with a hot steam room each, and a dry hot (steam?) room with soothing lights and sounds. You can also reach an inter-connecting shared male/female steam room from both the male and female facilities. The spa has lots of showers and L'occitaine products to shower and moisturise (these are also the standard products in the bathrooms of the hotel) . This is perfect if you check out of the hotel at 12.00 and your flight doesn't go until the evening as you still get full use of the hotel facilities.",
            "title": "Wonderful Retreat!",
            "user": "leolimoncello2003"
        },
        {
            "date": "July 6, 2007",
            "detail_rating": {
                "business": null,
                "cleanliness": 5.0,
                "desk": null,
                "front_desk": 4.0,
                "location": 5.0,
                "pool": null,
                "restaurant": null,
                "rooms": 5.0,
                "service": 5.0,
                "sleep": null,
                "value": 5.0
            },
            "helpfulness": 3,
            "id": 8067216,
            "likes": {
                "disliked": "\u2014 some furnitures should be refurbished or repaired.",
                "liked": null
            },
            "rating": 5.0,
            "stay_parameters": "Stayed July 2007, traveled solo",
            "text": "The gym is small, but fairly well equipped, with the emphasis being on the treadmills (in my experience, the most used equipment in a hotel gym). There are bowls of apples in the gym, reception, and other public areas, so plenty of healthy snacks to munch on throughout the day. They also place caraffes of water with fresh mint or fresh lemon in the public areas so you can help yourself to drinks whenever you want.",
            "title": "Marvelous boutique hotel",
            "user": "CD_in_geneva"
        },
        {
            "date": "November 11, 2007",
            "detail_rating": {
                "business": null,
                "cleanliness": 2.0,
                "desk": null,
                "front_desk": 3.0,
                "location": 5.0,
                "pool": null,
                "restaurant": null,
                "rooms": 2.0,
                "service": 2.0,
                "sleep": null,
                "value": 3.0
            },
            "helpfulness": null,
            "id": 10748993,
            "likes": {
                "disliked": "\u2014 Noise",
                "liked": "\u2014 Views"
            },
            "rating": 2.0,
            "stay_parameters": "Stayed October 2007, traveled with family",
            "text": "We stayed here for 3 nights in October. We deliberately chose a hotel away from the city centre so that it would be quiet and we would get great views. Well we did get great views and our terrace was superb for chilling out and watching the world. However we did not get quiet. Sadly the theme park next door, which we were well aware of and thoroughly enjoyed with our son, was a tad noisy. At first the screams of enjoyment were amusing but a whole day of it did get tiresome. Having said that it was only at the weekend and it did all stop at 8pm and didn't start till about midday.",
            "title": "Great View",
            "user": "sjwoolnough"
        },
        {
            "date": "November 8, 2007",
            "detail_rating": {
                "business": 4.0,
                "cleanliness": 2.0,
                "desk": null,
                "front_desk": 4.0,
                "location": 5.0,
                "pool": null,
                "restaurant": null,
                "rooms": 2.0,
                "service": 3.0,
                "sleep": null,
                "value": 2.0
            },
            "helpfulness": null,
            "id": 10687803,
            "likes": {
                "disliked": "\u2014 The bathroom (smell)",
                "liked": "\u2014 The view"
            },
            "rating": 2.0,
            "stay_parameters": "Stayed October 2007, traveled as a couple",
            "text": "The other issue we personally suffered with was a wedding being held in the hotel. The price we paid for having a superb view and terrace was that we were right above the wedding venue. The thud from the music was bad enough ( and this went on till gone 3am) but also the noise from drunken guests who regularly wandered past our room to get to theirs. I'm sure elsewhere in the hotel this was not a big problem but it was for us. So be warned, as delightful as the few rooms are with their terraces, on a Saturday night it is probably better to be elsewhere in the hotel.",
            "title": "Great Views, but could be better",
            "user": "Traveloguy"
        },
        {
            "date": "November 1, 2007",
            "detail_rating": {
                "business": 5.0,
                "cleanliness": 5.0,
                "desk": null,
                "front_desk": 5.0,
                "location": 2.0,
                "pool": null,
                "restaurant": null,
                "rooms": 5.0,
                "service": 4.0,
                "sleep": null,
                "value": 4.0
            },
            "helpfulness": 1,
            "id": 10507243,
            "likes": {
                "disliked": "\u2014 nothing",
                "liked": "\u2014 views and beds"
            },
            "rating": 4.0,
            "stay_parameters": "Stayed October 2007, traveled with friends",
            "text": "The other problem we suffered was the inability to get a table in the restaurant. To cut a long story short don't assume anything, book a table before you arrive.",
            "title": "Too far from the centre",
            "user": "SenorCharlie"
        },
        {
            "date": "October 4, 2007",
            "detail_rating": {
                "business": null,
                "cleanliness": 4.0,
                "desk": null,
                "front_desk": 5.0,
                "location": 5.0,
                "pool": null,
                "restaurant": null,
                "rooms": 5.0,
                "service": 3.0,
                "sleep": null,
                "value": 4.0
            },
            "helpfulness": 1,
            "id": 10040302,
            "likes": {
                "disliked": "\u2014 occasional poor service",
                "liked": "\u2014 chilled out ambience"
            },
            "rating": 5.0,
            "stay_parameters": "Stayed September 2007, traveled as a couple",
            "text": "Overall this hotel is lovely with stupendous views. However it does not really merit a leading hotels of the world badge especially for the price paid.",
            "title": "Nearly perfect!",
            "user": "RuairiCork"
        },
        {
            "date": "September 20, 2007",
            "detail_rating": {
                "business": 3.0,
                "cleanliness": 4.0,
                "desk": null,
                "front_desk": 4.0,
                "location": 3.0,
                "pool": null,
                "restaurant": null,
                "rooms": 4.0,
                "service": 3.0,
                "sleep": null,
                "value": 3.0
            },
            "helpfulness": 3,
            "id": 8827104,
            "likes": {
                "disliked": null,
                "liked": null
            },
            "rating": 3.0,
            "stay_parameters": "Stayed September 2007, traveled solo",
            "text": "Stayed in this hotel in October 2007. Stunning views although be prepared for a 20 minute cab ride off peak to get into town. That said, the view alone is worth it!",
            "title": "Hotel with a view outside the city center",
            "user": "warum"
        }
    ],
    "slim_ranking": 0.292543021033,
    "stars": 5,
    "tripadvisor": {
        "VISITED": false,
        "country_name": null,
        "locality": null,
        "pic_link": null,
        "street_address": null
    },
    "user_rating": 4.0,
    "variance": {
        "average": 58,
        "excellent": 265,
        "poor": 39,
        "terrible": 27,
        "very good": 132
    }
}