{
    "aka": "Barcelo Ixtapa Beach Hotel Ixtapa",
    "description": "Barcelo Ixtapa Beach***** is located in the heart of Ixtapa, right on \"El Palmar\" beach, one of the most attractive destinations in Mexico. It is the ideal place to go on family holidays, celebrate romantic weddings, organize successful business meetings and also to spend an unforgettable honeymoon. The Barcelo Ixtapa Beach***** hotel offers a convenient way to enjoy your holidays and experience the Barcelo All Inclusive program. It also offers the perfect location for those guests wanting to experience excursions to other parts of Ixtapa and Zihuatanejo.",
    "detail_rating": {
        "cleanliness": 4.5,
        "location": 4.5,
        "rooms": 3.5,
        "service": 4.0,
        "sleep": 4.0,
        "value": 4.0
    },
    "location": {
        "city": null,
        "continent": null,
        "country": "Mexico",
        "proposed_city": "Ixtapa",
        "province": null,
        "region": "Pacific Coast"
    },
    "name": "Hotel Barcelo Ixtapa Beach Resort",
    "places": {
        "aka": [
            "Ixtapa"
        ],
        "hotel_description": [
            "Ixtapa"
        ],
        "hotel_name": [
            "Ixtapa"
        ]
    },
    "review_count": 704,
    "review_count_current": 20,
    "reviews": [
        {
            "date": "January 13, 2011",
            "detail_rating": {
                "business": null,
                "cleanliness": 2.0,
                "desk": null,
                "location": 4.0,
                "pool": null,
                "restaurant": null,
                "rooms": 2.0,
                "service": 3.0,
                "sleep": 2.0,
                "value": 2.0
            },
            "helpfulness": null,
            "id": 92813325,
            "likes": {
                "disliked": null,
                "liked": null
            },
            "rating": 3.0,
            "stay_parameters": "Stayed December 2010, traveled with friends",
            "text": "Well one of my first rewiews on tripadvisor but i am allways reading them before i go.lol",
            "title": "pffff....i was expecting more from a Barcelo!",
            "user": "Citoyennedumonde-21"
        },
        {
            "date": "January 12, 2011",
            "detail_rating": {
                "business": null,
                "cleanliness": 5.0,
                "desk": null,
                "location": 5.0,
                "pool": null,
                "restaurant": null,
                "rooms": 4.0,
                "service": 5.0,
                "sleep": 4.0,
                "value": 5.0
            },
            "helpfulness": 2,
            "id": 92682743,
            "likes": {
                "disliked": null,
                "liked": null
            },
            "rating": 5.0,
            "stay_parameters": "Stayed January 2011, traveled as a couple",
            "text": "My first trip to Mexico... Ixtapa-beautifull beach -way more nicer than Acapulco , they have grate roads , a lot of security (in each hotel) , grate partyes and a real Mexican athmosphere because most of the turists that go there are Mexican thamselves.",
            "title": "Our most comfortable stay in Mexico",
            "user": "ctheworld123"
        },
        {
            "date": "January 12, 2011",
            "detail_rating": {
                "business": null,
                "cleanliness": 4.0,
                "desk": null,
                "location": 4.0,
                "pool": null,
                "restaurant": null,
                "rooms": 4.0,
                "service": 5.0,
                "sleep": 4.0,
                "value": 5.0
            },
            "helpfulness": 1,
            "id": 92670630,
            "likes": {
                "disliked": null,
                "liked": null
            },
            "rating": 4.0,
            "stay_parameters": "Stayed January 2011, traveled as a couple",
            "text": "Barcelo- it was not me that chosed the hotel , was my aunt that choosed it for the name that it carees and let me tell you ithat it does not mesure up!",
            "title": "I will return for another great vacation here",
            "user": "Carter244"
        },
        {
            "date": "January 9, 2011",
            "detail_rating": {
                "business": null,
                "cleanliness": 5.0,
                "desk": null,
                "location": 4.0,
                "pool": null,
                "restaurant": null,
                "rooms": 3.0,
                "service": 5.0,
                "sleep": 4.0,
                "value": 3.0
            },
            "helpfulness": 3,
            "id": 92316193,
            "likes": {
                "disliked": null,
                "liked": null
            },
            "rating": 4.0,
            "stay_parameters": "Stayed December 2010, traveled with family",
            "text": "The rooms are nothing special and a bit not taking care of, the food is ok but I would recomend you to go outside the resort(or not take all-inclusive, it`s not worh it for the price), to eat and have fun, because there region is very safe.",
            "title": "Loved Ixtapa and the Barcelo",
            "user": "titangirl36"
        },
        {
            "date": "December 30, 2010",
            "detail_rating": {
                "business": null,
                "cleanliness": 4.0,
                "desk": null,
                "location": 4.0,
                "pool": null,
                "restaurant": null,
                "rooms": 4.0,
                "service": 4.0,
                "sleep": 5.0,
                "value": 5.0
            },
            "helpfulness": 4,
            "id": 91069004,
            "likes": {
                "disliked": null,
                "liked": null
            },
            "rating": 4.0,
            "stay_parameters": "Stayed December 2010, traveled with friends",
            "text": "Let me tell you that this is not a 4* stars hotel it might be a 3* if you exclude the food and entertainment! It`s a ok hotel If YOU DO NOT PAY MOORE THAN 7-800$ for a week (all included and tax).",
            "title": "Relaxing Getaway for Families and Laidback Vacationers!",
            "user": "OregonCoastGirl"
        },
        {
            "date": "February 8, 2011",
            "detail_rating": {
                "business": null,
                "cleanliness": 5.0,
                "desk": null,
                "location": 5.0,
                "pool": null,
                "restaurant": null,
                "rooms": 5.0,
                "service": 5.0,
                "sleep": null,
                "value": 5.0
            },
            "helpfulness": 1,
            "id": 95971923,
            "likes": {
                "disliked": null,
                "liked": null
            },
            "rating": 5.0,
            "stay_parameters": "Stayed January 2011, traveled as a couple",
            "text": "Ixtapa is lovely in January. The Barcelo Ixtapa is probably your best choice of All Inclusives in Ixtapa. Excellent Beach Location. The Staff is Wonderful, Excellent Service.",
            "title": "Travel Agent Just Returned",
            "user": "LauraDisneyL"
        },
        {
            "date": "February 6, 2011",
            "detail_rating": {
                "business": null,
                "cleanliness": 5.0,
                "desk": null,
                "location": 5.0,
                "pool": null,
                "restaurant": null,
                "rooms": 4.0,
                "service": 5.0,
                "sleep": 5.0,
                "value": 5.0
            },
            "helpfulness": 1,
            "id": 95675998,
            "likes": {
                "disliked": null,
                "liked": null
            },
            "rating": 5.0,
            "stay_parameters": "Stayed December 2010, traveled as a couple",
            "text": "We stayed in one of the updated rooms, so it was nice to have flat screen TV.",
            "title": "STILL LOVING THE BARCELO",
            "user": "blueandy1601"
        },
        {
            "date": "February 2, 2011",
            "detail_rating": {
                "business": null,
                "cleanliness": 5.0,
                "desk": null,
                "location": 5.0,
                "pool": null,
                "restaurant": null,
                "rooms": 4.0,
                "service": 4.0,
                "sleep": 5.0,
                "value": 5.0
            },
            "helpfulness": 1,
            "id": 95333497,
            "likes": {
                "disliked": null,
                "liked": null
            },
            "rating": 4.0,
            "stay_parameters": "Stayed January 2011, traveled as a couple",
            "text": "Mini-bar had minimal selection , but was supplied every day. Only a few American TV channels. Across the street is Bank, Mini-Market, Flea Market and within 5 minute Walk",
            "title": "If you like mid-range all inclusives you'll love the Barcelo",
            "user": "WHS06"
        },
        {
            "date": "January 31, 2011",
            "detail_rating": {
                "business": null,
                "cleanliness": 3.0,
                "desk": null,
                "location": 4.0,
                "pool": null,
                "restaurant": null,
                "rooms": 2.0,
                "service": 2.0,
                "sleep": 3.0,
                "value": 2.0
            },
            "helpfulness": null,
            "id": 95117850,
            "likes": {
                "disliked": null,
                "liked": null
            },
            "rating": 2.0,
            "stay_parameters": "Stayed January 2011, traveled with family",
            "text": "30 restaurants and bars. So Location gets A+, Staff and Service get an A+",
            "title": "Barcelo needs an update",
            "user": "suzieq62_11"
        },
        {
            "date": "January 30, 2011",
            "detail_rating": {
                "business": null,
                "cleanliness": 3.0,
                "desk": null,
                "location": 5.0,
                "pool": null,
                "restaurant": null,
                "rooms": 3.0,
                "service": 4.0,
                "sleep": 1.0,
                "value": 5.0
            },
            "helpfulness": 1,
            "id": 94973794,
            "likes": {
                "disliked": null,
                "liked": null
            },
            "rating": 4.0,
            "stay_parameters": "Stayed January 2011, traveled with friends",
            "text": "This resort is only lacking a few items to make a total excellent experience.",
            "title": "Barcelo & Ixtapa Great Time",
            "user": "lindon"
        },
        {
            "date": "December 29, 2010",
            "detail_rating": {
                "business": null,
                "cleanliness": 5.0,
                "desk": null,
                "location": 5.0,
                "pool": null,
                "restaurant": null,
                "rooms": 4.0,
                "service": 5.0,
                "sleep": 5.0,
                "value": 5.0
            },
            "helpfulness": 3,
            "id": 91061035,
            "likes": {
                "disliked": null,
                "liked": null
            },
            "rating": 5.0,
            "stay_parameters": "Stayed December 2010, traveled with family",
            "text": "We\u2019ve been to Los Cabos, Puerto Vallarta and the Riviera Maya but are so impressed with Ixtapa that we are already planning next year\u2019s vacation \u2013 back to the Barcelo Beach. The rooms were very clean and ample for all our needs. Food was better than we have had at most all inclusives. But the 10th floor reasonably priced ocean view was THE BEST!!!",
            "title": "Just returned from 7 days in Paradise",
            "user": "HappyHoliday81"
        },
        {
            "date": "December 29, 2010",
            "detail_rating": {
                "business": null,
                "cleanliness": 5.0,
                "desk": null,
                "location": 4.0,
                "pool": null,
                "restaurant": null,
                "rooms": 3.0,
                "service": 5.0,
                "sleep": 2.0,
                "value": 2.0
            },
            "helpfulness": 3,
            "id": 90961234,
            "likes": {
                "disliked": null,
                "liked": null
            },
            "rating": 3.0,
            "stay_parameters": "Stayed December 2010, traveled with family",
            "text": "My 80-year-old Mom loved the beach (no rocks). We were all surprised by the very warm water and spent many hours bobbing in the waves. Can\u2019t wait to return.",
            "title": "Go for the weather, not the food",
            "user": "adventuras8128"
        },
        {
            "date": "December 28, 2010",
            "detail_rating": {
                "business": null,
                "cleanliness": 5.0,
                "desk": null,
                "location": 5.0,
                "pool": null,
                "restaurant": null,
                "rooms": 5.0,
                "service": 5.0,
                "sleep": 5.0,
                "value": 5.0
            },
            "helpfulness": 2,
            "id": 90905830,
            "likes": {
                "disliked": null,
                "liked": null
            },
            "rating": 5.0,
            "stay_parameters": "Stayed November 2010, traveled as a couple",
            "text": "We went to the Barcelo resort in Ixtapa for our Christmas break in 2010. Pluses: The reliable weather-- 84 degrees for nine straight days of our visit, was the real attraction. We have never stayed so close to the beach. From our window in the junior suite, we could see the kids playing in the ocean. The service was excellent-- everyone was kind, helpful, and friendly. We have been on cruises before and this service was every bit as thorough as that of the Disney Cruise. The resort is very clean inside and out.",
            "title": "Barcelo Ixtapa provided an excellent holiday",
            "user": "HaydenGregory"
        },
        {
            "date": "December 24, 2010",
            "detail_rating": {
                "business": null,
                "cleanliness": 4.0,
                "desk": null,
                "location": 4.0,
                "pool": null,
                "restaurant": null,
                "rooms": 4.0,
                "service": 5.0,
                "sleep": 4.0,
                "value": 4.0
            },
            "helpfulness": 1,
            "id": 90616087,
            "likes": {
                "disliked": null,
                "liked": null
            },
            "rating": 4.0,
            "stay_parameters": "Stayed December 2010, traveled as a couple",
            "text": "Lots to do in the resort: water aerobics, volleyball, bingo, ping pong, and painting ceramics ( for an extra fee). Tennis was extra at this all inclusive resort as well, but the courts are nice.",
            "title": "Great Escape from Winter",
            "user": "Cool-son"
        },
        {
            "date": "December 19, 2010",
            "detail_rating": {
                "business": null,
                "cleanliness": 4.0,
                "desk": null,
                "location": 5.0,
                "pool": null,
                "restaurant": null,
                "rooms": 3.0,
                "service": 5.0,
                "sleep": 3.0,
                "value": 5.0
            },
            "helpfulness": 1,
            "id": 90251259,
            "likes": {
                "disliked": null,
                "liked": null
            },
            "rating": 3.0,
            "stay_parameters": "Stayed December 2010, traveled as a couple",
            "text": "Negatives:",
            "title": "Guess what you get with 120 18 years olds and free booze?",
            "user": "chinick"
        },
        {
            "date": "January 29, 2011",
            "detail_rating": {
                "business": null,
                "cleanliness": 3.0,
                "desk": null,
                "location": 3.0,
                "pool": null,
                "restaurant": null,
                "rooms": 3.0,
                "service": 1.0,
                "sleep": 3.0,
                "value": 3.0
            },
            "helpfulness": 1,
            "id": 94869548,
            "likes": {
                "disliked": null,
                "liked": null
            },
            "rating": 3.0,
            "stay_parameters": "Stayed January 2011, traveled as a couple",
            "text": "The weather was the best i've ever experienced any where, the staff was great the food was good the locals were nice. The beach pirates got on my nerves but it's mexico so i expect it. It was the best holiday my wife and i had ever been on until we went to check out and were informed we were being billed for a \"missing' robe from our room, my wife had worn it earlier and the week and put it in the bath tub for the maid to change out. The man behid the desk argued with me for almost half an hour untiil finally i had enough and started yelling loudly how i was going back to canada and was going to tell everyone i new bad a place it was to stay unless he dropped it. lol..guess i'm not keeping my word",
            "title": "Great Trip until Check out",
            "user": "GregR30"
        },
        {
            "date": "January 26, 2011",
            "detail_rating": {
                "business": null,
                "cleanliness": 5.0,
                "desk": null,
                "location": 5.0,
                "pool": null,
                "restaurant": null,
                "rooms": 4.0,
                "service": 5.0,
                "sleep": 5.0,
                "value": 5.0
            },
            "helpfulness": 1,
            "id": 94549885,
            "likes": {
                "disliked": null,
                "liked": null
            },
            "rating": 5.0,
            "stay_parameters": "Stayed January 2011, traveled as a couple",
            "text": "just came back from a week in Ixtapa at the Barcelo, incredible, quite a location with the 3 pools, the beautiful beach. The food was also very good we ate at the a la carte restaurants 3 times and they were very good as well. The service was first class, the room were very good as well, the only thing we could have hoped for is a balcony, we were in the villa section and some do not have balconies as did ours, but the size and spaciousness of the room made up for it, all in all the best 4 star that I been to in Mexico.",
            "title": "Barcelo and Ixtapa a hit!",
            "user": "SDupuis"
        },
        {
            "date": "January 24, 2011",
            "detail_rating": {
                "business": null,
                "cleanliness": 5.0,
                "desk": null,
                "location": 5.0,
                "pool": null,
                "restaurant": null,
                "rooms": 4.0,
                "service": 4.0,
                "sleep": 4.0,
                "value": 5.0
            },
            "helpfulness": null,
            "id": 94306036,
            "likes": {
                "disliked": null,
                "liked": null
            },
            "rating": 4.0,
            "stay_parameters": "Stayed January 2011, traveled with family",
            "text": "Barcelo and Air Canada vacation thank you for a great week.",
            "title": "Great location and nice and compact",
            "user": "7asprinter"
        },
        {
            "date": "January 23, 2011",
            "detail_rating": {
                "business": null,
                "cleanliness": 5.0,
                "desk": null,
                "location": 5.0,
                "pool": null,
                "restaurant": null,
                "rooms": 4.0,
                "service": 5.0,
                "sleep": 4.0,
                "value": 5.0
            },
            "helpfulness": 1,
            "id": 94163859,
            "likes": {
                "disliked": null,
                "liked": null
            },
            "rating": 5.0,
            "stay_parameters": "Stayed January 2011, traveled with friends",
            "text": "My family and I stayed at the Barcelo Ixtapa from Jan 16th to the 21st and really I have nothing but good things to say. There were a few reviews that stated the hotel was old, not true. Also people complaining about the food, they must be very picky and quite the complainers... We stayed in a Villa which are oceanfront, there are 2 seperate villas with about 25 rooms in each, our agent did state that there would be a jacuzzi in each but that was incorrect there were a couple of jacuzzis in the villa area but however our rooms didn't have them. We had asked for adjoining rooms or side by side and when we arrived they had us in 2 different buildings, so please request that again at check in, if that applies to you. The rooms were quite adequate with a spectacular ocean view. We were ground floor so I can imagine the further up you would get the view probably got better and better. Also there is a pool outside of the villas that is specifically for the guests in the villas, it was never crowded and quite nice. There were plenty of chairs at all areas, however if you did want a good spot you did have to reserve a chair with your towel.",
            "title": "exceeded expectations",
            "user": "tequila000007"
        },
        {
            "date": "January 16, 2011",
            "detail_rating": {
                "business": null,
                "cleanliness": 5.0,
                "desk": null,
                "location": 5.0,
                "pool": null,
                "restaurant": null,
                "rooms": 3.0,
                "service": 4.0,
                "sleep": 4.0,
                "value": 4.0
            },
            "helpfulness": 1,
            "id": 93264438,
            "likes": {
                "disliked": null,
                "liked": null
            },
            "rating": 4.0,
            "stay_parameters": "Stayed January 2011, traveled as a couple",
            "text": "We got 2 vouchers for the specialty restaurants so we ate at each one time. I had a filet at Don Quiote and a ribeye at sunset and the beef was very good for mexico. There is always plenty of food to choose from and if you can't find enough to fill you up, you shouldn't be traveling all inclusive. We go somewhere everyyear and I rate this #2 of all times for the food.... The drinks~ some were VERY strong some were not, find a good bartender and tip!",
            "title": "Best Location",
            "user": "notboring"
        }
    ],
    "slim_ranking": 0.821428571429,
    "stars": 3.5,
    "tripadvisor": {
        "VISITED": false,
        "country_name": null,
        "locality": null,
        "pic_link": null,
        "street_address": null
    },
    "user_rating": 4.0,
    "variance": {
        "average": 136,
        "excellent": 200,
        "poor": 57,
        "terrible": 28,
        "very good": 283
    }
}