{
    "aka": null,
    "description": "Kiama Blue overlooks beautiful Kiama Harbour and the Pacific Ocean. Ideal for a weekend getaway, the resort is located within a short walking distance to the famous Kiama Blowhole, historic terrace shops and the beach. Acommodation at Kiama Blue ranges from Standard Rooms through to Deluxe Rooms and self-contained Apartments, all featuring ensuite bathrooms, mini bars and tea and coffee making facilities.",
    "detail_rating": {
        "cleanliness": null,
        "location": null,
        "rooms": null,
        "service": null,
        "sleep": null,
        "value": null
    },
    "location": {
        "city": null,
        "continent": "South Pacific",
        "country": "Australia",
        "proposed_city": null,
        "province": null,
        "region": null
    },
    "name": "Kiama Blue Hotel & Apartments",
    "places": {
        "aka": [],
        "hotel_description": [],
        "hotel_name": []
    },
    "review_count": 13,
    "review_count_current": 5,
    "reviews": [
        {
            "date": "July 20, 2008",
            "detail_rating": {
                "business": null,
                "cleanliness": 5.0,
                "desk": null,
                "front_desk": 4.0,
                "location": 5.0,
                "pool": null,
                "restaurant": null,
                "rooms": 4.0,
                "service": 4.0,
                "sleep": null,
                "value": 4.0
            },
            "helpfulness": 1,
            "id": 18061615,
            "likes": {
                "disliked": "\u2014 Uncomfortable bed",
                "liked": "\u2014 Fresh, new and modern. Friendly staff!"
            },
            "rating": 4.0,
            "stay_parameters": "Stayed July 2008, traveled as a couple",
            "text": "We have just returned from an overnight stay at Kiama Blue. We are accor members so we used it as one of our free nights then upgraded to a superior room for an extra $20.",
            "title": "Great Location!",
            "user": "kazkap"
        },
        {
            "date": "July 20, 2008",
            "detail_rating": {
                "business": null,
                "cleanliness": null,
                "desk": null,
                "location": null,
                "pool": null,
                "restaurant": null,
                "rooms": null,
                "service": null,
                "sleep": null,
                "value": null
            },
            "helpfulness": null,
            "id": 18059319,
            "likes": {
                "disliked": null,
                "liked": null
            },
            "rating": 3.0,
            "stay_parameters": null,
            "text": "The complex is brand new so very fresh and modern. The room was very large with lovely new decor. The room also had a great little mini kitchenette at the end that we didn't use but would be handy for longer stays, especially if you had children (we left ours at home with nanna!). The bed was a massive king size but quite uncomfortable as it joined together with a seam down the middle, obviously so it can be pulled apart to make up other bed configurations, not nice to sleep on. The old CRT TV looked very out of place in this otherwise stylish room.",
            "title": "Great relaxation spot.....",
            "user": "rkca56"
        },
        {
            "date": "June 27, 2008",
            "detail_rating": {
                "business": 4.0,
                "cleanliness": 5.0,
                "desk": null,
                "front_desk": 4.0,
                "location": 4.0,
                "pool": null,
                "restaurant": null,
                "rooms": 5.0,
                "service": 4.0,
                "sleep": null,
                "value": 3.0
            },
            "helpfulness": 1,
            "id": 17295983,
            "likes": {
                "disliked": "\u2014 Hard to find due to no sign, some teething problems still",
                "liked": "\u2014 Very modern and good location"
            },
            "rating": 4.0,
            "stay_parameters": "Stayed June 2008, traveled on business",
            "text": "The brasserie was lovely to sit outside and overlook the harbour with a drink or two... It also had a very nice breakfast. We arrived just after a large group had left and the staff apologised and replenished the whole breakfast buffet within 5 mins.",
            "title": "New and trying hard",
            "user": "Clea700"
        },
        {
            "date": "May 20, 2008",
            "detail_rating": {
                "business": null,
                "cleanliness": 4.0,
                "desk": null,
                "front_desk": 2.0,
                "location": 4.0,
                "pool": null,
                "restaurant": null,
                "rooms": 4.0,
                "service": 4.0,
                "sleep": null,
                "value": 3.0
            },
            "helpfulness": 1,
            "id": 16264083,
            "likes": {
                "disliked": "\u2014 Not Guest friendly",
                "liked": "\u2014 Everything new - Great"
            },
            "rating": 2.0,
            "stay_parameters": "Stayed May 2008, traveled as a couple",
            "text": "Overall a lovely hotel, despite the bed. I would recommend going to Chachis for dinner, a lovely LITTLE Italian restaurant in one of the Kiama terrace houses- yum! I would also plan a trip around the Kiama markets, very worthwhile.",
            "title": "Nice- but some problems",
            "user": "Treborleo"
        },
        {
            "date": "April 29, 2008",
            "detail_rating": {
                "business": 2.0,
                "cleanliness": 5.0,
                "desk": null,
                "front_desk": 4.0,
                "location": 5.0,
                "pool": null,
                "restaurant": null,
                "rooms": 4.0,
                "service": 4.0,
                "sleep": null,
                "value": 3.0
            },
            "helpfulness": 4,
            "id": 15451456,
            "likes": {
                "disliked": "\u2014 Lack of health facilities, limited dining options in the restaurant.",
                "liked": "\u2014 Location, views, room quality, cleanliness"
            },
            "rating": 4.0,
            "stay_parameters": "Stayed April 2008, traveled solo",
            "text": "My husband and went on a packagae deal as advertised by the tv show Getaway. I had read the reveiws and was a tad concerned, were my expectations too high? We arrived on the 18/7 and stayed til the morning of the 20/7.",
            "title": "Nice place, but coulda been a contender",
            "user": "Alan_Kay"
        }
    ],
    "slim_ranking": 0.875,
    "stars": 4.5,
    "tripadvisor": {
        "VISITED": false,
        "country_name": null,
        "locality": null,
        "pic_link": null,
        "street_address": null
    },
    "user_rating": 3.5,
    "variance": {
        "average": 3,
        "excellent": 1,
        "poor": 3,
        "terrible": 0,
        "very good": 6
    }
}