{
    "aka": "Room Mate Grace Hotel New York City",
    "description": "A hidden gem in the heart of Times Square, Room Mate Grace is located nearby Bryant Park, Broadway, and Rockefeller Center. Room Mate Grace is the stylish solution for the savvy traveler who wishes to experience the sophistication and fun New York has to offer. Room Mate Grace features a unique lobby and event space, complete with an indoor pool, sauna, and steam room. The 24 hour kiosk is stocked with everything from the most basic supplies to the most decadent treats. Stadium stairs lead to the mezzanine level, a haven for VIPs in the evening and early risers heading off to work who enjoy continental breakfast in style and comfort. The mezzanine doubles as meeting space for those looking to work creatively. DJs spin poolside on Friday and Saturday nights.",
    "detail_rating": {
        "cleanliness": 4.5,
        "location": 5.0,
        "rooms": 4.0,
        "service": 4.0,
        "sleep": 4.0,
        "value": 4.0
    },
    "location": {
        "city": "New York City",
        "continent": null,
        "country": "United States",
        "proposed_city": "York",
        "province": null,
        "region": null
    },
    "name": "Room Mate Grace",
    "places": {
        "aka": [
            "York"
        ],
        "hotel_description": [
            "Bryant",
            "York"
        ],
        "hotel_name": []
    },
    "review_count": 1666,
    "review_count_current": 82,
    "reviews": [
        {
            "date": "November 1, 2005",
            "detail_rating": {
                "business": null,
                "cleanliness": 5.0,
                "desk": null,
                "location": null,
                "pool": null,
                "restaurant": null,
                "rooms": 4.0,
                "service": 4.0,
                "sleep": null,
                "value": 5.0
            },
            "helpfulness": 7,
            "id": 4078942,
            "likes": {
                "disliked": null,
                "liked": null
            },
            "rating": 4.0,
            "stay_parameters": "Stayed November 2004",
            "text": "On first entry to the Hotel QT I had to do a double take to work out where the check in was as it looked like a newsagency counter, festooned with funky postcards, newspapers and packets of gum set in glass on the counter. The Hilton this hotel is not.",
            "title": "Coolness Personified",
            "user": "shonky"
        },
        {
            "date": "November 1, 2005",
            "detail_rating": {
                "business": null,
                "cleanliness": 5.0,
                "desk": null,
                "location": null,
                "pool": null,
                "restaurant": null,
                "rooms": 5.0,
                "service": 5.0,
                "sleep": null,
                "value": 5.0
            },
            "helpfulness": 11,
            "id": 4078345,
            "likes": {
                "disliked": null,
                "liked": null
            },
            "rating": 2.0,
            "stay_parameters": "Stayed October 2005",
            "text": "As the other reviewers have said, this hotel definitely maximises the space of the rooms. My room had 2 single beds wedged into the sleeping part of the room with the main bathroom/kitchen in the other half. The beds are comfy, however I would warn people who are looking to share a room, make sure it is someone you know intimately.",
            "title": "Get as high up as you can!",
            "user": "Bimbohead"
        },
        {
            "date": "October 31, 2005",
            "detail_rating": {
                "business": null,
                "cleanliness": 3.0,
                "desk": null,
                "location": null,
                "pool": null,
                "restaurant": null,
                "rooms": 4.0,
                "service": 3.0,
                "sleep": null,
                "value": 4.0
            },
            "helpfulness": 3,
            "id": 4076037,
            "likes": {
                "disliked": null,
                "liked": null
            },
            "rating": 4.0,
            "stay_parameters": "Stayed October 2005",
            "text": "Free Wifi, a small LCD tv, funky glass bar fridge, iron, all the requirements for a seasoned traveller. And for a cost of USD145 and just off Times Square, almost impossible to go wrong.",
            "title": "Location, Location, Location",
            "user": "IndianaTravelbuff"
        },
        {
            "date": "October 31, 2005",
            "detail_rating": {
                "business": null,
                "cleanliness": 4.0,
                "desk": null,
                "location": null,
                "pool": null,
                "restaurant": null,
                "rooms": 4.0,
                "service": 5.0,
                "sleep": null,
                "value": 5.0
            },
            "helpfulness": 3,
            "id": 4075961,
            "likes": {
                "disliked": null,
                "liked": null
            },
            "rating": 4.0,
            "stay_parameters": "Stayed October 2005",
            "text": "The only negatives, check in was strictly after 3pm due to their being full. Probably a common problem with their prices. This is offset by the midday checkout. Then lighting in the shower (a walk in \"wet room style\") is almost non existant and the same in the toilet. Also no door on either, so once again, only share a room if you know the person *very* well.",
            "title": "Great place for the money",
            "user": "ladybirdhill"
        },
        {
            "date": "October 27, 2005",
            "detail_rating": {
                "business": null,
                "cleanliness": 5.0,
                "desk": null,
                "location": null,
                "pool": null,
                "restaurant": null,
                "rooms": 4.0,
                "service": 4.0,
                "sleep": null,
                "value": 5.0
            },
            "helpfulness": 2,
            "id": 4055146,
            "likes": {
                "disliked": null,
                "liked": null
            },
            "rating": 4.0,
            "stay_parameters": "Stayed October 2005",
            "text": "In summary - somewhere I would definitely, definitely say again.",
            "title": "QT - good value",
            "user": "atlas750"
        },
        {
            "date": "March 11, 2006",
            "detail_rating": {
                "business": null,
                "cleanliness": 4.0,
                "desk": null,
                "location": null,
                "pool": null,
                "restaurant": null,
                "rooms": 4.0,
                "service": 4.0,
                "sleep": null,
                "value": 4.0
            },
            "helpfulness": 3,
            "id": 4600605,
            "likes": {
                "disliked": null,
                "liked": null
            },
            "rating": 5.0,
            "stay_parameters": "Stayed February 2006",
            "text": "This was our first time in New York and we had a great time, made even more memorable by the QT which we booked after seeing it mentioned in one of the Sunday broadsheets.",
            "title": "First visit to New York",
            "user": "SMOD"
        },
        {
            "date": "March 4, 2006",
            "detail_rating": {
                "business": null,
                "cleanliness": 5.0,
                "desk": null,
                "location": null,
                "pool": null,
                "restaurant": null,
                "rooms": 4.0,
                "service": 4.0,
                "sleep": null,
                "value": 4.0
            },
            "helpfulness": 7,
            "id": 4581626,
            "likes": {
                "disliked": null,
                "liked": null
            },
            "rating": 5.0,
            "stay_parameters": "Stayed February 2006",
            "text": "Everything we had read in the reviews was largely correct.",
            "title": "QT - one of the best in NYC.",
            "user": "Drewhuge"
        },
        {
            "date": "March 2, 2006",
            "detail_rating": {
                "business": null,
                "cleanliness": null,
                "desk": null,
                "location": null,
                "pool": null,
                "restaurant": null,
                "rooms": null,
                "service": null,
                "sleep": null,
                "value": null
            },
            "helpfulness": 5,
            "id": 4569109,
            "likes": {
                "disliked": null,
                "liked": null
            },
            "rating": 4.0,
            "stay_parameters": null,
            "text": "The hotel is chic, very well placed about 100 yards from Times Square. The pool adds to the atmosphere and it clearly attracts the beautiful people.",
            "title": "And very hush hush",
            "user": "idleL"
        },
        {
            "date": "February 13, 2006",
            "detail_rating": {
                "business": null,
                "cleanliness": null,
                "desk": null,
                "location": null,
                "pool": null,
                "restaurant": null,
                "rooms": null,
                "service": null,
                "sleep": null,
                "value": null
            },
            "helpfulness": 6,
            "id": 4458463,
            "likes": {
                "disliked": null,
                "liked": null
            },
            "rating": 3.0,
            "stay_parameters": null,
            "text": "The beds as stated elsewhere are great but mind your head on the bunks.",
            "title": "Not what expected",
            "user": "A TripAdvisor user"
        },
        {
            "date": "February 13, 2006",
            "detail_rating": {
                "business": null,
                "cleanliness": 4.0,
                "desk": null,
                "location": null,
                "pool": null,
                "restaurant": null,
                "rooms": 5.0,
                "service": 4.0,
                "sleep": null,
                "value": 5.0
            },
            "helpfulness": 8,
            "id": 4457603,
            "likes": {
                "disliked": null,
                "liked": null
            },
            "rating": 5.0,
            "stay_parameters": "Stayed December 2005",
            "text": "A great and friendly experience in the city that doesn't sleep",
            "title": "New Year's Eve, Great Place to Stay!",
            "user": "kimkru"
        },
        {
            "date": "July 17, 2007",
            "detail_rating": {
                "business": null,
                "cleanliness": 5.0,
                "desk": null,
                "front_desk": 5.0,
                "location": 4.0,
                "pool": null,
                "restaurant": null,
                "rooms": 5.0,
                "service": 5.0,
                "sleep": null,
                "value": 5.0
            },
            "helpfulness": 3,
            "id": 8133132,
            "likes": {
                "disliked": "\u2014 i wouldnt change a thing - except the lenght of my stay, i would have made it longer!",
                "liked": "\u2014 the beds and the fantastic staff"
            },
            "rating": 5.0,
            "stay_parameters": "Stayed April 2007, traveled as a couple",
            "text": "This was my first trip to NYC and i had been planning it for about 4 months. My friend recommended this Hotel to me as a budget, basic, modern hotel, sounded perfect. I am a member of Mr and Mrs Smith and the hotel was on there so we booked it through them. When we arrived at aprox 2am we were greeted with a huge smile and and a warm welcome from the front of house staff. We where then given a free room upgrade and vouchers for our free drinks in the bar (the free drink was part of the deal through Mr and Mrs Smith but the upgrade was not). The room had a humongous king size bed and another small double bed suspended from the ceiling. sink in the living area near the closet and a big bathroom with huge shower. I have never slept in a more comfortable bed in my life, it made it very hard to get out of it each morning! There was no view to speak of but it really really didnt make a difference. the location of the hotel is just off Times Square and it takes no time at all to get anywhere in the city by Taxi. I would recommend this hotel to anyone and everyone. The staff are really friendly, helpful and professional, the rooms are great and the location ideal for a first timer. Book it now!",
            "title": "The Fabulous Hotel QT",
            "user": "glamorama"
        },
        {
            "date": "July 14, 2007",
            "detail_rating": {
                "business": null,
                "cleanliness": null,
                "desk": null,
                "location": null,
                "pool": null,
                "restaurant": null,
                "rooms": null,
                "service": null,
                "sleep": null,
                "value": null
            },
            "helpfulness": 4,
            "id": 8116993,
            "likes": {
                "disliked": null,
                "liked": null
            },
            "rating": 3.0,
            "stay_parameters": null,
            "text": "Our stay was an experience!",
            "title": "Too \"weird\" if you consider yourself \"normal\"",
            "user": "A TripAdvisor user"
        },
        {
            "date": "July 13, 2007",
            "detail_rating": {
                "business": 2.0,
                "cleanliness": 2.0,
                "desk": null,
                "front_desk": 1.0,
                "location": 2.0,
                "pool": null,
                "restaurant": null,
                "rooms": 2.0,
                "service": 1.0,
                "sleep": null,
                "value": 1.0
            },
            "helpfulness": 4,
            "id": 8110278,
            "likes": {
                "disliked": "\u2014 Chlorine odor in the lobby and breakfast area",
                "liked": "\u2014 The bed was comfortable"
            },
            "rating": 1.0,
            "stay_parameters": "Stayed April 2007, traveled solo",
            "text": "UPs:",
            "title": "Big mistake",
            "user": "MountainViewer"
        },
        {
            "date": "July 13, 2007",
            "detail_rating": {
                "business": 3.0,
                "cleanliness": 5.0,
                "desk": null,
                "front_desk": 5.0,
                "location": 5.0,
                "pool": null,
                "restaurant": null,
                "rooms": 4.0,
                "service": 5.0,
                "sleep": null,
                "value": 5.0
            },
            "helpfulness": 2,
            "id": 8109469,
            "likes": {
                "disliked": "\u2014 The size.",
                "liked": "\u2014 The price."
            },
            "rating": 4.0,
            "stay_parameters": "Stayed July 2007, traveled solo",
            "text": "- Location / Rates / Bed and pillows / TV, DVD and CD / free and good breakfast / free wireless internet conection",
            "title": "A Cut Above.",
            "user": "spbyrne"
        },
        {
            "date": "July 11, 2007",
            "detail_rating": {
                "business": null,
                "cleanliness": 3.0,
                "desk": null,
                "front_desk": 3.0,
                "location": 4.0,
                "pool": null,
                "restaurant": null,
                "rooms": 4.0,
                "service": 3.0,
                "sleep": null,
                "value": 4.0
            },
            "helpfulness": 2,
            "id": 8102524,
            "likes": {
                "disliked": null,
                "liked": null
            },
            "rating": 4.0,
            "stay_parameters": "Stayed June 2007, traveled as a couple",
            "text": "DOWNs",
            "title": "Trendy Midtown Hotel",
            "user": "Mimsicle"
        },
        {
            "date": "August 7, 2007",
            "detail_rating": {
                "business": null,
                "cleanliness": null,
                "desk": null,
                "location": null,
                "pool": null,
                "restaurant": null,
                "rooms": null,
                "service": null,
                "sleep": null,
                "value": null
            },
            "helpfulness": 3,
            "id": 8366344,
            "likes": {
                "disliked": null,
                "liked": null
            },
            "rating": 5.0,
            "stay_parameters": null,
            "text": "This was a great hotel to stay at, in the heart of NYC, the staff were fabulous, the room was fun!! Do not stay if you are expecting\"laura ashley\" florals. This is a very modern, functional hotel. The pool was a great added bonus, the music excellent, wireless internet access, all good nothing bad!!",
            "title": "Absolutely Fabulous",
            "user": "fitzgeraldjack"
        },
        {
            "date": "August 6, 2007",
            "detail_rating": {
                "business": 4.0,
                "cleanliness": 4.0,
                "desk": null,
                "front_desk": 5.0,
                "location": 4.0,
                "pool": null,
                "restaurant": null,
                "rooms": 3.0,
                "service": 4.0,
                "sleep": null,
                "value": 2.0
            },
            "helpfulness": 1,
            "id": 8361003,
            "likes": {
                "disliked": "\u2014 only one and very small room window",
                "liked": "\u2014 location"
            },
            "rating": 4.0,
            "stay_parameters": "Stayed August 2007",
            "text": "chose the hotel based on the little availability in town on the dates I stayed, and for the only available option at QT I paid 400$+ per night.",
            "title": "fine atmosphere, but room w hardly any daylight",
            "user": "tripper-TA"
        },
        {
            "date": "August 1, 2007",
            "detail_rating": {
                "business": null,
                "cleanliness": null,
                "desk": null,
                "location": null,
                "pool": null,
                "restaurant": null,
                "rooms": null,
                "service": null,
                "sleep": null,
                "value": null
            },
            "helpfulness": 2,
            "id": 8273392,
            "likes": {
                "disliked": null,
                "liked": null
            },
            "rating": 4.0,
            "stay_parameters": null,
            "text": "Hotel was generally good but obviously no value for money.",
            "title": "Ultra-modern scene",
            "user": "mdavenport"
        },
        {
            "date": "July 29, 2007",
            "detail_rating": {
                "business": 4.0,
                "cleanliness": 4.0,
                "desk": null,
                "front_desk": 2.0,
                "location": 5.0,
                "pool": null,
                "restaurant": null,
                "rooms": 4.0,
                "service": 2.0,
                "sleep": null,
                "value": 3.0
            },
            "helpfulness": 4,
            "id": 8252093,
            "likes": {
                "disliked": "\u2014 very small rooms",
                "liked": "\u2014 comfy bed"
            },
            "rating": 3.0,
            "stay_parameters": "Stayed July 2007, traveled as a couple",
            "text": "Very friendly and helpful personnel at check-in, large room on 3rd floor, with one very small window of say one yard by one yard. If you need to spend daytime inside your room = QT not to be recommended.",
            "title": "cute and modern",
            "user": "carolina411"
        },
        {
            "date": "July 23, 2007",
            "detail_rating": {
                "business": 4.0,
                "cleanliness": 5.0,
                "desk": null,
                "front_desk": 5.0,
                "location": 4.0,
                "pool": null,
                "restaurant": null,
                "rooms": 5.0,
                "service": 5.0,
                "sleep": null,
                "value": 4.0
            },
            "helpfulness": 3,
            "id": 8221704,
            "likes": {
                "disliked": null,
                "liked": "\u2014 Cozy Rooms"
            },
            "rating": 4.0,
            "stay_parameters": "Stayed July 2007, traveled with family",
            "text": "Difficult also to get good cell phone contact from inside the room.",
            "title": "Cozy Paradise in Bustling NYC",
            "user": "Annabel0402"
        },
        {
            "date": "May 4, 2007",
            "detail_rating": {
                "business": 5.0,
                "cleanliness": 5.0,
                "desk": null,
                "front_desk": 5.0,
                "location": 1.0,
                "pool": null,
                "restaurant": null,
                "rooms": 4.0,
                "service": 5.0,
                "sleep": null,
                "value": 5.0
            },
            "helpfulness": 2,
            "id": 7545511,
            "likes": {
                "disliked": "\u2014 Times Square.",
                "liked": "\u2014 The rooms and the Wi-Fi."
            },
            "rating": 4.0,
            "stay_parameters": "Stayed April 2007, traveled on business",
            "text": "This is the second time I've stayed at the Hotel QT. The rooms are quiet, calm, and clean. The free breakfast and free Wi-Fi make this a good value. I was in a room on the third floor, so I could hear the thumpa-thumpa-thumpa of the speakers from the bar downstairs at night. It didn't bother me, but I know that it would drive my husband bananas if he had been traveling with me.",
            "title": "Good Value, Comfy Beds, Crazy Neighborhood",
            "user": "anita3544"
        },
        {
            "date": "April 22, 2007",
            "detail_rating": {
                "business": 3.0,
                "cleanliness": 4.0,
                "desk": null,
                "front_desk": 4.0,
                "location": 5.0,
                "pool": null,
                "restaurant": null,
                "rooms": 4.0,
                "service": 4.0,
                "sleep": null,
                "value": 4.0
            },
            "helpfulness": 3,
            "id": 7416389,
            "likes": {
                "disliked": null,
                "liked": null
            },
            "rating": 4.0,
            "stay_parameters": "Stayed April 2007, traveled on business",
            "text": "My big problem is that Times Square is getting so out-of-control crowded that I'm not sure I want to stay there anymore. I come to NYC primarily for business, and it gets tiring, pushing through the millions of people who have never seen a Toys-R-Us before just to get to the subway downtown.",
            "title": "QT Multiple Stays",
            "user": "oatmealflood"
        },
        {
            "date": "April 15, 2007",
            "detail_rating": {
                "business": 4.0,
                "cleanliness": 5.0,
                "desk": null,
                "front_desk": 5.0,
                "location": 5.0,
                "pool": null,
                "restaurant": null,
                "rooms": 5.0,
                "service": 5.0,
                "sleep": null,
                "value": 4.0
            },
            "helpfulness": 5,
            "id": 7365284,
            "likes": {
                "disliked": "\u2014 no free internet - but free wifi if got own alptop",
                "liked": "\u2014 bed"
            },
            "rating": 5.0,
            "stay_parameters": "Stayed April 2007, traveled as a couple",
            "text": "I'll probably be back, but not during high tourist season.",
            "title": "Excellent stay at the QT",
            "user": "Welsh_Yorkie"
        },
        {
            "date": "April 14, 2007",
            "detail_rating": {
                "business": 5.0,
                "cleanliness": 4.0,
                "desk": null,
                "front_desk": 5.0,
                "location": 3.0,
                "pool": null,
                "restaurant": null,
                "rooms": 4.0,
                "service": 5.0,
                "sleep": null,
                "value": 4.0
            },
            "helpfulness": 4,
            "id": 7349711,
            "likes": {
                "disliked": "\u2014 Open plan bathroom",
                "liked": "\u2014 Service"
            },
            "rating": 4.0,
            "stay_parameters": "Stayed April 2007",
            "text": "My business has taken me to NYC twice in the past month and Hotel QT is on their preferred vendor list. I was so pleased with my stay the first time around I begged to have them book it the second time for my week stay. The location is stellar. Pubs for a night cap right next door, Duane Reade for essentials right up the block...and most importantly Times Square a stone's throw from the front door. The staff was freindly and helpful, the complimentary breakfast...while light...is still a good value and beats the egg wedge and crusty potato cake you get at most \"free breakfasts\". The pool was the discussion of my trip the whole time. My business associates who stayed at other hotels did not believe I had a swim-up bar at the hotel and it took a google search to prove it. The best part of the pool area for me is that they had underwater speakers and they CARED about the music. Most places hit the radio and forget about it. You can tell that the music is suited for the arc of the day. Very quiet and calming early morning and gradually increasing in energy until nighttime when it is bumpin. Certainly not a place for the modest! All of the lobby and bar area can see you in pool (what polar bears must feel like at zoo) and my shower on the 11th floor had a HUGE bay window looking out to offices across...half was frosted...but anyone with binoculars and some time could get quite a show looking at that hotel. The bed was TOO comfortable...it was quite hard to get out of it each morning! Once I did however, had a swim, had a steam, had free breakfast, enjoyed my rain shower, got dressed and hit the city...I felt rested, relaxed, and rejuvinated...all signs of a good hotel. Love the QT....charming...inventive...quirky...fun!!! Try something new...you will love it.",
            "title": "Open plan bathroom! :(",
            "user": "Annika V"
        },
        {
            "date": "March 12, 2007",
            "detail_rating": {
                "business": 5.0,
                "cleanliness": 5.0,
                "desk": null,
                "front_desk": 3.0,
                "location": 5.0,
                "pool": null,
                "restaurant": null,
                "rooms": 3.0,
                "service": 3.0,
                "sleep": null,
                "value": 4.0
            },
            "helpfulness": 3,
            "id": 7014680,
            "likes": {
                "disliked": "\u2014 Teeny tiny rooms",
                "liked": "\u2014 The pool, sauna and steam room!"
            },
            "rating": 4.0,
            "stay_parameters": "Stayed February 2007, traveled as a couple",
            "text": "Myself and my partner have just returned from a 6 night stay at the hotel Qt. Having read some of the reviews on the website we were slightly concerned about the size of room we were to have and the activities within the pool area!",
            "title": "Sleek and Comfortable",
            "user": "cherishee"
        },
        {
            "date": "May 30, 2006",
            "detail_rating": {
                "business": null,
                "cleanliness": 5.0,
                "desk": null,
                "location": null,
                "pool": null,
                "restaurant": null,
                "rooms": 4.0,
                "service": 5.0,
                "sleep": null,
                "value": 5.0
            },
            "helpfulness": 4,
            "id": 5233500,
            "likes": {
                "disliked": null,
                "liked": null
            },
            "rating": 4.0,
            "stay_parameters": "Stayed May 2006",
            "text": "The hotel is in a great location right next to times square. It has a kind of budget-trendy and friendly vibe to it. The people at the front desk don't have the attitute you sometimes find at new york hotels. I paid for the lowest category room but somehow got upgraded to one of the \"penthouses\". I guess it was big by new york standards, would be tiny in any other city, i couldn't imagine how big the other rooms are. I'm not really picky about room size though considering it was only $200/night. The bed makes up for most if not any minor problems the hotel has. Sooo comfortable with egyptian cotton sheets and the room temperature is always perfect. Everything in the room is minimal and clean which I appreciated. The pool and bar area was nice too. I'm trying to think of anything I didn't like about it but for the price it was almost perfect. Oh yeah the rain showers are also amazing. I recommend it if you're looking for an inexpensive hotel that is also clean and well located.",
            "title": "Great for what you pay",
            "user": "fan987"
        },
        {
            "date": "May 29, 2006",
            "detail_rating": {
                "business": null,
                "cleanliness": null,
                "desk": null,
                "location": null,
                "pool": null,
                "restaurant": null,
                "rooms": null,
                "service": null,
                "sleep": null,
                "value": null
            },
            "helpfulness": 4,
            "id": 5230805,
            "likes": {
                "disliked": null,
                "liked": null
            },
            "rating": 5.0,
            "stay_parameters": null,
            "text": "The rooms were small (not the smallest I've been in in Times Square), but considering the price and the location, it was pretty awesome. What was particularly impressive was how they managed the space, it never felt cramped, and it had a very New York style to it. The staff was friendly, the bar was happening, and the pool may have been the swankiest place I've ever seen; we even had a live DJ for just the two of us as we swam. I highly recommend.",
            "title": "awesome, trendy hotel",
            "user": "A TripAdvisor user"
        },
        {
            "date": "May 15, 2006",
            "detail_rating": {
                "business": null,
                "cleanliness": null,
                "desk": null,
                "location": null,
                "pool": null,
                "restaurant": null,
                "rooms": null,
                "service": null,
                "sleep": null,
                "value": null
            },
            "helpfulness": 4,
            "id": 5068760,
            "likes": {
                "disliked": null,
                "liked": null
            },
            "rating": 2.0,
            "stay_parameters": null,
            "text": "Visited the Hotel QT for the third time in early May. In the past, we have enjoyed this hotel. This time, our experience was not a pleasant one.",
            "title": "Third time Not a charm",
            "user": "trudy3649"
        },
        {
            "date": "May 9, 2006",
            "detail_rating": {
                "business": null,
                "cleanliness": 5.0,
                "desk": null,
                "location": null,
                "pool": null,
                "restaurant": null,
                "rooms": 4.0,
                "service": 5.0,
                "sleep": null,
                "value": 5.0
            },
            "helpfulness": 11,
            "id": 5044469,
            "likes": {
                "disliked": null,
                "liked": null
            },
            "rating": 5.0,
            "stay_parameters": "Stayed May 2006",
            "text": "Our first room was facing the street. Very noisey - at 3am we were awakened by the garbage trucks. The noise continued for at least a half hour. The next day, we moved to the back of the hotel. Unpacked again, only to find our tv didn't work! Our third room was very nice and much larger than the first two but again there were major problems so we moved to the Millenium accross the street.",
            "title": "What a QT",
            "user": "zoeroberts"
        },
        {
            "date": "May 4, 2006",
            "detail_rating": {
                "business": null,
                "cleanliness": 5.0,
                "desk": null,
                "location": null,
                "pool": null,
                "restaurant": null,
                "rooms": 5.0,
                "service": 5.0,
                "sleep": null,
                "value": 5.0
            },
            "helpfulness": 3,
            "id": 5032788,
            "likes": {
                "disliked": null,
                "liked": null
            },
            "rating": 5.0,
            "stay_parameters": "Stayed April 2006",
            "text": "The hotel is in a great location but the security is very lax. Rarley is there any one watching the door when the guest come and go after 10pm. None of the staff wear any type of identification which can be a problem if somone knocks on your door saying they are with the hotel. The hallways are very dark and as a woman, I was not comfortable walking alone at night to my room. The elevators take forever so we often chose to use the stairs - at least we got our exercise.",
            "title": "The best deal in Times Square",
            "user": "Koei-Seun"
        },
        {
            "date": "July 5, 2007",
            "detail_rating": {
                "business": null,
                "cleanliness": 4.0,
                "desk": null,
                "front_desk": 4.0,
                "location": 5.0,
                "pool": null,
                "restaurant": null,
                "rooms": 5.0,
                "service": 4.0,
                "sleep": null,
                "value": 4.0
            },
            "helpfulness": 5,
            "id": 8065378,
            "likes": {
                "disliked": "\u2014 No fan in the bathroom",
                "liked": "\u2014 It was unique and unconventional"
            },
            "rating": 4.0,
            "stay_parameters": "Stayed July 2007, traveled with friends",
            "text": "Wasn't sure what to expect but was very pleasantly surprised. All front desk staff except one or two people were super helpful and friendly. King bed was super comfortable. More counter space in the bathroom would have been nice but no biggie. Pool and lounge were super chique. Breakfast was just right. Front desk is a retro 50's style candy counter. Location is awesome near Time Square but a few steps out of the hub bub and centrally located in Midtown. Room was plenty spacious for two. Nothing was lacking. Would stay again if I could get another good deal. Was lucky enough to get an avg/night price of $179 CAN for five nights + taxes and fees. Friends from New York visited us at the hotel and they plan on recommending it to their visitors to the city. But ask for an upgrade to a King when you check in.",
            "title": "Fun and Different",
            "user": "psyche115"
        },
        {
            "date": "June 23, 2007",
            "detail_rating": {
                "business": 3.0,
                "cleanliness": 5.0,
                "desk": null,
                "front_desk": 5.0,
                "location": 5.0,
                "pool": null,
                "restaurant": null,
                "rooms": 5.0,
                "service": 5.0,
                "sleep": null,
                "value": 5.0
            },
            "helpfulness": 4,
            "id": 7971925,
            "likes": {
                "disliked": "\u2014 Leaving",
                "liked": "\u2014 Room"
            },
            "rating": 5.0,
            "stay_parameters": "Stayed June 2007, traveled as a couple",
            "text": "I have just returned from a wonderful 7-night stay at the QT with my girlfriend. I had booked an F Class room, but prior to arriving i emailed the hotel and explained that my girlfriend had been travelling for the last 3 months and we were meeting up in New York and i wanted to book a meal for us both. They recommended a trendy tapas bar (Sortie) and booked it, upgraded our room, and also arranged for flowers to greet her arrival!!",
            "title": "Superb 7 nights",
            "user": "T0lly"
        },
        {
            "date": "May 29, 2007",
            "detail_rating": {
                "business": 5.0,
                "cleanliness": 5.0,
                "desk": null,
                "front_desk": 5.0,
                "location": 5.0,
                "pool": null,
                "restaurant": null,
                "rooms": 5.0,
                "service": 5.0,
                "sleep": null,
                "value": 5.0
            },
            "helpfulness": 6,
            "id": 7712589,
            "likes": {
                "disliked": "\u2014 the sauna wasn't working when we tried...",
                "liked": "\u2014 the beds, ipod deck in room & bar"
            },
            "rating": 5.0,
            "stay_parameters": "Stayed May 2007, traveled as a couple",
            "text": "The hotel itself is very hip, breakfast was great, croissants, bagels, cereal juice fruit etc Just what u need before a day of sight seeing.",
            "title": "I recommend this hotel!",
            "user": "Surrey_Bird80"
        },
        {
            "date": "May 23, 2007",
            "detail_rating": {
                "business": null,
                "cleanliness": 5.0,
                "desk": null,
                "front_desk": 5.0,
                "location": 5.0,
                "pool": null,
                "restaurant": null,
                "rooms": 5.0,
                "service": 5.0,
                "sleep": null,
                "value": 5.0
            },
            "helpfulness": 3,
            "id": 7682319,
            "likes": {
                "disliked": "\u2014 Nothing",
                "liked": "\u2014 Comfort of the room"
            },
            "rating": 5.0,
            "stay_parameters": "Stayed April 2007, traveled solo",
            "text": "I used the pool/sauna/steam room a couple of times n it was always empty. Bar was also good, with friendly bar-staff.",
            "title": "Can't wait to go back!",
            "user": "lucy2001"
        },
        {
            "date": "May 15, 2007",
            "detail_rating": {
                "business": 5.0,
                "cleanliness": 5.0,
                "desk": null,
                "front_desk": 4.0,
                "location": 5.0,
                "pool": null,
                "restaurant": null,
                "rooms": 5.0,
                "service": 5.0,
                "sleep": null,
                "value": 4.0
            },
            "helpfulness": 5,
            "id": 7625913,
            "likes": {
                "disliked": "\u2014 no view from rooms - but spent most time out of the room anyway!",
                "liked": "\u2014 Location breakfast cleanliness and price"
            },
            "rating": 5.0,
            "stay_parameters": "Stayed May 2007, traveled as a couple",
            "text": "Staff on the desk were always helpful and nothing was too much trouble. Location is great, literally 50 yards from times square.",
            "title": "Hotel QT was great",
            "user": "Paulaura82"
        },
        {
            "date": "September 30, 2005",
            "detail_rating": {
                "business": null,
                "cleanliness": 5.0,
                "desk": null,
                "location": null,
                "pool": null,
                "restaurant": null,
                "rooms": 5.0,
                "service": 3.0,
                "sleep": null,
                "value": 4.0
            },
            "helpfulness": 5,
            "id": 3980340,
            "likes": {
                "disliked": null,
                "liked": null
            },
            "rating": 5.0,
            "stay_parameters": "Stayed July 2005",
            "text": "My partner and I booked a 4 night stay for a romantic break. We had a fabulous time. The hotel was great. Amazing location, wonderful room (#411), cool bar and pool in the lobby, lesbian/gay friendly. No, the room wasn't massive but there was more than enough space and I have no complaints about that. It was clean , the bed was so comfy, the decor was contemporary and attractive,overall it was fab. Having looked at one of the floor plans I would advise that you don't get a corner room - they do look tiny compared to ours. The pool isn't the kind of place you are going to do laps in but it's great for lounging around in. The continental breakfast in the morning was great and the staff were friendly. I agree that when you asked for advice the staff had to 'google' but they were really nice. My only complaint was that they did not pass on a phone message for me from my partner to say that her plane had been delayed, fortunately this did not cause any problems. We had a wonderful time and I will return on my next trip to NYC.",
            "title": "Perfect hotel for romantic break",
            "user": "munchkp"
        },
        {
            "date": "September 29, 2005",
            "detail_rating": {
                "business": null,
                "cleanliness": null,
                "desk": null,
                "location": null,
                "pool": null,
                "restaurant": null,
                "rooms": null,
                "service": null,
                "sleep": null,
                "value": null
            },
            "helpfulness": 6,
            "id": 3946768,
            "likes": {
                "disliked": null,
                "liked": null
            },
            "rating": 4.0,
            "stay_parameters": null,
            "text": "I have just returned from staying at Hotel QT on West 45th Street. The hotel itself is small and describes itself as \"no frills\" hence if you are looking for a mini bar in your room, look elsewhere. The rooms are very stylishly decorated. Beds are on platforms and furnishings are functional and minimalist. Like most hotels in NYC, the rooms are small but the designer has made great use of the space.",
            "title": "Boutique hotel in NYC",
            "user": "luxuriousliving"
        },
        {
            "date": "September 28, 2005",
            "detail_rating": {
                "business": null,
                "cleanliness": null,
                "desk": null,
                "location": null,
                "pool": null,
                "restaurant": null,
                "rooms": null,
                "service": null,
                "sleep": null,
                "value": null
            },
            "helpfulness": 2,
            "id": 3946650,
            "likes": {
                "disliked": null,
                "liked": null
            },
            "rating": 5.0,
            "stay_parameters": null,
            "text": "A continental style breakfast is free and I found it to be more than adequate. There is a really cool swimming pool that opens up onto the bar so you can have a cosmopolitan in the evenings while swimming up to the bar!",
            "title": "Excellent location and pool bar",
            "user": "victoriamars"
        },
        {
            "date": "September 25, 2005",
            "detail_rating": {
                "business": null,
                "cleanliness": 5.0,
                "desk": null,
                "location": null,
                "pool": null,
                "restaurant": null,
                "rooms": 3.0,
                "service": 5.0,
                "sleep": null,
                "value": 4.0
            },
            "helpfulness": 6,
            "id": 3937191,
            "likes": {
                "disliked": null,
                "liked": null
            },
            "rating": 2.0,
            "stay_parameters": "Stayed September 2005",
            "text": "The one complaint I would have is over the reservations/reception desk. Staff are not very competent in this area and you get the feeling that they need training in room categories and how to check people in!",
            "title": "Great for some but not for everyone",
            "user": "Buddy3567"
        },
        {
            "date": "September 13, 2005",
            "detail_rating": {
                "business": null,
                "cleanliness": null,
                "desk": null,
                "location": null,
                "pool": null,
                "restaurant": null,
                "rooms": null,
                "service": null,
                "sleep": null,
                "value": null
            },
            "helpfulness": 10,
            "id": 3898944,
            "likes": {
                "disliked": null,
                "liked": null
            },
            "rating": 3.0,
            "stay_parameters": null,
            "text": "Overall, great location, nice rooms and very reasonably priced. I would stay there again....",
            "title": "great value for midtown",
            "user": "BradleyW"
        },
        {
            "date": "August 28, 2008",
            "detail_rating": {
                "business": 4.0,
                "cleanliness": 4.0,
                "desk": null,
                "front_desk": 3.0,
                "location": 5.0,
                "pool": null,
                "restaurant": null,
                "rooms": 4.0,
                "service": 4.0,
                "sleep": null,
                "value": 4.0
            },
            "helpfulness": null,
            "id": 19459659,
            "likes": {
                "disliked": "\u2014 Unimpressive lobby",
                "liked": "\u2014 Excellent room, quietness, friendly staff"
            },
            "rating": 4.0,
            "stay_parameters": "Stayed August 2008, traveled as a couple",
            "text": "Room Mate Grace, despite the unusual name, is an excellent choice for a hotel in the Theatre District. Half a block from Times Square, it is nonetheless exceptionally quiet, at least on the upper floors. The lobby is unimpressive and the poorest part of the experience, but you don't book a hotel for its lobby. We were initially booked into a tiny room - you could not access the bed without hitting the TV. After a request, we were relocated to a terrific room, twice the size, at the same cost.",
            "title": "Good Choice",
            "user": "FrequentTravellers"
        },
        {
            "date": "August 27, 2008",
            "detail_rating": {
                "business": 5.0,
                "cleanliness": 5.0,
                "desk": null,
                "front_desk": 2.0,
                "location": 4.0,
                "pool": null,
                "restaurant": null,
                "rooms": 2.0,
                "service": 5.0,
                "sleep": null,
                "value": 3.0
            },
            "helpfulness": null,
            "id": 19431577,
            "likes": {
                "disliked": null,
                "liked": null
            },
            "rating": 3.0,
            "stay_parameters": "Stayed August 2008, traveled as a couple",
            "text": "The platform beds may be a bit difficult to access for older folks or those with some disabilities. Fabulously comfortable, though.",
            "title": "Nice but Understaffed",
            "user": "erm161"
        },
        {
            "date": "August 24, 2008",
            "detail_rating": {
                "business": 5.0,
                "cleanliness": 5.0,
                "desk": null,
                "front_desk": 5.0,
                "location": 5.0,
                "pool": null,
                "restaurant": null,
                "rooms": 5.0,
                "service": 5.0,
                "sleep": null,
                "value": 5.0
            },
            "helpfulness": null,
            "id": 19318727,
            "likes": {
                "disliked": null,
                "liked": "\u2014 Fun atmosphere. Location location location."
            },
            "rating": 5.0,
            "stay_parameters": "Stayed June 2008, traveled on business",
            "text": "Free WiFi. Excellent continental breakfast with REAL espresso. Friendly and helpful staff. Pool, exercise room, sauna and steam room for those so inclined. Can't ask for much more!",
            "title": "Great value for Times Square",
            "user": "purly"
        },
        {
            "date": "August 22, 2008",
            "detail_rating": {
                "business": 4.0,
                "cleanliness": 5.0,
                "desk": null,
                "front_desk": 3.0,
                "location": 5.0,
                "pool": null,
                "restaurant": null,
                "rooms": 4.0,
                "service": 5.0,
                "sleep": null,
                "value": 4.0
            },
            "helpfulness": null,
            "id": 19227663,
            "likes": {
                "disliked": "\u2014 size of room",
                "liked": "\u2014 location"
            },
            "rating": 4.0,
            "stay_parameters": "Stayed August 2008, traveled as a couple",
            "text": "This Times Square hotel staffs 2 receptionists for 139 highly priced rooms. One receptionist called out so we waited in line over 20 minutes for service.",
            "title": "Practical and Modern",
            "user": "paticoLondon"
        },
        {
            "date": "August 21, 2008",
            "detail_rating": {
                "business": 5.0,
                "cleanliness": 5.0,
                "desk": null,
                "front_desk": 5.0,
                "location": 5.0,
                "pool": null,
                "restaurant": null,
                "rooms": 4.0,
                "service": 5.0,
                "sleep": null,
                "value": 5.0
            },
            "helpfulness": 1,
            "id": 19213234,
            "likes": {
                "disliked": "\u2014 The shower pressure :o(",
                "liked": "\u2014 Tim @ Reception!!"
            },
            "rating": 5.0,
            "stay_parameters": "Stayed July 2008, traveled as a couple",
            "text": "The pool area and lounge cater to a younger crowd, which was nice. The place was small but chic - the standard room beds were surrounded by an awkward bench-like border, which makes throwing someone on the bed more of a toss.",
            "title": "LOVED IT!!",
            "user": "squirrel20"
        },
        {
            "date": "October 12, 2005",
            "detail_rating": {
                "business": null,
                "cleanliness": null,
                "desk": null,
                "location": null,
                "pool": null,
                "restaurant": null,
                "rooms": null,
                "service": null,
                "sleep": null,
                "value": null
            },
            "helpfulness": 6,
            "id": 4015811,
            "likes": {
                "disliked": null,
                "liked": null
            },
            "rating": 5.0,
            "stay_parameters": null,
            "text": "My boyfriend and I recently spent 3 nights at the QT for my birthday weekend. Having read the reviews I was expecting a very small dingy bedroom but was incredibly surprised when I opened the door to a large, bright, clean, modern room. Regarding the towels we had a rail in our room so this may be a new installment. We were on the 8th floor. There was space to hang our clothes and room under the bed to hide our suitcases. All in all extremely impressed and happy. I would recommend this to anyone. The comments about it being full of young, trendy model types should not put you off. When we went there was a range of people from late teens to early 60s. Something for everyone. One last thing - the breakfast! This was fantastic. You can eat as much or as little as you want. Fresh coffee, juice, bagels, muffins - wonderful. The hotel staff will also organise a car back to JFK at a fixed price which saves the hassle of a cab.",
            "title": "Fabulous",
            "user": "A TripAdvisor user"
        },
        {
            "date": "October 8, 2005",
            "detail_rating": {
                "business": null,
                "cleanliness": null,
                "desk": null,
                "location": null,
                "pool": null,
                "restaurant": null,
                "rooms": null,
                "service": null,
                "sleep": null,
                "value": null
            },
            "helpfulness": 11,
            "id": 4002119,
            "likes": {
                "disliked": null,
                "liked": null
            },
            "rating": 5.0,
            "stay_parameters": null,
            "text": "Have just returned from a 6 night stay at the Hotel QT after getting married in New York. I had read all the reviews before going out and all seemed to be quite positive, but you are always wary until you get there incase it turns out completely different. Hotel QT surpassed all my expectations and I will definitely be going back there when we go back to New York.",
            "title": "Excellent!!!!",
            "user": "stevom72"
        },
        {
            "date": "October 3, 2005",
            "detail_rating": {
                "business": null,
                "cleanliness": null,
                "desk": null,
                "location": null,
                "pool": null,
                "restaurant": null,
                "rooms": null,
                "service": null,
                "sleep": null,
                "value": null
            },
            "helpfulness": 5,
            "id": 3987503,
            "likes": {
                "disliked": null,
                "liked": null
            },
            "rating": 5.0,
            "stay_parameters": null,
            "text": "Location wise for starters cant be beaten. 50 mtrs from the heart of Time Square, right next door to two excellent irish bars, and close by to metro stations, bus stop,etc.",
            "title": "Hotel QT",
            "user": "A TripAdvisor user"
        },
        {
            "date": "October 1, 2005",
            "detail_rating": {
                "business": null,
                "cleanliness": 5.0,
                "desk": null,
                "location": null,
                "pool": null,
                "restaurant": null,
                "rooms": 4.0,
                "service": 4.0,
                "sleep": null,
                "value": 5.0
            },
            "helpfulness": 5,
            "id": 3982586,
            "likes": {
                "disliked": null,
                "liked": null
            },
            "rating": 4.0,
            "stay_parameters": "Stayed September 2005, traveled on business",
            "text": "The Hotel itself is quite inconspicous from the outside, and probably just looks like a magazine shop to someone looking inside the front window, however you only get too appreciate how cool it is once you actually go inside. The check in desk was also where they sell magazines, drinks etc, however on arrival at about 1:30pm, we were given rooms straight away and found the staff to be very pleasant and helpful, something that we experienced all throughout our stay. From the front door staff to the porters, even the maids cleaning the rooms, everyone always took time to say hello or good morning.",
            "title": "Odd blend of chic and sparse",
            "user": "Wkonsunshine"
        },
        {
            "date": "October 1, 2005",
            "detail_rating": {
                "business": null,
                "cleanliness": 5.0,
                "desk": null,
                "location": null,
                "pool": null,
                "restaurant": null,
                "rooms": 3.0,
                "service": 3.0,
                "sleep": null,
                "value": 4.0
            },
            "helpfulness": 13,
            "id": 3982467,
            "likes": {
                "disliked": null,
                "liked": null
            },
            "rating": 2.0,
            "stay_parameters": "Stayed September 2005",
            "text": "On arriving in our room, we were given one in the front of the hotel on the corner of the building(1210). All the rooms appear to be different sizes and ours was on the small size, however, perfectly adequate for the 6 day stay (including getting dressed on our wedding day). My parents room was (1008) and this was a lot bigger in size, however there wasnt as much natural light in their room and the toilet/shower faced right onto the room.",
            "title": "Beware checking in",
            "user": "rgoz3Dayton_Ohio"
        },
        {
            "date": "October 25, 2005",
            "detail_rating": {
                "business": null,
                "cleanliness": 4.0,
                "desk": null,
                "location": null,
                "pool": null,
                "restaurant": null,
                "rooms": 4.0,
                "service": 3.0,
                "sleep": null,
                "value": 4.0
            },
            "helpfulness": 4,
            "id": 4052650,
            "likes": {
                "disliked": null,
                "liked": null
            },
            "rating": 5.0,
            "stay_parameters": "Stayed September 2005",
            "text": "I usually don't write reviews but after coming here, I just HAD to. It was perfect. Clean and had a cool chic feel to it. The hallways to the rooms seemed a little shady but never had a problem. Never took advantage of the pool but wish we had.",
            "title": "Great!",
            "user": "kimfolz"
        },
        {
            "date": "October 25, 2005",
            "detail_rating": {
                "business": null,
                "cleanliness": null,
                "desk": null,
                "location": null,
                "pool": null,
                "restaurant": null,
                "rooms": null,
                "service": null,
                "sleep": null,
                "value": null
            },
            "helpfulness": 1,
            "id": 4050858,
            "likes": {
                "disliked": null,
                "liked": null
            },
            "rating": 4.0,
            "stay_parameters": null,
            "text": "Location is great. Half a block from Times Square and just a couple blocks from 5th ave and all other shopping. There's always things happening around the corner (we were there for the grand opening of the Hard Rock Cafe at Times Square and Broadway on Broadway).",
            "title": "Great hip \"budget\" hotel",
            "user": "A TripAdvisor user"
        },
        {
            "date": "October 24, 2005",
            "detail_rating": {
                "business": null,
                "cleanliness": null,
                "desk": null,
                "location": null,
                "pool": null,
                "restaurant": null,
                "rooms": null,
                "service": null,
                "sleep": null,
                "value": null
            },
            "helpfulness": 5,
            "id": 4049947,
            "likes": {
                "disliked": null,
                "liked": null
            },
            "rating": 5.0,
            "stay_parameters": null,
            "text": "This was the best anniversary ever!",
            "title": "Best anniversary ever!!",
            "user": "wilmingtonsinger"
        },
        {
            "date": "October 14, 2005",
            "detail_rating": {
                "business": null,
                "cleanliness": 5.0,
                "desk": null,
                "location": null,
                "pool": null,
                "restaurant": null,
                "rooms": 5.0,
                "service": 5.0,
                "sleep": null,
                "value": 5.0
            },
            "helpfulness": 12,
            "id": 4022929,
            "likes": {
                "disliked": null,
                "liked": null
            },
            "rating": 5.0,
            "stay_parameters": "Stayed September 2005",
            "text": "Budget pricing in New York is different than other cities.",
            "title": "QT... so cool!!",
            "user": "travellingmurrays"
        },
        {
            "date": "October 13, 2005",
            "detail_rating": {
                "business": null,
                "cleanliness": 4.0,
                "desk": null,
                "location": null,
                "pool": null,
                "restaurant": null,
                "rooms": 4.0,
                "service": 3.0,
                "sleep": null,
                "value": 4.0
            },
            "helpfulness": 4,
            "id": 4020822,
            "likes": {
                "disliked": null,
                "liked": null
            },
            "rating": 4.0,
            "stay_parameters": "Stayed September 2005",
            "text": "The QT represents good value in this city - my room was spacious - the shower great - bed magnificent - and beigels at breakfast - great!",
            "title": "Would stay again!",
            "user": "CFF"
        },
        {
            "date": "August 21, 2008",
            "detail_rating": {
                "business": null,
                "cleanliness": null,
                "desk": null,
                "location": null,
                "pool": null,
                "restaurant": null,
                "rooms": null,
                "service": null,
                "sleep": null,
                "value": null
            },
            "helpfulness": null,
            "id": 19212949,
            "likes": {
                "disliked": null,
                "liked": null
            },
            "rating": 5.0,
            "stay_parameters": null,
            "text": "Clean, friendly and quiet. Great price and location. Would stay again.",
            "title": "Would stay again",
            "user": "RebaRuth"
        },
        {
            "date": "August 14, 2008",
            "detail_rating": {
                "business": null,
                "cleanliness": 4.0,
                "desk": null,
                "front_desk": 4.0,
                "location": 3.0,
                "pool": null,
                "restaurant": null,
                "rooms": 3.0,
                "service": null,
                "sleep": null,
                "value": 3.0
            },
            "helpfulness": 1,
            "id": 18962802,
            "likes": {
                "disliked": null,
                "liked": null
            },
            "rating": 3.0,
            "stay_parameters": "Stayed August 2008, traveled as a couple",
            "text": "the Room Mate Grace is a pretty interesting little place just one half block from Times Square. Definitely good for first-time visitors because you are right in the heart of a lot of touristy things. The staff was very friendly and helpful and the room was quiet with a comfortable bed that was up on a platform of sorts. I'd never seen anything quite like that!",
            "title": "Funky hotel right in Times Square",
            "user": "theresatoo"
        },
        {
            "date": "August 14, 2008",
            "detail_rating": {
                "business": 4.0,
                "cleanliness": 3.0,
                "desk": null,
                "front_desk": 3.0,
                "location": 4.0,
                "pool": null,
                "restaurant": null,
                "rooms": 3.0,
                "service": 3.0,
                "sleep": null,
                "value": 2.0
            },
            "helpfulness": 1,
            "id": 18944922,
            "likes": {
                "disliked": "\u2014 Small Rooms",
                "liked": "\u2014 Location"
            },
            "rating": 4.0,
            "stay_parameters": "Stayed August 2008, traveled as a couple",
            "text": "They have a funky little pool that overlooks the bar. There are also a few rows of stadium style benches that overlook the pool and a giant TV screen. That was a little random and at 1am looked a bit like a scene from a reality TV show with lots of young hipsters.",
            "title": "Great Location, Cool Hotel",
            "user": "JulieJulesJule"
        },
        {
            "date": "August 13, 2008",
            "detail_rating": {
                "business": 5.0,
                "cleanliness": 5.0,
                "desk": null,
                "front_desk": 5.0,
                "location": 5.0,
                "pool": null,
                "restaurant": null,
                "rooms": 4.0,
                "service": 5.0,
                "sleep": null,
                "value": 5.0
            },
            "helpfulness": 1,
            "id": 18910195,
            "likes": {
                "disliked": null,
                "liked": null
            },
            "rating": 4.0,
            "stay_parameters": "Stayed August 2008, traveled with family",
            "text": "If you are a regular visitor to NYC or arriving by car you may want to stay a little farther away from Times Square :)",
            "title": "Awesome hotel",
            "user": "jjsa-ny"
        },
        {
            "date": "August 7, 2008",
            "detail_rating": {
                "business": null,
                "cleanliness": 5.0,
                "desk": null,
                "front_desk": 5.0,
                "location": 5.0,
                "pool": null,
                "restaurant": null,
                "rooms": 3.0,
                "service": 5.0,
                "sleep": null,
                "value": 5.0
            },
            "helpfulness": null,
            "id": 18711908,
            "likes": {
                "disliked": "\u2014 the space of the bedroom",
                "liked": "\u2014 the hotel is cute in every way!"
            },
            "rating": 5.0,
            "stay_parameters": "Stayed August 2008, traveled as a couple",
            "text": "We've just got back from New York and enjoyed our 2nd stay at the Room Mate Grace (formerly the QT Hotel). It's still a great hotel in a perfect mid-town location next to Times Square.",
            "title": "We loved it!",
            "user": "Braziliancouple2008"
        },
        {
            "date": "August 6, 2008",
            "detail_rating": {
                "business": null,
                "cleanliness": 5.0,
                "desk": null,
                "front_desk": 5.0,
                "location": 5.0,
                "pool": null,
                "restaurant": null,
                "rooms": 5.0,
                "service": 5.0,
                "sleep": null,
                "value": 4.0
            },
            "helpfulness": null,
            "id": 18670617,
            "likes": {
                "disliked": "\u2014 There are no hooks to hang your towels",
                "liked": "\u2014 Location and breakfast"
            },
            "rating": 4.0,
            "stay_parameters": "Stayed July 2008, traveled as a couple",
            "text": "Great place to stay very central and just a lovely experience. Breakfast is fab and sets you up for the day. Would definitely recommend it as somewhere to stay to friends and family.",
            "title": "Fabulous Stay",
            "user": "numster"
        },
        {
            "date": "August 5, 2008",
            "detail_rating": {
                "business": null,
                "cleanliness": 5.0,
                "desk": null,
                "front_desk": 5.0,
                "location": 4.0,
                "pool": null,
                "restaurant": null,
                "rooms": 5.0,
                "service": 4.0,
                "sleep": null,
                "value": 4.0
            },
            "helpfulness": null,
            "id": 18639037,
            "likes": {
                "disliked": "\u2014 nothing",
                "liked": "\u2014 clean, comfortable, quiet room"
            },
            "rating": 5.0,
            "stay_parameters": "Stayed August 2008, traveled with family",
            "text": "The Hotel Grace is an oasis in the middle of Times Square. Front desk staff were very friendly and helpful. Rooms are attractive, comfortable, clean, and quiet. Plus, on a hot day, what can beat a refreshing dip in the pool?",
            "title": "My Favorite Hotel",
            "user": "guin80"
        },
        {
            "date": "July 25, 2008",
            "detail_rating": {
                "business": null,
                "cleanliness": null,
                "desk": null,
                "location": null,
                "pool": null,
                "restaurant": null,
                "rooms": null,
                "service": null,
                "sleep": null,
                "value": null
            },
            "helpfulness": 1,
            "id": 18247472,
            "likes": {
                "disliked": null,
                "liked": null
            },
            "rating": 5.0,
            "stay_parameters": null,
            "text": "We spent 4 nights at the Roommate Grace Hotel in New York and absolutely loved it! The hotel, located in the heart of Midtown, is well situated close to many attractions - Times Square, Rockefeller Center, Central Park, the Met, MoMA, among others. But its location is not its best feature. We loved the design of the hotel and our room. It is very modern and funky. While small, our room was so well designed that it functioned far better than a regular hotel room. We had ample room to unpack clothes in the closet and store our luggage under our platform bed. The bed itself was amazing; it was so comfortable and had great linens. The bathroom was spacious; the vanity opened into the bedroom but the shower and the toilet were self-contained. Everything was very modern in design.",
            "title": "An amazing hotel in NYC!!!",
            "user": "ELM0718"
        },
        {
            "date": "July 21, 2008",
            "detail_rating": {
                "business": 4.0,
                "cleanliness": 5.0,
                "desk": null,
                "front_desk": 3.0,
                "location": 4.0,
                "pool": null,
                "restaurant": null,
                "rooms": 5.0,
                "service": 4.0,
                "sleep": null,
                "value": 4.0
            },
            "helpfulness": 2,
            "id": 18115779,
            "likes": {
                "disliked": null,
                "liked": "\u2014 Perfect boutique accomodations without the boutique hotel price"
            },
            "rating": 4.0,
            "stay_parameters": "Stayed July 2008, traveled as a couple",
            "text": "Breakfast was included with our room and served in the 2nd floor lounge. Cereals, fruit, yogurt, bagels, toast, eggs, croissants and muffins were offered daily along with juice, coffee, tea and hot chocolate. A small pool is located off the lobby and has a swim-up bar.",
            "title": "Room Mate Grace Hotel - Best 'Room Mate' in NYC",
            "user": "francesca2010"
        },
        {
            "date": "July 11, 2008",
            "detail_rating": {
                "business": null,
                "cleanliness": 5.0,
                "desk": null,
                "front_desk": 5.0,
                "location": 5.0,
                "pool": null,
                "restaurant": null,
                "rooms": 5.0,
                "service": 5.0,
                "sleep": null,
                "value": 5.0
            },
            "helpfulness": null,
            "id": 17794916,
            "likes": {
                "disliked": "\u2014 Nothing",
                "liked": "\u2014 Location"
            },
            "rating": 5.0,
            "stay_parameters": "Stayed June 2008, traveled with friends",
            "text": "The hotel staff are amazing. We always found everyone to be extremely helpful. We arrived in New York at 8:30 a.m. and were immediately given a room. Had a room not been available, they would have happily stored our luggage as they did the day we left but before we caught our flight out. The front desk staff upgraded our room as well! When asking for directions, subway help or restaurant recommendations, they were always ready and willing to help.",
            "title": "Amazing Hotel!",
            "user": "Gillianbeattie"
        },
        {
            "date": "September 19, 2008",
            "detail_rating": {
                "business": 3.0,
                "cleanliness": 4.0,
                "desk": null,
                "front_desk": 4.0,
                "location": 4.0,
                "pool": null,
                "restaurant": null,
                "rooms": 4.0,
                "service": 4.0,
                "sleep": null,
                "value": 3.0
            },
            "helpfulness": null,
            "id": 20206715,
            "likes": {
                "disliked": "\u2014 lobby",
                "liked": "\u2014 location, vibe, staff"
            },
            "rating": 4.0,
            "stay_parameters": "Stayed September 2008, traveled as a couple",
            "text": "Room Mate Grace has an awesome location in Times Square. The front desk crew is very helpful and really worked to get us an awesome place in the Village for dinner upon our late friday night arrival. The only bummer is that the owner held private parties both friday and saturday night so we could not use the bar and there was no DJ there either. Upon checkout they did apologize and say that this was unusual. The breakfast is quite tasty. Our room had lots of windows and good views. Loved the walk in shower too. The bed was comfy, however they need to put in a towel bar though in the bathroom. And, the plasma TV was nice but small. Loved the euro feel and vibe incl. the 'funky wall paper' on the 10th floor. Anyway, we will be back again! I like the newsstand at the checkin too. Oh, and the bag check on the last day was very helpful so we could completely enjoy the city for the day. Solid place to stay especially if you are a fan of modern living.",
            "title": "Good Euro Vibe and Great Location",
            "user": "modbouldergirl"
        },
        {
            "date": "September 15, 2008",
            "detail_rating": {
                "business": null,
                "cleanliness": 5.0,
                "desk": null,
                "front_desk": 5.0,
                "location": 5.0,
                "pool": null,
                "restaurant": null,
                "rooms": 5.0,
                "service": 5.0,
                "sleep": null,
                "value": 3.0
            },
            "helpfulness": null,
            "id": 20091477,
            "likes": {
                "disliked": "\u2014 price",
                "liked": "\u2014 style"
            },
            "rating": 5.0,
            "stay_parameters": "Stayed September 2008, traveled on business",
            "text": "Great style. Great customer service. Clean rooms with just enough ammenities. Very comfortable bed. Soft towels. Thanks for having a hair dryer since NYC was hit by a torrential downpour that I got stuck in! Cool bar area. Stayed here for a business trip. Excellent variety & freshness of continental breakfast. Would definitely consider staying at Room Mate Grace next time I am in NYC as well as other Room Mate properties around the world....for business as well as pleasure travel. Excellent discovery recommended to me by two coworkers (unbeknownst to each other) and glad I made the reservation. Thanks!",
            "title": "Loved Room Mate Grace",
            "user": "sf-traveler08"
        },
        {
            "date": "September 12, 2008",
            "detail_rating": {
                "business": null,
                "cleanliness": null,
                "desk": null,
                "location": null,
                "pool": null,
                "restaurant": null,
                "rooms": null,
                "service": null,
                "sleep": null,
                "value": null
            },
            "helpfulness": null,
            "id": 20015385,
            "likes": {
                "disliked": null,
                "liked": null
            },
            "rating": 5.0,
            "stay_parameters": null,
            "text": "A great hotel, near the Times Square, and 5th avenue. Rooms are very nice and quiet, and all people are very relaxed and friendly. Our new favourite hotel in NY, for our next NY-trip.",
            "title": "We loved Grace",
            "user": "subi79"
        },
        {
            "date": "September 7, 2008",
            "detail_rating": {
                "business": 5.0,
                "cleanliness": 5.0,
                "desk": null,
                "front_desk": 5.0,
                "location": 5.0,
                "pool": null,
                "restaurant": null,
                "rooms": 5.0,
                "service": 5.0,
                "sleep": null,
                "value": 5.0
            },
            "helpfulness": null,
            "id": 19843675,
            "likes": {
                "disliked": "\u2014 phoning the hotel to speak to hotel guests is not very quick to pick up phone but a small point",
                "liked": "\u2014 clean, modern, funky, great location"
            },
            "rating": 5.0,
            "stay_parameters": "Stayed August 2008, traveled as a couple",
            "text": "I cannot reccomend this hotel enough. We stayed 28 Aug - 2 Sept 2008.",
            "title": "Absolutely superb, a real find",
            "user": "robthetraveller_7"
        },
        {
            "date": "September 5, 2008",
            "detail_rating": {
                "business": 4.0,
                "cleanliness": 4.0,
                "desk": null,
                "front_desk": 4.0,
                "location": 4.0,
                "pool": null,
                "restaurant": null,
                "rooms": 4.0,
                "service": 4.0,
                "sleep": null,
                "value": 4.0
            },
            "helpfulness": null,
            "id": 19811082,
            "likes": {
                "disliked": "\u2014 no bathroom door for privacy",
                "liked": "\u2014 comfortable bed and great morning breakfast"
            },
            "rating": 4.0,
            "stay_parameters": "Stayed September 2008, traveled as a couple",
            "text": "It is incredibly clean, our room was upgraded to the 15th floor as it was my daughters 16th birthday. Its location is excellent. The downstairs pool/bar is a cool vibe playing great chilled/funky music but not too much that it disturbs being a hotel guest if the music is not your thing. I have already reccommended this to 3 groups who are going to new york by the end of the year.",
            "title": "Good experience",
            "user": "derinka"
        },
        {
            "date": "May 3, 2006",
            "detail_rating": {
                "business": null,
                "cleanliness": 4.0,
                "desk": null,
                "location": null,
                "pool": null,
                "restaurant": null,
                "rooms": 5.0,
                "service": 4.0,
                "sleep": null,
                "value": 5.0
            },
            "helpfulness": 3,
            "id": 5031841,
            "likes": {
                "disliked": null,
                "liked": null
            },
            "rating": 5.0,
            "stay_parameters": "Stayed April 2006",
            "text": "I go to New York once or twice a year, and am often asked \"where do you stay?\" At last I have an answer!",
            "title": "I Now Have an Answer",
            "user": "Ashley L.M."
        },
        {
            "date": "May 2, 2006",
            "detail_rating": {
                "business": null,
                "cleanliness": null,
                "desk": null,
                "location": null,
                "pool": null,
                "restaurant": null,
                "rooms": null,
                "service": null,
                "sleep": null,
                "value": null
            },
            "helpfulness": 4,
            "id": 5026874,
            "likes": {
                "disliked": null,
                "liked": null
            },
            "rating": 5.0,
            "stay_parameters": null,
            "text": "I stayed in the smallest plan room they have (Option F), and it was the largest room I have had in New York (having stayed at Hotel 41 at twice the price, Hotel 17, Quality Inn, Larchmont, Portland Square, and also some nasty shared-bathroom places from back when I was poorer). The QT was also SO much better.",
            "title": "Cracking Hotel",
            "user": "Tori"
        },
        {
            "date": "April 26, 2006",
            "detail_rating": {
                "business": null,
                "cleanliness": 4.0,
                "desk": null,
                "location": null,
                "pool": null,
                "restaurant": null,
                "rooms": 1.0,
                "service": 4.0,
                "sleep": null,
                "value": 2.0
            },
            "helpfulness": 4,
            "id": 5011584,
            "likes": {
                "disliked": null,
                "liked": null
            },
            "rating": 2.0,
            "stay_parameters": "Stayed April 2006",
            "text": "It may not be nicer than some 400 or 500 a night rooms (I wouldn't know!) but it was the nicest room I've had yet. The staff were very very courteous and friendly; I felt very welcomed. The location, obviously, is brilliant. I stayed in room 607 and could hear street noise (hello, it's New York) but no bar noises, plumbing, neighbours, etc., and of course fell right to sleep on the wonderful bed.",
            "title": "A prison cell would have been an upgrade",
            "user": "Neftist"
        },
        {
            "date": "April 21, 2006",
            "detail_rating": {
                "business": null,
                "cleanliness": null,
                "desk": null,
                "location": null,
                "pool": null,
                "restaurant": null,
                "rooms": null,
                "service": null,
                "sleep": null,
                "value": null
            },
            "helpfulness": 6,
            "id": 4993284,
            "likes": {
                "disliked": null,
                "liked": null
            },
            "rating": 3.0,
            "stay_parameters": null,
            "text": "Obviously, depending on your needs, you may or may not like this hotel. For instance, I like very much that the room cost $175. That's a big deal for me, it means I can stay for a week instead of a couple of days. I like having my own bathroom, but don't care if it's huge (this one is, but it didn't matter to me). I love that there's a table with wheels instead of a desk--I was able to customize my space, move the cushions to a different part of the ledge, it felt very organic.",
            "title": "Good, but not that good",
            "user": "A TripAdvisor user"
        },
        {
            "date": "April 18, 2006",
            "detail_rating": {
                "business": null,
                "cleanliness": 3.0,
                "desk": null,
                "location": null,
                "pool": null,
                "restaurant": null,
                "rooms": 3.0,
                "service": 4.0,
                "sleep": null,
                "value": 4.0
            },
            "helpfulness": 5,
            "id": 4985130,
            "likes": {
                "disliked": null,
                "liked": null
            },
            "rating": 3.0,
            "stay_parameters": "Stayed April 2006",
            "text": "I don't mind no bellman, but maybe you do. I don't mind no shower curtain, again, maybe that's important to you. No drawers? Fine, I put my socks and unmentionables in my suitcase and tucked it under the ledge around the bed.",
            "title": "Great bed! Great Location! No privacy!!",
            "user": "lunamedea"
        },
        {
            "date": "April 12, 2006",
            "detail_rating": {
                "business": null,
                "cleanliness": 4.0,
                "desk": null,
                "location": null,
                "pool": null,
                "restaurant": null,
                "rooms": 4.0,
                "service": 5.0,
                "sleep": null,
                "value": 4.0
            },
            "helpfulness": 10,
            "id": 4966193,
            "likes": {
                "disliked": null,
                "liked": null
            },
            "rating": 4.0,
            "stay_parameters": "Stayed April 2006",
            "text": "My husband and I stayed at Hotel QT April 6 through 9, 2006 after we returned from a Caribbean cruise that left out of New York.",
            "title": "Location, Location, Location!",
            "user": "CruiseLuvinGurl"
        },
        {
            "date": "April 9, 2006",
            "detail_rating": {
                "business": null,
                "cleanliness": 3.0,
                "desk": null,
                "location": null,
                "pool": null,
                "restaurant": null,
                "rooms": 3.0,
                "service": 3.0,
                "sleep": null,
                "value": 2.0
            },
            "helpfulness": 7,
            "id": 4953914,
            "likes": {
                "disliked": null,
                "liked": null
            },
            "rating": 3.0,
            "stay_parameters": "Stayed April 2006",
            "text": "This stylish, chic hotel was right in the middle of everything--just steps from Times Square and the Theater District and close to the subway. Tons of great restaurants and shops within walking distance. The hotel was clean and the bed was no doubt the most comfortable bed I've ever slept in at a hotel--heck, it was more comfortable than my bed at home! The room had a refrigerator, safe, iron and ironing board, small table, and free wireless Internet. My only complaint is that there was no dresser. The bed was high enough so that we could store our suitcases underneath it easily.",
            "title": "Disappointed with Hotel QT",
            "user": "astro50"
        },
        {
            "date": "April 4, 2006",
            "detail_rating": {
                "business": null,
                "cleanliness": 5.0,
                "desk": null,
                "location": null,
                "pool": null,
                "restaurant": null,
                "rooms": 4.0,
                "service": 4.0,
                "sleep": null,
                "value": 5.0
            },
            "helpfulness": 7,
            "id": 4933473,
            "likes": {
                "disliked": null,
                "liked": null
            },
            "rating": 5.0,
            "stay_parameters": "Stayed March 2006",
            "text": "The bathroom was pretty large. It looked like a long, narrow hallway, with the sink and vanity first, the toilet (for anyone who knows anything about plumbing fixtures, the toilet was a Toto, top of the line) in the middle (with a sliding divider door for privacy) and then the HUGE shower. Three people could have showered in it at the same time. We had plenty of toiletries and fresh towels delivered every day.",
            "title": "A+++ Hotel QT",
            "user": "mr_mactee"
        },
        {
            "date": "April 4, 2006",
            "detail_rating": {
                "business": null,
                "cleanliness": 4.0,
                "desk": null,
                "location": null,
                "pool": null,
                "restaurant": null,
                "rooms": 3.0,
                "service": 4.0,
                "sleep": null,
                "value": 5.0
            },
            "helpfulness": 12,
            "id": 4932360,
            "likes": {
                "disliked": null,
                "liked": null
            },
            "rating": 5.0,
            "stay_parameters": "Stayed March 2006",
            "text": "The staff was friendly and helpful. As I mentioned, we had just returned from a cruise so we arrived at the hotel quite early, around 11 a.m. Check-in time is 4:00 p.m., but they allowed us to check in early and we were even upgraded to a deluxe room at no extra charge! VERY nice! The staff was happy to provide directions and printed our airline boarding passes for us the night before our departure.",
            "title": "Chic, affordable Times Square Hotel",
            "user": "KlausTheInspector"
        },
        {
            "date": "March 20, 2006",
            "detail_rating": {
                "business": null,
                "cleanliness": null,
                "desk": null,
                "location": null,
                "pool": null,
                "restaurant": null,
                "rooms": null,
                "service": null,
                "sleep": null,
                "value": null
            },
            "helpfulness": 7,
            "id": 4694930,
            "likes": {
                "disliked": null,
                "liked": null
            },
            "rating": 4.0,
            "stay_parameters": null,
            "text": "I thought the breakfast provided was very nice and very adequate, especially for FREE! Bagels with cream cheese or preserves and muffins, hard-boiled eggs, orange juice, coffee, espresso, yogurt, cold cereals, milk, and various fruits. It was certainly enough to get you going for the day!",
            "title": "A hidden gem",
            "user": "A TripAdvisor user"
        },
        {
            "date": "September 4, 2008",
            "detail_rating": {
                "business": 4.0,
                "cleanliness": 5.0,
                "desk": null,
                "front_desk": 5.0,
                "location": 5.0,
                "pool": null,
                "restaurant": null,
                "rooms": 5.0,
                "service": 5.0,
                "sleep": null,
                "value": 5.0
            },
            "helpfulness": null,
            "id": 19742620,
            "likes": {
                "disliked": "\u2014 Only that the pool was too cold a couple of nights... which is so minimal in the total of our trip.",
                "liked": "\u2014 The location couldn't have been better - just far enough off time square to get a good night sleep, but still close enough to all the action (about 1/2 a block)."
            },
            "rating": 5.0,
            "stay_parameters": "Stayed August 2008, traveled as a couple",
            "text": "Its appraisal of the rooms is 100% true. Small but so well designed it never occurs to you that they are slightly small. and to be honest they arent that small compared to other new york hotel rooms.",
            "title": "Our stay was absolutely amazing!",
            "user": "KimberlyJean"
        },
        {
            "date": "September 1, 2008",
            "detail_rating": {
                "business": 5.0,
                "cleanliness": 5.0,
                "desk": null,
                "front_desk": 5.0,
                "location": 5.0,
                "pool": null,
                "restaurant": null,
                "rooms": 5.0,
                "service": 5.0,
                "sleep": null,
                "value": 4.0
            },
            "helpfulness": null,
            "id": 19595996,
            "likes": {
                "disliked": "\u2014 Nothing",
                "liked": "\u2014 Locality, pool & free internet"
            },
            "rating": 4.0,
            "stay_parameters": "Stayed June 2008, traveled with friends",
            "text": "As we checked out they were starting some building work in the lobby - not sure the extent but might be worth checking if you are staying in Sept 08.",
            "title": "Great location",
            "user": "tinkertaylor10"
        }
    ],
    "slim_ranking": 0.465011286682,
    "stars": 3.5,
    "tripadvisor": {
        "VISITED": false,
        "country_name": null,
        "locality": null,
        "pic_link": null,
        "street_address": null
    },
    "user_rating": 4.0,
    "variance": {
        "average": 186,
        "excellent": 625,
        "poor": 86,
        "terrible": 56,
        "very good": 713
    }
}