{
    "aka": "La Quinta Inn St. Louis - Maryland Heights Hotel",
    "description": null,
    "detail_rating": {
        "cleanliness": null,
        "location": null,
        "rooms": null,
        "service": null,
        "sleep": null,
        "value": null
    },
    "location": {
        "city": null,
        "continent": null,
        "country": "United States",
        "proposed_city": "Maryland",
        "province": null,
        "region": null
    },
    "name": "La Quinta Inn & Suites St. Louis Maryland Heights",
    "places": {
        "aka": [
            "Maryland"
        ],
        "hotel_description": [],
        "hotel_name": [
            "Maryland"
        ]
    },
    "review_count": 156,
    "review_count_current": 1,
    "reviews": [
        {
            "date": "April 20, 2004",
            "detail_rating": {
                "business": null,
                "cleanliness": null,
                "desk": null,
                "location": null,
                "pool": null,
                "restaurant": null,
                "rooms": null,
                "service": null,
                "sleep": null,
                "value": null
            },
            "helpfulness": 1,
            "id": 1793862,
            "likes": {
                "disliked": null,
                "liked": null
            },
            "rating": 2.0,
            "stay_parameters": null,
            "text": "Stayed at the Baymont during the 04 Ncaa basketball regional. Got a double non-smoking from around $60/night. Upon arrival, we were warmly received and promptly checked in by the manager. A problem with the room keys was immediately and courteously remedied personally by the manager. The following morning, I inquired at the front desk about area grocery shopping. The weekend desk person \"didn't know\", barely glancing up to look at me. The next morning I asked the maid about eating in St. Louis. She referred me to the same person at the front desk. Again, that person \"didn't know\", this time even more gruff than before. It became clear to me that the weekend staff level of customer service is far from the managers standards. Hardly 3-star service, which is what advertises. As for the room. It was adequate, although not the cleanest (toilet bowl stains, poorly cleaned base-boards in bathroom and room). But I may be more discerning than most. The amenities on property were better than most, but outside of the manager, service was terrible. Very reasonable stay for the money, but if possible deal with the general manager, she's a customer service pro.",
            "title": "3 star?",
            "user": "reddrover"
        }
    ],
    "slim_ranking": 0.533333333333,
    "stars": 2,
    "tripadvisor": {
        "VISITED": false,
        "country_name": null,
        "locality": null,
        "pic_link": null,
        "street_address": null
    },
    "user_rating": 3.5,
    "variance": {
        "average": 33,
        "excellent": 40,
        "poor": 24,
        "terrible": 18,
        "very good": 41
    }
}