{
  "id": "006",
  "title": "orlando universal studios shuttle",
  "description": "Which hotels in Orlando offer a shuttle service to the Universal studios?",
  "narrative": "The hotel of a relevant review has to be in Orlando, FL, USA. The review has to describe, that hotel offers a shuttle service or similar transportation to the Universal Studios Orlando.",
  "relevances": [
    {
      "hotelId": 112828555,
      "reviewId": 7711731,
      "isRelevant": 0
    },
    {
      "hotelId": 112828555,
      "reviewId": 7581217,
      "isRelevant": 1
    },
    {
      "hotelId": 112828555,
      "reviewId": 7147387,
      "isRelevant": 0
    },
    {
      "hotelId": 112828555,
      "reviewId": 7832922,
      "isRelevant": 0
    },
    {
      "hotelId": 112828555,
      "reviewId": 8204083,
      "isRelevant": 1
    },
    {
      "hotelId": 112828555,
      "reviewId": 5601057,
      "isRelevant": 0
    },
    {
      "hotelId": 112828555,
      "reviewId": 6808096,
      "isRelevant": 1
    },
    {
      "hotelId": 112828555,
      "reviewId": 5965987,
      "isRelevant": 1
    },
    {
      "hotelId": 112828555,
      "reviewId": 5489474,
      "isRelevant": 0
    },
    {
      "hotelId": 112828555,
      "reviewId": 5983797,
      "isRelevant": 0
    },
    {
      "hotelId": 2005887398,
      "reviewId": 4090807,
      "isRelevant": 0
    },
    {
      "hotelId": 2005887398,
      "reviewId": 4328895,
      "isRelevant": 0
    },
    {
      "hotelId": 2005887398,
      "reviewId": 4354879,
      "isRelevant": 0
    },
    {
      "hotelId": 2005887398,
      "reviewId": 4723098,
      "isRelevant": 1
    },
    {
      "hotelId": 2005887398,
      "reviewId": 4142730,
      "isRelevant": 0
    },
    {
      "hotelId": 2005887398,
      "reviewId": 5009830,
      "isRelevant": 0
    },
    {
      "hotelId": 2005887398,
      "reviewId": 4281151,
      "isRelevant": 1
    },
    {
      "hotelId": 2005887398,
      "reviewId": 4827620,
      "isRelevant": 0
    },
    {
      "hotelId": 2005887398,
      "reviewId": 4088240,
      "isRelevant": 0
    },
    {
      "hotelId": 2005887398,
      "reviewId": 4117575,
      "isRelevant": 0
    },
    {
      "hotelId": 960953668,
      "reviewId": 119979324,
      "isRelevant": 1
    },
    {
      "hotelId": 960953668,
      "reviewId": 153687956,
      "isRelevant": 1
    },
    {
      "hotelId": 960953668,
      "reviewId": 119679153,
      "isRelevant": 1
    },
    {
      "hotelId": 960953668,
      "reviewId": 151685075,
      "isRelevant": 1
    },
    {
      "hotelId": 960953668,
      "reviewId": 120041616,
      "isRelevant": 1
    },
    {
      "hotelId": 960953668,
      "reviewId": 152525377,
      "isRelevant": 1
    },
    {
      "hotelId": 960953668,
      "reviewId": 119894486,
      "isRelevant": 0
    },
    {
      "hotelId": 960953668,
      "reviewId": 153256962,
      "isRelevant": 1
    },
    {
      "hotelId": 960953668,
      "reviewId": 119494170,
      "isRelevant": 1
    },
    {
      "hotelId": 960953668,
      "reviewId": 150618752,
      "isRelevant": 0
    },
    {
      "hotelId": -86707108,
      "reviewId": 17981777,
      "isRelevant": 1
    },
    {
      "hotelId": -86707108,
      "reviewId": 18167346,
      "isRelevant": 0
    },
    {
      "hotelId": -86707108,
      "reviewId": 119774532,
      "isRelevant": 1
    },
    {
      "hotelId": -86707108,
      "reviewId": 119898454,
      "isRelevant": 0
    },
    {
      "hotelId": -86707108,
      "reviewId": 17782384,
      "isRelevant": 1
    },
    {
      "hotelId": -86707108,
      "reviewId": 18147860,
      "isRelevant": 0
    },
    {
      "hotelId": -86707108,
      "reviewId": 119804555,
      "isRelevant": 0
    },
    {
      "hotelId": -86707108,
      "reviewId": 119534384,
      "isRelevant": 1
    },
    {
      "hotelId": -86707108,
      "reviewId": 17503389,
      "isRelevant": 0
    },
    {
      "hotelId": -86707108,
      "reviewId": 17669811,
      "isRelevant": 0
    },
    {
      "hotelId": 125972920,
      "reviewId": 127314380,
      "isRelevant": 1
    },
    {
      "hotelId": 125972920,
      "reviewId": 128359239,
      "isRelevant": 1
    },
    {
      "hotelId": 125972920,
      "reviewId": 124546140,
      "isRelevant": 1
    },
    {
      "hotelId": 125972920,
      "reviewId": 128303670,
      "isRelevant": 1
    },
    {
      "hotelId": 125972920,
      "reviewId": 126734104,
      "isRelevant": 1
    },
    {
      "hotelId": 125972920,
      "reviewId": 123857559,
      "isRelevant": 0
    },
    {
      "hotelId": 125972920,
      "reviewId": 126614315,
      "isRelevant": 0
    },
    {
      "hotelId": 125972920,
      "reviewId": 126002617,
      "isRelevant": 1
    },
    {
      "hotelId": 125972920,
      "reviewId": 122304566,
      "isRelevant": 0
    },
    {
      "hotelId": 125972920,
      "reviewId": 127784262,
      "isRelevant": 1
    },
    {
      "hotelId": 1261852049,
      "reviewId": 14287153,
      "isRelevant": 1
    },
    {
      "hotelId": 1261852049,
      "reviewId": 13764899,
      "isRelevant": 1
    },
    {
      "hotelId": 1261852049,
      "reviewId": 13783512,
      "isRelevant": 1
    },
    {
      "hotelId": 1261852049,
      "reviewId": 7291487,
      "isRelevant": 1
    },
    {
      "hotelId": 1261852049,
      "reviewId": 14256751,
      "isRelevant": 0
    },
    {
      "hotelId": 1261852049,
      "reviewId": 136798974,
      "isRelevant": 0
    },
    {
      "hotelId": 1261852049,
      "reviewId": 7419136,
      "isRelevant": 0
    },
    {
      "hotelId": 1261852049,
      "reviewId": 137241454,
      "isRelevant": 0
    },
    {
      "hotelId": 1261852049,
      "reviewId": 136521230,
      "isRelevant": 0
    },
    {
      "hotelId": 1261852049,
      "reviewId": 7301063,
      "isRelevant": 0
    },
    {
      "hotelId": -1925257567,
      "reviewId": 5591922,
      "isRelevant": 1
    },
    {
      "hotelId": -1925257567,
      "reviewId": 122440343,
      "isRelevant": 1
    },
    {
      "hotelId": -1925257567,
      "reviewId": 5626286,
      "isRelevant": 0
    },
    {
      "hotelId": -1925257567,
      "reviewId": 5801407,
      "isRelevant": 1
    },
    {
      "hotelId": -1925257567,
      "reviewId": 122451803,
      "isRelevant": 0
    },
    {
      "hotelId": -1925257567,
      "reviewId": 5505032,
      "isRelevant": 1
    },
    {
      "hotelId": -1925257567,
      "reviewId": 4386614,
      "isRelevant": 0
    },
    {
      "hotelId": -1925257567,
      "reviewId": 5539326,
      "isRelevant": 0
    },
    {
      "hotelId": -1925257567,
      "reviewId": 5631661,
      "isRelevant": 0
    },
    {
      "hotelId": -1925257567,
      "reviewId": 122670125,
      "isRelevant": 0
    },
    {
      "hotelId": -110453718,
      "reviewId": 12038887,
      "isRelevant": 0
    },
    {
      "hotelId": -110453718,
      "reviewId": 15459649,
      "isRelevant": 0
    },
    {
      "hotelId": -110453718,
      "reviewId": 15361397,
      "isRelevant": 0
    },
    {
      "hotelId": -110453718,
      "reviewId": 75622254,
      "isRelevant": 0
    },
    {
      "hotelId": -110453718,
      "reviewId": 75446071,
      "isRelevant": 0
    },
    {
      "hotelId": -110453718,
      "reviewId": 19982611,
      "isRelevant": 0
    },
    {
      "hotelId": -110453718,
      "reviewId": 77898102,
      "isRelevant": 0
    },
    {
      "hotelId": -110453718,
      "reviewId": 5373410,
      "isRelevant": 0
    },
    {
      "hotelId": -110453718,
      "reviewId": 20375496,
      "isRelevant": 0
    },
    {
      "hotelId": -110453718,
      "reviewId": 10090747,
      "isRelevant": 0
    },
    {
      "hotelId": -2010553486,
      "reviewId": 21321453,
      "isRelevant": 1
    },
    {
      "hotelId": -2010553486,
      "reviewId": 21695937,
      "isRelevant": 0
    },
    {
      "hotelId": -2010553486,
      "reviewId": 14440258,
      "isRelevant": 0
    },
    {
      "hotelId": -2010553486,
      "reviewId": 16854611,
      "isRelevant": 0
    },
    {
      "hotelId": -2010553486,
      "reviewId": 23736296,
      "isRelevant": 0
    },
    {
      "hotelId": 738816598,
      "reviewId": 125128237,
      "isRelevant": 1
    },
    {
      "hotelId": 738816598,
      "reviewId": 123782640,
      "isRelevant": 0
    },
    {
      "hotelId": 738816598,
      "reviewId": 122793660,
      "isRelevant": 1
    },
    {
      "hotelId": 738816598,
      "reviewId": 120808072,
      "isRelevant": 1
    },
    {
      "hotelId": 738816598,
      "reviewId": 121560433,
      "isRelevant": 0
    },
    {
      "hotelId": 738816598,
      "reviewId": 119930236,
      "isRelevant": 1
    },
    {
      "hotelId": 738816598,
      "reviewId": 122849685,
      "isRelevant": 0
    },
    {
      "hotelId": 738816598,
      "reviewId": 121471804,
      "isRelevant": 0
    },
    {
      "hotelId": 738816598,
      "reviewId": 123135993,
      "isRelevant": 0
    }
  ]
}