{
    "aka": null,
    "description": null,
    "detail_rating": {
        "cleanliness": 4.5,
        "location": 5.0,
        "rooms": 4.5,
        "service": 5.0,
        "sleep": 4.5,
        "value": 5.0
    },
    "location": {
        "city": null,
        "continent": "Europe",
        "country": "France",
        "proposed_city": "Nice",
        "province": null,
        "region": "Provence"
    },
    "name": "Nice Garden Hotel",
    "places": {
        "aka": [],
        "hotel_description": [],
        "hotel_name": [
            "Nice"
        ]
    },
    "review_count": 443,
    "review_count_current": 10,
    "reviews": [
        {
            "date": "October 3, 2007",
            "detail_rating": {
                "business": null,
                "cleanliness": 5.0,
                "desk": null,
                "front_desk": 5.0,
                "location": 5.0,
                "pool": null,
                "restaurant": null,
                "rooms": 5.0,
                "service": 5.0,
                "sleep": null,
                "value": 5.0
            },
            "helpfulness": 4,
            "id": 10033808,
            "likes": {
                "disliked": "\u2014 That we had to leave!",
                "liked": "\u2014 The Garden"
            },
            "rating": 5.0,
            "stay_parameters": "Stayed September 2007, traveled as a couple",
            "text": "We were very happy with this hotel. We stayed in Room 5 which was a classical room. It was a good sized room with large windows onto the garden which was beautiful. We had a warm welcome and lots of helpful advice on Nice. The hotel was clean, quiet and in an excellent location for exploring Nice. The breakfast was very yummy!",
            "title": "Great stay in Nice",
            "user": "gemybell"
        },
        {
            "date": "October 2, 2007",
            "detail_rating": {
                "business": null,
                "cleanliness": 5.0,
                "desk": null,
                "front_desk": 5.0,
                "location": 5.0,
                "pool": null,
                "restaurant": null,
                "rooms": 4.0,
                "service": 5.0,
                "sleep": null,
                "value": 5.0
            },
            "helpfulness": 2,
            "id": 10031272,
            "likes": {
                "disliked": null,
                "liked": null
            },
            "rating": 5.0,
            "stay_parameters": "Stayed September 2007, traveled as a couple",
            "text": "We stayed two nights in Room #2. Although previous reviewers complained about the noise level in this room, we did not have this experience. Our stay at the Nice Garden Hotel was comfortable, convenient, and pleasant. Marion and her staff are most friendly and helpful. The room was very quiet at night. Of course, once breakfast service starts, one can hear some activity, but my wife and I were always up by 8AM anyway. Yes, the shower and bathroom are small, but this is a 2 star hotel. The breakfast in the garden is a most enjoyable experience. Given the price, location, friendliness and helpfulness of the staff, I think this is an outstanding value. I definitely would stay here again.",
            "title": "Excellent Experience !",
            "user": "HansJuergen"
        },
        {
            "date": "October 2, 2007",
            "detail_rating": {
                "business": 5.0,
                "cleanliness": 4.0,
                "desk": null,
                "front_desk": 5.0,
                "location": 5.0,
                "pool": null,
                "restaurant": null,
                "rooms": 4.0,
                "service": 5.0,
                "sleep": null,
                "value": 4.0
            },
            "helpfulness": 3,
            "id": 10030769,
            "likes": {
                "disliked": "\u2014 Very thin walls",
                "liked": "\u2014 The garden"
            },
            "rating": 4.0,
            "stay_parameters": "Stayed September 2007, traveled as a couple",
            "text": "Lovely place, very friendly, I felt very well looked after! I would highly recommend it.",
            "title": "It was Great",
            "user": "OxfordTravelady"
        },
        {
            "date": "September 19, 2007",
            "detail_rating": {
                "business": null,
                "cleanliness": 3.0,
                "desk": null,
                "front_desk": 5.0,
                "location": 4.0,
                "pool": null,
                "restaurant": null,
                "rooms": 2.0,
                "service": 5.0,
                "sleep": null,
                "value": 2.0
            },
            "helpfulness": 3,
            "id": 8823689,
            "likes": {
                "disliked": "\u2014 The noisy corridoor by Room 2",
                "liked": "\u2014 Breakfast"
            },
            "rating": 2.0,
            "stay_parameters": "Stayed August 2007, traveled as a couple",
            "text": "Having just read the most recent comments about the Nice Garden Hotel I just had to agree about Room 2 - the noise of people walking out to the garden for breakfast woke me, and kept me awake, each morning! (Ironically I think it was Marion or her staff walking up and down providing their friendly service which was one of the main causes!). I also agree that the bathroom was very small and each night I had to move the bed away from the wall. However, on the plus side, the welcome and service was great, the location is fantastic and remembering that you're in a 2 star hotel it was good value for money. Would I stay there again? Perhaps for a city break when you're on a budget and want to be up and about early every morning. But for a relaxing, summer holiday - probably not.",
            "title": "Great service but noisy corridor",
            "user": "Hopscotch3"
        },
        {
            "date": "September 17, 2007",
            "detail_rating": {
                "business": null,
                "cleanliness": 5.0,
                "desk": null,
                "front_desk": 5.0,
                "location": 5.0,
                "pool": null,
                "restaurant": null,
                "rooms": 3.0,
                "service": 5.0,
                "sleep": null,
                "value": 5.0
            },
            "helpfulness": 2,
            "id": 8739244,
            "likes": {
                "disliked": "\u2014 Small bathroom",
                "liked": "\u2014 Welcome and breakfast"
            },
            "rating": 5.0,
            "stay_parameters": "Stayed August 2007, traveled as a couple",
            "text": "We only stayed here for one night but had a great experience in keeping with what the previous reviews say. Great welcome and fantastic breakfast in the garden. We stayed in room 7 which was basic (and perhaps a bit dark) but clean and had a comfortable bed.",
            "title": "Great, affordable hotel in central location",
            "user": "Hawson"
        },
        {
            "date": "September 12, 2007",
            "detail_rating": {
                "business": 4.0,
                "cleanliness": 4.0,
                "desk": null,
                "front_desk": 5.0,
                "location": 5.0,
                "pool": null,
                "restaurant": null,
                "rooms": 4.0,
                "service": 5.0,
                "sleep": null,
                "value": 5.0
            },
            "helpfulness": 2,
            "id": 8701378,
            "likes": {
                "disliked": null,
                "liked": "\u2014 Location, professional staff"
            },
            "rating": 5.0,
            "stay_parameters": "Stayed August 2007, traveled as a couple",
            "text": "Another fan of the Nice Garden Hotel. We spent seven nights there a week ago and found the stay to be exactly as others have stated before on similar reviews.",
            "title": "As the others have said...",
            "user": "Capsu78"
        },
        {
            "date": "September 12, 2007",
            "detail_rating": {
                "business": null,
                "cleanliness": 2.0,
                "desk": null,
                "front_desk": 3.0,
                "location": 5.0,
                "pool": null,
                "restaurant": null,
                "rooms": null,
                "service": 5.0,
                "sleep": null,
                "value": 5.0
            },
            "helpfulness": 5,
            "id": 8699347,
            "likes": {
                "disliked": "\u2014 The horrible accomodation AKA - our room",
                "liked": "\u2014 The family who run the hotel & the garden"
            },
            "rating": 2.0,
            "stay_parameters": "Stayed September 2007, traveled as a couple",
            "text": "As a seasoned \"business traveler\" who prefers corporate chain hotels and usually doesn't like most B&B experiences, I found this hotel to be a perfect hybrid of the concepts. The service was very personal and attentive and the property itself to be very homey and comfortable.",
            "title": "Mixed Bag",
            "user": "Hectar"
        },
        {
            "date": "August 24, 2007",
            "detail_rating": {
                "business": 5.0,
                "cleanliness": 5.0,
                "desk": null,
                "front_desk": 5.0,
                "location": 5.0,
                "pool": null,
                "restaurant": null,
                "rooms": 5.0,
                "service": 5.0,
                "sleep": null,
                "value": 5.0
            },
            "helpfulness": 2,
            "id": 8498436,
            "likes": {
                "disliked": "\u2014 no outlet in the bathroom",
                "liked": "\u2014 friendly staff"
            },
            "rating": 5.0,
            "stay_parameters": "Stayed August 2007, traveled with family",
            "text": "The location is simply fantastic for anything you would want to do in Nice, and so convenient to the train station that the walk, even with rolling suitcases was very manageable. In fact the location was so suitable, we scaled back some of our daytrips just to relax... either by the sea, or in the Flower market or even just walking around the shops just a block or 2 away.",
            "title": "Home away from home",
            "user": "kkteigland"
        },
        {
            "date": "August 17, 2007",
            "detail_rating": {
                "business": null,
                "cleanliness": 3.0,
                "desk": null,
                "front_desk": 5.0,
                "location": 5.0,
                "pool": null,
                "restaurant": null,
                "rooms": 2.0,
                "service": 5.0,
                "sleep": null,
                "value": 4.0
            },
            "helpfulness": 3,
            "id": 8441083,
            "likes": {
                "disliked": "\u2014 faded decor",
                "liked": "\u2014 personal attention"
            },
            "rating": 4.0,
            "stay_parameters": "Stayed July 2007, traveled as a couple",
            "text": "It is obvious the hosts have hotel management experience as they run the place in a very orderly way... in addition, we were more often than not greeted when we got back to the hotel. You get the feeling you are guests in their home as opposed to simply occupying a room.",
            "title": "Friendly welcome in Nice",
            "user": "phil_oldham"
        },
        {
            "date": "August 16, 2007",
            "detail_rating": {
                "business": null,
                "cleanliness": 5.0,
                "desk": null,
                "front_desk": 5.0,
                "location": 4.0,
                "pool": null,
                "restaurant": null,
                "rooms": 4.0,
                "service": 5.0,
                "sleep": null,
                "value": 5.0
            },
            "helpfulness": 2,
            "id": 8438912,
            "likes": {
                "disliked": null,
                "liked": "\u2014 friendly service"
            },
            "rating": 5.0,
            "stay_parameters": "Stayed August 2007, traveled as a couple",
            "text": "Two thumbs up for this hotel, and thanks to Marion, Katerina and the entire family for making our stay a memorable one.",
            "title": "Great little hotel........",
            "user": "EboracumYork"
        }
    ],
    "slim_ranking": 0.0093896713615,
    "stars": null,
    "tripadvisor": {
        "VISITED": false,
        "country_name": null,
        "locality": null,
        "pic_link": null,
        "street_address": null
    },
    "user_rating": 4.5,
    "variance": {
        "average": 19,
        "excellent": 312,
        "poor": 10,
        "terrible": 4,
        "very good": 98
    }
}