{
    "aka": "Kadina Bed & Breakfast Holt, Norfolk",
    "description": "Kadina is situated in the peaceful, wooded village of High Kelling, one and a half miles from Holt. Relax, unwind and enjoy tea and afternoon cake on arrival, a good nights sleep and a hearty breakfast which will set you up to explore beautiful north Norfolk.",
    "detail_rating": {
        "cleanliness": null,
        "location": null,
        "rooms": null,
        "service": null,
        "sleep": null,
        "value": null
    },
    "location": {
        "city": null,
        "continent": "Europe",
        "country": "United Kingdom (UK)",
        "proposed_city": null,
        "province": null,
        "region": null
    },
    "name": "Kadina Bed & Breakfast",
    "places": {
        "aka": [
            "Holt",
            "Norfolk"
        ],
        "hotel_description": [
            "Holt",
            "Norfolk"
        ],
        "hotel_name": []
    },
    "review_count": 35,
    "review_count_current": 20,
    "reviews": [
        {
            "date": "June 29, 2011",
            "detail_rating": {
                "business": null,
                "cleanliness": 5.0,
                "desk": null,
                "location": null,
                "pool": null,
                "restaurant": null,
                "rooms": null,
                "service": 5.0,
                "sleep": 5.0,
                "value": 5.0
            },
            "helpfulness": null,
            "id": 114881325,
            "likes": {
                "disliked": null,
                "liked": null
            },
            "rating": 5.0,
            "stay_parameters": "Stayed June 2011, traveled with family",
            "text": "We had a weekend in Norfolk doing a great variety of things including seeing old school pals and family. Alison at Kadina gave a wonderful base. So very peaceful, great room and exceptional hospitality to say nothing about the great variety of the breakfast options. We strongly recommend Kadina.",
            "title": "A wonderful place to stay",
            "user": "Jeremy048"
        },
        {
            "date": "June 23, 2011",
            "detail_rating": {
                "business": null,
                "cleanliness": 5.0,
                "desk": null,
                "location": null,
                "pool": null,
                "restaurant": null,
                "rooms": null,
                "service": 5.0,
                "sleep": 4.0,
                "value": 5.0
            },
            "helpfulness": 1,
            "id": 114667253,
            "likes": {
                "disliked": null,
                "liked": null
            },
            "rating": 5.0,
            "stay_parameters": "Stayed June 2011, traveled as a couple",
            "text": "Wow Allison - we were impressed. Think you can't have your cake and eat it? You CAN at Kadina! From when you arrive with a cup of tea, and if you are lucky like we were, some more to set you on your way home. For those budding B&B proprietors to indeed, the most experienced, you should all take a trip to High Kelling and receive a masterclass from Allison. Spotlessly kept accommodation with the best power shower you could imagine in the 1st floor en-suite. Leisurely tailor-made breakfasts at the big table were a joy! It has all been said before and we sincerely agree with every word printed. We look forward to our next stay. John&Julia",
            "title": "Can have your cake and eat it!",
            "user": "wilberforce_10"
        },
        {
            "date": "May 17, 2011",
            "detail_rating": {
                "business": null,
                "cleanliness": 5.0,
                "desk": null,
                "location": 5.0,
                "pool": null,
                "restaurant": null,
                "rooms": 5.0,
                "service": 5.0,
                "sleep": 5.0,
                "value": 5.0
            },
            "helpfulness": null,
            "id": 108641761,
            "likes": {
                "disliked": null,
                "liked": null
            },
            "rating": 5.0,
            "stay_parameters": "Stayed May 2011, traveled as a couple",
            "text": "Clean, spacious, comfortable, delicious food. We stayed 5 nights and had an evening meal each day. Food excellent. Wide choice for breakfast and superb evening meals, all freshly cooked with lovely home made sauces. The chocolate sponge pudding was a chocaholic's dream. Allison is a great hostess as well as fantastic cook. Nothing too much trouble. Room was spotless with lots of extras, even emery boards! Proper towels to wrap round you after using the power shower or corner bath. Allison is very knowledgeable regarding the surrounding area for places of interest and where to find places to eat, but why would you want to eat anywhere else? We will be returning. Peter and Eileen",
            "title": "Best B&B we have ever stayed at",
            "user": "outdoormanPeter"
        },
        {
            "date": "May 2, 2011",
            "detail_rating": {
                "business": null,
                "cleanliness": 5.0,
                "desk": null,
                "location": 5.0,
                "pool": null,
                "restaurant": null,
                "rooms": 5.0,
                "service": 5.0,
                "sleep": 5.0,
                "value": 5.0
            },
            "helpfulness": null,
            "id": 106508298,
            "likes": {
                "disliked": null,
                "liked": null
            },
            "rating": 5.0,
            "stay_parameters": "Stayed April 2011, traveled as a couple",
            "text": "This is our 2nd stay at Kadina. It is spotlessly clean, the host Allison is wonderful nothing is too much trouble. She goes out of her way to cook a fantastic breakfast of your choice. She is very knowledgable of the area and will recommended places to visit and restaurants to eat at. It is an outstanding bed and breakfast.",
            "title": "Absolutely Fantastic",
            "user": "Jayne195811"
        },
        {
            "date": "April 30, 2011",
            "detail_rating": {
                "business": null,
                "cleanliness": 5.0,
                "desk": null,
                "location": 4.0,
                "pool": null,
                "restaurant": null,
                "rooms": 5.0,
                "service": 5.0,
                "sleep": 5.0,
                "value": 5.0
            },
            "helpfulness": null,
            "id": 106273020,
            "likes": {
                "disliked": null,
                "liked": null
            },
            "rating": 5.0,
            "stay_parameters": "Stayed April 2011, traveled as a couple",
            "text": "The owner Allison cannot do enough to make your stay as pleasant as possible.",
            "title": "Have never stayed in a better B & B, it's perfect",
            "user": "KDS23"
        },
        {
            "date": "September 7, 2012",
            "detail_rating": {
                "business": null,
                "cleanliness": 5.0,
                "desk": null,
                "location": 5.0,
                "pool": null,
                "restaurant": null,
                "rooms": 5.0,
                "service": 5.0,
                "sleep": 5.0,
                "value": 5.0
            },
            "helpfulness": null,
            "id": 139669909,
            "likes": {
                "disliked": null,
                "liked": null
            },
            "rating": 5.0,
            "stay_parameters": "Stayed August 2012, traveled as a couple",
            "text": "We have just had another lovely long weekend visit to Kadina B&B. We have returned many times as we feel it is a fantastic place to stay. It is in a very good location for exploring Holt and the beautiful North Norfolk coastline. Kadina is situated next to Kelling Heath where you can watch the rabbits and wildlife from the upstairs bedroom. There is ample parking to the front of the property.",
            "title": "\"Excellent\" B&B",
            "user": "MandJH"
        },
        {
            "date": "September 6, 2012",
            "detail_rating": {
                "business": null,
                "cleanliness": 5.0,
                "desk": null,
                "location": 5.0,
                "pool": null,
                "restaurant": null,
                "rooms": 5.0,
                "service": 5.0,
                "sleep": 5.0,
                "value": 5.0
            },
            "helpfulness": null,
            "id": 139582036,
            "likes": {
                "disliked": null,
                "liked": null
            },
            "rating": 5.0,
            "stay_parameters": "Stayed September 2012, traveled as a couple",
            "text": "From the moment you arrive Allison, Trevor and Ruby make you very welcome, nothing is too much trouble and Allison goes out of her way to help with advice and knowledge on the area. The whole B&B is spotlessly clean, beautifully decorated with lots of attention to detail. Allison is a wonderful cook and leaves you very yummy cakes and cookies in your bedroom, a great variety and chioce for breakfast to set you up for the day and we would highly recommend you stay in for dinner in the evening (Allison arranges the menu with you and the meals are delicious).",
            "title": "Lovely comfortable stay",
            "user": "NZShearer"
        },
        {
            "date": "August 14, 2012",
            "detail_rating": {
                "business": null,
                "cleanliness": 5.0,
                "desk": null,
                "location": 5.0,
                "pool": null,
                "restaurant": null,
                "rooms": 5.0,
                "service": 5.0,
                "sleep": 5.0,
                "value": 5.0
            },
            "helpfulness": null,
            "id": 137201049,
            "likes": {
                "disliked": null,
                "liked": null
            },
            "rating": 5.0,
            "stay_parameters": "Stayed August 2012, traveled as a couple",
            "text": "Overall Kadina B&B deserves the \"excellent\" rating we and other travellers have given it and anyone looking for a B&B in this part of Norfolk would not find a better place to stay.",
            "title": "great place to stay",
            "user": "ladolcevitaLondon"
        },
        {
            "date": "July 14, 2012",
            "detail_rating": {
                "business": null,
                "cleanliness": 5.0,
                "desk": null,
                "location": 5.0,
                "pool": null,
                "restaurant": null,
                "rooms": 5.0,
                "service": 5.0,
                "sleep": 5.0,
                "value": 5.0
            },
            "helpfulness": 1,
            "id": 134352996,
            "likes": {
                "disliked": null,
                "liked": null
            },
            "rating": 5.0,
            "stay_parameters": "Stayed July 2012, traveled as a couple",
            "text": "We definately look foreward to many more weedends with Allison, Trevor and Ruby!!",
            "title": "Returning again and again",
            "user": "johnandvalnorfolk"
        },
        {
            "date": "April 28, 2012",
            "detail_rating": {
                "business": null,
                "cleanliness": 5.0,
                "desk": null,
                "location": 5.0,
                "pool": null,
                "restaurant": null,
                "rooms": 5.0,
                "service": 5.0,
                "sleep": 5.0,
                "value": 5.0
            },
            "helpfulness": null,
            "id": 128974416,
            "likes": {
                "disliked": null,
                "liked": null
            },
            "rating": 5.0,
            "stay_parameters": "Stayed April 2012, traveled as a couple",
            "text": "Great b&b, attention to detail really good. Allison is an excellent host, and cook! Breakfasts are fabulous. Room comfortable, clean, and location great for exploring North Norfolk. Holt close by and great for evenings out. Deserves its excellent reviews.",
            "title": "Wonderful welcome, just like going home",
            "user": "Christine T"
        },
        {
            "date": "April 28, 2012",
            "detail_rating": {
                "business": null,
                "cleanliness": 5.0,
                "desk": null,
                "location": 5.0,
                "pool": null,
                "restaurant": null,
                "rooms": 5.0,
                "service": 5.0,
                "sleep": 5.0,
                "value": 5.0
            },
            "helpfulness": null,
            "id": 128966198,
            "likes": {
                "disliked": null,
                "liked": null
            },
            "rating": 5.0,
            "stay_parameters": "Stayed April 2012, traveled as a couple",
            "text": "Just returned from a wonderful stay at 'Kadina' where Allison is the perfect host. This is the best Bed and Breakfast accommodation we have ever stayed in. The room on the 1st Floor was beautiful and spacious. The cakes on arrival were a welcome addition after a dreadful journey in the rain. The breakfast and the selection offered, really set you up for the day. We will be going back, again and again! Paul & Karen",
            "title": "Perfection",
            "user": "Wattisfield S"
        },
        {
            "date": "March 3, 2012",
            "detail_rating": {
                "business": null,
                "cleanliness": 5.0,
                "desk": null,
                "location": 5.0,
                "pool": null,
                "restaurant": null,
                "rooms": 5.0,
                "service": 5.0,
                "sleep": null,
                "value": 5.0
            },
            "helpfulness": null,
            "id": 125552714,
            "likes": {
                "disliked": null,
                "liked": null
            },
            "rating": 5.0,
            "stay_parameters": "Stayed February 2012",
            "text": "We went to stay here recommended by friends who used to run there own B+ B in Holt with my elderly parents. It was like staying with friends we will be back to stay.",
            "title": "Just like staying with friends",
            "user": "RPGibbs62"
        },
        {
            "date": "February 20, 2012",
            "detail_rating": {
                "business": null,
                "cleanliness": 5.0,
                "desk": null,
                "location": 4.0,
                "pool": null,
                "restaurant": null,
                "rooms": 5.0,
                "service": 5.0,
                "sleep": 5.0,
                "value": 5.0
            },
            "helpfulness": null,
            "id": 124865953,
            "likes": {
                "disliked": null,
                "liked": null
            },
            "rating": 5.0,
            "stay_parameters": "Stayed February 2012, traveled as a couple",
            "text": "This is the second time we have stayed at the Kadina B&B near Holt. This time we went for a mid-winter weekend break. Alison was very friendly and welcoming as always and this time we had the slightly larger room upstairs with the bath and larger bathroom. Both rooms are good, but the added bath and extra space upstairs is worth it. The breakfasts are fantastic, probably one of the best we've ever had at a B&B! Allround a great place to stay within a short drive of Holt, Sheringham and some great beaches - We'll be back!",
            "title": "A wonderful B&B - Highly recommended!",
            "user": "Richard L"
        },
        {
            "date": "August 31, 2011",
            "detail_rating": {
                "business": null,
                "cleanliness": 5.0,
                "desk": null,
                "location": null,
                "pool": null,
                "restaurant": null,
                "rooms": null,
                "service": 5.0,
                "sleep": 5.0,
                "value": 5.0
            },
            "helpfulness": null,
            "id": 117507769,
            "likes": {
                "disliked": null,
                "liked": null
            },
            "rating": 5.0,
            "stay_parameters": "Stayed August 2011, traveled as a couple",
            "text": "This is simply outstanding Bed and Breakfast accommodation. There was a lovely warm welcome from Allison and Trevor and this top level of hospitality continued throughout our three days. The facilities are top class. Allison is a first rate cook and the breakfast and evening meals she prepared were delicious, not to mention the little extras like home made cakes and biscuits. We hope to return in the not too distant future. Jim & Jean",
            "title": "An all round winner !",
            "user": "jambar504022"
        },
        {
            "date": "August 8, 2011",
            "detail_rating": {
                "business": null,
                "cleanliness": 5.0,
                "desk": null,
                "location": null,
                "pool": null,
                "restaurant": null,
                "rooms": null,
                "service": 5.0,
                "sleep": 5.0,
                "value": 5.0
            },
            "helpfulness": 1,
            "id": 116443657,
            "likes": {
                "disliked": null,
                "liked": null
            },
            "rating": 5.0,
            "stay_parameters": "Stayed August 2011, traveled as a couple",
            "text": "Had a great stay at Kadina, the room we had was really well appointed, with plenty of space to move around. A great shower again with loads of room. Alison's homemade cookies in biscuit tin went down a treat. Breakfast was enough to keep us going all day, and we had a great selection of fruit to choose from. We had evening meals in, who needed to go out for meals when the standard of cooking was so good. I have already recommended her to our friends.",
            "title": "The AA were wrong, it's not 4 star, its 7 star.",
            "user": "drighlynne"
        },
        {
            "date": "April 3, 2013",
            "detail_rating": {
                "business": null,
                "cleanliness": null,
                "desk": null,
                "location": null,
                "pool": null,
                "restaurant": null,
                "rooms": null,
                "service": null,
                "sleep": null,
                "value": null
            },
            "helpfulness": 1,
            "id": 156515779,
            "likes": {
                "disliked": null,
                "liked": null
            },
            "rating": 5.0,
            "stay_parameters": null,
            "text": "It is difficult to find anything new to say, but I have to reiterate what has been said many times before. This is a superb place to stay in the north Norfolk area for a few days. The welcome is warm and Allison can't do enough to make you feel at home with lovely home cooking. The breakfast is ordered the previous night with a generous choice including pancakes, haddock and home made natural yoghurt as well as all the usual fry-up favourites. We had the first floor room and it was warm and comfortable on a bitterly cold weekend. The en suite is very well appointed with a great power shower. There was powerful wifi which made a pleasant change, but don't expect much of a mobile phone signal. I cannot fault this establishment unless you hoped to walk into Holt which is a couple of miles away.",
            "title": "Faultless B&B",
            "user": "ChrisRugby"
        },
        {
            "date": "March 28, 2013",
            "detail_rating": {
                "business": null,
                "cleanliness": 5.0,
                "desk": null,
                "location": 5.0,
                "pool": null,
                "restaurant": null,
                "rooms": 5.0,
                "service": 5.0,
                "sleep": 5.0,
                "value": 5.0
            },
            "helpfulness": 1,
            "id": 155890714,
            "likes": {
                "disliked": null,
                "liked": null
            },
            "rating": 5.0,
            "stay_parameters": "Stayed March 2013, traveled as a couple",
            "text": "Of course, there are now more than a few excellent B&Bs in the UK, but some are quite smug about it. There is no such pretentiousness here. It is like staying in a warm, cosy and luxurious farmhouse - albeit a quality modern variety. You would never guess such a lovely place like this was tucked away in the outskirts of Holt - but it definitely is THE place to stay if you like walking and the outdoors. No wearing of shoes upstairs either, which I think is a very good policy. From the moment you step into your room you get the feeling that the holiday has begun - even if it is only a weekend! That's because the furnishings and fittings are well-designed and there are fresh flowers in the room. I loved the lace tray cloths and the view (from the small window) over garden and heathland. Kadina is perfectly placed for walks on the Kelling Heath SSSI and if you are a bit of a train spotter, on your outing you will love seeing locomotive smoke through the trees - you are very near the heritage (but daily timetabled) train line to Sheringham. Have I mentioned the cooking? We were welcomed in the afternoon by a cream tea (no less) and despatched with some delicious home-baked fruit cake for our train journey home. In between, had the best ever three course breakfasts to order. I recommend highly - you would not get anything like this in a hotel.",
            "title": "A treasure of a place - surely one of the UK's best",
            "user": "AlexandraUB"
        },
        {
            "date": "March 14, 2013",
            "detail_rating": {
                "business": null,
                "cleanliness": 5.0,
                "desk": null,
                "location": 5.0,
                "pool": null,
                "restaurant": null,
                "rooms": 5.0,
                "service": 5.0,
                "sleep": 5.0,
                "value": 5.0
            },
            "helpfulness": null,
            "id": 154571020,
            "likes": {
                "disliked": null,
                "liked": null
            },
            "rating": 5.0,
            "stay_parameters": "Stayed March 2013, traveled as a couple",
            "text": "This is such a brilliant place if you want peace (so quiet at night) and tranquility - especially if you really want to be allowed to relax and unwind. It is OK too if you are non-driver. You'll probably be arriving by taxi, but if you just ask, you can get details of the bus timetable and can pick up the reliable Coast Hopper if you want to go further afield along the coast. However, I believe that coastal Salthouse is walkable from the B&B and then you are not far from Cley. Thanks to Allison and Trevor and Ruby (a charming and intelligent terrier) for having us in their home. We'll be back as soon as we can possibly manage it.",
            "title": "High Quality B&B",
            "user": "A G"
        },
        {
            "date": "November 7, 2012",
            "detail_rating": {
                "business": null,
                "cleanliness": 5.0,
                "desk": null,
                "location": 5.0,
                "pool": null,
                "restaurant": null,
                "rooms": 5.0,
                "service": 5.0,
                "sleep": 5.0,
                "value": 5.0
            },
            "helpfulness": null,
            "id": 144885112,
            "likes": {
                "disliked": null,
                "liked": null
            },
            "rating": 5.0,
            "stay_parameters": "Stayed October 2012, traveled as a couple",
            "text": "Me and my wife stayed on a cold wet weekend in March 2013. Lovley warm cosy B&B, more like home than hotel. Our damp coats were taken away for drying and fresh cups of tea were provided in a cosy kitchen. The owner made us very welcome. Our room was spacious, very clean and comfortable. Bedroom and bathroom were finished to a high standard and small home made cakes in a tin with the tea making tray was a nice touch. Good nights sleep in a very cosy bed and next morning an excellent breakfast with lots of choice. Good location for exploring North Norfolk. I will go back again. (Sat Navs may not tell you to turn up the gravel track by the red bin on Bridge Rd).",
            "title": "High Class in High Kelling",
            "user": "Designation"
        },
        {
            "date": "September 9, 2012",
            "detail_rating": {
                "business": null,
                "cleanliness": 4.0,
                "desk": null,
                "location": 4.0,
                "pool": null,
                "restaurant": null,
                "rooms": 4.0,
                "service": 4.0,
                "sleep": 4.0,
                "value": 4.0
            },
            "helpfulness": null,
            "id": 139830462,
            "likes": {
                "disliked": null,
                "liked": null
            },
            "rating": 5.0,
            "stay_parameters": "Stayed August 2012, traveled with family",
            "text": "Kadina is the best B&B in Norfolk. A bold statement perhaps but one I think you'll agree with when you stay there. Allison is just amazing and nothing is too much trouble for her. The standard throughout the B&B is absolutely top-class with lots of nice homely touches in the rooms, which are clean, modern and well kept. The breakfast selection is wonderful and varied, with everything from fruit to Full English! From the minute we arrived we felt relaxed and comfortable and quickly settled in to a perfect week's holiday. A slice of home-made cake and a cup of tea on arrival were very welcome after a long journey! Nice touch. Kadina is situated in a peaceful location but within easy reach of the lovely Georgian town of Holt. It's a perfect base for exploring all the diverse beauty that North Norfolk has to offer. Allison's excellent local knowledge is also invaluable when planning trips out around the area. We were sad to leave after a wonderful week but came home with many happy memories of a great holiday break. Kadina is a fabulous, well-run B&B that fully deserves all its excellent reviews on this site. We have already booked to come back for a week again next year and I absolutely can't wait!",
            "title": "A great homely B&B",
            "user": "Lister110"
        }
    ],
    "slim_ranking": 0.0555555555556,
    "stars": 4,
    "tripadvisor": {
        "VISITED": false,
        "country_name": null,
        "locality": null,
        "pic_link": null,
        "street_address": null
    },
    "user_rating": 5.0,
    "variance": {
        "average": 0,
        "excellent": 35,
        "poor": 0,
        "terrible": 0,
        "very good": 0
    }
}