{
    "aka": "Premier Inn Liverpool Albert Dock Hotel Liverpool",
    "description": "In the heart of Liverpool Albert Dock, this 19th Century, Grade 1 listed Premier Inn makes an ideal base to explore the local surroundings. Local attractions include ACC Liverpool Echo Arena, Liverpool One shopping centre, Tate Art Gallery and the Beatles Story. Conveniently located for Liverpool Lime Street Station. The hotel offers business & leisure travellers a great opportunity to stay in the very heart of Liverpool\u2019s vibrant waterfront area.Our Liverpool Albert Dock Premier Inn has been sensitively converted to ensure none of the charm and character of the original structure was lost. The hotel offers everything you'd expect, incredibly comfy beds in every room and an integrated restaurant serving a mix of traditional and contemporary dishes.",
    "detail_rating": {
        "cleanliness": 4.5,
        "location": 5.0,
        "rooms": 4.5,
        "service": 4.5,
        "sleep": 4.0,
        "value": 4.5
    },
    "location": {
        "city": null,
        "continent": "Europe",
        "country": "United Kingdom (UK)",
        "proposed_city": "Liverpool",
        "province": null,
        "region": null
    },
    "name": "Premier Inn Liverpool Albert Dock",
    "places": {
        "aka": [
            "Liverpool"
        ],
        "hotel_description": [
            "Liverpool"
        ],
        "hotel_name": [
            "Liverpool"
        ]
    },
    "review_count": 1513,
    "review_count_current": 20,
    "reviews": [
        {
            "date": "October 4, 2010",
            "detail_rating": {
                "business": null,
                "cleanliness": 5.0,
                "desk": null,
                "location": 5.0,
                "pool": null,
                "restaurant": null,
                "rooms": 5.0,
                "service": 5.0,
                "sleep": 5.0,
                "value": 5.0
            },
            "helpfulness": 1,
            "id": 82103791,
            "likes": {
                "disliked": null,
                "liked": null
            },
            "rating": 5.0,
            "stay_parameters": "Stayed October 2010, traveled as a couple",
            "text": "We stayed here for 3 nights over the weekend, i had never stayed in a Premier Inn before so i was a little cautious, my husband had stayed in this hotel and was very positive about it. I am so glad we didnt waste our money on a different hotel, we had 3 excellent night's sleep here, the staff were lovely and the location is excellent.",
            "title": "Best night's hotel sleep ever.",
            "user": "rhysethan"
        },
        {
            "date": "September 30, 2010",
            "detail_rating": {
                "business": null,
                "cleanliness": 5.0,
                "desk": null,
                "location": 5.0,
                "pool": null,
                "restaurant": null,
                "rooms": 5.0,
                "service": 5.0,
                "sleep": 5.0,
                "value": 5.0
            },
            "helpfulness": 1,
            "id": 81638471,
            "likes": {
                "disliked": null,
                "liked": null
            },
            "rating": 5.0,
            "stay_parameters": "Stayed August 2010, traveled as a couple",
            "text": "You have to be mindful that this is also a hen/stag type hotel but to be honest bar a little bit of noise on the saturday night it was very quiet. The rooms were very attrictive and spacious for what you pay, we didnt eat here so i cant comment on the quality of their food but my husband has had dinner here and was fairly happy.",
            "title": "Fantastic stay",
            "user": "lorna4111"
        },
        {
            "date": "September 18, 2010",
            "detail_rating": {
                "business": null,
                "cleanliness": 5.0,
                "desk": null,
                "location": 5.0,
                "pool": null,
                "restaurant": null,
                "rooms": 4.0,
                "service": 5.0,
                "sleep": 4.0,
                "value": 5.0
            },
            "helpfulness": null,
            "id": 80038869,
            "likes": {
                "disliked": null,
                "liked": null
            },
            "rating": 5.0,
            "stay_parameters": "Stayed August 2010, traveled as a couple",
            "text": "We were really happy with our stay, very clean and the staff were very friendly. The meal deal was excellent. I have coaliac Disease and the hotel had data sheets to let me know what I could eat it was fab.",
            "title": "Great Location, Great Staff and Great room",
            "user": "kellydb22"
        },
        {
            "date": "September 17, 2010",
            "detail_rating": {
                "business": null,
                "cleanliness": 5.0,
                "desk": null,
                "location": 5.0,
                "pool": null,
                "restaurant": null,
                "rooms": 4.0,
                "service": 4.0,
                "sleep": 4.0,
                "value": 5.0
            },
            "helpfulness": null,
            "id": 79948852,
            "likes": {
                "disliked": null,
                "liked": null
            },
            "rating": 5.0,
            "stay_parameters": "Stayed September 2010, traveled on business",
            "text": "Being from the states we had never stayed or heard of a Premier Inn and were kind of worried since the price was so cheap but it turned out to be a great place to stay! The location is amazing, right next to The Beatles story and the docks which has tons of shopping and eating. We were able to walk to the Cavern club and the little downtown area, it was about .5 mile. The building was very cool and our room was pretty big and very comfortable and clean. There are no real perks but thats probably why the price is so great. The staff was VERY friendly and helpful when we had questions about the area. When we go back to Liverpool we are staying here!!",
            "title": "Stunning location + unique building = more than your average Premier Inn",
            "user": "cjm2010_10"
        },
        {
            "date": "September 16, 2010",
            "detail_rating": {
                "business": null,
                "cleanliness": 5.0,
                "desk": null,
                "location": 5.0,
                "pool": null,
                "restaurant": null,
                "rooms": 5.0,
                "service": 5.0,
                "sleep": 5.0,
                "value": 5.0
            },
            "helpfulness": 1,
            "id": 79805951,
            "likes": {
                "disliked": null,
                "liked": null
            },
            "rating": 5.0,
            "stay_parameters": "Stayed September 2010, traveled as a couple",
            "text": "A Premier Inn is normally a solid choice for a budget hotel. The Albert Dock Premier Inn can boast all the usual Premier Inn qualities - good value, decent service, comfortable rooms - along with a beautiful, historic building and great views over the Dock. My room (and presumably most rooms) featured exposed brickwork - a very nice touch. If you want to stay somewhere central in Liverpool and don't want to spend more than \u00a3100 a night, I really can't imagine you'd do better than this.",
            "title": "Absolutely fabulous! Couldn't ask for more!",
            "user": "TracetheAce"
        },
        {
            "date": "January 3, 2011",
            "detail_rating": {
                "business": null,
                "cleanliness": 5.0,
                "desk": null,
                "location": 5.0,
                "pool": null,
                "restaurant": null,
                "rooms": 5.0,
                "service": 4.0,
                "sleep": 5.0,
                "value": 5.0
            },
            "helpfulness": null,
            "id": 91621881,
            "likes": {
                "disliked": null,
                "liked": null
            },
            "rating": 5.0,
            "stay_parameters": "Stayed December 2010, traveled as a couple",
            "text": "This is defo the bestest Premier Inn i've stayed in, rooms are so unique.not like the bog standard rooms at most Premier inns. The bed & pillows were sooooo comfy. The room was a little cold on arrival but it was boxing day & had been snowing outside so once we got the heating on & the portable fan heater provided going it was soon roasty toasty.",
            "title": "Best Premier Inn I've stayed in :-)",
            "user": "1foxyminx"
        },
        {
            "date": "December 21, 2010",
            "detail_rating": {
                "business": null,
                "cleanliness": 5.0,
                "desk": null,
                "location": 5.0,
                "pool": null,
                "restaurant": null,
                "rooms": 5.0,
                "service": 4.0,
                "sleep": 5.0,
                "value": 5.0
            },
            "helpfulness": null,
            "id": 90388037,
            "likes": {
                "disliked": null,
                "liked": null
            },
            "rating": 5.0,
            "stay_parameters": "Stayed December 2010, traveled with friends",
            "text": "The reason for our stay in Liverpool was the Cream Boxing Night Special so never got back 2 room until 4am so the only tiny grumble i have was we were woken up 9.30am as unfortunately our room window was above The Beatles museum were blaring Beatles music comes from the entrance once it opens :-( which is not good when you've not long got in2 bed.",
            "title": "Quirky hotel, excellent location",
            "user": "tollibott"
        },
        {
            "date": "December 19, 2010",
            "detail_rating": {
                "business": null,
                "cleanliness": 3.0,
                "desk": null,
                "location": 5.0,
                "pool": null,
                "restaurant": null,
                "rooms": 3.0,
                "service": 4.0,
                "sleep": null,
                "value": 4.0
            },
            "helpfulness": null,
            "id": 90204056,
            "likes": {
                "disliked": null,
                "liked": null
            },
            "rating": 3.0,
            "stay_parameters": "Stayed December 2010",
            "text": "Parking outside Hotel cost \u00a315 for 24 hours which we paid b4 checking in2 room, once we had checked in we found out we could of got discounted parking in multi story carpark a 5 mins walk away. I was not 2 upset as it was freezing cold outside & don't think saving a few quid was worth the walk hahaha",
            "title": "Standards Sadly Slipping",
            "user": "Nandoland"
        },
        {
            "date": "December 12, 2010",
            "detail_rating": {
                "business": null,
                "cleanliness": 5.0,
                "desk": null,
                "location": 5.0,
                "pool": null,
                "restaurant": null,
                "rooms": 5.0,
                "service": 5.0,
                "sleep": 5.0,
                "value": 5.0
            },
            "helpfulness": 1,
            "id": 89644105,
            "likes": {
                "disliked": null,
                "liked": null
            },
            "rating": 5.0,
            "stay_parameters": "Stayed December 2010, traveled as a couple",
            "text": "I will use this hotel again & defo recommend",
            "title": "What a craking hotel",
            "user": "rogerramjet365"
        },
        {
            "date": "December 8, 2010",
            "detail_rating": {
                "business": null,
                "cleanliness": 5.0,
                "desk": null,
                "location": 5.0,
                "pool": null,
                "restaurant": null,
                "rooms": 5.0,
                "service": 5.0,
                "sleep": 5.0,
                "value": 5.0
            },
            "helpfulness": null,
            "id": 89307372,
            "likes": {
                "disliked": null,
                "liked": null
            },
            "rating": 5.0,
            "stay_parameters": "Stayed July 2010, traveled as a couple",
            "text": "Stayed one night as we were seeing a show at the Echo Arena. The location was excellent - right opposite, with a selection of bars and restaurants nearby as well as a nice looking hotel restaurant.",
            "title": "If you think you know Premier Inn's think again",
            "user": "IanB1892"
        },
        {
            "date": "September 15, 2010",
            "detail_rating": {
                "business": null,
                "cleanliness": 5.0,
                "desk": null,
                "location": 4.0,
                "pool": null,
                "restaurant": null,
                "rooms": 5.0,
                "service": 5.0,
                "sleep": 5.0,
                "value": 5.0
            },
            "helpfulness": null,
            "id": 79675018,
            "likes": {
                "disliked": null,
                "liked": null
            },
            "rating": 5.0,
            "stay_parameters": "Stayed August 2010, traveled with friends",
            "text": "Stayed here for 1 night in August. We paid \u00a328 for the hotel room so shared between 2 it was a bargain price.",
            "title": "Great hotel for a trip to Liverpool",
            "user": "ami1708"
        },
        {
            "date": "September 6, 2010",
            "detail_rating": {
                "business": null,
                "cleanliness": 5.0,
                "desk": null,
                "location": 5.0,
                "pool": null,
                "restaurant": null,
                "rooms": 5.0,
                "service": 5.0,
                "sleep": 4.0,
                "value": 5.0
            },
            "helpfulness": null,
            "id": 78435417,
            "likes": {
                "disliked": null,
                "liked": null
            },
            "rating": 5.0,
            "stay_parameters": "Stayed September 2010, traveled with friends",
            "text": "The hotel is in a lovely location down on the Albert Docks - plenty of places to eat, drink & have a stroll around. It's about a 10min walk up to the centre of Liverpool.",
            "title": "Brilliant place to stay!",
            "user": "Ruby06London"
        },
        {
            "date": "September 4, 2010",
            "detail_rating": {
                "business": null,
                "cleanliness": 5.0,
                "desk": null,
                "location": 5.0,
                "pool": null,
                "restaurant": null,
                "rooms": 5.0,
                "service": 4.0,
                "sleep": 4.0,
                "value": 5.0
            },
            "helpfulness": null,
            "id": 78227471,
            "likes": {
                "disliked": null,
                "liked": null
            },
            "rating": 5.0,
            "stay_parameters": "Stayed August 2010, traveled as a couple",
            "text": "The hotel was very clean, the room was fab. Paid for the buffet breakfast which was worth the money.",
            "title": "A good choice",
            "user": "valamac"
        },
        {
            "date": "September 1, 2010",
            "detail_rating": {
                "business": null,
                "cleanliness": 4.0,
                "desk": null,
                "location": 4.0,
                "pool": null,
                "restaurant": null,
                "rooms": 5.0,
                "service": 4.0,
                "sleep": 3.0,
                "value": 4.0
            },
            "helpfulness": null,
            "id": 77869757,
            "likes": {
                "disliked": null,
                "liked": null
            },
            "rating": 4.0,
            "stay_parameters": "Stayed August 2010, traveled as a couple",
            "text": "I stayed here with a friend last weekend and we thought it was a lovely hotel. The staff were very friendly, as everyone seemed to be in Liverpool, the room was very clean, spacious and the food was good too.",
            "title": "A lovely loft room with beams and a view",
            "user": "Beatlesfan76"
        },
        {
            "date": "August 31, 2010",
            "detail_rating": {
                "business": null,
                "cleanliness": 5.0,
                "desk": null,
                "location": 5.0,
                "pool": null,
                "restaurant": null,
                "rooms": 5.0,
                "service": 5.0,
                "sleep": 5.0,
                "value": 5.0
            },
            "helpfulness": null,
            "id": 77733482,
            "likes": {
                "disliked": null,
                "liked": null
            },
            "rating": 5.0,
            "stay_parameters": "Stayed August 2010, traveled as a couple",
            "text": "We couldn't have asked for a better location either.",
            "title": "great place to stay",
            "user": "colin375"
        },
        {
            "date": "November 13, 2010",
            "detail_rating": {
                "business": null,
                "cleanliness": 5.0,
                "desk": null,
                "location": 5.0,
                "pool": null,
                "restaurant": null,
                "rooms": 5.0,
                "service": 5.0,
                "sleep": 5.0,
                "value": 5.0
            },
            "helpfulness": null,
            "id": 86944756,
            "likes": {
                "disliked": null,
                "liked": null
            },
            "rating": 5.0,
            "stay_parameters": "Stayed October 2010, traveled with family",
            "text": "If you're looking for a budget hotel in Liverpool, then look no further. Location and views are hard to beat. Close to all amenities. Lovely views over Albert Dock and the Liver Building. Spacious room and comfortable bed. Excellent breakfast and free for our teenager!",
            "title": "highly recommended",
            "user": "angleseymember"
        },
        {
            "date": "October 13, 2010",
            "detail_rating": {
                "business": null,
                "cleanliness": 3.0,
                "desk": null,
                "location": 5.0,
                "pool": null,
                "restaurant": null,
                "rooms": 3.0,
                "service": 3.0,
                "sleep": 3.0,
                "value": 4.0
            },
            "helpfulness": null,
            "id": 83351319,
            "likes": {
                "disliked": null,
                "liked": null
            },
            "rating": 3.0,
            "stay_parameters": "Stayed October 2010, traveled on business",
            "text": "I enjoyed my 3 nights at the Premier Inn @ Albert Dock for:",
            "title": "Nice Location!",
            "user": "heiranig"
        },
        {
            "date": "October 10, 2010",
            "detail_rating": {
                "business": null,
                "cleanliness": 5.0,
                "desk": null,
                "location": 4.0,
                "pool": null,
                "restaurant": null,
                "rooms": 5.0,
                "service": 3.0,
                "sleep": 1.0,
                "value": 3.0
            },
            "helpfulness": null,
            "id": 82857948,
            "likes": {
                "disliked": null,
                "liked": null
            },
            "rating": 2.0,
            "stay_parameters": "Stayed October 2010, traveled with friends",
            "text": "- location right next to the Convention Center, next to the Beatles' museum",
            "title": "So noisy!!!",
            "user": "NottinghamClaire"
        },
        {
            "date": "October 9, 2010",
            "detail_rating": {
                "business": null,
                "cleanliness": 5.0,
                "desk": null,
                "location": 5.0,
                "pool": null,
                "restaurant": null,
                "rooms": 5.0,
                "service": 4.0,
                "sleep": 5.0,
                "value": 4.0
            },
            "helpfulness": null,
            "id": 82755972,
            "likes": {
                "disliked": null,
                "liked": null
            },
            "rating": 5.0,
            "stay_parameters": "Stayed March 2010, traveled on business",
            "text": "- walking distance to huge, wonderful shopping center",
            "title": "Great hotel, great location",
            "user": "Courthmp"
        },
        {
            "date": "October 7, 2010",
            "detail_rating": {
                "business": null,
                "cleanliness": 5.0,
                "desk": null,
                "location": 5.0,
                "pool": null,
                "restaurant": null,
                "rooms": 5.0,
                "service": 4.0,
                "sleep": 4.0,
                "value": 4.0
            },
            "helpfulness": 1,
            "id": 82462736,
            "likes": {
                "disliked": null,
                "liked": null
            },
            "rating": 5.0,
            "stay_parameters": "Stayed December 2009, traveled as a couple",
            "text": "- many restaurants around (fantastic indian next door)",
            "title": "Best Hotel by far!",
            "user": "Mrs_Paisita"
        }
    ],
    "slim_ranking": 0.142857142857,
    "stars": null,
    "tripadvisor": {
        "VISITED": false,
        "country_name": null,
        "locality": null,
        "pic_link": null,
        "street_address": null
    },
    "user_rating": 4.5,
    "variance": {
        "average": 146,
        "excellent": 871,
        "poor": 49,
        "terrible": 24,
        "very good": 423
    }
}