{
    "aka": "Best Western Grove City Hotel Grove City",
    "description": null,
    "detail_rating": {
        "cleanliness": null,
        "location": null,
        "rooms": null,
        "service": null,
        "sleep": null,
        "value": null
    },
    "location": {
        "city": "Grove City",
        "continent": null,
        "country": "United States",
        "proposed_city": "Grove",
        "province": null,
        "region": null
    },
    "name": "BEST WESTERN Grove City Inn",
    "places": {
        "aka": [
            "Best",
            "Grove"
        ],
        "hotel_description": [],
        "hotel_name": [
            "BEST",
            "Grove"
        ]
    },
    "review_count": 224,
    "review_count_current": 2,
    "reviews": [
        {
            "date": "September 17, 2007",
            "detail_rating": {
                "business": 3.0,
                "cleanliness": 4.0,
                "desk": null,
                "front_desk": 5.0,
                "location": 4.0,
                "pool": null,
                "restaurant": null,
                "rooms": 4.0,
                "service": 4.0,
                "sleep": null,
                "value": 5.0
            },
            "helpfulness": 1,
            "id": 8738473,
            "likes": {
                "disliked": "\u2014 Free breakfast was cramped and crowded.",
                "liked": "\u2014 Value - clean room at a great price!"
            },
            "rating": 4.0,
            "stay_parameters": "Stayed September 2007, traveled with family",
            "text": "Clean room, friendly front desk staff, no problem with our reservation and lots of parking. Even the small in-door pool was okay. Breakfast is a little cramped next to the front desk. Show your key card and get 10% off at the Kings restaurant next door, or the Eat-n-Park across the street. With a child in college near-by, we'll be back often.",
            "title": "Nice stay",
            "user": "JohninDC"
        },
        {
            "date": "September 11, 2007",
            "detail_rating": {
                "business": null,
                "cleanliness": null,
                "desk": null,
                "location": null,
                "pool": null,
                "restaurant": null,
                "rooms": null,
                "service": null,
                "sleep": null,
                "value": null
            },
            "helpfulness": 1,
            "id": 8697144,
            "likes": {
                "disliked": null,
                "liked": null
            },
            "rating": 1.0,
            "stay_parameters": null,
            "text": "Our toilet overflowed the morning we left. There was no vent fan in the bathroom. The sheets were dirty. Complained at check out. They said we should have told them the night before about the sheets. We were late going to bed and slept on top of the covers. Contacted Best Western and they said I would receive an email from the hotel directly in 7 days that was on August 29th still have not heard anything. We do not plan on using Best Western again.",
            "title": "Stay somewhere else",
            "user": "HomePA"
        }
    ],
    "slim_ranking": 0.25,
    "stars": null,
    "tripadvisor": {
        "VISITED": false,
        "country_name": null,
        "locality": null,
        "pic_link": null,
        "street_address": null
    },
    "user_rating": 3.5,
    "variance": {
        "average": 49,
        "excellent": 53,
        "poor": 8,
        "terrible": 24,
        "very good": 90
    }
}