{
    "aka": "Metropole Hotel Singapore",
    "description": "Naumi Hotel is an intimate retreat in Singapore that presents a selection of 73 elegantly-appointed rooms to cocoon guests in comfort. Find refuge and resplendence in Naumi Hotel with a huge selection of handpicked original design pieces from B&B Italia, Poltrona Frau, Zanotta, Tom Dixon, Artemide, alongside an impressive collection of some specially commissioned Singaporean art. With an international design pulse that is both attractive and architecturally appealing, Naumi is the trendsetter. Set in the heart of the Singapore\u2019s Central Business District, Naumi Hotel is a state-of-the-art boutique hotel located a stone\u2019s throw away from the Suntec Convention Centre, the Formula One Track, and a myriad of inner-city shopping centres.",
    "detail_rating": {
        "cleanliness": 4.5,
        "location": 4.5,
        "rooms": 4.5,
        "service": 4.5,
        "sleep": 4.5,
        "value": 4.5
    },
    "location": {
        "city": null,
        "continent": "Asia",
        "country": "Singapore",
        "proposed_city": null,
        "province": null,
        "region": null
    },
    "name": "Naumi Hotel",
    "places": {
        "aka": [],
        "hotel_description": [
            "Dixon",
            "Central"
        ],
        "hotel_name": []
    },
    "review_count": 744,
    "review_count_current": 1,
    "reviews": [
        {
            "date": "June 19, 2008",
            "detail_rating": {
                "business": null,
                "cleanliness": null,
                "desk": null,
                "location": null,
                "pool": null,
                "restaurant": null,
                "rooms": null,
                "service": null,
                "sleep": null,
                "value": null
            },
            "helpfulness": 2,
            "id": 17059211,
            "likes": {
                "disliked": null,
                "liked": null
            },
            "rating": 4.0,
            "stay_parameters": null,
            "text": "A fantastic stylish new hotel in Singapore. Great location. Incredible lap pool on roof. Nice style. Great breakfast. Wish it was possible to open the windows and get fresh air. Staff needs to be trained in hotel basics, very helpful but quite inefficient. I would stay again. Really enjoyed the style and cleanliness.",
            "title": "Great hotel",
            "user": "mitchmu"
        }
    ],
    "slim_ranking": 0.0555555555556,
    "stars": 4.5,
    "tripadvisor": {
        "VISITED": false,
        "country_name": null,
        "locality": null,
        "pic_link": null,
        "street_address": null
    },
    "user_rating": 4.5,
    "variance": {
        "average": 42,
        "excellent": 487,
        "poor": 18,
        "terrible": 10,
        "very good": 187
    }
}