{
    "aka": "Sandy Lane Resort",
    "description": "Elegant and exclusive, Sandy Lane is set in an ancient mahogany grove overlooking a 1000 foot crescent of gorgeous white sand beach. Accommodations include 112 rooms and suites as well as a stunning 5-bedroom villa. With a magnificent 47,000-square-foot spa, four restaurants, six bars, nine floodlit tennis courses, beachside service, 45 holes of championship golf and The Treehouse Club facility for kids and teens, Sandy Lane will cater to your every need.",
    "detail_rating": {
        "cleanliness": 5.0,
        "location": 5.0,
        "rooms": 5.0,
        "service": 4.5,
        "sleep": 5.0,
        "value": 4.5
    },
    "location": {
        "city": null,
        "continent": null,
        "country": "Caribbean",
        "proposed_city": "Sandy",
        "province": null,
        "region": null
    },
    "name": "Sandy Lane Hotel",
    "places": {
        "aka": [
            "Sandy"
        ],
        "hotel_description": [
            "Sandy"
        ],
        "hotel_name": [
            "Sandy"
        ]
    },
    "review_count": 409,
    "review_count_current": 20,
    "reviews": [
        {
            "date": "November 15, 2012",
            "detail_rating": {
                "business": null,
                "cleanliness": 5.0,
                "desk": null,
                "location": 5.0,
                "pool": null,
                "restaurant": null,
                "rooms": 5.0,
                "service": 5.0,
                "sleep": null,
                "value": 5.0
            },
            "helpfulness": 1,
            "id": 145489730,
            "likes": {
                "disliked": null,
                "liked": null
            },
            "rating": 5.0,
            "stay_parameters": "Stayed November 2012",
            "text": "We are here for our anniversary. We were here for our honeymoon. Sandy Lane is a diamond in the Carribean! The service is above any 5 star resort we ever visited. The food is comparable to NYC +. Housekeeping is impeccable! The staff is genuine , attentive and always pleasant and ready to serve you. The beds are like being on s cloud . Push a button and the drapes open, another and the lights go on. Devine!",
            "title": "Amazing and romantic! You are so spoiled being here! Literally, everything is at your fingertips.",
            "user": "sonnfun"
        },
        {
            "date": "November 7, 2012",
            "detail_rating": {
                "business": null,
                "cleanliness": null,
                "desk": null,
                "location": null,
                "pool": null,
                "restaurant": null,
                "rooms": null,
                "service": null,
                "sleep": null,
                "value": null
            },
            "helpfulness": null,
            "id": 144820065,
            "likes": {
                "disliked": null,
                "liked": null
            },
            "rating": 5.0,
            "stay_parameters": null,
            "text": "I have 3 concerns though, one is that it is crazy expensive! A bottle of wine is above or much more than $80. ( Lots of taxes etc. added)The beach is lovely but the lounges are right next to one another. (Way to close) there is construction of a home for one of the owners. This begins at 720 am and goes til 6 PM. Too much noise for us but it should be completed in the next yr. ( it had been going now for 2 yrs:). )",
            "title": "Swimming with Hawksbill turtles at Sandy Lane Hotel Beach",
            "user": "khristetah"
        },
        {
            "date": "November 4, 2012",
            "detail_rating": {
                "business": null,
                "cleanliness": 5.0,
                "desk": null,
                "location": 5.0,
                "pool": null,
                "restaurant": null,
                "rooms": null,
                "service": 5.0,
                "sleep": null,
                "value": 5.0
            },
            "helpfulness": 2,
            "id": 144500910,
            "likes": {
                "disliked": null,
                "liked": null
            },
            "rating": 5.0,
            "stay_parameters": "Stayed November 2012, traveled with friends",
            "text": "Catamarans arrive each day around noon . They play loud music, drop the guests off to swim and walk the beach. I find this intrusive bc we pay a fortune and now we have all this noise and folks walking and snapping pictures.",
            "title": "Afternoon Tea at Sandy Lane Hotel Barbados",
            "user": "Sue T"
        },
        {
            "date": "November 4, 2012",
            "detail_rating": {
                "business": null,
                "cleanliness": 5.0,
                "desk": null,
                "location": 5.0,
                "pool": null,
                "restaurant": null,
                "rooms": 5.0,
                "service": 5.0,
                "sleep": 5.0,
                "value": 4.0
            },
            "helpfulness": 2,
            "id": 144471535,
            "likes": {
                "disliked": null,
                "liked": null
            },
            "rating": 5.0,
            "stay_parameters": "Stayed October 2012, traveled with family",
            "text": "Overall I give Sandy Lane an A + . You will never receive attention or service as you do at Sandy Lane.",
            "title": "Perfection",
            "user": "David A"
        },
        {
            "date": "November 4, 2012",
            "detail_rating": {
                "business": null,
                "cleanliness": 5.0,
                "desk": null,
                "location": 5.0,
                "pool": null,
                "restaurant": null,
                "rooms": 5.0,
                "service": 5.0,
                "sleep": 5.0,
                "value": 4.0
            },
            "helpfulness": 1,
            "id": 144448712,
            "likes": {
                "disliked": null,
                "liked": null
            },
            "rating": 5.0,
            "stay_parameters": "Stayed October 2012, traveled as a couple",
            "text": "Awesome experience. We were fortunate to experience the privacy that we had when we went to the area. The Sandy Lane Beach in Barbados is where the Hawsbill turtles comes in to play so we saw a couple of turtles and swam with them. They were very friendly and fun. They swam around us and were not afraid when one of us touches them (we were not supposed to... except you just cannot resist!)",
            "title": "Still hard to find anything better then sandylane",
            "user": "TorontoSpagirl"
        },
        {
            "date": "January 3, 2013",
            "detail_rating": {
                "business": null,
                "cleanliness": 5.0,
                "desk": null,
                "location": 5.0,
                "pool": null,
                "restaurant": null,
                "rooms": 5.0,
                "service": 5.0,
                "sleep": 5.0,
                "value": 4.0
            },
            "helpfulness": 25,
            "id": 148710603,
            "likes": {
                "disliked": null,
                "liked": null
            },
            "rating": 5.0,
            "stay_parameters": "Stayed November 2012, traveled as a couple",
            "text": "We stayed at Sandy Lane in November to celebrate our Silver Wedding Anniversary and had a really wonderful time.",
            "title": "Exceptional and Pretty close to Perfect",
            "user": "slj60"
        },
        {
            "date": "December 31, 2012",
            "detail_rating": {
                "business": null,
                "cleanliness": 5.0,
                "desk": null,
                "location": 5.0,
                "pool": null,
                "restaurant": null,
                "rooms": 5.0,
                "service": 5.0,
                "sleep": null,
                "value": 5.0
            },
            "helpfulness": 7,
            "id": 148466945,
            "likes": {
                "disliked": null,
                "liked": null
            },
            "rating": 5.0,
            "stay_parameters": "Stayed April 2012",
            "text": "The Sandy Lane 'experience' begins even before you arrive. I received an email from them via my Travel Agent with a questionnaire attached for my preferences for the drinks in the mini bar, the non alcholic ones being complimentary, and any other special requests such as dining reservations, spa appointments and island tours.",
            "title": "Elegance in the Caribbean.",
            "user": "Lisa B"
        },
        {
            "date": "December 28, 2012",
            "detail_rating": {
                "business": null,
                "cleanliness": 5.0,
                "desk": null,
                "location": 5.0,
                "pool": null,
                "restaurant": null,
                "rooms": 5.0,
                "service": 5.0,
                "sleep": 5.0,
                "value": 4.0
            },
            "helpfulness": 5,
            "id": 148224260,
            "likes": {
                "disliked": null,
                "liked": null
            },
            "rating": 5.0,
            "stay_parameters": "Stayed October 2012, traveled as a couple",
            "text": "On arrival at the airport we were whisked through security ( although I think this is a service arranged by our Travel Agent) and met by a representative of the hotel and escorted to our car.",
            "title": "Paradise",
            "user": "JQ_1a"
        },
        {
            "date": "December 22, 2012",
            "detail_rating": {
                "business": null,
                "cleanliness": null,
                "desk": null,
                "location": null,
                "pool": null,
                "restaurant": null,
                "rooms": null,
                "service": null,
                "sleep": null,
                "value": null
            },
            "helpfulness": 21,
            "id": 147906026,
            "likes": {
                "disliked": null,
                "liked": null
            },
            "rating": 5.0,
            "stay_parameters": null,
            "text": "We arrived at the hotel and were shown to our room and were greeted to Etta James on the entertainment system singing \"At Last\" which really set the mood for our stay.",
            "title": "Afternoon Tea in the Tropics",
            "user": "KoolKandi"
        },
        {
            "date": "December 21, 2012",
            "detail_rating": {
                "business": null,
                "cleanliness": 5.0,
                "desk": null,
                "location": 5.0,
                "pool": null,
                "restaurant": null,
                "rooms": 5.0,
                "service": 5.0,
                "sleep": 5.0,
                "value": 5.0
            },
            "helpfulness": null,
            "id": 147845643,
            "likes": {
                "disliked": null,
                "liked": null
            },
            "rating": 5.0,
            "stay_parameters": "Stayed December 2012, traveled as a couple",
            "text": "What makes Sandy Lane so special is the attention to detail,which is the best I have experienced in a hotel anywhere. The staff really don't miss anything and the fabric is maintained to a very high standard. Our towels and even bathrobes were changed daily and new slippers were left each day. There were two days when curiously the maid did not leave us bathmats but there were so many towels we used those. We did ask for a kettle and a tea pot to be delivered to the room as the coffee maker did not boil the water hot enough for a decent cup of tea. The tea pot arrived within minutes but not the kettle. I suspect they don't have any and possibly deliberately for health and safety reasons so I can forgive them for that.",
            "title": "Barbados Bliss",
            "user": "Stacy B"
        },
        {
            "date": "November 2, 2012",
            "detail_rating": {
                "business": null,
                "cleanliness": 5.0,
                "desk": null,
                "location": 5.0,
                "pool": null,
                "restaurant": null,
                "rooms": 5.0,
                "service": 5.0,
                "sleep": 5.0,
                "value": 3.0
            },
            "helpfulness": null,
            "id": 144317483,
            "likes": {
                "disliked": null,
                "liked": null
            },
            "rating": 5.0,
            "stay_parameters": "Stayed December 2011, traveled with family",
            "text": "I took my Wife and youngest son here back in 2009. Quite frankly an amazing hotel with great service. Beautifully equipped rooms and great food. Beach was a dream as was the service on the beach. You are made to feel very special whilst staying at the hotel even down to being assisted on arrival to the airport and personally being escorted through customs etc.",
            "title": "Very nice...",
            "user": "Stephen B"
        },
        {
            "date": "October 26, 2012",
            "detail_rating": {
                "business": null,
                "cleanliness": 5.0,
                "desk": null,
                "location": 4.0,
                "pool": null,
                "restaurant": null,
                "rooms": 5.0,
                "service": 5.0,
                "sleep": 4.0,
                "value": 4.0
            },
            "helpfulness": 2,
            "id": 143779642,
            "likes": {
                "disliked": null,
                "liked": null
            },
            "rating": 5.0,
            "stay_parameters": "Stayed October 2012, traveled solo",
            "text": "I passed through for two days principally to relax between business meetings in the region.",
            "title": "Perfect stay",
            "user": "philip s"
        },
        {
            "date": "October 24, 2012",
            "detail_rating": {
                "business": null,
                "cleanliness": 5.0,
                "desk": null,
                "location": 5.0,
                "pool": null,
                "restaurant": null,
                "rooms": 5.0,
                "service": 5.0,
                "sleep": 5.0,
                "value": 4.0
            },
            "helpfulness": 1,
            "id": 143581007,
            "likes": {
                "disliked": null,
                "liked": null
            },
            "rating": 5.0,
            "stay_parameters": "Stayed October 2012, traveled as a couple",
            "text": "The hotel was perfect for that, including the food (Acajoux), room (very quiet and comfortable with a garden view), service and spa. Didn't have time for golf but others raved about it, and a round was included in my package.",
            "title": "Close to perfection...will return again",
            "user": "landmiller"
        },
        {
            "date": "October 19, 2012",
            "detail_rating": {
                "business": null,
                "cleanliness": 5.0,
                "desk": null,
                "location": 5.0,
                "pool": null,
                "restaurant": null,
                "rooms": 5.0,
                "service": 5.0,
                "sleep": 5.0,
                "value": 4.0
            },
            "helpfulness": 2,
            "id": 143225505,
            "likes": {
                "disliked": null,
                "liked": null
            },
            "rating": 5.0,
            "stay_parameters": "Stayed October 2012, traveled as a couple",
            "text": "It's truly one of the world's great hotels up there with the Baur au Lac, des Bergues, Oriental, Okura, Amstel, etc. Very well managed in all respects. I tihnk this sets the high end standard in the entire region.",
            "title": "A wonderful honeymoon",
            "user": "AS-reviewer"
        },
        {
            "date": "September 30, 2012",
            "detail_rating": {
                "business": null,
                "cleanliness": 5.0,
                "desk": null,
                "location": 5.0,
                "pool": null,
                "restaurant": null,
                "rooms": 5.0,
                "service": 5.0,
                "sleep": 5.0,
                "value": 5.0
            },
            "helpfulness": 2,
            "id": 141650775,
            "likes": {
                "disliked": null,
                "liked": null
            },
            "rating": 5.0,
            "stay_parameters": "Stayed May 2012, traveled as a couple",
            "text": "Sandy Lane deserves 5 stars not because it is perfect, but because it comes so darn close...and there aren't many hotels that do. From the plush rooms with so much attention to detail to ensure you have the comfort and space to feel at home to the exceptionally well trained staff, Sandy Lane has a lot to offer. It is situated on the Carribbean side of the island, which is important. We drove to the Atlantic Ocean side one day and while it was certainly an adventure and we enjoyed the \"workout\" battling the waves near the hotel that is often compared to Sandy Lane, it just doesn't compare...not even close. If you want to relax, be pampered, receive exceptional service and stay in a luxurious room with convenience at your fingertips with state-of-the-art touchpads for lighting/drapes, etc., stay at Sandy Lane. I will caution you: you will pay dearly for those comforts. Hotel and food is pricey, but we must feel it is worth it because we will be back...again.",
            "title": "Pretty amazing place",
            "user": "Danny M"
        },
        {
            "date": "December 9, 2012",
            "detail_rating": {
                "business": null,
                "cleanliness": 5.0,
                "desk": null,
                "location": 5.0,
                "pool": null,
                "restaurant": null,
                "rooms": 5.0,
                "service": 5.0,
                "sleep": 5.0,
                "value": 4.0
            },
            "helpfulness": 2,
            "id": 147052063,
            "likes": {
                "disliked": null,
                "liked": null
            },
            "rating": 5.0,
            "stay_parameters": "Stayed December 2012, traveled with family",
            "text": "We stayed here for 2 weeks. It is expensive but you get the service you expect with the price tag.",
            "title": "Beautiful place, friendly staff & kid friendly",
            "user": "Trina214"
        },
        {
            "date": "November 20, 2012",
            "detail_rating": {
                "business": null,
                "cleanliness": 5.0,
                "desk": null,
                "location": 5.0,
                "pool": null,
                "restaurant": null,
                "rooms": 5.0,
                "service": 5.0,
                "sleep": 5.0,
                "value": 4.0
            },
            "helpfulness": 1,
            "id": 145857021,
            "likes": {
                "disliked": null,
                "liked": null
            },
            "rating": 5.0,
            "stay_parameters": "Stayed November 2012, traveled as a couple",
            "text": "Sometimes too much - they check in on you a lot so be sure to put up your Do Not Disturb if you don't want to be bothered.",
            "title": "The best I've been to.",
            "user": "Real B"
        },
        {
            "date": "November 17, 2012",
            "detail_rating": {
                "business": null,
                "cleanliness": 4.0,
                "desk": null,
                "location": 3.0,
                "pool": null,
                "restaurant": null,
                "rooms": 4.0,
                "service": 4.0,
                "sleep": 3.0,
                "value": 2.0
            },
            "helpfulness": 3,
            "id": 145572070,
            "likes": {
                "disliked": null,
                "liked": null
            },
            "rating": 3.0,
            "stay_parameters": "Stayed December 2011, traveled as a couple",
            "text": "Its not a huge hotel, you can walk from one side of the resort to the other in less than 5 minutes.",
            "title": "Cant compare to resorts in Hawaii",
            "user": "cass s"
        },
        {
            "date": "November 16, 2012",
            "detail_rating": {
                "business": null,
                "cleanliness": 5.0,
                "desk": null,
                "location": 5.0,
                "pool": null,
                "restaurant": null,
                "rooms": 5.0,
                "service": 5.0,
                "sleep": 5.0,
                "value": 4.0
            },
            "helpfulness": 1,
            "id": 145511516,
            "likes": {
                "disliked": null,
                "liked": null
            },
            "rating": 5.0,
            "stay_parameters": "Stayed November 2012, traveled as a couple",
            "text": "The staff is super friendly and we spent many afternoons having lunch by the beach.",
            "title": "Best ever",
            "user": "Lars B"
        },
        {
            "date": "November 16, 2012",
            "detail_rating": {
                "business": null,
                "cleanliness": 5.0,
                "desk": null,
                "location": 5.0,
                "pool": null,
                "restaurant": null,
                "rooms": 5.0,
                "service": 5.0,
                "sleep": 5.0,
                "value": 5.0
            },
            "helpfulness": 5,
            "id": 145507419,
            "likes": {
                "disliked": null,
                "liked": null
            },
            "rating": 5.0,
            "stay_parameters": "Stayed October 2012, traveled as a couple",
            "text": "If you can get a room on the bottom floor in the dolphin wing I highly suggest it - you can just open your back door and take a short walk to the beach.",
            "title": "By far and away exceeds the experience of 2nd best hotel I've ever stayed in",
            "user": "Jamietraveller"
        }
    ],
    "slim_ranking": 0.111111111111,
    "stars": 5,
    "tripadvisor": {
        "VISITED": false,
        "country_name": null,
        "locality": null,
        "pic_link": null,
        "street_address": null
    },
    "user_rating": 4.5,
    "variance": {
        "average": 25,
        "excellent": 324,
        "poor": 16,
        "terrible": 15,
        "very good": 29
    }
}