{
    "aka": "Sun & Ski Hotel",
    "description": "Bordered by the Little River and shadowed by Mount Mansfield, Sun & Ski Inn and Suites offers comfortable lodging rooms and amenities for the best vacation. Experience the enrichment of a peaceful mountain setting as well as the excitement of being near the fun! Located between the historic village of Stowe, Vermont and the mountain, Sun & Ski Inn and Suites has something to offer to the skiers, hikers and mountainbikers as well as to those longing for the famous New England warmth and hospitality.",
    "detail_rating": {
        "cleanliness": null,
        "location": null,
        "rooms": null,
        "service": null,
        "sleep": null,
        "value": null
    },
    "location": {
        "city": "Stowe",
        "continent": null,
        "country": "United States",
        "proposed_city": "Mansfield",
        "province": null,
        "region": null
    },
    "name": "Sun & Ski Inn and Suites",
    "places": {
        "aka": [],
        "hotel_description": [
            "Mansfield"
        ],
        "hotel_name": []
    },
    "review_count": 251,
    "review_count_current": 9,
    "reviews": [
        {
            "date": "February 13, 2006",
            "detail_rating": {
                "business": null,
                "cleanliness": 4.0,
                "desk": null,
                "location": null,
                "pool": null,
                "restaurant": null,
                "rooms": 4.0,
                "service": 3.0,
                "sleep": null,
                "value": 4.0
            },
            "helpfulness": 9,
            "id": 4457315,
            "likes": {
                "disliked": null,
                "liked": null
            },
            "rating": 4.0,
            "stay_parameters": "Stayed February 2006",
            "text": "I was a little worried about this place before checking in. We needed a room for one night for a ski trip and this was the only property available for less then 150.00/nt that looked even half-way decent. After Check-in I realized that this was all needed. We reserved a Riverside Superior room for 123.00/nt, because it seemed like a little more space. The room was quite large at about 400 sqaure feet, and had a patio looking out at the river. The room wasnt luxurious by any stretch, but it was clean and came with most amenities a person would need, including a refridgerator. I would suggest getting this room because it was only about 7.00 to 10.00 more per night then the economey or standard rooms, and it looked considerably larger. The lodge came with a indoor heated pool, and enclosed outdoor jacuzzi. They were both decent, and we had the place to ourselves, so it was quite pleasant. Stowe Mountain is about 5 mins up the road and is a very easy drive. There are also several nice restaurants close by, and quite a few areas for ski rentals.",
            "title": "Not bad at all....",
            "user": "icem2829"
        },
        {
            "date": "January 11, 2006",
            "detail_rating": {
                "business": null,
                "cleanliness": null,
                "desk": null,
                "location": null,
                "pool": null,
                "restaurant": null,
                "rooms": null,
                "service": null,
                "sleep": null,
                "value": null
            },
            "helpfulness": 5,
            "id": 4346801,
            "likes": {
                "disliked": null,
                "liked": null
            },
            "rating": 5.0,
            "stay_parameters": null,
            "text": "All in all I highly recmd. this place based on the low rate, and the clean comfortable accomidations.",
            "title": "Best vacation ever p",
            "user": "A TripAdvisor user"
        },
        {
            "date": "October 14, 2005",
            "detail_rating": {
                "business": null,
                "cleanliness": null,
                "desk": null,
                "location": null,
                "pool": null,
                "restaurant": null,
                "rooms": null,
                "service": null,
                "sleep": null,
                "value": null
            },
            "helpfulness": 3,
            "id": 4022788,
            "likes": {
                "disliked": null,
                "liked": null
            },
            "rating": 2.0,
            "stay_parameters": null,
            "text": "My husband and I have been staying for a week or more",
            "title": "We would not stay there again",
            "user": "MarkFPlantation"
        },
        {
            "date": "October 5, 2005",
            "detail_rating": {
                "business": null,
                "cleanliness": null,
                "desk": null,
                "location": null,
                "pool": null,
                "restaurant": null,
                "rooms": null,
                "service": null,
                "sleep": null,
                "value": null
            },
            "helpfulness": 4,
            "id": 3996174,
            "likes": {
                "disliked": null,
                "liked": null
            },
            "rating": 2.0,
            "stay_parameters": null,
            "text": "every summer at the Sun and Ski Motel in Stowe, Vermont for over ten years. We have been accompanied at times by our children and grandchildren as well and all of us have gone back to Florida relaxed and happy. The staff is outstanding, rooms are clean and comfortable, breakfasts are delightful. I could praise this place even more but I do NOT want to see hordes of tourists descending on my very special place! We're heading back again this summer and can't wait to get there!",
            "title": "Beware of cancellation policy",
            "user": "WAFamilyof4"
        },
        {
            "date": "September 25, 2005",
            "detail_rating": {
                "business": null,
                "cleanliness": 1.0,
                "desk": null,
                "location": null,
                "pool": null,
                "restaurant": null,
                "rooms": 1.0,
                "service": 3.0,
                "sleep": null,
                "value": 1.0
            },
            "helpfulness": 4,
            "id": 3937162,
            "likes": {
                "disliked": null,
                "liked": null
            },
            "rating": 1.0,
            "stay_parameters": "Stayed August 2005",
            "text": "We would not stay there again. The bed was hard as a rock, dipping in the middle with flat pilliows. The wallpaper was peeling off in several places in the room. There was even a light plate missing from a receptable behind the bed. The night clerk was not willing to relocate us to a better room and was not very friendly at all. We booked this place due the nice website, but guess pictures do not show the complete package. Next year we will stay elsewhere.",
            "title": "smells! yuk yuk yuk",
            "user": "weekendtripper"
        },
        {
            "date": "February 20, 2005",
            "detail_rating": {
                "business": null,
                "cleanliness": null,
                "desk": null,
                "location": null,
                "pool": null,
                "restaurant": null,
                "rooms": null,
                "service": null,
                "sleep": null,
                "value": null
            },
            "helpfulness": 7,
            "id": 3212457,
            "likes": {
                "disliked": null,
                "liked": null
            },
            "rating": 5.0,
            "stay_parameters": null,
            "text": "Excellent hotel, very nice and clean rooms. Great rates. A good hotel to really relax and enjoy Stowe. The staff is extremely friendly making us feel at home. Great location with free shuttle service. Beautiful heated indoor pool (roof opens in the summer).",
            "title": "A wonderful get-away",
            "user": "A TripAdvisor user"
        },
        {
            "date": "February 14, 2005",
            "detail_rating": {
                "business": null,
                "cleanliness": null,
                "desk": null,
                "location": null,
                "pool": null,
                "restaurant": null,
                "rooms": null,
                "service": null,
                "sleep": null,
                "value": null
            },
            "helpfulness": 6,
            "id": 3184757,
            "likes": {
                "disliked": null,
                "liked": null
            },
            "rating": 5.0,
            "stay_parameters": null,
            "text": "This was the second time we stayed here. Once for skiing (fire place) and once for the foliage.",
            "title": "Excellent place to stay while in Stowe",
            "user": "A TripAdvisor user"
        },
        {
            "date": "February 13, 2005",
            "detail_rating": {
                "business": null,
                "cleanliness": null,
                "desk": null,
                "location": null,
                "pool": null,
                "restaurant": null,
                "rooms": null,
                "service": null,
                "sleep": null,
                "value": null
            },
            "helpfulness": 1,
            "id": 3183141,
            "likes": {
                "disliked": null,
                "liked": null
            },
            "rating": 4.0,
            "stay_parameters": null,
            "text": "The recreation path is close by and bikes are free to use.",
            "title": "Sun and ski Review",
            "user": "A TripAdvisor user"
        },
        {
            "date": "August 31, 2004",
            "detail_rating": {
                "business": null,
                "cleanliness": null,
                "desk": null,
                "location": null,
                "pool": null,
                "restaurant": null,
                "rooms": null,
                "service": null,
                "sleep": null,
                "value": null
            },
            "helpfulness": 9,
            "id": 2504250,
            "likes": {
                "disliked": null,
                "liked": null
            },
            "rating": 4.0,
            "stay_parameters": null,
            "text": "We highly recommend this hotel!!",
            "title": "Right combination",
            "user": "Whizzzy"
        }
    ],
    "slim_ranking": 0.217391304348,
    "stars": 2.5,
    "tripadvisor": {
        "VISITED": false,
        "country_name": null,
        "locality": null,
        "pic_link": null,
        "street_address": null
    },
    "user_rating": 4.0,
    "variance": {
        "average": 21,
        "excellent": 126,
        "poor": 12,
        "terrible": 8,
        "very good": 84
    }
}