{
    "aka": "Bewleys Hotel Manchester",
    "description": "Bewley's Hotel Manchester Airport is located just minutes from terminals one and three of Manchester Airport. A complimentary shuttle service to both the airport and train stations is also provided for added convenience. Quality and value in warm friendly surroundings is what this stylish hotel is all about.",
    "detail_rating": {
        "cleanliness": 4.5,
        "location": 4.5,
        "rooms": 4.0,
        "service": 4.0,
        "sleep": 4.0,
        "value": 4.0
    },
    "location": {
        "city": null,
        "continent": "Europe",
        "country": "United Kingdom (UK)",
        "proposed_city": "Manchester",
        "province": null,
        "region": null
    },
    "name": "Bewleys Hotel Manchester Airport",
    "places": {
        "aka": [
            "Manchester"
        ],
        "hotel_description": [
            "Manchester"
        ],
        "hotel_name": [
            "Manchester"
        ]
    },
    "review_count": 1959,
    "review_count_current": 20,
    "reviews": [
        {
            "date": "March 21, 2007",
            "detail_rating": {
                "business": null,
                "cleanliness": 5.0,
                "desk": null,
                "front_desk": 3.0,
                "location": 5.0,
                "pool": null,
                "restaurant": null,
                "rooms": 4.0,
                "service": 3.0,
                "sleep": null,
                "value": 4.0
            },
            "helpfulness": 6,
            "id": 7196408,
            "likes": {
                "disliked": null,
                "liked": "\u2014 Clean and modern, location right at the airport"
            },
            "rating": 4.0,
            "stay_parameters": "Stayed March 2007, traveled on business",
            "text": "Stayed for 1 night, good sized room, very comfortable bed, everything very clean, modern bathroom. Impressed by the fact that you don't hear any noise from the airport. Friendly and lively bar in the evening. Certainly good value for money.",
            "title": "Really good",
            "user": "kwenga"
        },
        {
            "date": "March 18, 2007",
            "detail_rating": {
                "business": null,
                "cleanliness": 3.0,
                "desk": null,
                "front_desk": 4.0,
                "location": 4.0,
                "pool": null,
                "restaurant": null,
                "rooms": 3.0,
                "service": 3.0,
                "sleep": null,
                "value": 5.0
            },
            "helpfulness": 4,
            "id": 7184957,
            "likes": {
                "disliked": "\u2014 Nothing",
                "liked": "\u2014 Good value, efficiency of transport to airport, location"
            },
            "rating": 5.0,
            "stay_parameters": "Stayed March 2007, traveled as a couple",
            "text": "When reading some of the reviews of airport hotels at Manchester I began to wonder if any of them were any good. Then we saw the reviews of Bewleys and decided to stay there on a park and fly deal. You won't find this one on any of the airport extras websites, you book direct on the hotel site. It proved really good value at just over \u00a3100 including 8 days parking. You park in the hotel car park rather than having to drive to another car parking site which is a system that some of the other hotels operate. It's within walking distance of Terminals 1 & 3 and there is a shuttle service to all three terminals. Check in was efficient and the staff were friendly. Our room was comfortable although we did pick up the occasional bit of aircraft noise. It certainly wasn't enough to interrupt our sleep though and I am a light sleeper. There is a large bar serving a range of reasonably priced food and drink. The bar was pretty smoke free too. We booked the shuttle bus to take us to T2 at 7.30am and it was waiting for us 10 minutes early. The journey took about 5 mins and the driver was really helpful. The hotel does a full Irish breakfast for \u00a37 which we wished we had got up a bit earlier and had. The bacon roll and coffee at the airport was somewhat less appetising but virtually cost the same! Upon arrival back at Manchester I used the courtesy phone in arrivals to inform Bewley's of our arrival and the bus arrived within ten minutes. To be honest I can't really pick fault with anything. It was slick, effortless and trouble free, we'll definately use Bewleys again.",
            "title": "A hidden gem!",
            "user": "SteveLeicestershire"
        },
        {
            "date": "March 12, 2007",
            "detail_rating": {
                "business": 5.0,
                "cleanliness": 5.0,
                "desk": null,
                "front_desk": 5.0,
                "location": 5.0,
                "pool": null,
                "restaurant": null,
                "rooms": 5.0,
                "service": 5.0,
                "sleep": null,
                "value": 5.0
            },
            "helpfulness": 1,
            "id": 7147737,
            "likes": {
                "disliked": null,
                "liked": null
            },
            "rating": 5.0,
            "stay_parameters": "Stayed February 2007, traveled with family",
            "text": "Thanks to trip advisor I researched this hotel before we went, and we were not dissapointed. 1st class hotel, great location, next door to the Crowne Plaza (which is more than double the price), rooms were great, very modern, clean 2 double beds, so the kids were pleased not to have a fold up camp bed thingy. Check in and out very easy. Booked the bus for pick in the morning, at the airport in less than 5 mins, same on way back, phoned and the bus came almost immediately. Left our car, no problems, would not hesitate in recommending this hotel to all, and im quite fussy about rooms, beds etc, definately a 5 Star hotel but half the price!!",
            "title": "Fantastic, Great Value For Money",
            "user": "joolz7"
        },
        {
            "date": "March 4, 2007",
            "detail_rating": {
                "business": null,
                "cleanliness": null,
                "desk": null,
                "location": null,
                "pool": null,
                "restaurant": null,
                "rooms": null,
                "service": null,
                "sleep": null,
                "value": null
            },
            "helpfulness": 3,
            "id": 6911041,
            "likes": {
                "disliked": null,
                "liked": null
            },
            "rating": 5.0,
            "stay_parameters": null,
            "text": "booked this hotel as part of a parking package. Paid \u00a378 for hotel and a weeks parking. Have stayed here many times previously even when it was called a holiday inn. Rooms big, clean, modern. Staff helpful, nice bar, good food, sound proofed rooms, wake up service. The main advantage is price and location as you can literally walk to airport terminal. You head out of car park cross over small road and head straight for multi storey car park. There is a free transfer service from the hotel and the car park bus dropped me outside when i had dropped my car off the night before my stay. I would stay here again and would certainly recommend to others. Its a gem. Some of the other hotels nearby are a rip off compared to bewleys.",
            "title": "location is the best for the airport",
            "user": "charlie_dog"
        },
        {
            "date": "February 27, 2007",
            "detail_rating": {
                "business": null,
                "cleanliness": 5.0,
                "desk": null,
                "front_desk": 5.0,
                "location": 3.0,
                "pool": null,
                "restaurant": null,
                "rooms": 5.0,
                "service": 5.0,
                "sleep": null,
                "value": 5.0
            },
            "helpfulness": 5,
            "id": 6849437,
            "likes": {
                "disliked": "\u2014 nothing",
                "liked": "\u2014 everything"
            },
            "rating": 5.0,
            "stay_parameters": "Stayed January 2007, traveled as a couple",
            "text": "As seasoned travellers we look for quality, comfort, reasonable food, closeness to terminals and, finally, cost. We could barely believe our luck when this hotel fulfilled all our requirements. I had booked by E. Mail, speedy response made me certain that my booking was confirmed. We travelled to Manchester by train to find that the hotel was on our right moments before we entered the station. Made our way to Terminal 1, approximately 7 minutes walk, used the courtesy phone and were collected by minibus within 5 minutes. It is possible to walk from the station but heavy traffic flow means that you are in less danger if you are being driven. Check-in was smooth and efficient and within minutes of our arrival we were safely in our bedroom. The size of the room was impressive, not only did it contain a double bed but there was also a 3 seater settee and 2 easy chairs. Television, tea and coffee etc were available plus the usual last minute 'I've forgotten' things. Possibly the most appreciated discovery was that the room was totally soundproofed, no traffic noise, no aircraft noise and, definitely, no noise from other guests. The hotel boasts a fairly substantial brasserie, bar and restaurant. The bar service was excellent, the barman remembering our first order and enquiring if we wanted the same again. We ate in the restaurant and, once again, we were impressed with the quality of our meal. Many of the staff are Eastern Europeans who took great pride in their jobs and ensured that each table was well looked after. Our bill for the whole experience was, in our opinion, a joy to behold, our room was \u00a369 for both of us and our total meal bill for 3 courses each was \u00a335. We have stayed at many of the airport hotels, the good, the bad, the absolute pits and the very expensive. Bewleys Hotel has surpassed all the others and we shall be going back, again.",
            "title": "Even husband was impressed!",
            "user": "winniehoney"
        },
        {
            "date": "February 24, 2007",
            "detail_rating": {
                "business": null,
                "cleanliness": 5.0,
                "desk": null,
                "front_desk": 1.0,
                "location": 3.0,
                "pool": null,
                "restaurant": null,
                "rooms": 5.0,
                "service": 1.0,
                "sleep": null,
                "value": 5.0
            },
            "helpfulness": 3,
            "id": 6834792,
            "likes": {
                "disliked": "\u2014 The staff on teh reception were diabolical!!! Sorry!",
                "liked": "\u2014 Price"
            },
            "rating": 5.0,
            "stay_parameters": "Stayed August 2006, traveled as a couple",
            "text": "We booked Bewleys on the day of our flight out of Manchester.",
            "title": "Booked late",
            "user": "DarrenBailes"
        },
        {
            "date": "February 21, 2007",
            "detail_rating": {
                "business": null,
                "cleanliness": 5.0,
                "desk": null,
                "front_desk": 4.0,
                "location": 5.0,
                "pool": null,
                "restaurant": null,
                "rooms": 5.0,
                "service": 4.0,
                "sleep": null,
                "value": 5.0
            },
            "helpfulness": 2,
            "id": 6822512,
            "likes": {
                "disliked": "\u2014 Nothing",
                "liked": "\u2014 Close to airport, hotel restaurant"
            },
            "rating": 5.0,
            "stay_parameters": "Stayed January 2007, traveled with friends",
            "text": "We couldnt have asked for more from an airport hotel. Cheap as chips, totally modern, and with an outstanding restaurant.",
            "title": "Excellent hotel close to Manchester Airport",
            "user": "Manx_on_tour"
        },
        {
            "date": "February 16, 2007",
            "detail_rating": {
                "business": null,
                "cleanliness": null,
                "desk": null,
                "location": null,
                "pool": null,
                "restaurant": null,
                "rooms": null,
                "service": null,
                "sleep": null,
                "value": null
            },
            "helpfulness": 4,
            "id": 6801343,
            "likes": {
                "disliked": null,
                "liked": null
            },
            "rating": 5.0,
            "stay_parameters": null,
            "text": "Brilliant. Thanks Bewleys!",
            "title": "Great experience!",
            "user": "Ashton2"
        },
        {
            "date": "January 24, 2007",
            "detail_rating": {
                "business": 4.0,
                "cleanliness": 5.0,
                "desk": null,
                "front_desk": 4.0,
                "location": 4.0,
                "pool": null,
                "restaurant": null,
                "rooms": 5.0,
                "service": 4.0,
                "sleep": null,
                "value": 5.0
            },
            "helpfulness": 4,
            "id": 6654313,
            "likes": {
                "disliked": "\u2014 Slamming doors in the night.",
                "liked": "\u2014 Cleanliness... ease of transport to city"
            },
            "rating": 5.0,
            "stay_parameters": "Stayed January 2007, traveled with family",
            "text": "We stayed at this hotel on a one night stop-over. Therefore, comments are based on a relatively short stay.",
            "title": "Excellent Value",
            "user": "Honkycat"
        },
        {
            "date": "January 17, 2007",
            "detail_rating": {
                "business": null,
                "cleanliness": null,
                "desk": null,
                "location": null,
                "pool": null,
                "restaurant": null,
                "rooms": null,
                "service": null,
                "sleep": null,
                "value": null
            },
            "helpfulness": 3,
            "id": 6611371,
            "likes": {
                "disliked": null,
                "liked": null
            },
            "rating": 4.0,
            "stay_parameters": null,
            "text": "However, we feel it offers excellent value, offering good standard accomodation close to Manchester Airport - a short five minute walk from Terminals one and three although a shuttle bus is available as well.",
            "title": "What a find!",
            "user": "Maggie93"
        },
        {
            "date": "June 15, 2007",
            "detail_rating": {
                "business": null,
                "cleanliness": 5.0,
                "desk": null,
                "front_desk": 2.0,
                "location": 5.0,
                "pool": null,
                "restaurant": null,
                "rooms": 5.0,
                "service": null,
                "sleep": null,
                "value": 5.0
            },
            "helpfulness": 3,
            "id": 7851120,
            "likes": {
                "disliked": "\u2014 Nothing really",
                "liked": "\u2014 Clean and spacious"
            },
            "rating": 4.0,
            "stay_parameters": "Stayed June 2007, traveled as a couple",
            "text": "A really great Hotel, very conveniently situated! Rooms fantastic, Brasserie service exceptional - wish I could remember the name of our waitress. She was top class!",
            "title": "Unhelpful and untrained Receptionist",
            "user": "flossieChristchurch"
        },
        {
            "date": "June 13, 2007",
            "detail_rating": {
                "business": 4.0,
                "cleanliness": 5.0,
                "desk": null,
                "front_desk": 2.0,
                "location": 5.0,
                "pool": null,
                "restaurant": null,
                "rooms": 5.0,
                "service": 4.0,
                "sleep": null,
                "value": 4.0
            },
            "helpfulness": 2,
            "id": 7845659,
            "likes": {
                "disliked": null,
                "liked": null
            },
            "rating": 4.0,
            "stay_parameters": "Stayed June 2007, traveled with family",
            "text": "Just one problem. We did not book into the Hotel, just arrived early afternoon and asked for a twin room. We were told there were none left. Only doubles. We asked whether there was a possibility that a folding bed could be placed in the room, as we cannot sleep in a double bed. We were told this was not possible and they had nothing they could give us, only the double bed.",
            "title": "Good hotel",
            "user": "Caltonian"
        },
        {
            "date": "May 30, 2007",
            "detail_rating": {
                "business": 4.0,
                "cleanliness": 5.0,
                "desk": null,
                "front_desk": 5.0,
                "location": 5.0,
                "pool": null,
                "restaurant": null,
                "rooms": 5.0,
                "service": 5.0,
                "sleep": null,
                "value": 4.0
            },
            "helpfulness": 5,
            "id": 7719957,
            "likes": {
                "disliked": "\u2014 food and no restaurants nearby",
                "liked": "\u2014 clean, comfortable room"
            },
            "rating": 5.0,
            "stay_parameters": "Stayed May 2007, traveled on business",
            "text": "As we had to have a room, we accepted the double. On entering the room, however, we immediately noticed that the sofa converted into a double bed. We set it up, and I rang Reception asking whether we could have another duvet. I was told by the Receptionist that as the Hotel was almost full, there would not be one available.",
            "title": "Refreshing Surprise by the Airport",
            "user": "traveler223"
        },
        {
            "date": "May 21, 2007",
            "detail_rating": {
                "business": null,
                "cleanliness": 5.0,
                "desk": null,
                "front_desk": 4.0,
                "location": 4.0,
                "pool": null,
                "restaurant": null,
                "rooms": 5.0,
                "service": 4.0,
                "sleep": null,
                "value": 5.0
            },
            "helpfulness": 4,
            "id": 7668445,
            "likes": {
                "disliked": null,
                "liked": "\u2014 Welcoming, bright, open quality of public areas."
            },
            "rating": 4.0,
            "stay_parameters": "Stayed May 2007, traveled solo",
            "text": "I found this incredible, and unbelieveable that in a Hotel the size of Bewleys, that they would not have spare bedding! I can only assume the Receptionist was too lazy to do anything about getting us one. I also find it incredible that the Reception staff are unaware that the sofas convert into beds!",
            "title": "Bewley's - great value, good food, high comfort",
            "user": "Ghoti"
        },
        {
            "date": "May 2, 2007",
            "detail_rating": {
                "business": null,
                "cleanliness": 4.0,
                "desk": null,
                "front_desk": 4.0,
                "location": 4.0,
                "pool": null,
                "restaurant": null,
                "rooms": 4.0,
                "service": 4.0,
                "sleep": null,
                "value": 4.0
            },
            "helpfulness": 6,
            "id": 7494295,
            "likes": {
                "disliked": "\u2014 No toilet brush.....",
                "liked": "\u2014 Overall ambience, value"
            },
            "rating": 4.0,
            "stay_parameters": "Stayed May 2007, traveled on business",
            "text": "Had a problem at check-in where they advised us they hadn't took the payment for our rooms (2) when we booked. Apparently this is standard practise, but we couldnt confirm it with our bank., (and hadnt checked beforehand...our fault)",
            "title": "A good hotel",
            "user": "Pelikan"
        },
        {
            "date": "April 16, 2007",
            "detail_rating": {
                "business": null,
                "cleanliness": 5.0,
                "desk": null,
                "front_desk": 5.0,
                "location": 5.0,
                "pool": null,
                "restaurant": null,
                "rooms": 5.0,
                "service": 5.0,
                "sleep": null,
                "value": 5.0
            },
            "helpfulness": 7,
            "id": 7374453,
            "likes": {
                "disliked": "\u2014 nothing",
                "liked": "\u2014 eveything"
            },
            "rating": 5.0,
            "stay_parameters": "Stayed November 2006, traveled with family",
            "text": "stayed at this place on the 5/11/2006 due to long haul flight the following day so we neaded an early start .Everything about the hotel was spot on .The bathroom was very clean the decor was very nice the beds were very comfortable the wake up call was on time the menu was well priced and the room for the night and parking for 14 days was a lot less than what i expected to pay .this hotel could charge 200 pound a night and it would be worth it .Ipaid 109 pounds.This hotel is awesome",
            "title": "loved eveything",
            "user": "bigbopper000"
        },
        {
            "date": "April 9, 2007",
            "detail_rating": {
                "business": null,
                "cleanliness": 5.0,
                "desk": null,
                "front_desk": 5.0,
                "location": 3.0,
                "pool": null,
                "restaurant": null,
                "rooms": 4.0,
                "service": 5.0,
                "sleep": null,
                "value": 5.0
            },
            "helpfulness": 15,
            "id": 7299467,
            "likes": {
                "disliked": "\u2014 Nothing",
                "liked": "\u2014 Great staff attitude, value for money"
            },
            "rating": 5.0,
            "stay_parameters": "Stayed April 2007, traveled as a couple",
            "text": "There is a consistent theme with all reviews - top hotel and cheap.",
            "title": "Top hotel - great price - there must be a catch?",
            "user": "ManxQueenies"
        },
        {
            "date": "March 30, 2007",
            "detail_rating": {
                "business": 5.0,
                "cleanliness": 5.0,
                "desk": null,
                "front_desk": 5.0,
                "location": 5.0,
                "pool": null,
                "restaurant": null,
                "rooms": 5.0,
                "service": 5.0,
                "sleep": null,
                "value": 5.0
            },
            "helpfulness": 6,
            "id": 7254176,
            "likes": {
                "disliked": null,
                "liked": "\u2014 Clean"
            },
            "rating": 5.0,
            "stay_parameters": "Stayed January 2007, traveled on business",
            "text": "On the basis of these I booked on an over night prior to long haug morning flight.",
            "title": "Excellent airport hotel",
            "user": "Pawa"
        },
        {
            "date": "March 24, 2007",
            "detail_rating": {
                "business": null,
                "cleanliness": 5.0,
                "desk": null,
                "front_desk": 5.0,
                "location": 5.0,
                "pool": null,
                "restaurant": null,
                "rooms": 5.0,
                "service": 5.0,
                "sleep": null,
                "value": 5.0
            },
            "helpfulness": 8,
            "id": 7215705,
            "likes": {
                "disliked": "\u2014 n/a",
                "liked": "\u2014 The comfy bed!"
            },
            "rating": 5.0,
            "stay_parameters": "Stayed March 2007, traveled with friends",
            "text": "As next to terminal 3 that I arrived to it looked just a short walk and is - if you can suss the complex pathways through the airport car park, and then the heavans opened.... That'll teach me to get the shuttle, if only for a few hundred yards.",
            "title": "Great Airport Hotel",
            "user": "sp1982"
        },
        {
            "date": "March 21, 2007",
            "detail_rating": {
                "business": null,
                "cleanliness": 5.0,
                "desk": null,
                "front_desk": 4.0,
                "location": 4.0,
                "pool": null,
                "restaurant": null,
                "rooms": 5.0,
                "service": 3.0,
                "sleep": null,
                "value": 4.0
            },
            "helpfulness": 4,
            "id": 7196889,
            "likes": {
                "disliked": null,
                "liked": null
            },
            "rating": 4.0,
            "stay_parameters": "Stayed December 2006",
            "text": "Check in quick, easy and courteous. Booked shuttle for next morning - amazingly full at 6.45am. great driver, very helpful.",
            "title": "Goood airport hotel",
            "user": "Jaytraveller"
        }
    ],
    "slim_ranking": 0.313559322034,
    "stars": 3,
    "tripadvisor": {
        "VISITED": false,
        "country_name": null,
        "locality": null,
        "pic_link": null,
        "street_address": null
    },
    "user_rating": 4.0,
    "variance": {
        "average": 357,
        "excellent": 665,
        "poor": 113,
        "terrible": 71,
        "very good": 753
    }
}