{
    "aka": "Montrose Days Inn",
    "description": "In the Heart of Montrose, and just 5 miles from the airport, The Days Inn is the perfect home away from home. The beautiful 70 room property is just minutes away from Colorado most beautiful landscape\u2014Grand Mesa features over 250 lakes, Gunnison Nation Park, Ridgeway Park, Box Canyon Falls. The rooms at the Days inn give you the felling of home and family, with our tropical outdoor pool and hot tub and homemade cookies every evening in our lobby, the free high speed internet, Complimentary USA Today, and Work desk make it perfect for business travelers. Start your day with our complimentary deluxe breakfast with fresh local fruit, Biscuits and gravy, Waffles, healthy granola cereal and oatmeal. We also allow pets.",
    "detail_rating": {
        "cleanliness": null,
        "location": null,
        "rooms": null,
        "service": null,
        "sleep": null,
        "value": null
    },
    "location": {
        "city": "Montrose",
        "continent": null,
        "country": "United States",
        "proposed_city": "Montrose",
        "province": null,
        "region": null
    },
    "name": "Days Inn Montrose",
    "places": {
        "aka": [
            "Montrose"
        ],
        "hotel_description": [
            "Montrose",
            "Colorado",
            "Mesa"
        ],
        "hotel_name": [
            "Montrose"
        ]
    },
    "review_count": 177,
    "review_count_current": 2,
    "reviews": [
        {
            "date": "May 16, 2008",
            "detail_rating": {
                "business": 5.0,
                "cleanliness": 4.0,
                "desk": null,
                "front_desk": 5.0,
                "location": 4.0,
                "pool": null,
                "restaurant": null,
                "rooms": 4.0,
                "service": 3.0,
                "sleep": null,
                "value": 4.0
            },
            "helpfulness": null,
            "id": 16086971,
            "likes": {
                "disliked": "\u2014 Room too light at night",
                "liked": "\u2014 Clean, good value"
            },
            "rating": 4.0,
            "stay_parameters": "Stayed May 2008, traveled solo",
            "text": "I decided to try this place, as the previous tripadvisor review had been neutral, but other websites carried more encouraging reviews.",
            "title": "Terrific value if you have a limited budget",
            "user": "Aztec_Tripper"
        },
        {
            "date": "December 2, 2007",
            "detail_rating": {
                "business": 3.0,
                "cleanliness": 3.0,
                "desk": null,
                "front_desk": 3.0,
                "location": 3.0,
                "pool": null,
                "restaurant": null,
                "rooms": 3.0,
                "service": 3.0,
                "sleep": null,
                "value": 4.0
            },
            "helpfulness": null,
            "id": 11195943,
            "likes": {
                "disliked": "\u2014 not enough toilet paper; no decaf; opened lotion",
                "liked": "\u2014 location; lighting"
            },
            "rating": 3.0,
            "stay_parameters": "Stayed November 2007",
            "text": "All my comments are to be taken in the context of a room rate of $34+tax. Room is pretty good, fixtures mostly not new, and the bath and toilet seat have seen better days. The room is quite light at night - lots of strong lighting outside makes it look good at dusk from the exterior, and helps with security - but quite a lot of light percolates around the curtains, which isn't great if you are a light sleeper. It's on with those eyeshades for me.",
            "title": "This budget motel could be VERY good, if........",
            "user": "nancyadams"
        }
    ],
    "slim_ranking": 0.545454545455,
    "stars": 2,
    "tripadvisor": {
        "VISITED": false,
        "country_name": null,
        "locality": null,
        "pic_link": null,
        "street_address": null
    },
    "user_rating": 4.0,
    "variance": {
        "average": 34,
        "excellent": 66,
        "poor": 4,
        "terrible": 2,
        "very good": 71
    }
}