{
    "aka": null,
    "description": "Taskule Hotel is located on the beach. All rooms are air conditioned and with full facilities. A wireless internet connection is available in hotel. It is 50 meters away from city center, where you can find all kinds of activities.",
    "detail_rating": {
        "cleanliness": null,
        "location": null,
        "rooms": null,
        "service": null,
        "sleep": null,
        "value": null
    },
    "location": {
        "city": null,
        "continent": "Europe",
        "country": "Turkey",
        "proposed_city": null,
        "province": null,
        "region": "Turkish Aegean Coast"
    },
    "name": "Taskule Hotel",
    "places": {
        "aka": [],
        "hotel_description": [],
        "hotel_name": []
    },
    "review_count": 36,
    "review_count_current": 10,
    "reviews": [
        {
            "date": "June 26, 2008",
            "detail_rating": {
                "business": 5.0,
                "cleanliness": 5.0,
                "desk": null,
                "front_desk": 5.0,
                "location": 5.0,
                "pool": null,
                "restaurant": null,
                "rooms": 5.0,
                "service": 5.0,
                "sleep": null,
                "value": null
            },
            "helpfulness": 1,
            "id": 17246423,
            "likes": {
                "disliked": "\u2014 there is nothing not to like its perfect!",
                "liked": "\u2014 The gorgeous rooms and the friendly staff"
            },
            "rating": 5.0,
            "stay_parameters": "Stayed June 2008, traveled with family",
            "text": "We have been going to the Taskule Hotel for several years now and it is a gem of a hotel - the rooms are absolutely gorgeous and spotlessly clean (thanks to Sultan who is a little star). nothing is too much trouble and they always treat us like family when we come to stay. its in a great location with a lovely bar/restaurant at the front of it which we like to eat in and watch the sunset.",
            "title": "Fabulous Hotel!!",
            "user": "terri2242"
        },
        {
            "date": "April 27, 2007",
            "detail_rating": {
                "business": null,
                "cleanliness": null,
                "desk": null,
                "location": null,
                "pool": null,
                "restaurant": null,
                "rooms": null,
                "service": null,
                "sleep": null,
                "value": null
            },
            "helpfulness": null,
            "id": 7476483,
            "likes": {
                "disliked": null,
                "liked": null
            },
            "rating": 5.0,
            "stay_parameters": null,
            "text": "What a wonderful hotel! We stayed at the beginning of April and this was one of the few hotels in Yalikavak to have the swimming pool ready for use. Excellent, friendly service - nothing was too much trouble. Easy walking distance to village (2 mins if that!) and straight onto beach.",
            "title": "a haven of tranquility",
            "user": "holidayfiends"
        },
        {
            "date": "February 17, 2007",
            "detail_rating": {
                "business": null,
                "cleanliness": null,
                "desk": null,
                "location": null,
                "pool": null,
                "restaurant": null,
                "rooms": null,
                "service": null,
                "sleep": null,
                "value": null
            },
            "helpfulness": 3,
            "id": 6805583,
            "likes": {
                "disliked": null,
                "liked": null
            },
            "rating": 5.0,
            "stay_parameters": null,
            "text": "Spotlessly clean, beautifully decorated rooms - can't wait to go back.",
            "title": "Hotel Taskule a treasure",
            "user": "Min-7"
        },
        {
            "date": "March 27, 2006",
            "detail_rating": {
                "business": null,
                "cleanliness": 5.0,
                "desk": null,
                "location": null,
                "pool": null,
                "restaurant": null,
                "rooms": 5.0,
                "service": 5.0,
                "sleep": null,
                "value": 5.0
            },
            "helpfulness": 3,
            "id": 4737702,
            "likes": {
                "disliked": null,
                "liked": null
            },
            "rating": 5.0,
            "stay_parameters": "Stayed September 2005",
            "text": "Angela and Gareth",
            "title": "stunning",
            "user": "mrmundo"
        },
        {
            "date": "September 13, 2005",
            "detail_rating": {
                "business": null,
                "cleanliness": 5.0,
                "desk": null,
                "location": null,
                "pool": null,
                "restaurant": null,
                "rooms": 5.0,
                "service": 5.0,
                "sleep": null,
                "value": 5.0
            },
            "helpfulness": 14,
            "id": 3898071,
            "likes": {
                "disliked": null,
                "liked": null
            },
            "rating": 5.0,
            "stay_parameters": "Stayed September 2005, traveled on business",
            "text": "I stayed in this Hotel before it was refurbished, and saw the refurbishment taking place. The owners are charming people and the staff excellent. they have become firm friends. The standard of the Hotel is very high, always spotlessly clean. I would recommend this Hotel to anyone on their first trip to Turkey and Yalikavak it is a wonderful experience.",
            "title": "What a charming place!",
            "user": "Islabuild"
        },
        {
            "date": "September 16, 2009",
            "detail_rating": {
                "business": null,
                "cleanliness": 5.0,
                "desk": null,
                "location": 5.0,
                "pool": null,
                "restaurant": null,
                "rooms": 4.0,
                "service": 5.0,
                "sleep": null,
                "value": 4.0
            },
            "helpfulness": null,
            "id": 42105005,
            "likes": {
                "disliked": null,
                "liked": null
            },
            "rating": 5.0,
            "stay_parameters": "Stayed September 2009, traveled with family",
            "text": "We have just had a 7 night stay at the 'Excellent' Taskule hotel in Yalikavak.",
            "title": "Excellent Hotel - One of the best in Yalikavak",
            "user": "jb812"
        },
        {
            "date": "July 4, 2009",
            "detail_rating": {
                "business": null,
                "cleanliness": 5.0,
                "desk": null,
                "location": 5.0,
                "pool": null,
                "restaurant": null,
                "rooms": 4.0,
                "service": 4.0,
                "sleep": null,
                "value": 4.0
            },
            "helpfulness": 1,
            "id": 33848618,
            "likes": {
                "disliked": null,
                "liked": null
            },
            "rating": 4.0,
            "stay_parameters": "Stayed June 2009, traveled with family",
            "text": "The staff could not have been more frienly, and we will definatly look to stay here again on our next visit.",
            "title": "Wish we were there now!!",
            "user": "exsfgal"
        },
        {
            "date": "October 4, 2008",
            "detail_rating": {
                "business": 3.0,
                "cleanliness": 2.0,
                "desk": null,
                "front_desk": 2.0,
                "location": 5.0,
                "pool": null,
                "restaurant": null,
                "rooms": 3.0,
                "service": 3.0,
                "sleep": null,
                "value": 3.0
            },
            "helpfulness": 1,
            "id": 20620763,
            "likes": {
                "disliked": "\u2014 So called luxury which is, nt there, but: overall very o.k.",
                "liked": "\u2014 Location"
            },
            "rating": 3.0,
            "stay_parameters": "Stayed September 2008, traveled as a couple",
            "text": "As professionals from the airline industry we stay in fine hotels all over the world and expect a very high standard, this one is of a very high standard and I would recommend it to anyone looking for a high standard of comfort.",
            "title": "Location is all...",
            "user": "Kaaskop2"
        },
        {
            "date": "September 22, 2008",
            "detail_rating": {
                "business": null,
                "cleanliness": 4.0,
                "desk": null,
                "front_desk": 3.0,
                "location": 5.0,
                "pool": null,
                "restaurant": null,
                "rooms": 4.0,
                "service": 3.0,
                "sleep": null,
                "value": 5.0
            },
            "helpfulness": 1,
            "id": 20268275,
            "likes": {
                "disliked": "\u2014 Poor air-con",
                "liked": "\u2014 Location"
            },
            "rating": 4.0,
            "stay_parameters": "Stayed September 2008, traveled as a couple",
            "text": "I especialy enjoyed sitting outiside the hotel on the sofas with a cool drink wantching the sun go down over the sea.",
            "title": "Nice location",
            "user": "BlackDouglas"
        },
        {
            "date": "July 24, 2008",
            "detail_rating": {
                "business": null,
                "cleanliness": 4.0,
                "desk": null,
                "front_desk": 1.0,
                "location": 4.0,
                "pool": null,
                "restaurant": null,
                "rooms": 3.0,
                "service": 1.0,
                "sleep": null,
                "value": 1.0
            },
            "helpfulness": 1,
            "id": 18194163,
            "likes": {
                "disliked": null,
                "liked": null
            },
            "rating": 1.0,
            "stay_parameters": "Stayed July 2008",
            "text": "Please ignore any of the negative reviews about the staff, this hotel is exceptionaly friendly and they could not do enough for myself my wife and my 2 year old Georgina.",
            "title": "Awful experience - unhelpful and rude owner",
            "user": "laurenf1"
        }
    ],
    "slim_ranking": 0.125,
    "stars": null,
    "tripadvisor": {
        "VISITED": false,
        "country_name": null,
        "locality": null,
        "pic_link": null,
        "street_address": null
    },
    "user_rating": 4.5,
    "variance": {
        "average": 1,
        "excellent": 21,
        "poor": 1,
        "terrible": 2,
        "very good": 11
    }
}