{
    "aka": "Atlantean Cottage Hotel",
    "description": "Atlantean Cottage is the name given to this lovely Tudor cottage, the personal residence of renowned Bar Harbor architect Frederick Savage. You'll find no more tranquil, quiet locale so very close to the best restaurants, galleries, museums, and shops. On a peaceful lane between Main Street and the ocean lies this serene getaway just around the corner from all that Bar Harbor Village has to offer.",
    "detail_rating": {
        "cleanliness": null,
        "location": null,
        "rooms": null,
        "service": null,
        "sleep": null,
        "value": null
    },
    "location": {
        "city": null,
        "continent": null,
        "country": "United States",
        "proposed_city": null,
        "province": null,
        "region": null
    },
    "name": "Atlantean Cottage",
    "places": {
        "aka": [],
        "hotel_description": [
            "Bar",
            "Frederick",
            "Savage"
        ],
        "hotel_name": []
    },
    "review_count": 147,
    "review_count_current": 20,
    "reviews": [
        {
            "date": "June 11, 2007",
            "detail_rating": {
                "business": null,
                "cleanliness": 5.0,
                "desk": null,
                "front_desk": 5.0,
                "location": 5.0,
                "pool": null,
                "restaurant": null,
                "rooms": 5.0,
                "service": 5.0,
                "sleep": null,
                "value": 5.0
            },
            "helpfulness": 2,
            "id": 7836303,
            "likes": {
                "disliked": null,
                "liked": null
            },
            "rating": 5.0,
            "stay_parameters": "Stayed June 2007, traveled as a couple",
            "text": "We had to change our dates the very last min. due to family member illness. Gary and Heidi could not have been nicer to accommondate us. The B&B is very tastefuly decorated and we just loved our stay. I wish we had found this place sooner. This is a place we will definitely return.",
            "title": "will definitely return!",
            "user": "t_world"
        },
        {
            "date": "June 3, 2007",
            "detail_rating": {
                "business": null,
                "cleanliness": null,
                "desk": null,
                "location": null,
                "pool": null,
                "restaurant": null,
                "rooms": null,
                "service": null,
                "sleep": null,
                "value": null
            },
            "helpfulness": 1,
            "id": 7752778,
            "likes": {
                "disliked": null,
                "liked": null
            },
            "rating": 5.0,
            "stay_parameters": null,
            "text": "We arrived in Bar Harbour at the end of May looking for somewhere nice to stay for 2 nights.",
            "title": "A luxurious home away from home",
            "user": "katharrison22"
        },
        {
            "date": "April 23, 2007",
            "detail_rating": {
                "business": null,
                "cleanliness": 5.0,
                "desk": null,
                "front_desk": 5.0,
                "location": 5.0,
                "pool": null,
                "restaurant": null,
                "rooms": 5.0,
                "service": 5.0,
                "sleep": null,
                "value": 5.0
            },
            "helpfulness": 1,
            "id": 7419395,
            "likes": {
                "disliked": null,
                "liked": null
            },
            "rating": 5.0,
            "stay_parameters": "Stayed April 2007, traveled as a couple",
            "text": "By chance we happened upon the Atlantean Inn and I am so glad we did!",
            "title": "Best B and B",
            "user": "AlabamaTravel123"
        },
        {
            "date": "March 17, 2007",
            "detail_rating": {
                "business": null,
                "cleanliness": 5.0,
                "desk": null,
                "front_desk": 5.0,
                "location": 5.0,
                "pool": null,
                "restaurant": null,
                "rooms": 5.0,
                "service": 5.0,
                "sleep": null,
                "value": 4.0
            },
            "helpfulness": 1,
            "id": 7180062,
            "likes": {
                "disliked": "\u2014 Nothing",
                "liked": "\u2014 Beautiful rooms, lovely hosts"
            },
            "rating": 5.0,
            "stay_parameters": "Stayed March 2007, traveled as a couple",
            "text": "This was the nicest place we stayed in on our trip up north from boston.",
            "title": "Can't wait to return!",
            "user": "adriannicole"
        },
        {
            "date": "February 20, 2007",
            "detail_rating": {
                "business": null,
                "cleanliness": 5.0,
                "desk": null,
                "front_desk": 5.0,
                "location": 5.0,
                "pool": null,
                "restaurant": null,
                "rooms": 5.0,
                "service": 5.0,
                "sleep": null,
                "value": 5.0
            },
            "helpfulness": 2,
            "id": 6817728,
            "likes": {
                "disliked": null,
                "liked": null
            },
            "rating": 5.0,
            "stay_parameters": "Stayed February 2007, traveled as a couple",
            "text": "Gary and Heidi were very welcoming and encouraged us to make ourselves at home whilst we stayed with them.",
            "title": "Would definitely go back!",
            "user": "kew25"
        },
        {
            "date": "March 1, 2008",
            "detail_rating": {
                "business": 5.0,
                "cleanliness": 5.0,
                "desk": null,
                "front_desk": 5.0,
                "location": 5.0,
                "pool": null,
                "restaurant": null,
                "rooms": 5.0,
                "service": 5.0,
                "sleep": null,
                "value": 5.0
            },
            "helpfulness": null,
            "id": 13970486,
            "likes": {
                "disliked": "\u2014 Nothing to dislike.",
                "liked": "\u2014 Impeccably clean with wonderful owners."
            },
            "rating": 5.0,
            "stay_parameters": "Stayed February 2008, traveled as a couple",
            "text": "Overall Inn: impeccably clean; very well maintained. Very cozy and exactly as it appears on the web site. Delicious homemeade cookies awaited us in our room on arrival! The butler pantry was well stocked, and we were always welcome to help ourselves to coffee, tea, cocoa, biscotti, etc.",
            "title": "The Perfect B & B",
            "user": "Soglio"
        },
        {
            "date": "October 7, 2007",
            "detail_rating": {
                "business": 3.0,
                "cleanliness": 5.0,
                "desk": null,
                "front_desk": 5.0,
                "location": 5.0,
                "pool": null,
                "restaurant": null,
                "rooms": 5.0,
                "service": 5.0,
                "sleep": null,
                "value": 4.0
            },
            "helpfulness": 2,
            "id": 10049039,
            "likes": {
                "disliked": null,
                "liked": null
            },
            "rating": 5.0,
            "stay_parameters": "Stayed September 2007",
            "text": "Innkeepers: Heidi and Gary are warm, inviting, friendly and attentive. They are a magnificent couple who obviously enjoy what they do. Their dogs are cute too and very well behaved!",
            "title": "Very good at what it does.",
            "user": "Skizz"
        },
        {
            "date": "September 16, 2007",
            "detail_rating": {
                "business": null,
                "cleanliness": 5.0,
                "desk": null,
                "front_desk": 5.0,
                "location": 5.0,
                "pool": null,
                "restaurant": null,
                "rooms": 4.0,
                "service": 5.0,
                "sleep": null,
                "value": 4.0
            },
            "helpfulness": 2,
            "id": 8726091,
            "likes": {
                "disliked": null,
                "liked": "\u2014 Quality of rooms/food"
            },
            "rating": 5.0,
            "stay_parameters": "Stayed September 2007, traveled as a couple",
            "text": "Room: (Edgemere) Looks exactly as pictured on the web site. Very comfortable king size bed. Modern bathroom with whirlpool tub and separate shower and radiant floor heat. Very tastefully decorated. We had a fire in the fireplace during each of our two nights--a great touch! A truly beautiful room( --plus it was toasty warm without drafts in the dead of winter.)",
            "title": "The Best of Bar Harbor",
            "user": "jwdksd"
        },
        {
            "date": "September 9, 2007",
            "detail_rating": {
                "business": null,
                "cleanliness": 5.0,
                "desk": null,
                "front_desk": 5.0,
                "location": 5.0,
                "pool": null,
                "restaurant": null,
                "rooms": 5.0,
                "service": 5.0,
                "sleep": null,
                "value": 5.0
            },
            "helpfulness": 3,
            "id": 8682889,
            "likes": {
                "disliked": "\u2014 Having to leave!!",
                "liked": "\u2014 Inn location and the Chatswold room were both excellent"
            },
            "rating": 5.0,
            "stay_parameters": "Stayed September 2007, traveled as a couple",
            "text": "Food: Delicious with very generous portions. Wonderful fruits in the middle of winter for the first course and sinfully tasty gourmet main dishes. The high quality of the breakfasts is not emphasized enough on the web site. Magnificent!",
            "title": "Best kept secret in Bar Harbor",
            "user": "Hopping-along"
        },
        {
            "date": "September 6, 2007",
            "detail_rating": {
                "business": 5.0,
                "cleanliness": 5.0,
                "desk": null,
                "front_desk": 5.0,
                "location": 5.0,
                "pool": null,
                "restaurant": null,
                "rooms": 5.0,
                "service": 5.0,
                "sleep": null,
                "value": 5.0
            },
            "helpfulness": 2,
            "id": 8667999,
            "likes": {
                "disliked": "\u2014 Nothing - you'll love it all",
                "liked": "\u2014 The suite and common room accomodations - plenty of room"
            },
            "rating": 5.0,
            "stay_parameters": "Stayed September 2007, traveled with family",
            "text": "Overall: Five Stars! Loved it. We will definitely return here and will recommend it to everyone we know.",
            "title": "Well worth the drive from Long Island!",
            "user": "schooners3"
        },
        {
            "date": "August 30, 2007",
            "detail_rating": {
                "business": null,
                "cleanliness": 5.0,
                "desk": null,
                "front_desk": 5.0,
                "location": 5.0,
                "pool": null,
                "restaurant": null,
                "rooms": 5.0,
                "service": 5.0,
                "sleep": null,
                "value": 4.0
            },
            "helpfulness": 1,
            "id": 8588623,
            "likes": {
                "disliked": "\u2014 nothing negative",
                "liked": "\u2014 The location"
            },
            "rating": 4.0,
            "stay_parameters": "Stayed August 2007, traveled with friends",
            "text": "My friend and I stayed at the Atlantean for a girls weekend away in August and it was wonderful. The inn is beautifully maintained. We had a room with double beds (very comfortable) and a GREAT shower! We liked being able to walk around town and it is close to the shore walk as well. It was on a quiet side street and the innkeepers were very knowledgeable. Gary will warn you of the significant number of tourists in certain places in the park (Acadia), but that goes with the territory. It's a very popular place in the summer. Being from Maine, we are well accustomed to it! And it was bearable :) Breakfast was good, although not quite to our particular liking. Very good restaurants nearby: Havana, Cafe This Way. And you have to stop at the Trenton Bridge Lobster Pound for lobster (unless you don't like lobster)!! Just not on Sunday, when they are closed. Bar Harbor & Acadia (specifically Southwest Harbor and Seal Harbor) are great places to hang out and hike in the summer and early fall.",
            "title": "Lovely inn",
            "user": "ccurtis"
        },
        {
            "date": "August 30, 2007",
            "detail_rating": {
                "business": null,
                "cleanliness": 5.0,
                "desk": null,
                "front_desk": 5.0,
                "location": 5.0,
                "pool": null,
                "restaurant": null,
                "rooms": 5.0,
                "service": 5.0,
                "sleep": null,
                "value": 5.0
            },
            "helpfulness": 5,
            "id": 8548611,
            "likes": {
                "disliked": null,
                "liked": null
            },
            "rating": 5.0,
            "stay_parameters": "Stayed July 2007, traveled as a couple",
            "text": "We spent four nights here and thought this was a first-rate, professional operation. The house and grounds provided the perfect backdrop for our first Maine vacation. We travel a lot and were looking for an inn-type property rather than a mom-and-pop set-up and the Atlantean really came through.",
            "title": "A Class Act",
            "user": "booklover"
        },
        {
            "date": "August 13, 2007",
            "detail_rating": {
                "business": null,
                "cleanliness": 5.0,
                "desk": null,
                "front_desk": 4.0,
                "location": 5.0,
                "pool": null,
                "restaurant": null,
                "rooms": 5.0,
                "service": 4.0,
                "sleep": null,
                "value": 3.0
            },
            "helpfulness": 2,
            "id": 8405847,
            "likes": {
                "disliked": "\u2014 the price",
                "liked": "\u2014 the room"
            },
            "rating": 4.0,
            "stay_parameters": "Stayed July 2007, traveled as a couple",
            "text": "We were in the Mizzentop suite, which was wonderful. It consisted of a bedroom, lounge/tv room, second bedroom with a day bed and a fabulous bathroom. To start, the bathroom was fit for a king\u2014with a raised platform Jacuzzi tub and big windows it was really a fabulous place to soak after a hike in Acadia. The second bedroom was a great place for an afternoon read as the daybed was directly below a huge skylight. We really liked having the tv lounge as it gave you room to spread out and somewhere else to sit besides the bed. There was ample room for luggage. The room, as well as the entire inn, was immaculately clean\u2014no dusty knickknacks here, no thrift store bric a brac. At one point I dropped an earring on the floor and had to get it from under the bed\u2014you could have eaten breakfast on that floor. The room looks exactly like the photos on the website.",
            "title": "Had a great time!",
            "user": "physioBarrie"
        },
        {
            "date": "June 24, 2007",
            "detail_rating": {
                "business": 5.0,
                "cleanliness": 5.0,
                "desk": null,
                "front_desk": 5.0,
                "location": 5.0,
                "pool": null,
                "restaurant": null,
                "rooms": 5.0,
                "service": 5.0,
                "sleep": null,
                "value": 5.0
            },
            "helpfulness": 1,
            "id": 7974063,
            "likes": {
                "disliked": "\u2014 Nothing!!",
                "liked": "\u2014 The cleanliness of the B&B as well as the delicious breakfasts!"
            },
            "rating": 5.0,
            "stay_parameters": "Stayed June 2007, traveled as a couple",
            "text": "The public areas of the inn consisted of the foyer, parlor, breakfast room, butler\u2019s pantry and garden and porch. All were elegantly decorated. In the pantry hosts Gary and Heidi provide snacks of all types, bottled water and a fridge for guests. There are thick books of local information compiled for guests and Gary presided over the breakfast room every morning answering questions and providing suggestions for the day\u2019s activities. Both Gary and Heidi were unfailingly helpful and professional.",
            "title": "Fell in love with the Atlantean!",
            "user": "ldybugs916"
        },
        {
            "date": "June 19, 2007",
            "detail_rating": {
                "business": null,
                "cleanliness": 5.0,
                "desk": null,
                "front_desk": 5.0,
                "location": 5.0,
                "pool": null,
                "restaurant": null,
                "rooms": 5.0,
                "service": 5.0,
                "sleep": null,
                "value": 5.0
            },
            "helpfulness": 1,
            "id": 7937893,
            "likes": {
                "disliked": "\u2014 No Air conditioning",
                "liked": "\u2014 Room appointment and location of Inn"
            },
            "rating": 5.0,
            "stay_parameters": "Stayed June 2007, traveled as a couple",
            "text": "Breakfasts consisted of a fruit dish and a hot entr\u00e9e. Most were very good\u2014the pineapple French toast in particular. We did have one clunker though (sorry Gary\u2014ditch the Acadian pie). The white chocolate chip oatmeal cookies they put out in the afternoon are to die for. I really had to discipline myself.",
            "title": "Loved our stay",
            "user": "aanla"
        },
        {
            "date": "September 19, 2008",
            "detail_rating": {
                "business": null,
                "cleanliness": 5.0,
                "desk": null,
                "front_desk": 5.0,
                "location": 5.0,
                "pool": null,
                "restaurant": null,
                "rooms": 5.0,
                "service": 5.0,
                "sleep": null,
                "value": 5.0
            },
            "helpfulness": 1,
            "id": 20207601,
            "likes": {
                "disliked": "\u2014 nothing",
                "liked": "\u2014 Warm, friendly atmosphere & room was romatinc"
            },
            "rating": 5.0,
            "stay_parameters": "Stayed July 2008, traveled as a couple",
            "text": "We enjoyed our stay at the Atlantean. The location was great - on a quiet street right near the center of Bar Harbor. Our room was romantic - with wood floors, a fire place and queen estate bed with wooden headboard. Heidi and Gary were very friendly and made us feel at home. They served yummy cookies in the late afternoon. The breakfast was delicious. The next time we go to Bar Harbor we are going to stay here.",
            "title": "We enjoyed our stay at the Atlantean",
            "user": "shemoves"
        },
        {
            "date": "September 16, 2008",
            "detail_rating": {
                "business": 5.0,
                "cleanliness": 5.0,
                "desk": null,
                "front_desk": 4.0,
                "location": 5.0,
                "pool": null,
                "restaurant": null,
                "rooms": 5.0,
                "service": 5.0,
                "sleep": null,
                "value": 5.0
            },
            "helpfulness": null,
            "id": 20127740,
            "likes": {
                "disliked": "\u2014 Parking space if I had to choose.",
                "liked": "\u2014 The Inn itself and the innkeepers"
            },
            "rating": 5.0,
            "stay_parameters": "Stayed September 2008, traveled as a couple",
            "text": "Wife and I thoroughly enjoyed this Inn. We would not look for any other place to stay in Bar Harbor. Great atmosphere, great location, great property. Great innkeepers.",
            "title": "Ideal place to stay",
            "user": "srojoe"
        },
        {
            "date": "August 14, 2008",
            "detail_rating": {
                "business": null,
                "cleanliness": 5.0,
                "desk": null,
                "front_desk": 5.0,
                "location": 5.0,
                "pool": null,
                "restaurant": null,
                "rooms": 5.0,
                "service": 5.0,
                "sleep": null,
                "value": 5.0
            },
            "helpfulness": 2,
            "id": 18964242,
            "likes": {
                "disliked": "\u2014 Limited breakfast selection",
                "liked": "\u2014 Quiet location, quiet inn, great innkeepers, beautiful house"
            },
            "rating": 5.0,
            "stay_parameters": "Stayed August 2008, traveled with family",
            "text": "We can confirm the other glowing reviews of this property and the innkeepers. The real reason to stay here may be the location - a beautiful and quiet street just a couple of blocks from all the shops and restaurants in Bar Harbor. Many of the other inns and hotels that you may be considering are on busy main streets or outside of town. The inn itself was also very quiet - other than at breakfast, it seemed that we were the only ones there, despite all 8 rooms being occupied for our four night stay. Gary and Heidi were great sources of local information, helping us avoid the summer crowds.",
            "title": "No Need to Look Anywhere Else",
            "user": "NPHiker"
        },
        {
            "date": "August 12, 2008",
            "detail_rating": {
                "business": 2.0,
                "cleanliness": 3.0,
                "desk": null,
                "front_desk": 2.0,
                "location": 3.0,
                "pool": null,
                "restaurant": null,
                "rooms": 3.0,
                "service": 3.0,
                "sleep": null,
                "value": 2.0
            },
            "helpfulness": 11,
            "id": 18900016,
            "likes": {
                "disliked": "\u2014 Being Overcharged",
                "liked": "\u2014 The Inn's History"
            },
            "rating": 2.0,
            "stay_parameters": "Stayed July 2008, traveled as a couple",
            "text": "While our stay was not entirely unpleasant, this business snuck an additional charge for one of the nights we reserved... We had problems with our flight to Maine and could not arrive until the second evening. We notified the inn as soon as possible, and were then informed that we would lose our 50% deposit. When we arrived, the innkeepers took advantage of the circumstances and charged the full amount instead (for the night we missed).",
            "title": "Slippery and",
            "user": "Bramfield1"
        },
        {
            "date": "July 19, 2008",
            "detail_rating": {
                "business": 5.0,
                "cleanliness": 5.0,
                "desk": null,
                "front_desk": 5.0,
                "location": 5.0,
                "pool": null,
                "restaurant": null,
                "rooms": 5.0,
                "service": 5.0,
                "sleep": null,
                "value": 5.0
            },
            "helpfulness": null,
            "id": 18052300,
            "likes": {
                "disliked": null,
                "liked": "\u2014 Cleanliness, interior design, friendly innkeepers, privacy of room, comfort, breakfast, sightseeing advice."
            },
            "rating": 5.0,
            "stay_parameters": "Stayed July 2008, traveled as a couple",
            "text": "Since we stayed four nights at a nondiscounted rate, it would've been reasonable for Atlantean Inn to waive the fees for one night, or to withhold our 50% deposit for the night we missed, instead of charging the full amount.. However, these inkeepers are unreasonable and are unwilling to work with their customers.",
            "title": "Most beautiful B&B in Bar Harbor!",
            "user": "yukondoit"
        }
    ],
    "slim_ranking": 0.0294117647059,
    "stars": null,
    "tripadvisor": {
        "VISITED": false,
        "country_name": null,
        "locality": null,
        "pic_link": null,
        "street_address": null
    },
    "user_rating": 5.0,
    "variance": {
        "average": 2,
        "excellent": 138,
        "poor": 1,
        "terrible": 0,
        "very good": 6
    }
}