{
    "aka": "Marietta`s Apartments & Studios Hotel Mykonos Town",
    "description": null,
    "detail_rating": {
        "cleanliness": null,
        "location": null,
        "rooms": null,
        "service": null,
        "sleep": null,
        "value": null
    },
    "location": {
        "city": null,
        "continent": "Europe",
        "country": "Greece",
        "proposed_city": "Marietta",
        "province": null,
        "region": null
    },
    "name": "Marietta's Apartments & Studios",
    "places": {
        "aka": [
            "Marietta"
        ],
        "hotel_description": [],
        "hotel_name": [
            "Marietta"
        ]
    },
    "review_count": 115,
    "review_count_current": 20,
    "reviews": [
        {
            "date": "May 21, 2011",
            "detail_rating": {
                "business": null,
                "cleanliness": 5.0,
                "desk": null,
                "location": 5.0,
                "pool": null,
                "restaurant": null,
                "rooms": 5.0,
                "service": 5.0,
                "sleep": 5.0,
                "value": 5.0
            },
            "helpfulness": 1,
            "id": 109163575,
            "likes": {
                "disliked": null,
                "liked": null
            },
            "rating": 5.0,
            "stay_parameters": "Stayed May 2011, traveled as a couple",
            "text": "We loved our stay at marietta's studio, a separte property from her main building. It was private and elegantly decorated. The room was kept spotless with a thorough cleaning every day - I mean thorough, bathroom scrubbed, floors swetp and mopped, kitchen cleaned. Unlike other studio rooms, we had a full separte kitchen with a 2 burner cooktop as well as convection oven. Shops were close by for mini market, bank and bakery. Bed was a king size pillow top mattress - very comfortable. Roof top balcony was very nice with large umbrella and 2 chairs - stairs are steep to get to the rooftop, but if no mobility problems very nice. Bathroom also has 3 steps down to get into it, so again if mobility is an issue Room had large room safe, able to fit small laptop. Marietta was full of information on the island and very willing to help at any time.",
            "title": "Marietta is a gem, studio room was spotless!",
            "user": "onajourneyToronto"
        },
        {
            "date": "May 20, 2011",
            "detail_rating": {
                "business": null,
                "cleanliness": 5.0,
                "desk": null,
                "location": 5.0,
                "pool": null,
                "restaurant": null,
                "rooms": 5.0,
                "service": 5.0,
                "sleep": 5.0,
                "value": 5.0
            },
            "helpfulness": null,
            "id": 109129910,
            "likes": {
                "disliked": null,
                "liked": null
            },
            "rating": 5.0,
            "stay_parameters": "Stayed May 2011, traveled with family",
            "text": "We would highly recommend marietta's to anyone wanting a local feel within the maze of streets that are Mykonos. No wifi at this location but you can get wifi at her other property near little venice. This was the only drawback to our accommodation, but otherwise excellent! Marietta will meet you at the airport/port and take you back upon request - free.",
            "title": "Home away from home",
            "user": "DK2011293984"
        },
        {
            "date": "May 12, 2011",
            "detail_rating": {
                "business": null,
                "cleanliness": 5.0,
                "desk": null,
                "location": 5.0,
                "pool": null,
                "restaurant": null,
                "rooms": 5.0,
                "service": 5.0,
                "sleep": null,
                "value": 4.0
            },
            "helpfulness": 1,
            "id": 108007196,
            "likes": {
                "disliked": null,
                "liked": null
            },
            "rating": 5.0,
            "stay_parameters": "Stayed May 2011",
            "text": "I stayed at the triple room. The view was just AMAZING and the location was all we hoped for. Marietta is a warm and friendly person who went beyond her obligations in order to make our stay the dream vacation. She even took us to the beach on our last day since there were no buses. It trully is like having somewhere to stay on Mykonos where you are not a tourist but a friend. 100% Recommendable. Plus it is cleaner than my own house haha",
            "title": "Nice stay",
            "user": "supzoom"
        },
        {
            "date": "May 3, 2011",
            "detail_rating": {
                "business": null,
                "cleanliness": 5.0,
                "desk": null,
                "location": 5.0,
                "pool": null,
                "restaurant": null,
                "rooms": 5.0,
                "service": 5.0,
                "sleep": 5.0,
                "value": 5.0
            },
            "helpfulness": null,
            "id": 106608756,
            "likes": {
                "disliked": null,
                "liked": null
            },
            "rating": 5.0,
            "stay_parameters": "Stayed May 2011, traveled as a couple",
            "text": "My wife and I stayed at the triple room with balcony. The room is clean and have nice sea view. Marietta was quite busy but very kind to us. The location is prefect, very close to the town and have a lot of nice shops & restaurants around.",
            "title": "Just perfect",
            "user": "PocoLoco2"
        },
        {
            "date": "December 31, 2010",
            "detail_rating": {
                "business": null,
                "cleanliness": 5.0,
                "desk": null,
                "location": 5.0,
                "pool": null,
                "restaurant": null,
                "rooms": 5.0,
                "service": 5.0,
                "sleep": 5.0,
                "value": 5.0
            },
            "helpfulness": 1,
            "id": 91184285,
            "likes": {
                "disliked": null,
                "liked": null
            },
            "rating": 4.0,
            "stay_parameters": "Stayed September 2010, traveled as a couple",
            "text": "We contacted Marietta while coming across from Samos. She answered our email promptly and was waiting at the port to pick us up. This woman is 100% committed to your comfort. Since we arrived she has bent over backwards for us and other guests to ensure our stay is a pleasant one. And it has been. She sat with us on the verandah overlooking Little Venice and went over the map, showing us the best places to eat and buy supplies. There's no pretence here - she genuinely recommends these places.",
            "title": "Home away from home in Mykonos",
            "user": "BarbaraR_10"
        },
        {
            "date": "July 4, 2011",
            "detail_rating": {
                "business": null,
                "cleanliness": null,
                "desk": null,
                "location": null,
                "pool": null,
                "restaurant": null,
                "rooms": null,
                "service": null,
                "sleep": null,
                "value": null
            },
            "helpfulness": 4,
            "id": 115009781,
            "likes": {
                "disliked": null,
                "liked": null
            },
            "rating": 5.0,
            "stay_parameters": null,
            "text": "Besides the perfect location, beautifull view, and VERY clean room; the best thing about Marietta's Appartment & Studio is Marietta herself. You feel at home the moment she welcomes you. Our luggage didn't arrive so she picked it up at the airport the next morning at 6:30 AM. The rooms have everything you need; fridge, cooker, tostimachine, etc.",
            "title": "PERFECT",
            "user": "henrverh20"
        },
        {
            "date": "June 19, 2011",
            "detail_rating": {
                "business": null,
                "cleanliness": 5.0,
                "desk": null,
                "location": null,
                "pool": null,
                "restaurant": null,
                "rooms": null,
                "service": 5.0,
                "sleep": 5.0,
                "value": 5.0
            },
            "helpfulness": 2,
            "id": 114389481,
            "likes": {
                "disliked": null,
                "liked": null
            },
            "rating": 5.0,
            "stay_parameters": "Stayed June 2011, traveled as a couple",
            "text": "We will definitely go back to Marietta.",
            "title": "Marietta is the best host ever!!!",
            "user": "Orek"
        },
        {
            "date": "June 10, 2011",
            "detail_rating": {
                "business": null,
                "cleanliness": 5.0,
                "desk": null,
                "location": null,
                "pool": null,
                "restaurant": null,
                "rooms": null,
                "service": null,
                "sleep": 5.0,
                "value": 5.0
            },
            "helpfulness": 2,
            "id": 112557609,
            "likes": {
                "disliked": null,
                "liked": null
            },
            "rating": 5.0,
            "stay_parameters": "Stayed June 2011, traveled with friends",
            "text": "My wife and I stayed in Marietta\u00b4s Apartments & Studios for three nights and we did not want to leave. Marietta picked us up from the airport with a great smile and took us to one of her great rooms. Everything was so clean, well kept and beautifully decorated. The location is amazing because you are in the old town but in a quiet street and the beds at Marietta\u00b4s are the best! So comfortable... We woke up everyday with a smile in our face. The day we left Mykonos, Marietta picked us up at 5:45 am and took us to the airport. We have only great things to say about Marietta and her rooms and we recommend them to anyone who is looking for a clean, lovely place to stay and for great customer service. I wish all host were like Marietta. She is one of a kind!",
            "title": "The perfect apartment",
            "user": "Ninachesterton"
        },
        {
            "date": "May 30, 2011",
            "detail_rating": {
                "business": null,
                "cleanliness": 5.0,
                "desk": null,
                "location": 5.0,
                "pool": null,
                "restaurant": null,
                "rooms": 5.0,
                "service": 5.0,
                "sleep": 5.0,
                "value": 5.0
            },
            "helpfulness": 2,
            "id": 110497977,
            "likes": {
                "disliked": null,
                "liked": null
            },
            "rating": 5.0,
            "stay_parameters": "Stayed May 2011, traveled as a couple",
            "text": "The apartment is small but perfectly formed. The small kitchen and bathroom are well equipped and cleaner than any other apartment I have ever stayed in. Marietta was very friendly, easily accessible and gave good recommendations.",
            "title": "Our best experience on the Greek Islands",
            "user": "Zalakain01"
        },
        {
            "date": "May 29, 2011",
            "detail_rating": {
                "business": null,
                "cleanliness": 5.0,
                "desk": null,
                "location": 5.0,
                "pool": null,
                "restaurant": null,
                "rooms": 3.0,
                "service": 4.0,
                "sleep": 4.0,
                "value": 5.0
            },
            "helpfulness": null,
            "id": 110326925,
            "likes": {
                "disliked": null,
                "liked": null
            },
            "rating": 4.0,
            "stay_parameters": "Stayed May 2011, traveled as a couple",
            "text": "If you have difficulty walking then this is probably not the apartment for you as it's up quite a few stairs...however, then Mykonos is probably not for you either.",
            "title": "The best sunset view in town",
            "user": "zaphod_es"
        },
        {
            "date": "August 10, 2011",
            "detail_rating": {
                "business": null,
                "cleanliness": 5.0,
                "desk": null,
                "location": null,
                "pool": null,
                "restaurant": null,
                "rooms": null,
                "service": 5.0,
                "sleep": 5.0,
                "value": 5.0
            },
            "helpfulness": 3,
            "id": 116524299,
            "likes": {
                "disliked": null,
                "liked": null
            },
            "rating": 5.0,
            "stay_parameters": "Stayed August 2011, traveled with friends",
            "text": "we were me and my friend, the apartment we had was situated in a tipical building of myknos, very nice with airconditioning, clean and with a big bed. the cleaning lady was perfect, every day she cleaned everything, included the dishes! Marietta was great, puntual in picking us up, and punctual in driving us back to the airport at the end of the vacation. she even dropped us to buy some food with the car!",
            "title": "awesome for mykonos",
            "user": "robenc12"
        },
        {
            "date": "July 28, 2011",
            "detail_rating": {
                "business": null,
                "cleanliness": 5.0,
                "desk": null,
                "location": null,
                "pool": null,
                "restaurant": null,
                "rooms": null,
                "service": 5.0,
                "sleep": 5.0,
                "value": 5.0
            },
            "helpfulness": 2,
            "id": 115925315,
            "likes": {
                "disliked": null,
                "liked": null
            },
            "rating": 5.0,
            "stay_parameters": "Stayed July 2011, traveled with friends",
            "text": "the apartment is in the centre of myknos, you have all the bars, discos, restaurants, shops, rental and the bus station few steps from you!",
            "title": "The best!",
            "user": "paz079"
        },
        {
            "date": "July 14, 2011",
            "detail_rating": {
                "business": null,
                "cleanliness": 5.0,
                "desk": null,
                "location": null,
                "pool": null,
                "restaurant": null,
                "rooms": null,
                "service": null,
                "sleep": 5.0,
                "value": 5.0
            },
            "helpfulness": 3,
            "id": 115367394,
            "likes": {
                "disliked": null,
                "liked": null
            },
            "rating": 5.0,
            "stay_parameters": "Stayed July 2011, traveled as a couple",
            "text": "We stayed here for 3 amazing nights in Mykonos. Our room was adorable and the view from the terrace was excellent! Marietta went above and beyond to make our stay memorable and comfortable. She picked us up from the airport, helped us rent quads and even took us to a store to buy a CD player. We had an issue with our ferry tickets and she got our money back for us and helped us book new ferry tickets so we could stay an extra day. Amazing! The apartments are in a beautiful area between Little Venice, and the Windmills. Stay here!",
            "title": "Great Location, Great roof terrace!",
            "user": "dinkybluebug"
        },
        {
            "date": "July 11, 2011",
            "detail_rating": {
                "business": null,
                "cleanliness": 5.0,
                "desk": null,
                "location": null,
                "pool": null,
                "restaurant": null,
                "rooms": null,
                "service": 5.0,
                "sleep": 4.0,
                "value": 5.0
            },
            "helpfulness": 3,
            "id": 115253385,
            "likes": {
                "disliked": null,
                "liked": null
            },
            "rating": 5.0,
            "stay_parameters": "Stayed June 2011, traveled as a couple",
            "text": "Thank you Marietta for everything! Nicole and Vicky!",
            "title": "a fantastic place to stay in Mykonos",
            "user": "philopera"
        },
        {
            "date": "July 11, 2011",
            "detail_rating": {
                "business": null,
                "cleanliness": null,
                "desk": null,
                "location": null,
                "pool": null,
                "restaurant": null,
                "rooms": null,
                "service": null,
                "sleep": null,
                "value": null
            },
            "helpfulness": 3,
            "id": 115239998,
            "likes": {
                "disliked": null,
                "liked": null
            },
            "rating": 4.0,
            "stay_parameters": null,
            "text": "We loved staying at Marietta's. She picked us up from the Airport and we were met with a great room, very clean and comfortable.",
            "title": "PERFECT ACCOMODATION",
            "user": "tamborl"
        },
        {
            "date": "November 4, 2011",
            "detail_rating": {
                "business": null,
                "cleanliness": 5.0,
                "desk": null,
                "location": 5.0,
                "pool": null,
                "restaurant": null,
                "rooms": 5.0,
                "service": 5.0,
                "sleep": 5.0,
                "value": 5.0
            },
            "helpfulness": 1,
            "id": 120140737,
            "likes": {
                "disliked": null,
                "liked": null
            },
            "rating": 5.0,
            "stay_parameters": "Stayed September 2011, traveled with friends",
            "text": "We were greeted as old friends when Marietta met us at the airport and we were wrapped in this wonderful sense of friendship throughout our 3 day stay. Marietta is the most vivacious, generous host you could possibly hope to meet. Her rooms / studios are in a stunning location - the magnificent view from the balcony of Little Venice & the windmills makes it the perfect spot for a glass or 2 of vino. The room known as \"Peter's room\" is particularly lovely - our rooms were very comfortable and simply furnished. Marietta dropped us at the ferry early one morning & there were tears as she said farewell to \"my dears\".",
            "title": "Marietta is Mykonos",
            "user": "Peter_Joan"
        },
        {
            "date": "October 11, 2011",
            "detail_rating": {
                "business": null,
                "cleanliness": 5.0,
                "desk": null,
                "location": 5.0,
                "pool": null,
                "restaurant": null,
                "rooms": 5.0,
                "service": 5.0,
                "sleep": 5.0,
                "value": 5.0
            },
            "helpfulness": 3,
            "id": 119188524,
            "likes": {
                "disliked": null,
                "liked": null
            },
            "rating": 5.0,
            "stay_parameters": "Stayed September 2011, traveled solo",
            "text": "I was on Mykonos from Sept. 21st until Oct.1st.. For some days I had to stay in the beautiful BALCONY-Room which is very nice decorated, with a fridge, hairdryer, safe-box and a beautiful new bathroom. There is a fantastic view to the sea, also from the bed ! How can a day start better after opening the eyes and look to the blue sea ?",
            "title": "Staying in MARIETTA`s rooms - and your holidays become perfect !",
            "user": "peter S"
        },
        {
            "date": "October 6, 2011",
            "detail_rating": {
                "business": null,
                "cleanliness": 5.0,
                "desk": null,
                "location": 5.0,
                "pool": null,
                "restaurant": null,
                "rooms": 5.0,
                "service": 5.0,
                "sleep": 5.0,
                "value": 5.0
            },
            "helpfulness": 2,
            "id": 118986140,
            "likes": {
                "disliked": null,
                "liked": null
            },
            "rating": 5.0,
            "stay_parameters": "Stayed September 2011, traveled as a couple",
            "text": "The other days I spent in the same house but in the VERANDA-Room which is also very beautiful decorated, also with a fridge, hairdryer, safe-box and a bathroom with a window.",
            "title": "Can't imagine a better place",
            "user": "glecoq"
        },
        {
            "date": "September 26, 2011",
            "detail_rating": {
                "business": null,
                "cleanliness": 5.0,
                "desk": null,
                "location": 5.0,
                "pool": null,
                "restaurant": null,
                "rooms": 5.0,
                "service": 5.0,
                "sleep": 5.0,
                "value": 5.0
            },
            "helpfulness": 1,
            "id": 118593464,
            "likes": {
                "disliked": null,
                "liked": null
            },
            "rating": 5.0,
            "stay_parameters": "Stayed September 2011, traveled as a couple",
            "text": "From this room I could reach the roof-terrace with a fantastic view - overlooking the sea and the town !! I wouldn`t leave this wonderful place !",
            "title": "Great stay with friends.",
            "user": "Cajunwanderer"
        },
        {
            "date": "September 26, 2011",
            "detail_rating": {
                "business": null,
                "cleanliness": 5.0,
                "desk": null,
                "location": 5.0,
                "pool": null,
                "restaurant": null,
                "rooms": 5.0,
                "service": 5.0,
                "sleep": 5.0,
                "value": 5.0
            },
            "helpfulness": 1,
            "id": 118593319,
            "likes": {
                "disliked": null,
                "liked": null
            },
            "rating": 5.0,
            "stay_parameters": "Stayed September 2011, traveled as a couple",
            "text": "These rooms were well-groomed, centrally located, next to the famous windmills, but very quiet.",
            "title": "Amazing stayn in Mykonos",
            "user": "DinaRoyer"
        }
    ],
    "slim_ranking": 0.0833333333333,
    "stars": null,
    "tripadvisor": {
        "VISITED": false,
        "country_name": null,
        "locality": null,
        "pic_link": null,
        "street_address": null
    },
    "user_rating": 4.5,
    "variance": {
        "average": 2,
        "excellent": 96,
        "poor": 0,
        "terrible": 3,
        "very good": 14
    }
}