{
    "aka": "Fort Hotel Enniskillen",
    "description": "We offer a brand new hotel experience unlike any other, where the people make the place, and make you feel right at home. Situated in Enniskillen town, our rooms offer contemporary sophistication; whether you are a visiting for business or pleasure. And that\u2019s before you\u2019ve tried one of our specialty whiskeys or cocktails!",
    "detail_rating": {
        "cleanliness": null,
        "location": null,
        "rooms": null,
        "service": null,
        "sleep": null,
        "value": null
    },
    "location": {
        "city": null,
        "continent": "Europe",
        "country": "United Kingdom (UK)",
        "proposed_city": null,
        "province": null,
        "region": null
    },
    "name": "The Enniskillen Hotel",
    "places": {
        "aka": [],
        "hotel_description": [],
        "hotel_name": []
    },
    "review_count": 102,
    "review_count_current": 20,
    "reviews": [
        {
            "date": "May 6, 2013",
            "detail_rating": {
                "business": null,
                "cleanliness": 5.0,
                "desk": null,
                "location": 5.0,
                "pool": null,
                "restaurant": null,
                "rooms": 3.0,
                "service": 5.0,
                "sleep": 5.0,
                "value": 4.0
            },
            "helpfulness": null,
            "id": 159838052,
            "likes": {
                "disliked": null,
                "liked": null
            },
            "rating": 4.0,
            "stay_parameters": "Stayed May 2013, traveled as a couple",
            "text": "Don't be fooled by the exterior of this property, it is bizarre and does not seem to be a classy hotel from the outside. However once inside the hotel is decorated to a very high standard, if a little dark in places. The bedroom is not overly large, even the superior double was quite small, but was very nice and absolutely clean. The bathroom was lovely, with great little touches. There was coffee, tea, water all complimentary in the rooms. Even the hair dyer was of very good quality, not like the one in many other hotels. The bar and restaurant were very inviting and the breakfast was excellent. The cooked selection in particular was really impressive and there was a variety of morning newspapers as all at breakfast. The location is ideal for walking into the town, a short 5min walk will have you at bars, restaurants and shops.",
            "title": "A surprise!",
            "user": "Louise C"
        },
        {
            "date": "May 6, 2013",
            "detail_rating": {
                "business": null,
                "cleanliness": 5.0,
                "desk": null,
                "location": 5.0,
                "pool": null,
                "restaurant": null,
                "rooms": 5.0,
                "service": 5.0,
                "sleep": 5.0,
                "value": 5.0
            },
            "helpfulness": 1,
            "id": 159829953,
            "likes": {
                "disliked": null,
                "liked": null
            },
            "rating": 5.0,
            "stay_parameters": "Stayed May 2013, traveled as a couple",
            "text": "Having never been to Enniskillen before we had no idea what to expect or where the hotel was. We were thoroughly impressed with this hotel from the moment we arrived!",
            "title": "Absolutely brilliant stay!",
            "user": "M S"
        },
        {
            "date": "May 2, 2013",
            "detail_rating": {
                "business": null,
                "cleanliness": 4.0,
                "desk": null,
                "location": 3.0,
                "pool": null,
                "restaurant": null,
                "rooms": 3.0,
                "service": 3.0,
                "sleep": 4.0,
                "value": 2.0
            },
            "helpfulness": 2,
            "id": 159460575,
            "likes": {
                "disliked": null,
                "liked": null
            },
            "rating": 3.0,
            "stay_parameters": "Stayed April 2013, traveled as a couple",
            "text": "On our arrival we were greeted by a lovely receptionist and checked in very quickly. We booked the whiskey tasting option for our stay and on check-in we confirmed our drink options for that night agreeing to do whiskey tasting on night one and cocktail making on night two.",
            "title": "Only Mediocre",
            "user": "Irish_Elouise"
        },
        {
            "date": "April 14, 2013",
            "detail_rating": {
                "business": null,
                "cleanliness": 5.0,
                "desk": null,
                "location": 5.0,
                "pool": null,
                "restaurant": null,
                "rooms": null,
                "service": 5.0,
                "sleep": null,
                "value": 5.0
            },
            "helpfulness": 1,
            "id": 157702491,
            "likes": {
                "disliked": null,
                "liked": null
            },
            "rating": 5.0,
            "stay_parameters": "Stayed April 2013, traveled with friends",
            "text": "We found the hotel to be very very clean and everything is brand spanking new! A very modern monochrome theme runs through the hotel making it feel very classy and modern.",
            "title": "Fantastic!",
            "user": "Morrisson24"
        },
        {
            "date": "April 14, 2013",
            "detail_rating": {
                "business": null,
                "cleanliness": 5.0,
                "desk": null,
                "location": 5.0,
                "pool": null,
                "restaurant": null,
                "rooms": 5.0,
                "service": 5.0,
                "sleep": 5.0,
                "value": 5.0
            },
            "helpfulness": null,
            "id": 157665526,
            "likes": {
                "disliked": null,
                "liked": null
            },
            "rating": 5.0,
            "stay_parameters": "Stayed February 2013, traveled as a couple",
            "text": "Our room number was 104 and was a superior double.",
            "title": "Excellent - luxury at an amazing price",
            "user": "gbtravells"
        },
        {
            "date": "May 20, 2013",
            "detail_rating": {
                "business": null,
                "cleanliness": 5.0,
                "desk": null,
                "location": 5.0,
                "pool": null,
                "restaurant": null,
                "rooms": 4.0,
                "service": 4.0,
                "sleep": 2.0,
                "value": 2.0
            },
            "helpfulness": 1,
            "id": 161283021,
            "likes": {
                "disliked": null,
                "liked": null
            },
            "rating": 3.0,
            "stay_parameters": "Stayed May 2013, traveled as a couple",
            "text": "The good - very polite staff. Central. Cosy. Decent bathroom and shower. The bad - a horrific grey colour throughout the hotel that makes it look very drab and depressing. Screaming and roaring at 4am from some inconsiderate guests that woke many people (I know because a few guests mentioned it at the breakfast). My wife was giving a lecture at a local college the following morning, and was awake for hours because of the noise. She never got back to sleep after it. The receptionist wasn't prepared to apologise for it. She just said that the hotel was powerless to do anything about it. I dunno. Surely a night porter should get involved ? Maybe he was unaware of it ? The breakfast was decent, but the breakfast room very cramped. Overall it was very pricey here for one night. I probably would seek out other accommodation the next time.",
            "title": "Had good and bad points",
            "user": "BurstYourBubble"
        },
        {
            "date": "May 19, 2013",
            "detail_rating": {
                "business": null,
                "cleanliness": 5.0,
                "desk": null,
                "location": 5.0,
                "pool": null,
                "restaurant": null,
                "rooms": 5.0,
                "service": 5.0,
                "sleep": null,
                "value": 5.0
            },
            "helpfulness": 1,
            "id": 161165313,
            "likes": {
                "disliked": null,
                "liked": null
            },
            "rating": 5.0,
            "stay_parameters": "Stayed May 2013",
            "text": "From doing the booking to checking out we had a wonderful stay, every member of staff was exceptional and trained to a very high standard, the bar food was excellent and the cocktail making lessons 1stclass. The bedrooms and hotel decor very chic and taste full done. Would recommend this to everyone and can't wait to go back. Thank you for a wonderful stay",
            "title": "1st class hotel and staff",
            "user": "october44"
        },
        {
            "date": "May 17, 2013",
            "detail_rating": {
                "business": null,
                "cleanliness": 5.0,
                "desk": null,
                "location": 4.0,
                "pool": null,
                "restaurant": null,
                "rooms": 4.0,
                "service": 5.0,
                "sleep": 5.0,
                "value": 5.0
            },
            "helpfulness": 1,
            "id": 160988336,
            "likes": {
                "disliked": null,
                "liked": null
            },
            "rating": 5.0,
            "stay_parameters": "Stayed May 2013, traveled as a couple",
            "text": "stayed her when attending an evening wedding party at the lough erne resort. staff were very friendly without being pushy. quirky decor which works really well. rooms small but very comfortable bed and soft furnishings. bathroom/shower kitted out to high spec and fluffy towels. Breakfast next morning was excellent and would be delighted to have an excuse to go back. easy walking distance to eateries if you dont want to eat in but lovely bar area where you could have a quiet drink",
            "title": "a little gem",
            "user": "Andrew S"
        },
        {
            "date": "May 13, 2013",
            "detail_rating": {
                "business": null,
                "cleanliness": 5.0,
                "desk": null,
                "location": 5.0,
                "pool": null,
                "restaurant": null,
                "rooms": 5.0,
                "service": 5.0,
                "sleep": 5.0,
                "value": 5.0
            },
            "helpfulness": 2,
            "id": 160579304,
            "likes": {
                "disliked": null,
                "liked": null
            },
            "rating": 5.0,
            "stay_parameters": "Stayed May 2013, traveled with friends",
            "text": "Formerly known as the Fort Lodge, the hotel as been recently renovated to the highest of standards. What an amazing transformation. Tastefully decorated throughout. Very classy indeed. Extremely pleasant courteous staff who made you feel so welcome. The food we ate was of the highest quality. The room in which we stayed as good as I have I have ever seen. Lovely little touches which I'll let you discover for yourself. If you are looking for somewhere to stay in Fermanagh this is as good as it gets.",
            "title": "A Short Stay",
            "user": "johnmcbride45"
        },
        {
            "date": "May 6, 2013",
            "detail_rating": {
                "business": null,
                "cleanliness": 5.0,
                "desk": null,
                "location": 5.0,
                "pool": null,
                "restaurant": null,
                "rooms": 5.0,
                "service": 5.0,
                "sleep": null,
                "value": 5.0
            },
            "helpfulness": 1,
            "id": 159838245,
            "likes": {
                "disliked": null,
                "liked": null
            },
            "rating": 5.0,
            "stay_parameters": "Stayed May 2013",
            "text": "J MCBRIDE LONDON",
            "title": "Top class",
            "user": "Paulk320"
        },
        {
            "date": "March 19, 2013",
            "detail_rating": {
                "business": null,
                "cleanliness": null,
                "desk": null,
                "location": null,
                "pool": null,
                "restaurant": null,
                "rooms": null,
                "service": 5.0,
                "sleep": null,
                "value": 5.0
            },
            "helpfulness": 1,
            "id": 155092343,
            "likes": {
                "disliked": null,
                "liked": null
            },
            "rating": 5.0,
            "stay_parameters": "Stayed March 2013, traveled as a couple",
            "text": "We recently visited your hotel to eat not to stay,food was gorgeous 2 extremely bar staff served us and made sure everything was perfect for us, the atmosphere was so warm, at the minute we are planning to stay in your hotel. Customer service is the most important thing in a hotel, well done. Will see you soon.",
            "title": "Kilkenny couple",
            "user": "bunny2576"
        },
        {
            "date": "March 10, 2013",
            "detail_rating": {
                "business": null,
                "cleanliness": 5.0,
                "desk": null,
                "location": 5.0,
                "pool": null,
                "restaurant": null,
                "rooms": 5.0,
                "service": 5.0,
                "sleep": 5.0,
                "value": 5.0
            },
            "helpfulness": 2,
            "id": 154173356,
            "likes": {
                "disliked": null,
                "liked": null
            },
            "rating": 5.0,
            "stay_parameters": "Stayed March 2013, traveled as a couple",
            "text": "Stayed over while attending a wedding at loch erne, found hotel with sat nav no problem, hotel car park was full but public car park a short walk away, lady on reception very helpful and chatty, got to room and was impressed, modern and trendy, big comfy bed and great bathroom with awesome shower. Had dinner in the Wilde bar! Great service and fantastic food, good value for money, with simple but effective menu, had the sliders, which was 6 mini cheese burgers.... Lovely. Went to the wedding, came back and had a great nights sleep, breakfast was very good, and checking out was painless, overall very impressed with hotel. Would go back again",
            "title": "Top class hotel",
            "user": "milesyboy76"
        },
        {
            "date": "March 10, 2013",
            "detail_rating": {
                "business": null,
                "cleanliness": null,
                "desk": null,
                "location": null,
                "pool": null,
                "restaurant": null,
                "rooms": null,
                "service": null,
                "sleep": null,
                "value": null
            },
            "helpfulness": 2,
            "id": 154159654,
            "likes": {
                "disliked": null,
                "liked": null
            },
            "rating": 5.0,
            "stay_parameters": null,
            "text": "Stayed last weekend, room was perfect, clean, comfortable and cosy. Food was top quality and service was excellent. Staff very friendly and helpful. Handy to the town and parking onsite. I'll definitely be back.",
            "title": "Excellent",
            "user": "Luane01"
        },
        {
            "date": "March 9, 2013",
            "detail_rating": {
                "business": null,
                "cleanliness": 5.0,
                "desk": null,
                "location": 4.0,
                "pool": null,
                "restaurant": null,
                "rooms": 5.0,
                "service": 5.0,
                "sleep": 5.0,
                "value": 5.0
            },
            "helpfulness": 1,
            "id": 154097553,
            "likes": {
                "disliked": null,
                "liked": null
            },
            "rating": 5.0,
            "stay_parameters": "Stayed March 2013, traveled with friends",
            "text": "Stayed overnight following a small retirement function in the hotel. Room was excellent, large comfortable bed, fridge with complimentary water, lots of storage. Good sized bathroom with power shower. Evening meal and cooked breakfast very, very good. But most impressive feature is the staff. They were all so friendly, professional and helpful. Highly recommended.",
            "title": "Overnight Stay",
            "user": "tomj62"
        },
        {
            "date": "March 9, 2013",
            "detail_rating": {
                "business": null,
                "cleanliness": 5.0,
                "desk": null,
                "location": 4.0,
                "pool": null,
                "restaurant": null,
                "rooms": 5.0,
                "service": 5.0,
                "sleep": 5.0,
                "value": 5.0
            },
            "helpfulness": 1,
            "id": 154077743,
            "likes": {
                "disliked": null,
                "liked": null
            },
            "rating": 5.0,
            "stay_parameters": "Stayed March 2013, traveled with friends",
            "text": "As soon as you arrive you are greeted with a warm and friendly welcome. The rooms are excellent, I stayed at the hotel for a function. The staff can't do enough for you and are always making sure that you are comfortable and enjoying yourself. The food was superb as was the breakfast.",
            "title": "Brilliant hotel and staff",
            "user": "Jonathan K"
        },
        {
            "date": "April 6, 2013",
            "detail_rating": {
                "business": null,
                "cleanliness": 5.0,
                "desk": null,
                "location": 2.0,
                "pool": null,
                "restaurant": null,
                "rooms": null,
                "service": null,
                "sleep": null,
                "value": null
            },
            "helpfulness": 1,
            "id": 156810374,
            "likes": {
                "disliked": null,
                "liked": null
            },
            "rating": 5.0,
            "stay_parameters": "Stayed April 2013",
            "text": "I have been here a few times but I ate in here tonight with 2 children, the food and service was fantastic great place all round. The value was super and the food was not only presented well it tasted fantastic plus the staff were very very good , I will definitely be back :)",
            "title": "Fantastic",
            "user": "Bmcf12"
        },
        {
            "date": "April 2, 2013",
            "detail_rating": {
                "business": null,
                "cleanliness": 5.0,
                "desk": null,
                "location": 5.0,
                "pool": null,
                "restaurant": null,
                "rooms": 5.0,
                "service": 5.0,
                "sleep": null,
                "value": 5.0
            },
            "helpfulness": 1,
            "id": 156412478,
            "likes": {
                "disliked": null,
                "liked": null
            },
            "rating": 5.0,
            "stay_parameters": "Stayed March 2013",
            "text": "We (2 couples) stayed for 2 nights over Easter weekend.",
            "title": "Previously - this was a dive of a placeThat's definitely not the case now",
            "user": "Ciar\u00e1n R"
        },
        {
            "date": "March 25, 2013",
            "detail_rating": {
                "business": null,
                "cleanliness": 5.0,
                "desk": null,
                "location": 4.0,
                "pool": null,
                "restaurant": null,
                "rooms": 4.0,
                "service": 5.0,
                "sleep": 4.0,
                "value": 4.0
            },
            "helpfulness": null,
            "id": 155596316,
            "likes": {
                "disliked": null,
                "liked": null
            },
            "rating": 4.0,
            "stay_parameters": "Stayed March 2013, traveled on business",
            "text": "I stayed in this hotel before being renovated,and vowed never to return.",
            "title": "Pleasant hotel",
            "user": "Smileandbehappy"
        },
        {
            "date": "March 23, 2013",
            "detail_rating": {
                "business": null,
                "cleanliness": 5.0,
                "desk": null,
                "location": 4.0,
                "pool": null,
                "restaurant": null,
                "rooms": 5.0,
                "service": 4.0,
                "sleep": 4.0,
                "value": 4.0
            },
            "helpfulness": 1,
            "id": 155451729,
            "likes": {
                "disliked": null,
                "liked": null
            },
            "rating": 4.0,
            "stay_parameters": "Stayed March 2013, traveled with family",
            "text": "Now that its been renovated :",
            "title": "Great New Hotel",
            "user": "crimmo"
        },
        {
            "date": "March 22, 2013",
            "detail_rating": {
                "business": null,
                "cleanliness": 5.0,
                "desk": null,
                "location": 3.0,
                "pool": null,
                "restaurant": null,
                "rooms": 4.0,
                "service": 4.0,
                "sleep": 1.0,
                "value": 4.0
            },
            "helpfulness": null,
            "id": 155326581,
            "likes": {
                "disliked": null,
                "liked": null
            },
            "rating": 4.0,
            "stay_parameters": "Stayed March 2013, traveled on business",
            "text": "It was clean, stylish, close to enniskillen to walk in or home.",
            "title": "Problems but handled well",
            "user": "593NevilleC"
        }
    ],
    "slim_ranking": 0.285714285714,
    "stars": null,
    "tripadvisor": {
        "VISITED": false,
        "country_name": null,
        "locality": null,
        "pic_link": null,
        "street_address": null
    },
    "user_rating": 4.5,
    "variance": {
        "average": 3,
        "excellent": 80,
        "poor": 1,
        "terrible": 0,
        "very good": 18
    }
}