{
    "aka": "Premier Inn Poole North Hotel",
    "description": null,
    "detail_rating": {
        "cleanliness": 4.5,
        "location": 4.0,
        "rooms": 4.0,
        "service": 4.5,
        "sleep": 4.0,
        "value": 4.5
    },
    "location": {
        "city": null,
        "continent": "Europe",
        "country": "United Kingdom (UK)",
        "proposed_city": "Poole",
        "province": null,
        "region": null
    },
    "name": "Premier Inn Poole North",
    "places": {
        "aka": [
            "Poole"
        ],
        "hotel_description": [],
        "hotel_name": [
            "Poole"
        ]
    },
    "review_count": 437,
    "review_count_current": 20,
    "reviews": [
        {
            "date": "March 15, 2012",
            "detail_rating": {
                "business": null,
                "cleanliness": 4.0,
                "desk": null,
                "location": 3.0,
                "pool": null,
                "restaurant": null,
                "rooms": 3.0,
                "service": 4.0,
                "sleep": 4.0,
                "value": 4.0
            },
            "helpfulness": null,
            "id": 126152844,
            "likes": {
                "disliked": null,
                "liked": null
            },
            "rating": 3.0,
            "stay_parameters": "Stayed February 2012, traveled with friends",
            "text": "What can one say about any Premier Inn? I suppose the only answer is that they generally do what they say on the tin. The location is far from pretty but you book here because it is a one night stop-over to somewhere else rather than staying for a two week family holiday. Having said that the rooms are pretty good (much better than Weymouth, for example) and the breakfat sausages were excellent. Of note also was the friendly welcome by the reception staff. On the downside the shower did not work properly.",
            "title": "Can never get excited about a Premier Inn but...",
            "user": "BigMac58"
        },
        {
            "date": "March 12, 2012",
            "detail_rating": {
                "business": null,
                "cleanliness": 5.0,
                "desk": null,
                "location": 5.0,
                "pool": null,
                "restaurant": null,
                "rooms": 5.0,
                "service": 5.0,
                "sleep": 5.0,
                "value": 4.0
            },
            "helpfulness": null,
            "id": 126003542,
            "likes": {
                "disliked": null,
                "liked": null
            },
            "rating": 5.0,
            "stay_parameters": "Stayed March 2012, traveled with family",
            "text": "Good hotel, had all amenities, good car park and dining on site.",
            "title": "Homeward bound",
            "user": "Reeve1"
        },
        {
            "date": "March 12, 2012",
            "detail_rating": {
                "business": null,
                "cleanliness": 5.0,
                "desk": null,
                "location": 3.0,
                "pool": null,
                "restaurant": null,
                "rooms": 5.0,
                "service": 5.0,
                "sleep": 5.0,
                "value": 5.0
            },
            "helpfulness": 1,
            "id": 126001950,
            "likes": {
                "disliked": null,
                "liked": null
            },
            "rating": 5.0,
            "stay_parameters": "Stayed March 2012, traveled with family",
            "text": "I chose this hotel as it was close to the water park that I was treating my boys too for a birthday treat. It was easy to find and the young girl even gave me a courtisy call to make sure I found it ok. all the staff were very friendly and made both me and my boys very welcome, my youngest didn't want to leave!! We will certainly be using it again.",
            "title": "Weekend break with my two boys",
            "user": "heather r"
        },
        {
            "date": "February 28, 2012",
            "detail_rating": {
                "business": null,
                "cleanliness": 5.0,
                "desk": null,
                "location": 5.0,
                "pool": null,
                "restaurant": null,
                "rooms": 5.0,
                "service": 5.0,
                "sleep": 3.0,
                "value": 5.0
            },
            "helpfulness": null,
            "id": 125359329,
            "likes": {
                "disliked": null,
                "liked": null
            },
            "rating": 4.0,
            "stay_parameters": "Stayed February 2012, traveled as a couple",
            "text": "As a disabled person this was our second premier inn holiday ,the first was in blackpool in november which was fantastic we thought everything would be the same. but we were disappointed that the bed was much lower i really struggled getting in and out of bed.Everything else was lovely staff were very friendly and willing to help the room was very clean. So premier inn please make sure the beds in your disabled rooms are a better hieght.",
            "title": "disabled second stay",
            "user": "pam b"
        },
        {
            "date": "February 24, 2012",
            "detail_rating": {
                "business": null,
                "cleanliness": 5.0,
                "desk": null,
                "location": 5.0,
                "pool": null,
                "restaurant": null,
                "rooms": 5.0,
                "service": 5.0,
                "sleep": 5.0,
                "value": 5.0
            },
            "helpfulness": 1,
            "id": 125149662,
            "likes": {
                "disliked": null,
                "liked": null
            },
            "rating": 5.0,
            "stay_parameters": "Stayed February 2012, traveled with family",
            "text": "Great stay here, staff excellent can't do enough for you. Everyone had a smile on their face.",
            "title": "Can't beat this place",
            "user": "nojokel"
        },
        {
            "date": "February 23, 2012",
            "detail_rating": {
                "business": null,
                "cleanliness": 5.0,
                "desk": null,
                "location": 3.0,
                "pool": null,
                "restaurant": null,
                "rooms": 4.0,
                "service": 5.0,
                "sleep": 4.0,
                "value": 5.0
            },
            "helpfulness": null,
            "id": 125071384,
            "likes": {
                "disliked": null,
                "liked": null
            },
            "rating": 4.0,
            "stay_parameters": "Stayed February 2012, traveled with friends",
            "text": "We booked in for a few days with friends & this was our first stay at a Premier Inn. We found the staff very helpful & pleasent & enjoyed the 2 evening meals that we ate there. The special offer of buy 2 glasses of wine & get the rest of the bottle free was appreciated. The only gripes were that the pillows were too hard & there was a cracked tile around the bath tap. Apart from these issues, The room was very comfortable and was spotlessly clean.",
            "title": "Very Enjoyable",
            "user": "ady2010"
        },
        {
            "date": "February 21, 2012",
            "detail_rating": {
                "business": null,
                "cleanliness": 4.0,
                "desk": null,
                "location": 2.0,
                "pool": null,
                "restaurant": null,
                "rooms": 2.0,
                "service": 4.0,
                "sleep": 3.0,
                "value": 4.0
            },
            "helpfulness": null,
            "id": 124994445,
            "likes": {
                "disliked": null,
                "liked": null
            },
            "rating": 3.0,
            "stay_parameters": "Stayed February 2012, traveled with family",
            "text": "There were creaking noises from above when anyone in the room above walked across the floor, but this did not cause a problem during the night.",
            "title": "Not bad but not good either",
            "user": "BedfordshireZippy"
        },
        {
            "date": "February 21, 2012",
            "detail_rating": {
                "business": null,
                "cleanliness": 5.0,
                "desk": null,
                "location": 4.0,
                "pool": null,
                "restaurant": null,
                "rooms": 5.0,
                "service": 5.0,
                "sleep": 5.0,
                "value": 5.0
            },
            "helpfulness": null,
            "id": 124977675,
            "likes": {
                "disliked": null,
                "liked": null
            },
            "rating": 5.0,
            "stay_parameters": "Stayed February 2012, traveled as a couple",
            "text": "We've stayed at several Premier Inns and enjoy their value and consistency. However, this was the poorest stay we have had. There was some traffic noise from our bedroom on the side facing the main (50mph) road, albeit not desperately bad. The bathroom was a little tired, with some deteriorating paint and fittings. And the cooked breakfast was very average - on arrival there was little left and a buffet refresh took 10 minutes. When it did arrive the bacon was chewy and the sausages anaemic, bordering on undercooked.",
            "title": "Excellent",
            "user": "vince g"
        },
        {
            "date": "February 14, 2012",
            "detail_rating": {
                "business": null,
                "cleanliness": 5.0,
                "desk": null,
                "location": 5.0,
                "pool": null,
                "restaurant": null,
                "rooms": 5.0,
                "service": 5.0,
                "sleep": 5.0,
                "value": 5.0
            },
            "helpfulness": null,
            "id": 124585697,
            "likes": {
                "disliked": null,
                "liked": null
            },
            "rating": 5.0,
            "stay_parameters": "Stayed February 2012, traveled on business",
            "text": "Finally, the location - close to the sewerage and very far from the old town / harbour - was not ideal for our stay.",
            "title": "Impressed!",
            "user": "WallisKirkland"
        },
        {
            "date": "February 13, 2012",
            "detail_rating": {
                "business": null,
                "cleanliness": 5.0,
                "desk": null,
                "location": 3.0,
                "pool": null,
                "restaurant": null,
                "rooms": 5.0,
                "service": 5.0,
                "sleep": 5.0,
                "value": 5.0
            },
            "helpfulness": null,
            "id": 124523947,
            "likes": {
                "disliked": null,
                "liked": null
            },
            "rating": 5.0,
            "stay_parameters": "Stayed February 2012, traveled with friends",
            "text": "That all said, the staff were very friendly and approachable and the room was tidy / clean. Neverthless, we much prefered our earlier stay at Holiday Inn Holes Bay Road.",
            "title": "what more can you want for the price",
            "user": "warey55"
        },
        {
            "date": "January 9, 2012",
            "detail_rating": {
                "business": null,
                "cleanliness": 5.0,
                "desk": null,
                "location": 5.0,
                "pool": null,
                "restaurant": null,
                "rooms": 5.0,
                "service": 5.0,
                "sleep": 5.0,
                "value": 5.0
            },
            "helpfulness": null,
            "id": 122801587,
            "likes": {
                "disliked": null,
                "liked": null
            },
            "rating": 5.0,
            "stay_parameters": "Stayed October 2011, traveled as a couple",
            "text": "3rd stay at this hotel whilst visiting our son. Staff again excellent and food and bar staff vey efficient and accommodating. Bed rooms a good size with welcoming bar and restaurant area.",
            "title": "As good as last time we stayed",
            "user": "Harold P"
        },
        {
            "date": "December 21, 2011",
            "detail_rating": {
                "business": null,
                "cleanliness": 5.0,
                "desk": null,
                "location": 5.0,
                "pool": null,
                "restaurant": null,
                "rooms": 5.0,
                "service": 5.0,
                "sleep": 5.0,
                "value": 5.0
            },
            "helpfulness": null,
            "id": 121956532,
            "likes": {
                "disliked": null,
                "liked": null
            },
            "rating": 5.0,
            "stay_parameters": "Stayed December 2011, traveled with family",
            "text": "Visiting our daughter in Bournemouth for the weekend, decided to stay at the PI Poole North. Being our first time at a Premier Inn we were more than pleasantly surprised , Staff were friendly, informative and interested in us. The room was clean and comfortable, we had a good nights sleep ! We will definitely stay there again.",
            "title": "Premier Inn Poole North",
            "user": "Shirley P"
        },
        {
            "date": "December 19, 2011",
            "detail_rating": {
                "business": null,
                "cleanliness": 5.0,
                "desk": null,
                "location": 5.0,
                "pool": null,
                "restaurant": null,
                "rooms": 5.0,
                "service": 5.0,
                "sleep": 5.0,
                "value": 5.0
            },
            "helpfulness": null,
            "id": 121890151,
            "likes": {
                "disliked": null,
                "liked": null
            },
            "rating": 5.0,
            "stay_parameters": "Stayed December 2011, traveled as a couple",
            "text": "Very recently stayed at the Premier Inn, Poole North, Dorset, and can honestly say that the rooms, as far as cleanliness, comfort, ambience, were better than the Hilton that we had stayed in the previous night.",
            "title": "Premier Inn, Poole North",
            "user": "thompson5656"
        },
        {
            "date": "December 19, 2011",
            "detail_rating": {
                "business": null,
                "cleanliness": 5.0,
                "desk": null,
                "location": 3.0,
                "pool": null,
                "restaurant": null,
                "rooms": 5.0,
                "service": 5.0,
                "sleep": 5.0,
                "value": 5.0
            },
            "helpfulness": null,
            "id": 121881831,
            "likes": {
                "disliked": null,
                "liked": null
            },
            "rating": 5.0,
            "stay_parameters": "Stayed December 2011, traveled with family",
            "text": "All the staff were lovely, attentive and friendly, and the price of the rooms via the internet, were a st=eal at \u00a329 per night.",
            "title": "Great value for money",
            "user": "Alex v"
        },
        {
            "date": "December 12, 2011",
            "detail_rating": {
                "business": null,
                "cleanliness": 5.0,
                "desk": null,
                "location": 4.0,
                "pool": null,
                "restaurant": null,
                "rooms": 4.0,
                "service": 5.0,
                "sleep": 5.0,
                "value": 5.0
            },
            "helpfulness": null,
            "id": 121671293,
            "likes": {
                "disliked": null,
                "liked": null
            },
            "rating": 5.0,
            "stay_parameters": "Stayed December 2011, traveled with family",
            "text": "The Hilton cost us \u00a3129 a night, and was inferior.",
            "title": "A good nights kip!",
            "user": "mark h"
        },
        {
            "date": "February 13, 2012",
            "detail_rating": {
                "business": null,
                "cleanliness": 4.0,
                "desk": null,
                "location": 3.0,
                "pool": null,
                "restaurant": null,
                "rooms": 4.0,
                "service": 4.0,
                "sleep": 4.0,
                "value": 4.0
            },
            "helpfulness": null,
            "id": 124520359,
            "likes": {
                "disliked": null,
                "liked": null
            },
            "rating": 4.0,
            "stay_parameters": "Stayed February 2012, traveled with family",
            "text": "Stayed here to visit relatives so only needed a quiet place to put our heads down, and thats exactly what the Premier Inn was. Quiet. The hotel may be located in an industrial estate, and looks pretty industrial from the outside, but on a weekend this means there is virtually no external noise. Rooms were warm on one of the coldest February nights ever, 30 mins Wifi is nice but a hardly a dealmaker. Breakfast was varied but cooked fare was average at best.",
            "title": "A trip back home",
            "user": "Moledozer"
        },
        {
            "date": "February 12, 2012",
            "detail_rating": {
                "business": null,
                "cleanliness": 5.0,
                "desk": null,
                "location": 3.0,
                "pool": null,
                "restaurant": null,
                "rooms": 5.0,
                "service": 5.0,
                "sleep": null,
                "value": 5.0
            },
            "helpfulness": null,
            "id": 124477921,
            "likes": {
                "disliked": null,
                "liked": null
            },
            "rating": 4.0,
            "stay_parameters": "Stayed February 2012",
            "text": "All in all though a Clean, Warm, Quiet place for a family to have a night sleep.. Simples...",
            "title": "Great value for money",
            "user": "Kath1974"
        },
        {
            "date": "January 30, 2012",
            "detail_rating": {
                "business": null,
                "cleanliness": 5.0,
                "desk": null,
                "location": 3.0,
                "pool": null,
                "restaurant": null,
                "rooms": 4.0,
                "service": 4.0,
                "sleep": 4.0,
                "value": 5.0
            },
            "helpfulness": null,
            "id": 123840276,
            "likes": {
                "disliked": null,
                "liked": null
            },
            "rating": 4.0,
            "stay_parameters": "Stayed January 2012, traveled as a couple",
            "text": "I stayed here with my husband and twi children on a very cold night in February. Although the rooms were chilly to start with, it warmed up once we turned up the radiator. The reception and bar area were very cold however, though that was the only downside. The rooms were clean and large enough, the shower was hot, the breakfast was brilliant and the staff were friendly and helpful. We will be back.",
            "title": "Excellent value but with a few minor problems",
            "user": "Diane-TA"
        },
        {
            "date": "January 20, 2012",
            "detail_rating": {
                "business": null,
                "cleanliness": 4.0,
                "desk": null,
                "location": 4.0,
                "pool": null,
                "restaurant": null,
                "rooms": 3.0,
                "service": 4.0,
                "sleep": 3.0,
                "value": 5.0
            },
            "helpfulness": null,
            "id": 123360557,
            "likes": {
                "disliked": null,
                "liked": null
            },
            "rating": 4.0,
            "stay_parameters": "Stayed January 2012, traveled on business",
            "text": "We stayed for 3 nights in North Poole paying \u00a319 per night. The size, cleanliness and quality of room was good. The bed was comfy and the bathroom a fair size. However, the floors are rather creeky, especially from the people above us. It was good to have control over the room temperature as it was cold outside whilst staying at the PI. The car park was spacious. The reception staff were friendly and helpful regarding the local buses. We only ate dinner in the restaurant. I paid \u00a39.30 for fish pie & peas. Bottle of wine about \u00a311.99. Food hot and OK for price paid. Our room was at the front so only heard distant traffic noise when window slightly open.",
            "title": "I would stay again",
            "user": "Peter L"
        },
        {
            "date": "January 10, 2012",
            "detail_rating": {
                "business": null,
                "cleanliness": 5.0,
                "desk": null,
                "location": 5.0,
                "pool": null,
                "restaurant": null,
                "rooms": 5.0,
                "service": 5.0,
                "sleep": 5.0,
                "value": 5.0
            },
            "helpfulness": null,
            "id": 122891522,
            "likes": {
                "disliked": null,
                "liked": null
            },
            "rating": 5.0,
            "stay_parameters": "Stayed January 2012, traveled with family",
            "text": "Although the room and our stay at the PI was good we did have a few minor problems. Firstly the radio didn't work within the TV. As a radio 4 fan (and especially The Archers) this was a disappointment. I mentioned the problem to the staff but they seemed surprised anyone even wanted to listen to the radio. The TV worked but the message on the TV said no signal when I tried to get radio 4. We don't all need free WiFi and hairdryers a good radio signal will surfice. Another thing which bugged my husband was that they never topped up the decaff coffee. Each day he had to go to reception and ask for a few sachets.The bedside lights weren't that brilliant for reading either.",
            "title": "A great value family-friendly hotel!",
            "user": "Jingo33"
        }
    ],
    "slim_ranking": 0.266666666667,
    "stars": null,
    "tripadvisor": {
        "VISITED": false,
        "country_name": null,
        "locality": null,
        "pic_link": null,
        "street_address": null
    },
    "user_rating": 4.0,
    "variance": {
        "average": 61,
        "excellent": 181,
        "poor": 29,
        "terrible": 8,
        "very good": 158
    }
}