{
    "aka": null,
    "description": "Opened in 1910 The Hermitage Hotel is Tennessee's only Forbes Five Star and AAA Five Diamond Hotel. Reborn in 2003 The Hermitage Hotel is again a Sanctuary for travelers in the heart of Music City.",
    "detail_rating": {
        "cleanliness": 5.0,
        "location": 5.0,
        "rooms": 5.0,
        "service": 5.0,
        "sleep": 5.0,
        "value": 5.0
    },
    "location": {
        "city": "Nashville",
        "continent": null,
        "country": "United States",
        "proposed_city": "Hermitage",
        "province": null,
        "region": null
    },
    "name": "Hermitage Hotel",
    "places": {
        "aka": [],
        "hotel_description": [
            "Hermitage"
        ],
        "hotel_name": [
            "Hermitage"
        ]
    },
    "review_count": 784,
    "review_count_current": 48,
    "reviews": [
        {
            "date": "July 29, 2009",
            "detail_rating": {
                "business": null,
                "cleanliness": 5.0,
                "desk": null,
                "location": 5.0,
                "pool": null,
                "restaurant": null,
                "rooms": 5.0,
                "service": 5.0,
                "sleep": null,
                "value": 5.0
            },
            "helpfulness": null,
            "id": 36132199,
            "likes": {
                "disliked": null,
                "liked": null
            },
            "rating": 5.0,
            "stay_parameters": "Stayed July 2009, traveled as a couple",
            "text": "What a fabulous hotel! The room was spacious and relaxing. The food was delicious and the staff was helpful and personable. I will return for another visit.",
            "title": "WONDERFUL!",
            "user": "belle001"
        },
        {
            "date": "July 28, 2009",
            "detail_rating": {
                "business": null,
                "cleanliness": 5.0,
                "desk": null,
                "location": 5.0,
                "pool": null,
                "restaurant": null,
                "rooms": 5.0,
                "service": 5.0,
                "sleep": null,
                "value": 5.0
            },
            "helpfulness": null,
            "id": 36082568,
            "likes": {
                "disliked": null,
                "liked": null
            },
            "rating": 5.0,
            "stay_parameters": "Stayed July 2009, traveled as a couple",
            "text": "this is the place to stay with your pet. All the staff members are pet friendly and go out of their way to make you and your pet comfortable.",
            "title": "Our weekend could not have been better",
            "user": "mariebt"
        },
        {
            "date": "July 28, 2009",
            "detail_rating": {
                "business": null,
                "cleanliness": 5.0,
                "desk": null,
                "location": 5.0,
                "pool": null,
                "restaurant": null,
                "rooms": 5.0,
                "service": 5.0,
                "sleep": null,
                "value": 5.0
            },
            "helpfulness": null,
            "id": 36058001,
            "likes": {
                "disliked": null,
                "liked": null
            },
            "rating": 5.0,
            "stay_parameters": "Stayed July 2009, traveled as a couple",
            "text": "We had an overnight stay at The Hermitage and could not have been more pleased. The hotel is beautiful and the service is wonderful without being stuffy or overbearing. When we arrived, our car was unloaded and parked for us; and the front desk had been notified of our arrival before we got there so check-in was fast. The room was very large for a city hotel and the bathroom was perfectly appointed with a large shower, a large tub and two sinks. The robes were wonderful too. The bed and linens perfect. We had a \"short\" walk to everything we wanted to visit and the concierge was happy to point the way. Breakfast at the Capitol Grille was delicious and the prices were reasonable (our breakfast was included in the package). We have stayed at many \"luxury\" hotels but this is one of our very favorites.",
            "title": "Worth every penny!",
            "user": "needstraveladvice"
        },
        {
            "date": "July 28, 2009",
            "detail_rating": {
                "business": null,
                "cleanliness": 5.0,
                "desk": null,
                "location": 5.0,
                "pool": null,
                "restaurant": null,
                "rooms": 5.0,
                "service": 5.0,
                "sleep": null,
                "value": 5.0
            },
            "helpfulness": null,
            "id": 36052493,
            "likes": {
                "disliked": null,
                "liked": null
            },
            "rating": 5.0,
            "stay_parameters": "Stayed July 2009, traveled as a couple",
            "text": "This is a fabulous hotel. The room was spacious and nicely decorated.",
            "title": "Very Relaxing Hotel",
            "user": "jrbtex"
        },
        {
            "date": "July 28, 2009",
            "detail_rating": {
                "business": null,
                "cleanliness": 5.0,
                "desk": null,
                "location": 4.0,
                "pool": null,
                "restaurant": null,
                "rooms": 5.0,
                "service": 5.0,
                "sleep": null,
                "value": 5.0
            },
            "helpfulness": null,
            "id": 36043964,
            "likes": {
                "disliked": null,
                "liked": null
            },
            "rating": 5.0,
            "stay_parameters": "Stayed July 2009, traveled on business",
            "text": "We were only there one night but it was so relaxing we did not want to leave. The service was great and dinner at the hotel resturant was really good and the waiters were really helpful and personable.",
            "title": "Amazing Accommodations",
            "user": "sammdaman"
        },
        {
            "date": "October 22, 2011",
            "detail_rating": {
                "business": null,
                "cleanliness": 4.0,
                "desk": null,
                "location": 3.0,
                "pool": null,
                "restaurant": null,
                "rooms": 4.0,
                "service": 4.0,
                "sleep": 4.0,
                "value": 4.0
            },
            "helpfulness": null,
            "id": 119584685,
            "likes": {
                "disliked": null,
                "liked": null
            },
            "rating": 4.0,
            "stay_parameters": "Stayed September 2011, traveled with family",
            "text": "Stayed for one night with our family (2 adults and 2 teenage children) in September 2011. We initially booked a room for 4 people, but they didn't have rooms for four! Before we could say \"what's going on?\", they told us that they had put us into adjoining rooms for no extra charge, greatly appreciated.",
            "title": "What great little hotel",
            "user": "VictorG"
        },
        {
            "date": "July 31, 2011",
            "detail_rating": {
                "business": null,
                "cleanliness": 5.0,
                "desk": null,
                "location": null,
                "pool": null,
                "restaurant": null,
                "rooms": null,
                "service": 4.0,
                "sleep": 4.0,
                "value": 4.0
            },
            "helpfulness": null,
            "id": 116075793,
            "likes": {
                "disliked": null,
                "liked": null
            },
            "rating": 4.0,
            "stay_parameters": "Stayed July 2011, traveled as a couple",
            "text": "Check-in was very easy and no problems, as was the taxi from the central train station - took about 10-15 minutes and only cost Euro12.",
            "title": "Lovely hotel but be aware of location",
            "user": "FreewheelinBoA"
        },
        {
            "date": "July 11, 2011",
            "detail_rating": {
                "business": null,
                "cleanliness": 3.0,
                "desk": null,
                "location": 2.0,
                "pool": null,
                "restaurant": null,
                "rooms": 2.0,
                "service": 1.0,
                "sleep": null,
                "value": 2.0
            },
            "helpfulness": null,
            "id": 115263376,
            "likes": {
                "disliked": null,
                "liked": null
            },
            "rating": 3.0,
            "stay_parameters": "Stayed July 2011",
            "text": "We had 2 rooms on the 3rd floor and they are really nice; each room had a king or two singles, a couch, coffee table and flat screen TV.",
            "title": "Disappointing...",
            "user": "Xecutiv"
        },
        {
            "date": "July 6, 2011",
            "detail_rating": {
                "business": null,
                "cleanliness": 5.0,
                "desk": null,
                "location": null,
                "pool": null,
                "restaurant": null,
                "rooms": null,
                "service": 5.0,
                "sleep": 5.0,
                "value": 5.0
            },
            "helpfulness": null,
            "id": 115106781,
            "likes": {
                "disliked": null,
                "liked": null
            },
            "rating": 5.0,
            "stay_parameters": "Stayed June 2011, traveled as a couple",
            "text": "Bathroom was nice and big and the vanity was large enough for my wife to spread all her toiletries out.",
            "title": "Classy and a bit posh, the photos don't do it justice. Very comfortable indeed.",
            "user": "Jan_T50"
        },
        {
            "date": "June 13, 2011",
            "detail_rating": {
                "business": null,
                "cleanliness": 4.0,
                "desk": null,
                "location": null,
                "pool": null,
                "restaurant": null,
                "rooms": null,
                "service": 3.0,
                "sleep": 4.0,
                "value": 3.0
            },
            "helpfulness": 1,
            "id": 113167604,
            "likes": {
                "disliked": null,
                "liked": null
            },
            "rating": 4.0,
            "stay_parameters": "Stayed May 2011, traveled on business",
            "text": "The room looks nice - has a safe but couldn't find an iron, nice carpet, heavy drapes which keep out all the morning lights, timber panelling and the walls are finished with padded material - seems really posh and may sound funny, but in fact looks really good.",
            "title": "A bit old school but lovely enough",
            "user": "bronwenfb"
        },
        {
            "date": "November 28, 2011",
            "detail_rating": {
                "business": null,
                "cleanliness": null,
                "desk": null,
                "location": null,
                "pool": null,
                "restaurant": null,
                "rooms": null,
                "service": null,
                "sleep": null,
                "value": null
            },
            "helpfulness": null,
            "id": 121110244,
            "likes": {
                "disliked": null,
                "liked": null
            },
            "rating": 1.0,
            "stay_parameters": null,
            "text": "From the minute we walked into this place it just looked and felt really old, cold and odd. I think this was some sort of institution at one time (a hospital ward, nursing home, something like that). Even the front doors, and doors in the hallways had tho7se big metal push panels you only find in places like that. There were only lights on in some areas that made the whole place dark and scary. They have these large common rooms for watching t.v., having breakfast, etc., (that's another reason for the nursing home reference) which were just so cold (linoleum floors, bright lights) that you really did not want to stay in any of them. There was a marble troth in the hallway off the lobby area, for what, I do not know, and probably don't want to know.",
            "title": "Creepy!!!!!!",
            "user": "ChampagnePrincess"
        },
        {
            "date": "July 17, 2011",
            "detail_rating": {
                "business": null,
                "cleanliness": 5.0,
                "desk": null,
                "location": null,
                "pool": null,
                "restaurant": null,
                "rooms": null,
                "service": 5.0,
                "sleep": 5.0,
                "value": 5.0
            },
            "helpfulness": null,
            "id": 115437521,
            "likes": {
                "disliked": null,
                "liked": null
            },
            "rating": 5.0,
            "stay_parameters": "Stayed June 2011, traveled as a couple",
            "text": "Now to the room, it literally felt like a hospital room. No pictures on the walls, only two old nails sticking out, cracked paint on the walls, and scaffolding outside the window. I slept in my clothes because I despised the dirty beadspread and this place so much.",
            "title": "Lots of outlets, wood floors, good parking, clean & spacious rooms",
            "user": "voyageons"
        },
        {
            "date": "January 25, 2011",
            "detail_rating": {
                "business": null,
                "cleanliness": 4.0,
                "desk": null,
                "location": 4.0,
                "pool": null,
                "restaurant": null,
                "rooms": 4.0,
                "service": 4.0,
                "sleep": 2.0,
                "value": 4.0
            },
            "helpfulness": 1,
            "id": 94408610,
            "likes": {
                "disliked": null,
                "liked": null
            },
            "rating": 3.0,
            "stay_parameters": "Stayed January 2011, traveled as a couple",
            "text": "DO NOT STAY HERE UNDER ANY CIRCUMSTANCES!",
            "title": "hermitage hotel",
            "user": "piotrkoczara"
        },
        {
            "date": "July 23, 2010",
            "detail_rating": {
                "business": null,
                "cleanliness": 4.0,
                "desk": null,
                "location": 3.0,
                "pool": null,
                "restaurant": null,
                "rooms": 3.0,
                "service": 5.0,
                "sleep": 4.0,
                "value": 3.0
            },
            "helpfulness": 2,
            "id": 72018406,
            "likes": {
                "disliked": null,
                "liked": null
            },
            "rating": 3.0,
            "stay_parameters": "Stayed June 2010, traveled as a couple",
            "text": "This hotel deserves a review simply because our room had the most available outlets we've ever seen in a hotel room anywhere --about six or eight! So if two of you each have a laptop, phone & camera, etc. you're in luck. We didn't have to unplug the TV or a lamp to be able to plug in all our electronics. Unfortunately, there was no Internet in the rooms, which would have been handy since you could actually keep your laptop plugged in. (We were told Internet was available downstairs in the common area.) The room felt spacious. Although it was a typical style with small sleeping area with long entrance going past closet and bathroom, both the closet and bathroom were large so the \"hallway\" was longer than usual in our room. There was a suitcase rack as well as chairs around a small table. I liked the wooden floors, not real plank wood but nice enough and cleaner than sticky or worn carpets and warmer than tile. There was a small table outside our room with magazines--nice touch--and a large common room on main floor with giant screen TV on which someone was watching an Italian movie. We had to leave early before breakfast but the desk reception clerk kindly on his own brought us coffee. Hotel is hard to find at night, up some narrow streets, but the parking is good. Our room overlooked the parking lot and was very quiet. They advertise a \"sea view\" and I didn't actually check it in the morning light but I suspect our room had a partial sea view through other buildings.",
            "title": "Ok for 1 night - very helpful stuff",
            "user": "sbgath"
        },
        {
            "date": "May 31, 2010",
            "detail_rating": {
                "business": null,
                "cleanliness": 4.0,
                "desk": null,
                "location": 2.0,
                "pool": null,
                "restaurant": null,
                "rooms": 3.0,
                "service": 4.0,
                "sleep": 3.0,
                "value": 3.0
            },
            "helpfulness": null,
            "id": 65923601,
            "likes": {
                "disliked": null,
                "liked": null
            },
            "rating": 3.0,
            "stay_parameters": "Stayed May 2010, traveled with family",
            "text": "The hotel has an own parking with enough places. The rooms are large. If you walk down the hill, you can catch the bus which takes you to the center in 15 minutes. It was not possible to shower or wash in the morning, because there came hardly any water out of the taps. Breakfast was not good at all. The hotel was a bit too far from the center to go there on foot.",
            "title": "served our purposes, very helpful staff",
            "user": "ButimeTraveler"
        },
        {
            "date": "August 4, 2009",
            "detail_rating": {
                "business": null,
                "cleanliness": 5.0,
                "desk": null,
                "location": 5.0,
                "pool": null,
                "restaurant": null,
                "rooms": 5.0,
                "service": 5.0,
                "sleep": null,
                "value": 4.0
            },
            "helpfulness": null,
            "id": 36703540,
            "likes": {
                "disliked": null,
                "liked": null
            },
            "rating": 5.0,
            "stay_parameters": "Stayed July 2009, traveled with family",
            "text": "Our family stayed for 2 nights on a road trip. Expensive but the level of service and quality of the rooms make it worth while, would recommend. Saw Dolly Parton in the restaurant which put the icing on the cake!",
            "title": "The only place to stay in Nashville!",
            "user": "Jaspersdad"
        },
        {
            "date": "July 30, 2009",
            "detail_rating": {
                "business": null,
                "cleanliness": 5.0,
                "desk": null,
                "location": 5.0,
                "pool": null,
                "restaurant": null,
                "rooms": 5.0,
                "service": 5.0,
                "sleep": null,
                "value": 5.0
            },
            "helpfulness": null,
            "id": 36223165,
            "likes": {
                "disliked": null,
                "liked": null
            },
            "rating": 5.0,
            "stay_parameters": "Stayed July 2009, traveled as a couple",
            "text": "Hi,",
            "title": "Wonderful Hotel",
            "user": "TravelFT"
        },
        {
            "date": "July 30, 2009",
            "detail_rating": {
                "business": null,
                "cleanliness": 5.0,
                "desk": null,
                "location": 5.0,
                "pool": null,
                "restaurant": null,
                "rooms": 5.0,
                "service": 5.0,
                "sleep": null,
                "value": 3.0
            },
            "helpfulness": null,
            "id": 36219364,
            "likes": {
                "disliked": null,
                "liked": null
            },
            "rating": 5.0,
            "stay_parameters": "Stayed July 2009, traveled on business",
            "text": "My husband and I traveled to Nashville for the first time last weekend and stayed at the Hermitage Hotel and had an absolutely wonderful experience. Our room was georgous, we had a junior suite with a view of the Capitol. The service was outstanding, the staff could not do enough for you from the time we arrived til the time we departed.",
            "title": "Beautiful and Great Service",
            "user": "dvpgh"
        },
        {
            "date": "July 29, 2009",
            "detail_rating": {
                "business": null,
                "cleanliness": 5.0,
                "desk": null,
                "location": 5.0,
                "pool": null,
                "restaurant": null,
                "rooms": 4.0,
                "service": 5.0,
                "sleep": null,
                "value": 5.0
            },
            "helpfulness": null,
            "id": 36175149,
            "likes": {
                "disliked": null,
                "liked": null
            },
            "rating": 5.0,
            "stay_parameters": "Stayed July 2009, traveled with family",
            "text": "We loved Nashville and loved the hotel, can't wait to go back!!!",
            "title": "Lovely Hotel!",
            "user": "mjf"
        },
        {
            "date": "July 29, 2009",
            "detail_rating": {
                "business": null,
                "cleanliness": 5.0,
                "desk": null,
                "location": 5.0,
                "pool": null,
                "restaurant": null,
                "rooms": 5.0,
                "service": 5.0,
                "sleep": null,
                "value": 4.0
            },
            "helpfulness": null,
            "id": 36170330,
            "likes": {
                "disliked": null,
                "liked": null
            },
            "rating": 5.0,
            "stay_parameters": "Stayed November 2008, traveled as a couple",
            "text": "This hotel is beautiful and so is the staff. The service is one of the best I have ever had and the hotel is very clean. It is located right by the state capital and just a few short blocks from music row. I would most definitely stay again.",
            "title": "Elegant hotel, very romantic, very well-done.",
            "user": "FrasierC"
        },
        {
            "date": "September 5, 2009",
            "detail_rating": {
                "business": null,
                "cleanliness": 5.0,
                "desk": null,
                "location": 5.0,
                "pool": null,
                "restaurant": null,
                "rooms": 5.0,
                "service": 5.0,
                "sleep": null,
                "value": 5.0
            },
            "helpfulness": 1,
            "id": 39880483,
            "likes": {
                "disliked": null,
                "liked": null
            },
            "rating": 5.0,
            "stay_parameters": "Stayed August 2009, traveled with family",
            "text": "I can support the other excellent reviews that have been posted on here. This is one of the best city centre hotels that I have stayed in, furnished to a very high standard with very professional staff throughout. It is the small touches that make the difference, such as lemonade and cookies set out free of charge for guests every afternoon.",
            "title": "Excellent Hotel",
            "user": "RallyMonkey"
        },
        {
            "date": "September 2, 2009",
            "detail_rating": {
                "business": null,
                "cleanliness": 5.0,
                "desk": null,
                "location": 5.0,
                "pool": null,
                "restaurant": null,
                "rooms": 5.0,
                "service": 5.0,
                "sleep": null,
                "value": 5.0
            },
            "helpfulness": 1,
            "id": 39615725,
            "likes": {
                "disliked": null,
                "liked": null
            },
            "rating": 4.0,
            "stay_parameters": "Stayed July 2009, traveled as a couple",
            "text": "The Capital Grill is a fine restaurant, but prices were a little high particularly for wine, and the food good rather than exceptional. There are a number of good modern alternatives in Nashville, the concierge suggested Watermark, which was excellent.",
            "title": "Wonderful Historic Property",
            "user": "tomdenverDenverCO"
        },
        {
            "date": "August 25, 2009",
            "detail_rating": {
                "business": null,
                "cleanliness": 5.0,
                "desk": null,
                "location": 5.0,
                "pool": null,
                "restaurant": null,
                "rooms": 5.0,
                "service": 5.0,
                "sleep": null,
                "value": 5.0
            },
            "helpfulness": 1,
            "id": 38772173,
            "likes": {
                "disliked": null,
                "liked": null
            },
            "rating": 5.0,
            "stay_parameters": "Stayed August 2009, traveled as a couple",
            "text": "The Hermitage Hotel is a wonderful property that has managed to preserve days gone by yet is updated and modern. The hotel feels very polished and updated with out losing any of its historic charm. Too many hotels today get rid of the great things that make them special. The Hermitage has managed to keep their hotel special and very up todate.",
            "title": "This hotel defines classy",
            "user": "Team_T_Travelers"
        },
        {
            "date": "August 24, 2009",
            "detail_rating": {
                "business": null,
                "cleanliness": 5.0,
                "desk": null,
                "location": 5.0,
                "pool": null,
                "restaurant": null,
                "rooms": 5.0,
                "service": 5.0,
                "sleep": null,
                "value": 5.0
            },
            "helpfulness": null,
            "id": 38689635,
            "likes": {
                "disliked": null,
                "liked": null
            },
            "rating": 5.0,
            "stay_parameters": "Stayed August 2009, traveled as a couple",
            "text": "Great location across from the state capitol and easy walk to the bars and restaurants downtown.",
            "title": "Luxury defined",
            "user": "JJMT"
        },
        {
            "date": "August 19, 2009",
            "detail_rating": {
                "business": null,
                "cleanliness": 5.0,
                "desk": null,
                "location": 5.0,
                "pool": null,
                "restaurant": null,
                "rooms": 5.0,
                "service": 5.0,
                "sleep": null,
                "value": 4.0
            },
            "helpfulness": null,
            "id": 38194658,
            "likes": {
                "disliked": null,
                "liked": null
            },
            "rating": 5.0,
            "stay_parameters": "Stayed August 2009, traveled as a couple",
            "text": "I love this hotel. It is a treat to stay here. There is a wonderful sense of old world Southern charm mixed with modern standards of service and amenities. Wonderful. I've stayed here twice and looking forward to the next stay already!",
            "title": "Best Hotel",
            "user": "bubfn"
        },
        {
            "date": "August 16, 2009",
            "detail_rating": {
                "business": null,
                "cleanliness": 5.0,
                "desk": null,
                "location": 5.0,
                "pool": null,
                "restaurant": null,
                "rooms": 5.0,
                "service": 5.0,
                "sleep": null,
                "value": 4.0
            },
            "helpfulness": null,
            "id": 37869843,
            "likes": {
                "disliked": null,
                "liked": null
            },
            "rating": 5.0,
            "stay_parameters": "Stayed July 2009, traveled on business",
            "text": "We travel pretty frequently (~once every 1-2 months) for business and have stayed in many 4-5 star hotels. Without hesitation, The Hermitage is one of the best places we have ever had to pleasure to stay! The overall facilities, service, and hospitality rival/exceed what we have experienced at other hotels such as the Ritz Carltonand Four Seasons.",
            "title": "Incredible hotel-exemplifies true luxury and service",
            "user": "txnc"
        },
        {
            "date": "August 16, 2009",
            "detail_rating": {
                "business": null,
                "cleanliness": null,
                "desk": null,
                "location": null,
                "pool": null,
                "restaurant": null,
                "rooms": null,
                "service": null,
                "sleep": null,
                "value": null
            },
            "helpfulness": null,
            "id": 37861961,
            "likes": {
                "disliked": null,
                "liked": null
            },
            "rating": 5.0,
            "stay_parameters": null,
            "text": "Pros",
            "title": "Best Place To Stay",
            "user": "Chinchuwan"
        },
        {
            "date": "August 7, 2009",
            "detail_rating": {
                "business": null,
                "cleanliness": 5.0,
                "desk": null,
                "location": 5.0,
                "pool": null,
                "restaurant": null,
                "rooms": 5.0,
                "service": 5.0,
                "sleep": null,
                "value": 5.0
            },
            "helpfulness": null,
            "id": 37021725,
            "likes": {
                "disliked": null,
                "liked": null
            },
            "rating": 5.0,
            "stay_parameters": "Stayed August 2009, traveled with friends",
            "text": "1. Stunningly beautiful lobby impeccably maintained",
            "title": "Heaven on earth",
            "user": "dentgal"
        },
        {
            "date": "August 4, 2009",
            "detail_rating": {
                "business": null,
                "cleanliness": 5.0,
                "desk": null,
                "location": 5.0,
                "pool": null,
                "restaurant": null,
                "rooms": 5.0,
                "service": 5.0,
                "sleep": null,
                "value": 5.0
            },
            "helpfulness": null,
            "id": 36753473,
            "likes": {
                "disliked": null,
                "liked": null
            },
            "rating": 5.0,
            "stay_parameters": "Stayed July 2009, traveled on business",
            "text": "2. Rooms are large, spotlessly clean, with wonderfully luxurious linens (bed and towels) and Moulton Brown bath products.",
            "title": "The best hotel we've ever stayed at!",
            "user": "sammaiz"
        },
        {
            "date": "August 4, 2009",
            "detail_rating": {
                "business": null,
                "cleanliness": null,
                "desk": null,
                "location": null,
                "pool": null,
                "restaurant": null,
                "rooms": null,
                "service": null,
                "sleep": null,
                "value": null
            },
            "helpfulness": null,
            "id": 36720406,
            "likes": {
                "disliked": null,
                "liked": null
            },
            "rating": 5.0,
            "stay_parameters": null,
            "text": "3. Capitol Grille exceeds typical hotel restaurant fare. We had breakfast and lunch. In addition, we had dinner in the bar area and probably one of the best burgers ever!",
            "title": "We \"loved\" The Peabody. We \"ADORED\" the Hermitage!",
            "user": "A TripAdvisor user"
        },
        {
            "date": "April 19, 2012",
            "detail_rating": {
                "business": null,
                "cleanliness": 4.0,
                "desk": null,
                "location": 3.0,
                "pool": null,
                "restaurant": null,
                "rooms": 3.0,
                "service": 3.0,
                "sleep": 3.0,
                "value": 2.0
            },
            "helpfulness": 2,
            "id": 128198727,
            "likes": {
                "disliked": null,
                "liked": null
            },
            "rating": 3.0,
            "stay_parameters": "Stayed April 2012, traveled as a couple",
            "text": "You know you try to say good thing about people but the desk clerk would not direct you to any other service like restaurants, transportation, if the hotel provided it. Kinda of sad but the Hotel itself was clean but not a 4 star.",
            "title": "Nice hotel with OK service",
            "user": "skylane9"
        },
        {
            "date": "February 21, 2012",
            "detail_rating": {
                "business": null,
                "cleanliness": 4.0,
                "desk": null,
                "location": 3.0,
                "pool": null,
                "restaurant": null,
                "rooms": 4.0,
                "service": 4.0,
                "sleep": 4.0,
                "value": 5.0
            },
            "helpfulness": null,
            "id": 124992145,
            "likes": {
                "disliked": null,
                "liked": null
            },
            "rating": 4.0,
            "stay_parameters": "Stayed February 2012, traveled with friends",
            "text": "Did not see much of the hotel as came to Milan to watch Arsenal. Staff were pleasant and accommodating, providing a twin room. Room was bit enough for a few of us to gather for a few drinks before the game. Only annoyance was not being able to get any sort of food after the game in the early hours, no 24 hour food options.",
            "title": "Good Deal - Nice Hotel",
            "user": "GlobalGooner81"
        },
        {
            "date": "February 21, 2012",
            "detail_rating": {
                "business": null,
                "cleanliness": 5.0,
                "desk": null,
                "location": 3.0,
                "pool": null,
                "restaurant": null,
                "rooms": 4.0,
                "service": 5.0,
                "sleep": 4.0,
                "value": 5.0
            },
            "helpfulness": 2,
            "id": 124954457,
            "likes": {
                "disliked": null,
                "liked": null
            },
            "rating": 5.0,
            "stay_parameters": "Stayed February 2012, traveled as a couple",
            "text": "I stayed at this hotel last week for 2 nights and found it to be absolutely brilliant, The hotel is in the chinatown area but could not fault it. My only minor points were that the room did not have tea/coffee facilities which I have never found before and one of the reception staff was a bit rude but other than that everything else was absolutely brilliant. the breakfast is of an excellent standard. And the staff at night in the restaurant were absolutely superb they could not do enough for you. So don't hesitate and book this hotel I recommend it 100%",
            "title": "Superb Hotel",
            "user": "Ferguson19"
        },
        {
            "date": "February 21, 2012",
            "detail_rating": {
                "business": null,
                "cleanliness": 5.0,
                "desk": null,
                "location": 3.0,
                "pool": null,
                "restaurant": null,
                "rooms": 4.0,
                "service": 5.0,
                "sleep": 5.0,
                "value": 3.0
            },
            "helpfulness": 1,
            "id": 124951184,
            "likes": {
                "disliked": null,
                "liked": null
            },
            "rating": 3.0,
            "stay_parameters": "Stayed February 2012, traveled on business",
            "text": "The hotel is located near to the Chinese quarter. To the Douma cathedral of 25 minutes on foot. The hotel sometimes offers good special offers on residing, in this case residing at hotel don't expensive. Breakfasts are simple. Cleaning is excellent.",
            "title": "not so far from old center",
            "user": "VeronIka_1138"
        },
        {
            "date": "February 20, 2012",
            "detail_rating": {
                "business": null,
                "cleanliness": 4.0,
                "desk": null,
                "location": 3.0,
                "pool": null,
                "restaurant": null,
                "rooms": 4.0,
                "service": 4.0,
                "sleep": 2.0,
                "value": 4.0
            },
            "helpfulness": 1,
            "id": 124881602,
            "likes": {
                "disliked": null,
                "liked": null
            },
            "rating": 3.0,
            "stay_parameters": "Stayed February 2012, traveled with family",
            "text": "i stayed at the hermitage for a city break in milan",
            "title": "nice hotel but more business than holiday",
            "user": "iceland_poppy"
        },
        {
            "date": "June 4, 2011",
            "detail_rating": {
                "business": null,
                "cleanliness": 3.0,
                "desk": null,
                "location": null,
                "pool": null,
                "restaurant": null,
                "rooms": null,
                "service": 3.0,
                "sleep": 3.0,
                "value": 3.0
            },
            "helpfulness": 1,
            "id": 111506613,
            "likes": {
                "disliked": null,
                "liked": null
            },
            "rating": 3.0,
            "stay_parameters": "Stayed June 2011, traveled on business",
            "text": "Stayed for 6 nights for a business trip, nothing particularly good or bad about the hotel, Its old style, quite large and luxurious, large room, nice facilities, location isn't the best but walkable distance to the centre (about 25/30 min) and close to garibaldi area which is nice, internet speed is RIDICOLOUSLY slow and it costs 25 eur for 3 days. Friendly bar staff. I would go there again just because its behind my office but If it wasnt for the dustance Id rather stay at the NHOW. 130 eur 4 stars not too bad, just above average.",
            "title": "Not bad.",
            "user": "Lucio1969"
        },
        {
            "date": "May 4, 2010",
            "detail_rating": {
                "business": null,
                "cleanliness": 5.0,
                "desk": null,
                "location": 3.0,
                "pool": null,
                "restaurant": null,
                "rooms": 4.0,
                "service": 5.0,
                "sleep": 5.0,
                "value": 4.0
            },
            "helpfulness": 1,
            "id": 63246825,
            "likes": {
                "disliked": null,
                "liked": null
            },
            "rating": 4.0,
            "stay_parameters": "Stayed April 2010, traveled as a couple",
            "text": "First time in Milan. Busy city and busy area. Did not have great expectations going down the street but were delighted. Elegant room. Excellent breakfast. Lovely foyer and very helpful bar man. Finger food served with drinks.",
            "title": "Excellent hotel - an oasis of calm and good service",
            "user": "MNoonan10"
        },
        {
            "date": "December 7, 2007",
            "detail_rating": {
                "business": null,
                "cleanliness": null,
                "desk": null,
                "location": null,
                "pool": null,
                "restaurant": null,
                "rooms": null,
                "service": null,
                "sleep": null,
                "value": null
            },
            "helpfulness": 2,
            "id": 11311797,
            "likes": {
                "disliked": null,
                "liked": null
            },
            "rating": 3.0,
            "stay_parameters": null,
            "text": "The hotel is very nice and classy. Rooms are very well appointed, conference facilities are adequate and food is good as well. It well deserves 4 star classification.",
            "title": "Welcome to \"Mee Laan\"",
            "user": "A TripAdvisor user"
        },
        {
            "date": "December 27, 2006",
            "detail_rating": {
                "business": 3.0,
                "cleanliness": 5.0,
                "desk": null,
                "front_desk": 5.0,
                "location": 2.0,
                "pool": null,
                "restaurant": null,
                "rooms": 4.0,
                "service": 5.0,
                "sleep": null,
                "value": 4.0
            },
            "helpfulness": 2,
            "id": 6504582,
            "likes": {
                "disliked": "\u2014 Location",
                "liked": "\u2014 Cleaniness and helpful staff"
            },
            "rating": 4.0,
            "stay_parameters": "Stayed December 2006, traveled as a couple",
            "text": "However the area where the hotel is located has developed to be the heart of Milan's Chinatown. Not that this is really a problem, but it simply does not fit with the hotel itself, which caters amongst top sport and fashion stars. No nearby subway station.",
            "title": "Great Hotel",
            "user": "carrierobi77"
        },
        {
            "date": "August 17, 2004",
            "detail_rating": {
                "business": null,
                "cleanliness": null,
                "desk": null,
                "location": null,
                "pool": null,
                "restaurant": null,
                "rooms": null,
                "service": null,
                "sleep": null,
                "value": null
            },
            "helpfulness": 25,
            "id": 2454406,
            "likes": {
                "disliked": null,
                "liked": null
            },
            "rating": 4.0,
            "stay_parameters": null,
            "text": "If you do not mind about the surroundings, the hotel is definitely to be recommended.",
            "title": "Lovely hotel, poor location",
            "user": "A TripAdvisor user"
        },
        {
            "date": "January 1, 2012",
            "detail_rating": {
                "business": null,
                "cleanliness": 4.0,
                "desk": null,
                "location": 4.0,
                "pool": null,
                "restaurant": null,
                "rooms": 4.0,
                "service": 4.0,
                "sleep": 4.0,
                "value": 4.0
            },
            "helpfulness": 3,
            "id": 122364908,
            "likes": {
                "disliked": null,
                "liked": null
            },
            "rating": 4.0,
            "stay_parameters": "Stayed December 2011, traveled as a couple",
            "text": "Booked this Hotel - via Lastminute.com secret hotel - when we got the booking checked the review and was a little concerned about it being close to the Chinese Quarters. We went for 3 nights - for New Years celebration in Milan. The Hotel was excellent - as well as the area - yes the location is in \"Chinese Quarter\" - but the area is clean , vibrant , safe and within few minutes you are in an Italian Area - restaurants / bar and very close to the Hotel is a fabulous wine bar called Cantine Isola - where you can meet lost of Italians and also here you can buy great wines - or drink great wines",
            "title": "Really Great Value Hotel",
            "user": "Piyush47"
        },
        {
            "date": "December 23, 2011",
            "detail_rating": {
                "business": null,
                "cleanliness": 5.0,
                "desk": null,
                "location": 4.0,
                "pool": null,
                "restaurant": null,
                "rooms": 4.0,
                "service": 4.0,
                "sleep": 4.0,
                "value": 4.0
            },
            "helpfulness": 2,
            "id": 122023821,
            "likes": {
                "disliked": null,
                "liked": null
            },
            "rating": 4.0,
            "stay_parameters": "Stayed December 2011, traveled with family",
            "text": "Back to Hotel - great room - great service and really nice breakfast. The only thing missing is the lack of free access to WIFI. The receptionist recommended great restaurants. From the hotel you can get to the Duomo - which is the most centre you can get - by Tram / Bus - within 15 minutes. Take Tram No 1 - or Tram 19 - and you are in the Naviligia Area (near the Canal) etc - Train station / Metro Porta Garibaldi is also very close Bus 37 - three stops.",
            "title": "Good hotel near the centre of Milan",
            "user": "HappyTravellingTrio"
        },
        {
            "date": "November 22, 2011",
            "detail_rating": {
                "business": null,
                "cleanliness": 5.0,
                "desk": null,
                "location": 5.0,
                "pool": null,
                "restaurant": null,
                "rooms": 5.0,
                "service": 4.0,
                "sleep": 4.0,
                "value": 4.0
            },
            "helpfulness": 2,
            "id": 120900333,
            "likes": {
                "disliked": null,
                "liked": null
            },
            "rating": 4.0,
            "stay_parameters": "Stayed October 2011, traveled on business",
            "text": "If you get a good deal for this hotel - take it and you will enjoy it.",
            "title": "Business hotel in the chinese area",
            "user": "principe1965"
        },
        {
            "date": "November 13, 2011",
            "detail_rating": {
                "business": null,
                "cleanliness": 4.0,
                "desk": null,
                "location": 3.0,
                "pool": null,
                "restaurant": null,
                "rooms": 4.0,
                "service": 4.0,
                "sleep": 5.0,
                "value": 5.0
            },
            "helpfulness": null,
            "id": 120544486,
            "likes": {
                "disliked": null,
                "liked": null
            },
            "rating": 4.0,
            "stay_parameters": "Stayed November 2011, traveled on business",
            "text": "I spent a couple of nights in this hotel, it was a pleasant experience.",
            "title": "Really liked it- very good value",
            "user": "aeilat"
        },
        {
            "date": "November 13, 2011",
            "detail_rating": {
                "business": null,
                "cleanliness": 5.0,
                "desk": null,
                "location": 5.0,
                "pool": null,
                "restaurant": null,
                "rooms": 5.0,
                "service": 5.0,
                "sleep": 5.0,
                "value": 5.0
            },
            "helpfulness": 2,
            "id": 120527649,
            "likes": {
                "disliked": null,
                "liked": null
            },
            "rating": 5.0,
            "stay_parameters": "Stayed November 2011, traveled on business",
            "text": "The hotel is located near the centre of Milan. For those unfamiliar with the city, it is near via Paolo Sarpi. I read in a number of reviews this are labelled as \"China Town\", however readers should know that this is a relatively good and safe area in Milan. There is a populous Chinese community settled there, but this shouldn't deter anyone from choosing to stay here as this area is very convenient for most leisure and business requirements (near Garibaldi and Central Station, near the Fiera, and close to the hart of the city.",
            "title": "Elegant classic hotel",
            "user": "ONYER"
        },
        {
            "date": "September 26, 2009",
            "detail_rating": {
                "business": null,
                "cleanliness": 3.0,
                "desk": null,
                "location": 3.0,
                "pool": null,
                "restaurant": null,
                "rooms": 4.0,
                "service": 4.0,
                "sleep": null,
                "value": 3.0
            },
            "helpfulness": 1,
            "id": 44643554,
            "likes": {
                "disliked": null,
                "liked": null
            },
            "rating": 3.0,
            "stay_parameters": "Stayed September 2009, traveled as a couple",
            "text": "We picked this hotel based on other reviews but did find it a little isolated when it came to eating out. It's a 5-10 minute walk to the sea, but all we found there was a pizzeria which was disappointing. We later discovered there's a very friendly nearby trattoria called (I think) Trattoria Anders (the hotel staff know it) which serves good food and specialises in fish.",
            "title": "A bit out of the way",
            "user": "Juan45"
        },
        {
            "date": "May 7, 2009",
            "detail_rating": {
                "business": null,
                "cleanliness": 5.0,
                "desk": null,
                "location": 3.0,
                "pool": null,
                "restaurant": null,
                "rooms": 4.0,
                "service": 4.0,
                "sleep": null,
                "value": 4.0
            },
            "helpfulness": null,
            "id": 29538019,
            "likes": {
                "disliked": null,
                "liked": null
            },
            "rating": 4.0,
            "stay_parameters": "Stayed April 2009, traveled as a couple",
            "text": "The hotel has an institutional feel to it (I could believe it was once a school as another reviewer mentioned) but is clean and spacious. Breakfast was good, and there is free off-street parking. All in all not a bad bet but I don't think I'd go back.",
            "title": "A comfortable hotel in a quiet location to the east of the city centre",
            "user": "TravelLowdown"
        },
        {
            "date": "March 27, 2008",
            "detail_rating": {
                "business": null,
                "cleanliness": 5.0,
                "desk": null,
                "front_desk": 3.0,
                "location": 3.0,
                "pool": null,
                "restaurant": null,
                "rooms": 3.0,
                "service": 4.0,
                "sleep": null,
                "value": 5.0
            },
            "helpfulness": 1,
            "id": 14580961,
            "likes": {
                "disliked": "\u2014 Nothing it was what I was looking for",
                "liked": "\u2014 Very clean and quiet area of the city."
            },
            "rating": 4.0,
            "stay_parameters": "Stayed January 2008, traveled on business",
            "text": "Hotel located in a quiet location in the east of the city in a residential area that appeared safe. We arrived by taxi from the Brignole station for about 10 Euros. There are frequent buses (approximately every 15 minutes during week days, although the frequency is decreased in early morning and in the evening) that run from near the station to a stop about 100metres or so downhill from the hotel and another busline runs from another 100 metres or so further down the hill to the railway station's bus stop (check with hotel reception by email for the bus numbers prior to arriving if you are considering this option).",
            "title": "Absolutely no disturbance",
            "user": "CHMAalborg"
        }
    ],
    "slim_ranking": 0.00675675675676,
    "stars": null,
    "tripadvisor": {
        "VISITED": false,
        "country_name": null,
        "locality": null,
        "pic_link": null,
        "street_address": null
    },
    "user_rating": 4.5,
    "variance": {
        "average": 16,
        "excellent": 660,
        "poor": 18,
        "terrible": 14,
        "very good": 76
    }
}