{
    "aka": "Barocco Hotel Rome",
    "description": "Overlooking Bernini\u2019s Triton Fountain, the Barocco is a boutique hotel with just 41 rooms (and a staff of 22!) located in an old aristocratic building in the heart of Baroque Rome. Carefully refurbished in 2010 and 2012 to offer guests superior standards of comfort and style, the Barocco has followed the example of leading international hotels, becoming 100% smoke-free.Attention to detail, absolute cleanliness, unique and highly sought-after rooms, an atmosphere from times past, and 21st-century technology, make guests\u2019 stay at the Barocco a warm Italian experience full of magic.",
    "detail_rating": {
        "cleanliness": 5.0,
        "location": 5.0,
        "rooms": 4.5,
        "service": 5.0,
        "sleep": 4.5,
        "value": 5.0
    },
    "location": {
        "city": "Rome",
        "continent": "Europe",
        "country": "Italy",
        "proposed_city": "Rome",
        "province": null,
        "region": "Lazio"
    },
    "name": "Barocco Hotel",
    "places": {
        "aka": [
            "Rome"
        ],
        "hotel_description": [
            "Fountain",
            "Rome"
        ],
        "hotel_name": []
    },
    "review_count": 1313,
    "review_count_current": 39,
    "reviews": [
        {
            "date": "July 23, 2012",
            "detail_rating": {
                "business": null,
                "cleanliness": 5.0,
                "desk": null,
                "location": 5.0,
                "pool": null,
                "restaurant": null,
                "rooms": 5.0,
                "service": 5.0,
                "sleep": 5.0,
                "value": 5.0
            },
            "helpfulness": null,
            "id": 135145169,
            "likes": {
                "disliked": null,
                "liked": null
            },
            "rating": 5.0,
            "stay_parameters": "Stayed July 2012, traveled with family",
            "text": "What a great place to stay! The location is perfect, right on Piazza Barbarini which is convenient to all locations. Very friendly staff, great rooms (almost totally soundproof and with great A/C), and a terrific breakfast every day.",
            "title": "Perfect hotel in Rome",
            "user": "Mondak"
        },
        {
            "date": "July 22, 2012",
            "detail_rating": {
                "business": null,
                "cleanliness": 5.0,
                "desk": null,
                "location": 5.0,
                "pool": null,
                "restaurant": null,
                "rooms": 5.0,
                "service": 5.0,
                "sleep": 5.0,
                "value": 5.0
            },
            "helpfulness": 1,
            "id": 135093797,
            "likes": {
                "disliked": null,
                "liked": null
            },
            "rating": 5.0,
            "stay_parameters": "Stayed July 2012, traveled with family",
            "text": "We were in Italy for 2 weeks and stayed at several hotels in several cities including another hotel in Rome and this was the best. This hotel is a pearl. Great location, rooms were beautiful, staff went out of their way and the breakfast was superb. Rome was great and this is the place to stay!",
            "title": "Great Hotel",
            "user": "Jimmy G"
        },
        {
            "date": "July 22, 2012",
            "detail_rating": {
                "business": null,
                "cleanliness": null,
                "desk": null,
                "location": null,
                "pool": null,
                "restaurant": null,
                "rooms": null,
                "service": null,
                "sleep": null,
                "value": null
            },
            "helpfulness": null,
            "id": 135042654,
            "likes": {
                "disliked": null,
                "liked": null
            },
            "rating": 5.0,
            "stay_parameters": null,
            "text": "clean, intimate, personable, friendly, amazing are only a few of the adjectives i would use to describe the experience at Barocco, not to mention the beds are the most comfortable of any hotel, though there are many choices in Rome, (a city i frequent quite a bit) Barocco along with the affordable price, is always an easy choice for me.",
            "title": "excellent",
            "user": "Armand m"
        },
        {
            "date": "July 21, 2012",
            "detail_rating": {
                "business": null,
                "cleanliness": 5.0,
                "desk": null,
                "location": 5.0,
                "pool": null,
                "restaurant": null,
                "rooms": 5.0,
                "service": 5.0,
                "sleep": 5.0,
                "value": 4.0
            },
            "helpfulness": null,
            "id": 134975988,
            "likes": {
                "disliked": null,
                "liked": null
            },
            "rating": 5.0,
            "stay_parameters": "Stayed July 2012, traveled with family",
            "text": "We were in Rome for a family/friends vacation and stayed at the Barocco for two nights. It was a great place for both the adults and teenagers! The hotel has a great location on a quiet side street that opens to a beautiful piazza. The subway is just around the corner and many of the sights you don't want to miss are within an easy walk. This was our second time to Rome and if I ever return, I would surely stay at the Barocco Hotel again! Highly recommend this wonderful boutique hotel!",
            "title": "Wonderful Rome Hotel",
            "user": "Madonna R"
        },
        {
            "date": "July 20, 2012",
            "detail_rating": {
                "business": null,
                "cleanliness": 5.0,
                "desk": null,
                "location": 5.0,
                "pool": null,
                "restaurant": null,
                "rooms": 5.0,
                "service": 5.0,
                "sleep": 5.0,
                "value": 5.0
            },
            "helpfulness": null,
            "id": 134935327,
            "likes": {
                "disliked": null,
                "liked": null
            },
            "rating": 5.0,
            "stay_parameters": "Stayed July 2012, traveled with family",
            "text": "I stayed 3 nights at the Barocco in Rome. This was my first trip to Italy and I was concerned about travelling from the airport to the hotel alone. Fabio arranged for a shuttle to pick me up at the airport at an affordable price. My bed was large and extremely comfortable. The buffet breakfast selection was large and also included omelette selection from a menu if preferred. Restaurant suggestions by the staff were excellent. You can't beat this hotel for location, comfort and helpful cheery staff.",
            "title": "Great place to stay in Rome",
            "user": "Gail H"
        },
        {
            "date": "July 19, 2012",
            "detail_rating": {
                "business": null,
                "cleanliness": 5.0,
                "desk": null,
                "location": 5.0,
                "pool": null,
                "restaurant": null,
                "rooms": 5.0,
                "service": 5.0,
                "sleep": 4.0,
                "value": 4.0
            },
            "helpfulness": 5,
            "id": 134859785,
            "likes": {
                "disliked": null,
                "liked": null
            },
            "rating": 5.0,
            "stay_parameters": "Stayed July 2012, traveled as a couple",
            "text": "My wife and I stayed 5 nights at the Barocco Hotel. You can't get to much more centralized than where this hotel is located. It's about a 5min walk to the Spanish Steps, Trevi Fountain was only 15min walk, Pantheon about 10-15min walk, the Colosseum was about 25 min walk, Basilica of Saint Peter was about 30mins, and many, many other spectacular historical sights with in 20min walk (give or take 5mins). The maid service was impeccable. When you leave your hotel room, you drop your room key off at the front desk. When you come back, your bed is always made, even if you took a mid day nap. Their continental breakfast was exceptional. Nothing like you find in the states. If you aren't pleased with their breakfast, then the problem is not with them, but with you. You can get eggs to order, cappuccinos, lattes, American coffee with cream, and a few other items at no additional cost during breakfast hours (7am to 10:30am if I remember correctly). There are dozens of great restaurants near by, all within easy walking distance. They hotel staff can recommend some great restaurants in the near by area as well. The hotel is extremely close (1 block) from the nearest metro station so if you plan to go a little further away from the hotel or aren't able to walk great distances, just hop the metro. They have bus stops right around the corner as well. The room was perfect for our needs. Air conditioned, mini fridge, complimentary fruit on the desk, shower, hair dryer, heated towel rack, comfy bed, ample plugins for our camera batteries, computers, etc. They have a small 17in TV in the room, a safe, and wall locker for your hanging cloths. Can't ask for much more. Upon your arrival they will provide you with a complimentary map of the area showing you all the hot spots to visit. Ask them about restaurants, and they'll mark those on the map for you as well. When my wife and I visit Italy again, if we end up in Rome (Roma), we will, without a doubt, stay at the Barocco Hotel again.",
            "title": "Perfect Location",
            "user": "David D"
        },
        {
            "date": "July 19, 2012",
            "detail_rating": {
                "business": null,
                "cleanliness": 5.0,
                "desk": null,
                "location": 5.0,
                "pool": null,
                "restaurant": null,
                "rooms": 5.0,
                "service": 5.0,
                "sleep": 5.0,
                "value": 5.0
            },
            "helpfulness": null,
            "id": 134818624,
            "likes": {
                "disliked": null,
                "liked": null
            },
            "rating": 5.0,
            "stay_parameters": "Stayed July 2012, traveled as a couple",
            "text": "Hats off to the management and staff at the Barocco Hotel in Rome. The location, cleanliness and great breakfast was a big key to our sucessful stay. Thanks for a great stay in your beautiful city.",
            "title": "Great addition for our 30th anniversary trip.",
            "user": "Michael S"
        },
        {
            "date": "July 18, 2012",
            "detail_rating": {
                "business": null,
                "cleanliness": 5.0,
                "desk": null,
                "location": 5.0,
                "pool": null,
                "restaurant": null,
                "rooms": 5.0,
                "service": 5.0,
                "sleep": 5.0,
                "value": 5.0
            },
            "helpfulness": 1,
            "id": 134743036,
            "likes": {
                "disliked": null,
                "liked": null
            },
            "rating": 5.0,
            "stay_parameters": "Stayed July 2012, traveled as a couple",
            "text": "the location, the staff, the rooms, and the breakfast...all fantastic! What else could you ask for? Thanks for all of your help getting around the city and eating at the right places!",
            "title": "perfect place to stay in rome...",
            "user": "adam s"
        },
        {
            "date": "July 14, 2012",
            "detail_rating": {
                "business": null,
                "cleanliness": 5.0,
                "desk": null,
                "location": 5.0,
                "pool": null,
                "restaurant": null,
                "rooms": 5.0,
                "service": 5.0,
                "sleep": 5.0,
                "value": 4.0
            },
            "helpfulness": 1,
            "id": 134371777,
            "likes": {
                "disliked": null,
                "liked": null
            },
            "rating": 5.0,
            "stay_parameters": "Stayed June 2012, traveled with family",
            "text": "We are very particular in where we stay and were looking for a clean hotel that was in a good, central location with air conditioning. Upon reading so many reviews on tripadvisor it was very difficult to find one that met our standards until we found Hotel Barocco. It was clean, beautiful with marble floors and they had outstanding breakfast . The staff was very nice and very accomodating, and extremely professional. We don't have the outlook that your only sleeping there, for us it sets the tone to our vacation, especially since we are traveling with kids. We also used their service to pick us up from the airport, I recommend this when traveling with kids. I highly recommend this hotel and it is worth the money. We would definitely go again.",
            "title": "First time in Rome",
            "user": "Cannoli4"
        },
        {
            "date": "July 9, 2012",
            "detail_rating": {
                "business": null,
                "cleanliness": 5.0,
                "desk": null,
                "location": 5.0,
                "pool": null,
                "restaurant": null,
                "rooms": 5.0,
                "service": 5.0,
                "sleep": 5.0,
                "value": 5.0
            },
            "helpfulness": 1,
            "id": 133916591,
            "likes": {
                "disliked": null,
                "liked": null
            },
            "rating": 5.0,
            "stay_parameters": "Stayed July 2012, traveled as a couple",
            "text": "The hotel was ideally located / central to all major sights. The staff was awesome. The rooms were modern and comfortable. Finally the breakfast buffet (and breakfast menu) were excellent.",
            "title": "Great Location Married with Great Hotel",
            "user": "212Matt"
        },
        {
            "date": "July 9, 2012",
            "detail_rating": {
                "business": null,
                "cleanliness": 5.0,
                "desk": null,
                "location": 5.0,
                "pool": null,
                "restaurant": null,
                "rooms": 5.0,
                "service": 5.0,
                "sleep": 5.0,
                "value": 5.0
            },
            "helpfulness": null,
            "id": 133891925,
            "likes": {
                "disliked": null,
                "liked": null
            },
            "rating": 5.0,
            "stay_parameters": "Stayed June 2012, traveled as a couple",
            "text": "We stayed at the Hotel Barocco from June 25 to June 29. We booked the hotel on Expedia after reading many positive reviews on TripAdvisor; we were not let down. We had a very long travel day and were hoping for a nice welcome and pleasant hotel, we were not let down. The front office staff was incredbly helpful and welcoming. We had booked in the Annex building, which we were a little worried might not be as nice as the regular building. We were more than pleased with the Annex. It was cool (which was great given it was incredibly hot in Rome that week) and we were upgraded to a huge room (room 50). The breakfast was wonderful and service unbelievable. The location is great too. We basically walked to everything with the exception of the Vatican. We would certainly stay at Hotel Barocco the next time we are in Rome!!",
            "title": "Great stay at Hotel Barocco!",
            "user": "John D"
        },
        {
            "date": "July 5, 2012",
            "detail_rating": {
                "business": null,
                "cleanliness": 5.0,
                "desk": null,
                "location": 5.0,
                "pool": null,
                "restaurant": null,
                "rooms": 4.0,
                "service": 4.0,
                "sleep": 5.0,
                "value": 3.0
            },
            "helpfulness": null,
            "id": 133553964,
            "likes": {
                "disliked": null,
                "liked": null
            },
            "rating": 3.0,
            "stay_parameters": "Stayed June 2012, traveled as a couple",
            "text": "I travel to Europe monthly on business, so I am well aware that European hotel rooms are smaller than American. But, despite upgrading a level, the room was the width of the bed and the night stands. Room at the foot of the bed was limited to the extent that we had to put the luggage alongside the bed or we couldn't open the door. This meant I had to crawl in from the bottom of the bed each night.",
            "title": "Beautiful hotel, great location, SMALL rooms.",
            "user": "Steven G"
        },
        {
            "date": "July 4, 2012",
            "detail_rating": {
                "business": null,
                "cleanliness": 5.0,
                "desk": null,
                "location": 5.0,
                "pool": null,
                "restaurant": null,
                "rooms": 4.0,
                "service": 5.0,
                "sleep": 5.0,
                "value": 5.0
            },
            "helpfulness": 1,
            "id": 133455797,
            "likes": {
                "disliked": null,
                "liked": null
            },
            "rating": 5.0,
            "stay_parameters": "Stayed June 2012, traveled with family",
            "text": "That said, the room was very nice. Comfortable bed, high quality linens, the well appointed. Bathroom was beautiful with a glass shower, tub, marble vanity, and heated towels.",
            "title": "Great Location, Service and Buffet Breakfast",
            "user": "NYCSoHo"
        },
        {
            "date": "July 3, 2012",
            "detail_rating": {
                "business": null,
                "cleanliness": 5.0,
                "desk": null,
                "location": 5.0,
                "pool": null,
                "restaurant": null,
                "rooms": 5.0,
                "service": 4.0,
                "sleep": null,
                "value": 4.0
            },
            "helpfulness": null,
            "id": 133330415,
            "likes": {
                "disliked": null,
                "liked": null
            },
            "rating": 5.0,
            "stay_parameters": "Stayed June 2012",
            "text": "Breakfast was good, with made to order eggs, coffee and a good assortment of breads, pastries, fruits, meats and cheeses.",
            "title": "Beautiful hotel",
            "user": "katylu2"
        },
        {
            "date": "September 18, 2007",
            "detail_rating": {
                "business": 3.0,
                "cleanliness": 5.0,
                "desk": null,
                "front_desk": 5.0,
                "location": 5.0,
                "pool": null,
                "restaurant": null,
                "rooms": 5.0,
                "service": 5.0,
                "sleep": null,
                "value": 5.0
            },
            "helpfulness": 2,
            "id": 8750827,
            "likes": {
                "disliked": "\u2014 Stairs",
                "liked": "\u2014 The size of the room and the amenities"
            },
            "rating": 5.0,
            "stay_parameters": "Stayed September 2007, traveled as a couple",
            "text": "Don't let the entrance fool you. This is a great little hotel in a perfect location. We were fortunate enough to get Room 43 which had a private terrace overlooking Piazza Barberini.",
            "title": "The Barocco is Terrific",
            "user": "Juantwo"
        },
        {
            "date": "September 4, 2007",
            "detail_rating": {
                "business": 3.0,
                "cleanliness": 4.0,
                "desk": null,
                "front_desk": 5.0,
                "location": 5.0,
                "pool": null,
                "restaurant": null,
                "rooms": 4.0,
                "service": 4.0,
                "sleep": null,
                "value": 4.0
            },
            "helpfulness": 2,
            "id": 8654395,
            "likes": {
                "disliked": "\u2014 Tiny Elevator",
                "liked": "\u2014 Location"
            },
            "rating": 4.0,
            "stay_parameters": "Stayed July 2007, traveled with family",
            "text": "Rooms are very well appointed and have a great amenities package. The staff is very helpful and the location around the corner from the Via Veneto is terrific. Easy walk to the Spanish Steps and the Trevi Fountain.",
            "title": "Great Location for a short stay in Rome",
            "user": "lennythelion"
        },
        {
            "date": "August 29, 2007",
            "detail_rating": {
                "business": null,
                "cleanliness": 5.0,
                "desk": null,
                "front_desk": 5.0,
                "location": 5.0,
                "pool": null,
                "restaurant": null,
                "rooms": 5.0,
                "service": 5.0,
                "sleep": null,
                "value": 5.0
            },
            "helpfulness": null,
            "id": 8536876,
            "likes": {
                "disliked": null,
                "liked": null
            },
            "rating": 5.0,
            "stay_parameters": "Stayed August 2007, traveled as a couple",
            "text": "Have dinner at Ciao Bella around the corner. Expensive but excellent food and service.",
            "title": "Great Hotel!",
            "user": "camille7674"
        },
        {
            "date": "August 28, 2007",
            "detail_rating": {
                "business": null,
                "cleanliness": 5.0,
                "desk": null,
                "front_desk": 5.0,
                "location": 5.0,
                "pool": null,
                "restaurant": null,
                "rooms": 5.0,
                "service": 5.0,
                "sleep": null,
                "value": 4.0
            },
            "helpfulness": null,
            "id": 8523504,
            "likes": {
                "disliked": "\u2014 Nothing ... it was a great experience.",
                "liked": "\u2014 Location"
            },
            "rating": 5.0,
            "stay_parameters": "Stayed August 2007, traveled with family",
            "text": "We would go back to Barocco and recommend it to our friends.",
            "title": "Wonderful Hotel in Fantastic Location",
            "user": "MoMiller"
        },
        {
            "date": "August 24, 2007",
            "detail_rating": {
                "business": 4.0,
                "cleanliness": 5.0,
                "desk": null,
                "front_desk": 5.0,
                "location": 5.0,
                "pool": null,
                "restaurant": null,
                "rooms": 5.0,
                "service": 5.0,
                "sleep": null,
                "value": 5.0
            },
            "helpfulness": null,
            "id": 8493077,
            "likes": {
                "disliked": "\u2014 Internet connection was expensive",
                "liked": "\u2014 Services and room"
            },
            "rating": 5.0,
            "stay_parameters": "Stayed August 2007, traveled as a couple",
            "text": "Yes the location is excellent, ideal for walkers wanting to explore the streets of Rome or those who are happier to jump on the bus or the metro, but the hotel itself is certainly the business too. A good value 4 star hotel where the staff are very friendly and welcoming. The rooms are classical Italian (not modern minimalist) but clean and comfortable and adequate in size. Although there is a dining room for breakfast, there isn't a proper restaurant in the hotel - not a problem though as there are plenty of good eating places nearby. I would definitely stay here again.",
            "title": "Fantastic Experience",
            "user": "Isabelle206"
        },
        {
            "date": "July 11, 2012",
            "detail_rating": {
                "business": null,
                "cleanliness": 5.0,
                "desk": null,
                "location": 5.0,
                "pool": null,
                "restaurant": null,
                "rooms": 5.0,
                "service": 5.0,
                "sleep": 4.0,
                "value": 3.0
            },
            "helpfulness": null,
            "id": 134147171,
            "likes": {
                "disliked": null,
                "liked": null
            },
            "rating": 5.0,
            "stay_parameters": "Stayed July 2012, traveled as a couple",
            "text": "Absolutely awesome experience at Barocco Hotel, right off of Piazza Barberini. Proximity to almost everything in the old city (Trevi Fountain, Spanish Steps, etc) is a major plus, and the hotel is right off of a main spot for the hop on/hop off tour bus stops. There is a nice small travel agency just up the alley from the hotel, where you can make all of your other transportation arrangements while in Italy. About another block up the alley is a fabulous family owned restaurant (can't recall the name, but hotel concierge will tell you). The hotel staff was perfect; breakfast service and offerings were included and food was fantastic. The rooms, while somewhat small, were clean, fresh and well decorated. Noise was not a problem, as the hotel is very small. Proximity to a park (for runners) was a plus as well. They had fresh fruit in the room upon our arrival, which was a nice touch! Nightly turn-down service was standard. This place is a diamond in the rough and was a high point of an otherwise unremarkable visit to Rome.",
            "title": "Exceptional boutique hotel in Rome",
            "user": "Hunter W"
        },
        {
            "date": "July 11, 2012",
            "detail_rating": {
                "business": null,
                "cleanliness": 5.0,
                "desk": null,
                "location": 5.0,
                "pool": null,
                "restaurant": null,
                "rooms": 5.0,
                "service": 5.0,
                "sleep": 5.0,
                "value": 5.0
            },
            "helpfulness": null,
            "id": 134136491,
            "likes": {
                "disliked": null,
                "liked": null
            },
            "rating": 5.0,
            "stay_parameters": "Stayed July 2012, traveled with family",
            "text": "First time in Rome and loved this hotel. Great location with a friendly, helpful staff. Rooms are large and clean with air conditioning. Will definitely stay there again.",
            "title": "Great place to stay",
            "user": "Fred D"
        },
        {
            "date": "July 11, 2012",
            "detail_rating": {
                "business": null,
                "cleanliness": 5.0,
                "desk": null,
                "location": 5.0,
                "pool": null,
                "restaurant": null,
                "rooms": 5.0,
                "service": 5.0,
                "sleep": 5.0,
                "value": 5.0
            },
            "helpfulness": null,
            "id": 134124232,
            "likes": {
                "disliked": null,
                "liked": null
            },
            "rating": 5.0,
            "stay_parameters": "Stayed July 2012, traveled as a couple",
            "text": "This was our second stay at the Barocco Hotel and won't be our last! We stayed for 6 nights. The hotel staff are very friendly and accomodating. The hotel is clean, bathrooms are updated and have all of the amenities like home! This hotel is a typical European style hotel, very quaint and comfortable rooms, but small. The breakfast is wonderful and had many selections. They have the best Cappuccino!!! This hotel is centrally located so you have the ability to walk to many places.",
            "title": "Love this hotel!!",
            "user": "Lori B"
        },
        {
            "date": "July 10, 2012",
            "detail_rating": {
                "business": null,
                "cleanliness": 5.0,
                "desk": null,
                "location": 5.0,
                "pool": null,
                "restaurant": null,
                "rooms": 4.0,
                "service": 4.0,
                "sleep": 4.0,
                "value": 3.0
            },
            "helpfulness": null,
            "id": 134011211,
            "likes": {
                "disliked": null,
                "liked": null
            },
            "rating": 5.0,
            "stay_parameters": "Stayed July 2012, traveled as a couple",
            "text": "We stayed for 3 nights in the annex. It was very quiet and cold! Very good air conditioning which was important for us after long days in 36 degree heat! The breakfast is very good with a wide selection. The biggest perk was literally being right across the street from the metro station. We bought a Roma pass and got good use out of it solely based on the trains. If you are taking the train to get here which would be very easy and convenient, jjust make sure you have your eyes peeled as the sign is very hard to spot from the street, just says Hotel with one small door beside a cafe, the actual entrance is In the small side alley. would stay here again.",
            "title": "In the annex and perfect!",
            "user": "kcin41"
        },
        {
            "date": "July 9, 2012",
            "detail_rating": {
                "business": null,
                "cleanliness": 4.0,
                "desk": null,
                "location": 4.0,
                "pool": null,
                "restaurant": null,
                "rooms": 2.0,
                "service": 4.0,
                "sleep": 3.0,
                "value": 3.0
            },
            "helpfulness": 1,
            "id": 133926575,
            "likes": {
                "disliked": null,
                "liked": null
            },
            "rating": 3.0,
            "stay_parameters": "Stayed June 2012, traveled as a couple",
            "text": "This Hotel is directly on the Piazza Barberini. Fortunately, the room was soundproof so it was quiet. The room was extremely small, most of the room consisted of a king size bed. But, it was comfortable if cramped. There was no room for luggage except alongside the bed which made it more difficult to maneuver. The room was also very warm, even with the A/C on as high as it would go and it was only early May. I can't imagine what it would be like in the summer.",
            "title": "Unbelievably small room",
            "user": "cmeru51"
        },
        {
            "date": "July 28, 2008",
            "detail_rating": {
                "business": 5.0,
                "cleanliness": 5.0,
                "desk": null,
                "front_desk": 5.0,
                "location": 5.0,
                "pool": null,
                "restaurant": null,
                "rooms": 5.0,
                "service": 4.0,
                "sleep": null,
                "value": 5.0
            },
            "helpfulness": 2,
            "id": 18347350,
            "likes": {
                "disliked": "\u2014 breakfast",
                "liked": "\u2014 location, service"
            },
            "rating": 4.0,
            "stay_parameters": "Stayed July 2008, traveled solo",
            "text": "I spend three nights in Barocco in late July. Overall impression is great. The hotel is in perfect location. Reception staff very professional and efficient. Rooms are nice, comfortable, larger than in other European hotels I have visited. Everything is very clean and tidy, bathroom in marble with good water pressure. AC worked fine, which was nice since it was hot in Rome. Breakfast was OK, although nothing special and not exactly what I expect in a four star hotel. I was extremely satisfied with the hotel and would certainy recommend it.",
            "title": "Extremely satisfied",
            "user": "Shule"
        },
        {
            "date": "July 3, 2008",
            "detail_rating": {
                "business": null,
                "cleanliness": 5.0,
                "desk": null,
                "front_desk": 5.0,
                "location": 5.0,
                "pool": null,
                "restaurant": null,
                "rooms": 5.0,
                "service": 5.0,
                "sleep": null,
                "value": 4.0
            },
            "helpfulness": 3,
            "id": 17497475,
            "likes": {
                "disliked": null,
                "liked": "\u2014 Nice comfy room, efficient staffs"
            },
            "rating": 5.0,
            "stay_parameters": "Stayed June 2008, traveled as a couple",
            "text": "My boyfriend and I stayed in the Barocco for 3 nights in late June. We booked with lastminute and paid a bit extra for a classic room (vs standard room) in the Annex part of the hotel which is a group of rooms located in the fairly posh apartment block just next door to the hotel (<10 steps away). It's a nice old building with high ceilings - cooling in the very hot summer of Rome.",
            "title": "A great choice in Rome",
            "user": "ChristinaLo"
        },
        {
            "date": "June 18, 2008",
            "detail_rating": {
                "business": null,
                "cleanliness": 5.0,
                "desk": null,
                "front_desk": 5.0,
                "location": 4.0,
                "pool": null,
                "restaurant": null,
                "rooms": 4.0,
                "service": 5.0,
                "sleep": null,
                "value": 4.0
            },
            "helpfulness": 1,
            "id": 17013890,
            "likes": {
                "disliked": "\u2014 breakfast",
                "liked": "\u2014 Service"
            },
            "rating": 4.0,
            "stay_parameters": "Stayed May 2008, traveled as a couple",
            "text": "As mention in previous review, entrance to the hotel is on the side street Via della Purificazione, not facing the Barberini Piaza. On arrival, we were greeted by the receptionist who sent a maid to lead us to our room and arrange a porter to deliver our suitcase very promptly.",
            "title": "A wonderful place to stay",
            "user": "2blue"
        },
        {
            "date": "May 14, 2008",
            "detail_rating": {
                "business": null,
                "cleanliness": 5.0,
                "desk": null,
                "front_desk": 5.0,
                "location": 5.0,
                "pool": null,
                "restaurant": null,
                "rooms": 5.0,
                "service": 5.0,
                "sleep": null,
                "value": 5.0
            },
            "helpfulness": 2,
            "id": 16040400,
            "likes": {
                "disliked": "\u2014 Nothing",
                "liked": "\u2014 Comfort, cleanliness & central location"
            },
            "rating": 5.0,
            "stay_parameters": "Stayed May 2008, traveled as a couple",
            "text": "Our room was very clean and nicely decorated with touch of luxury - marble wall skirting, antique looking polished wooden furniture, mirror with golden frame, comfy bed (not to hard/soft), large marble bathroom with a hydro message tub. It has a view to the side street where the hotel entrance is on which I suppose is a bit more quite than those facing the square. Sound proofing is very adequate anyway. My only moan is that the aircon is a bit weak to my like but we left it on when we were out and it does the job to keep the room at a comfortable temperature. By the way, weak aircon seems to be a common issue in all the shops and restuarants.",
            "title": "Excellent stay",
            "user": "Chrissy08"
        },
        {
            "date": "February 29, 2008",
            "detail_rating": {
                "business": null,
                "cleanliness": null,
                "desk": null,
                "location": null,
                "pool": null,
                "restaurant": null,
                "rooms": null,
                "service": null,
                "sleep": null,
                "value": null
            },
            "helpfulness": 1,
            "id": 13924220,
            "likes": {
                "disliked": null,
                "liked": null
            },
            "rating": 5.0,
            "stay_parameters": null,
            "text": "The staffs in the reception are always polite and helpful and certainly treat you like a welcomed guest. We were very impressed with the efficient housekeeping staffs as they meticulously clean and tidy up our room/bed every time we went out (once 3 times in a day during our stay). The good thing is that they keep a low profile and don't bother you when you are in the room, so you don't actually see them but the result of their work!",
            "title": "One of my favoite hotel stays",
            "user": "lhcritter1974"
        },
        {
            "date": "February 15, 2008",
            "detail_rating": {
                "business": null,
                "cleanliness": 4.0,
                "desk": null,
                "front_desk": 4.0,
                "location": 4.0,
                "pool": null,
                "restaurant": null,
                "rooms": 3.0,
                "service": null,
                "sleep": null,
                "value": 3.0
            },
            "helpfulness": 3,
            "id": 13585543,
            "likes": {
                "disliked": "\u2014 housekeeping",
                "liked": "\u2014 Location/Front desk staff"
            },
            "rating": 2.0,
            "stay_parameters": "Stayed February 2008, traveled solo",
            "text": "The hotel was nice, clean and in a good location. It's near a Metro stop and within walking distance of most of the good stuff. Also the tour buses stopped right outside. Be sure to visit the Cimitero Dei Cappuccini just around the corner. It's a church with an adjacent crypt FILLED with the ancient bones of former monks. In some cases the monks are mummified and stand, wearing their robes, in archways made of skulls and femurs. It's truly bizarre.",
            "title": "I'd stay there again, but...",
            "user": "Intrepid_Traveler13"
        },
        {
            "date": "October 23, 2007",
            "detail_rating": {
                "business": null,
                "cleanliness": 5.0,
                "desk": null,
                "front_desk": 5.0,
                "location": 5.0,
                "pool": null,
                "restaurant": null,
                "rooms": 5.0,
                "service": 5.0,
                "sleep": null,
                "value": 5.0
            },
            "helpfulness": 1,
            "id": 10250731,
            "likes": {
                "disliked": null,
                "liked": "\u2014 lOCATION AND STAFF"
            },
            "rating": 5.0,
            "stay_parameters": "Stayed October 2007, traveled as a couple",
            "text": "The hotel might have been hard to find, had I not printed out a detailed description of how to find it. Plus, I asked someone.",
            "title": "Loved the Barocco",
            "user": "LLTTFNY"
        },
        {
            "date": "October 21, 2007",
            "detail_rating": {
                "business": null,
                "cleanliness": 4.0,
                "desk": null,
                "front_desk": 5.0,
                "location": 5.0,
                "pool": null,
                "restaurant": null,
                "rooms": 4.0,
                "service": 5.0,
                "sleep": null,
                "value": 4.0
            },
            "helpfulness": 1,
            "id": 10179741,
            "likes": {
                "disliked": "\u2014 No view.",
                "liked": "\u2014 The Location was the best!"
            },
            "rating": 4.0,
            "stay_parameters": "Stayed September 2007, traveled as a couple",
            "text": "Breakfast was pretty good. The front desk people were very helpful in arranging tours and transportation to the airport for me.",
            "title": "We Really Liked the Barocco Hotel",
            "user": "kypat"
        },
        {
            "date": "October 7, 2007",
            "detail_rating": {
                "business": 2.0,
                "cleanliness": 5.0,
                "desk": null,
                "front_desk": 5.0,
                "location": 5.0,
                "pool": null,
                "restaurant": null,
                "rooms": 5.0,
                "service": 5.0,
                "sleep": null,
                "value": 5.0
            },
            "helpfulness": 2,
            "id": 10049285,
            "likes": {
                "disliked": "\u2014 Internet connection, probably peculiar to the room.",
                "liked": "\u2014 Spacious comfort and high quality of concierge service."
            },
            "rating": 5.0,
            "stay_parameters": "Stayed September 2007, traveled as a couple",
            "text": "I would stay there again for all those reasons.",
            "title": "Barocco, Tutto Magnifico",
            "user": "travcomp"
        },
        {
            "date": "October 5, 2007",
            "detail_rating": {
                "business": 2.0,
                "cleanliness": 4.0,
                "desk": null,
                "front_desk": 3.0,
                "location": 4.0,
                "pool": null,
                "restaurant": null,
                "rooms": 2.0,
                "service": 3.0,
                "sleep": null,
                "value": 2.0
            },
            "helpfulness": 3,
            "id": 10042758,
            "likes": {
                "disliked": null,
                "liked": null
            },
            "rating": 3.0,
            "stay_parameters": "Stayed September 2007, traveled as a couple",
            "text": "But, the following are a few things that might play a part in *your* decision making:",
            "title": "Not Worth the Price",
            "user": "TTBoy1789"
        },
        {
            "date": "August 5, 2007",
            "detail_rating": {
                "business": 5.0,
                "cleanliness": 5.0,
                "desk": null,
                "front_desk": 5.0,
                "location": 5.0,
                "pool": null,
                "restaurant": null,
                "rooms": 5.0,
                "service": 5.0,
                "sleep": null,
                "value": null
            },
            "helpfulness": null,
            "id": 8353746,
            "likes": {
                "disliked": "\u2014 nothing",
                "liked": "\u2014 The rooms were superb"
            },
            "rating": 5.0,
            "stay_parameters": "Stayed August 2007, traveled as a couple",
            "text": "A most fabulous experience at The Barocco Hotel, the staff were superb, the food wonderful and the suite was beatiful. the location was perfect for all the sites, plenty of buses and taxi but also easy walking distance to the wonderful places to visit. i loved the ice creams!!!",
            "title": "Fantasic time",
            "user": "LadyCockburn"
        },
        {
            "date": "July 10, 2007",
            "detail_rating": {
                "business": null,
                "cleanliness": 5.0,
                "desk": null,
                "front_desk": 5.0,
                "location": 3.0,
                "pool": null,
                "restaurant": null,
                "rooms": 3.0,
                "service": 4.0,
                "sleep": null,
                "value": 4.0
            },
            "helpfulness": null,
            "id": 8093160,
            "likes": {
                "disliked": "\u2014 the small rooms",
                "liked": "\u2014 the location"
            },
            "rating": 4.0,
            "stay_parameters": "Stayed July 2007, traveled with family",
            "text": "we took the mother and father in law here and our 5 year old there room could have been a little larger but the location was perfect we were no more then 10 minutes from the fountain, the spanish steps ,and the gardens the breakfast was ok kept the hunger pangs away till lunch (.the more reasonable priced restaurants turn left out of the hotel doors then left again theres so many small traditional ones to choose from )the staff could not have been more freindly and the hotel was spotlesly clean . we intend on going back to rome in september with our other children and no dought about it we would defenitly stay here again",
            "title": "a great hotel=great stay",
            "user": "jossuk"
        },
        {
            "date": "July 6, 2007",
            "detail_rating": {
                "business": 3.0,
                "cleanliness": 3.0,
                "desk": null,
                "front_desk": 4.0,
                "location": 4.0,
                "pool": null,
                "restaurant": null,
                "rooms": 2.0,
                "service": 3.0,
                "sleep": null,
                "value": null
            },
            "helpfulness": 3,
            "id": 8069487,
            "likes": {
                "disliked": "\u2014 Noise",
                "liked": "\u2014 Location"
            },
            "rating": 2.0,
            "stay_parameters": "Stayed June 2007, traveled as a couple",
            "text": "From Liverpool England",
            "title": "Not what we expected",
            "user": "Honeymooners5"
        },
        {
            "date": "June 20, 2007",
            "detail_rating": {
                "business": 3.0,
                "cleanliness": 5.0,
                "desk": null,
                "front_desk": 5.0,
                "location": 5.0,
                "pool": null,
                "restaurant": null,
                "rooms": 4.0,
                "service": 4.0,
                "sleep": null,
                "value": 4.0
            },
            "helpfulness": 1,
            "id": 7952559,
            "likes": {
                "disliked": "\u2014 Slow internet speed",
                "liked": "\u2014 The location"
            },
            "rating": 5.0,
            "stay_parameters": "Stayed June 2007, traveled as a couple",
            "text": "We stayed at the hotel from June 16th to 19th for our honeymoon. We have stayed in Rome before at a 3 star hotel and decided to go book a",
            "title": "Great Location in walkable city",
            "user": "ChicagoHen"
        },
        {
            "date": "June 8, 2007",
            "detail_rating": {
                "business": null,
                "cleanliness": 4.0,
                "desk": null,
                "front_desk": 5.0,
                "location": 4.0,
                "pool": null,
                "restaurant": null,
                "rooms": 5.0,
                "service": 4.0,
                "sleep": null,
                "value": 4.0
            },
            "helpfulness": null,
            "id": 7807845,
            "likes": {
                "disliked": "\u2014 Nothing.",
                "liked": "\u2014 Small, intimate, friendly hote. Great room."
            },
            "rating": 4.0,
            "stay_parameters": "Stayed June 2007, traveled as a couple",
            "text": "4 star for our honeymoon. We looked at the reviews and decided that",
            "title": "Great hotel, fantastic location",
            "user": "geztek"
        }
    ],
    "slim_ranking": 0.00551181102362,
    "stars": 4,
    "tripadvisor": {
        "VISITED": false,
        "country_name": null,
        "locality": null,
        "pic_link": null,
        "street_address": null
    },
    "user_rating": 4.5,
    "variance": {
        "average": 47,
        "excellent": 941,
        "poor": 15,
        "terrible": 2,
        "very good": 308
    }
}