{
    "aka": null,
    "description": null,
    "detail_rating": {
        "cleanliness": null,
        "location": null,
        "rooms": null,
        "service": null,
        "sleep": null,
        "value": null
    },
    "location": {
        "city": null,
        "continent": "Europe",
        "country": "United Kingdom (UK)",
        "proposed_city": "Broomfield",
        "province": null,
        "region": null
    },
    "name": "Broomfield",
    "places": {
        "aka": [],
        "hotel_description": [],
        "hotel_name": [
            "Broomfield"
        ]
    },
    "review_count": 6,
    "review_count_current": 3,
    "reviews": [
        {
            "date": "April 5, 2012",
            "detail_rating": {
                "business": null,
                "cleanliness": 3.0,
                "desk": null,
                "location": 3.0,
                "pool": null,
                "restaurant": null,
                "rooms": 3.0,
                "service": 4.0,
                "sleep": 4.0,
                "value": 4.0
            },
            "helpfulness": null,
            "id": 127305218,
            "likes": {
                "disliked": null,
                "liked": null
            },
            "rating": 4.0,
            "stay_parameters": "Stayed March 2012, traveled with family",
            "text": "There was a warm Lancashire welcome at this guest house and everything was exactly \"as it said on the tin\".",
            "title": "Surprising Facilities at this Guest House",
            "user": "luceo"
        },
        {
            "date": "August 9, 2009",
            "detail_rating": {
                "business": null,
                "cleanliness": 3.0,
                "desk": null,
                "location": 3.0,
                "pool": null,
                "restaurant": null,
                "rooms": 2.0,
                "service": 3.0,
                "sleep": null,
                "value": 2.0
            },
            "helpfulness": null,
            "id": 37165013,
            "likes": {
                "disliked": null,
                "liked": null
            },
            "rating": 3.0,
            "stay_parameters": "Stayed August 2009, traveled as a couple",
            "text": "The rooms were clean and functional and the room rate with breakfast represented very good value for money.",
            "title": "Smells of smoke!",
            "user": "cupacoffee"
        },
        {
            "date": "July 5, 2009",
            "detail_rating": {
                "business": null,
                "cleanliness": 1.0,
                "desk": null,
                "location": 1.0,
                "pool": null,
                "restaurant": null,
                "rooms": 1.0,
                "service": 1.0,
                "sleep": null,
                "value": 1.0
            },
            "helpfulness": 1,
            "id": 33953144,
            "likes": {
                "disliked": null,
                "liked": null
            },
            "rating": 1.0,
            "stay_parameters": "Stayed July 2008, traveled on business",
            "text": "Generally I prefer the anonymity of hotels to the more intimate atmosphere in guest houses but in this case I would have no hesitation in recommending this establishment to those looking for good value accomodation in the area.",
            "title": "Very unpleasant, stay away!",
            "user": "Treeseller"
        }
    ],
    "slim_ranking": 0.833333333333,
    "stars": null,
    "tripadvisor": {
        "VISITED": false,
        "country_name": null,
        "locality": null,
        "pic_link": null,
        "street_address": null
    },
    "user_rating": 3.0,
    "variance": {
        "average": 2,
        "excellent": 1,
        "poor": 0,
        "terrible": 2,
        "very good": 1
    }
}