{
    "aka": "Cascada Hotel Lucerne",
    "description": "Modern non-smoking hotel centrally located directly at the train station and only few minutes from lake, Old Town and attractions. All rooms with air conditioning and an impressive wall painting of a Swiss waterfall. The Spanish BOLERO restaurant is known for its creative and various cuisine.",
    "detail_rating": {
        "cleanliness": null,
        "location": null,
        "rooms": null,
        "service": null,
        "sleep": null,
        "value": null
    },
    "location": {
        "city": null,
        "continent": "Europe",
        "country": "Switzerland",
        "proposed_city": null,
        "province": null,
        "region": null
    },
    "name": "Hotel Cascada",
    "places": {
        "aka": [],
        "hotel_description": [],
        "hotel_name": []
    },
    "review_count": 219,
    "review_count_current": 20,
    "reviews": [
        {
            "date": "September 25, 2007",
            "detail_rating": {
                "business": 3.0,
                "cleanliness": 5.0,
                "desk": null,
                "front_desk": 5.0,
                "location": 4.0,
                "pool": null,
                "restaurant": null,
                "rooms": 5.0,
                "service": 5.0,
                "sleep": null,
                "value": 3.0
            },
            "helpfulness": 6,
            "id": 10001047,
            "likes": {
                "disliked": null,
                "liked": null
            },
            "rating": 5.0,
            "stay_parameters": "Stayed July 2007, traveled as a couple",
            "text": "Wonderful experience.",
            "title": "A cascading wonderful stay",
            "user": "JR_ZA"
        },
        {
            "date": "August 20, 2007",
            "detail_rating": {
                "business": null,
                "cleanliness": 5.0,
                "desk": null,
                "front_desk": 5.0,
                "location": 4.0,
                "pool": null,
                "restaurant": null,
                "rooms": 5.0,
                "service": 5.0,
                "sleep": null,
                "value": 4.0
            },
            "helpfulness": 6,
            "id": 8455361,
            "likes": {
                "disliked": "\u2014 reading lamps impossible to read with",
                "liked": "\u2014 Views staff"
            },
            "rating": 4.0,
            "stay_parameters": "Stayed July 2007, traveled as a couple",
            "text": "Vehicle yard parking provided at 17 euro for the night across the road from the hotel behind another building. It looked dodgy (the parking) but car was fine.",
            "title": "Cascada Staff",
            "user": "Sienna54"
        },
        {
            "date": "December 7, 2006",
            "detail_rating": {
                "business": 4.0,
                "cleanliness": 5.0,
                "desk": null,
                "front_desk": 1.0,
                "location": 3.0,
                "pool": null,
                "restaurant": null,
                "rooms": 4.0,
                "service": 2.0,
                "sleep": null,
                "value": 3.0
            },
            "helpfulness": 7,
            "id": 6344621,
            "likes": {
                "disliked": "\u2014 horrible front desk staff",
                "liked": "\u2014 clean rooms"
            },
            "rating": 3.0,
            "stay_parameters": "Stayed October 2006",
            "text": "Big room. Very clean. Very friendly reception staff speaking some English.",
            "title": "Decent Hotel...",
            "user": "Robert_540"
        },
        {
            "date": "June 14, 2006",
            "detail_rating": {
                "business": null,
                "cleanliness": null,
                "desk": null,
                "location": null,
                "pool": null,
                "restaurant": null,
                "rooms": null,
                "service": null,
                "sleep": null,
                "value": null
            },
            "helpfulness": 10,
            "id": 5348555,
            "likes": {
                "disliked": null,
                "liked": null
            },
            "rating": 2.0,
            "stay_parameters": null,
            "text": "Not too far from the lakeside - was about a 10min walk. Very close to train station if you arrive by train.",
            "title": "Just OK, nothing special. Watch Swiss Quality Hotel's Bait and Switch technique",
            "user": "BFVIndy"
        },
        {
            "date": "March 20, 2006",
            "detail_rating": {
                "business": null,
                "cleanliness": 5.0,
                "desk": null,
                "location": null,
                "pool": null,
                "restaurant": null,
                "rooms": 5.0,
                "service": 4.0,
                "sleep": null,
                "value": null
            },
            "helpfulness": 7,
            "id": 4695156,
            "likes": {
                "disliked": null,
                "liked": null
            },
            "rating": 4.0,
            "stay_parameters": "Stayed March 2006, traveled on business",
            "text": "We stayed at the Cascada hotel recently and found the staff extremely pleasant and helpful. The only complaint we had was that trying to read in bed was almost impossible. The bedlights were very modern to look at but totally useless when it came to use them.",
            "title": "Comfortable and welcoming.",
            "user": "beldin"
        },
        {
            "date": "July 3, 2011",
            "detail_rating": {
                "business": null,
                "cleanliness": 5.0,
                "desk": null,
                "location": 4.0,
                "pool": null,
                "restaurant": null,
                "rooms": 4.0,
                "service": 5.0,
                "sleep": null,
                "value": 5.0
            },
            "helpfulness": null,
            "id": 114976811,
            "likes": {
                "disliked": null,
                "liked": null
            },
            "rating": 5.0,
            "stay_parameters": "Stayed July 2011",
            "text": "The hotel is located in walking distance from the train station, the lake, the KKL (Kultur- und Kongresszentrum Luzern) etc.",
            "title": "Great Value, good location, free WLAN",
            "user": "swiss74_ZRH"
        },
        {
            "date": "April 4, 2011",
            "detail_rating": {
                "business": null,
                "cleanliness": 5.0,
                "desk": null,
                "location": 5.0,
                "pool": null,
                "restaurant": null,
                "rooms": 3.0,
                "service": 5.0,
                "sleep": 4.0,
                "value": 5.0
            },
            "helpfulness": 1,
            "id": 102817225,
            "likes": {
                "disliked": null,
                "liked": null
            },
            "rating": 4.0,
            "stay_parameters": "Stayed April 2011, traveled on business",
            "text": "The staff is very friendly.",
            "title": "Not a designer hotel, but clean and friendly staff",
            "user": "smg81"
        },
        {
            "date": "January 23, 2011",
            "detail_rating": {
                "business": null,
                "cleanliness": 4.0,
                "desk": null,
                "location": 5.0,
                "pool": null,
                "restaurant": null,
                "rooms": 4.0,
                "service": 4.0,
                "sleep": 5.0,
                "value": 4.0
            },
            "helpfulness": 1,
            "id": 94140478,
            "likes": {
                "disliked": null,
                "liked": null
            },
            "rating": 4.0,
            "stay_parameters": "Stayed October 2010, traveled with family",
            "text": "WLAN is free as well in the rooms.",
            "title": "Great hotel in a beutiful city",
            "user": "EUHawkeye"
        },
        {
            "date": "September 29, 2010",
            "detail_rating": {
                "business": null,
                "cleanliness": 5.0,
                "desk": null,
                "location": 4.0,
                "pool": null,
                "restaurant": null,
                "rooms": 3.0,
                "service": 4.0,
                "sleep": 4.0,
                "value": 2.0
            },
            "helpfulness": 1,
            "id": 81453035,
            "likes": {
                "disliked": null,
                "liked": null
            },
            "rating": 4.0,
            "stay_parameters": "Stayed September 2010, traveled as a couple",
            "text": "There is a radio with iPod/iPhone docking station as well as a quite big flat screen TV in the room.",
            "title": "Was okay",
            "user": "baz61"
        },
        {
            "date": "September 21, 2010",
            "detail_rating": {
                "business": null,
                "cleanliness": 5.0,
                "desk": null,
                "location": 5.0,
                "pool": null,
                "restaurant": null,
                "rooms": 5.0,
                "service": 5.0,
                "sleep": 4.0,
                "value": 4.0
            },
            "helpfulness": null,
            "id": 80473549,
            "likes": {
                "disliked": null,
                "liked": null
            },
            "rating": 5.0,
            "stay_parameters": "Stayed September 2010, traveled with family",
            "text": "The breakfast buffet is included.",
            "title": "Clean clean clean!",
            "user": "MikiSMLA"
        },
        {
            "date": "August 4, 2011",
            "detail_rating": {
                "business": null,
                "cleanliness": 5.0,
                "desk": null,
                "location": null,
                "pool": null,
                "restaurant": null,
                "rooms": null,
                "service": 5.0,
                "sleep": 5.0,
                "value": 4.0
            },
            "helpfulness": 1,
            "id": 116281721,
            "likes": {
                "disliked": null,
                "liked": null
            },
            "rating": 5.0,
            "stay_parameters": "Stayed July 2011, traveled as a couple",
            "text": "My wife and I stayed here for 3 nights in July. It's an 8-10 walk from the train station; in some cities, that might mean you were in a sketchy part of town, but not so in Luzern, since the train station is central to almost everything. Our neighborhood was upscale and interesting, again just 8-10 walk to the river and the old town. The hotel was relatively modern, certainly chic in the lobby; the room was large and comfortable, ditto the bathroom. As usual, everything was spotlessly clean. Staff was friendly and helpful; breakfast buffet the best of our trip (omelets cooked to order). We ate only breakfast in the hotel restaurant. Luzern is wonderful, and the hotel helped make it possible. Tip: it's much easier to walk from the train station, pulling a suitcase, to the Cascada than going into the old town, over cobblestones. Also: elevators and airconditioning.",
            "title": "Fine hotel",
            "user": "Genings"
        },
        {
            "date": "August 4, 2011",
            "detail_rating": {
                "business": null,
                "cleanliness": 5.0,
                "desk": null,
                "location": null,
                "pool": null,
                "restaurant": null,
                "rooms": null,
                "service": 4.0,
                "sleep": 5.0,
                "value": 3.0
            },
            "helpfulness": 1,
            "id": 116257548,
            "likes": {
                "disliked": null,
                "liked": null
            },
            "rating": 4.0,
            "stay_parameters": "Stayed July 2011, traveled as a couple",
            "text": "We stayed at the Cascada for two weeks on our annual summer holiday. It is a good hotel with nice staff but a bit lacking in some areas for a 4-star hotel.",
            "title": "Good hotel with friendly staff",
            "user": "gproyd"
        },
        {
            "date": "July 28, 2011",
            "detail_rating": {
                "business": null,
                "cleanliness": 5.0,
                "desk": null,
                "location": null,
                "pool": null,
                "restaurant": null,
                "rooms": null,
                "service": 4.0,
                "sleep": 5.0,
                "value": 4.0
            },
            "helpfulness": 1,
            "id": 115909413,
            "likes": {
                "disliked": null,
                "liked": null
            },
            "rating": 4.0,
            "stay_parameters": "Stayed August 2010, traveled on business",
            "text": "The waterfall theme extends to the rooms which have mural paintings of Swiss waterfalls. Our room was a bit small (they all are apparently) and sparsely furnished. The wardrobe was just a few shelves and hangers attached to the wall. However there was a big television and good radio, both with several international stations. There was a good supply of toiletries in the bathroom. We had a balcony too. Although we were at the front of the hotel, which was on a busy road, there was good insulation so no traffic noise at night.",
            "title": "Wowhh!!!!!",
            "user": "Soumya_Chatterjee"
        },
        {
            "date": "July 25, 2011",
            "detail_rating": {
                "business": null,
                "cleanliness": 5.0,
                "desk": null,
                "location": 3.0,
                "pool": null,
                "restaurant": null,
                "rooms": 5.0,
                "service": 5.0,
                "sleep": null,
                "value": 4.0
            },
            "helpfulness": null,
            "id": 115773879,
            "likes": {
                "disliked": null,
                "liked": null
            },
            "rating": 4.0,
            "stay_parameters": "Stayed July 2011",
            "text": "The Spanish restaurant Bolero is excellent - the food is always of a high standard and lots of the locals seem to eat there. There is a small bar which is really an extension of the restaurant - service very good but the furniture had seen better days. The hotel also mentions a \"lounge\" but this does not exist - it is just a bar! The public areas could be better for a hotel of this class.",
            "title": "Big rooms! Free Wlan!",
            "user": "Dvillasmil"
        },
        {
            "date": "July 13, 2011",
            "detail_rating": {
                "business": null,
                "cleanliness": 4.0,
                "desk": null,
                "location": null,
                "pool": null,
                "restaurant": null,
                "rooms": null,
                "service": 5.0,
                "sleep": 4.0,
                "value": 3.0
            },
            "helpfulness": 1,
            "id": 115323538,
            "likes": {
                "disliked": null,
                "liked": null
            },
            "rating": 4.0,
            "stay_parameters": "Stayed July 2011, traveled with family",
            "text": "The Cascada is a comfortable hotel in a convenient location.",
            "title": "Nice cosy hotel for family",
            "user": "Duttashovan13"
        },
        {
            "date": "July 26, 2010",
            "detail_rating": {
                "business": null,
                "cleanliness": 5.0,
                "desk": null,
                "location": 4.0,
                "pool": null,
                "restaurant": null,
                "rooms": 4.0,
                "service": 5.0,
                "sleep": 4.0,
                "value": 5.0
            },
            "helpfulness": 2,
            "id": 72471004,
            "likes": {
                "disliked": null,
                "liked": null
            },
            "rating": 5.0,
            "stay_parameters": "Stayed July 2010, traveled with family",
            "text": "This hotel offers an exceptionally good value for the price in one of the most beautiful--and most visited--cities in Europe. The location is a pleasant walking distance (10 min.) from the main cultural attractions yet removed from the ongoing street noise--very important during the summertime/festival season. The entire property is immaculate, the rooms are a decent size and well appointed, the breakfast offerings were fresh and of good variety.",
            "title": "Great value, smart location, immaculate rooms, professional staff",
            "user": "swisstraveler2010"
        },
        {
            "date": "July 4, 2010",
            "detail_rating": {
                "business": null,
                "cleanliness": 4.0,
                "desk": null,
                "location": 4.0,
                "pool": null,
                "restaurant": null,
                "rooms": 4.0,
                "service": 3.0,
                "sleep": 4.0,
                "value": 3.0
            },
            "helpfulness": null,
            "id": 69682868,
            "likes": {
                "disliked": null,
                "liked": null
            },
            "rating": 4.0,
            "stay_parameters": "Stayed August 2009, traveled with family",
            "text": "I felt that this hotel was a great find. As someone particularly sensitive to noise and cleanliness, I was very happy with my stay.",
            "title": "Good location",
            "user": "dima01"
        },
        {
            "date": "June 9, 2010",
            "detail_rating": {
                "business": null,
                "cleanliness": 4.0,
                "desk": null,
                "location": 5.0,
                "pool": null,
                "restaurant": null,
                "rooms": 3.0,
                "service": 2.0,
                "sleep": 4.0,
                "value": 3.0
            },
            "helpfulness": null,
            "id": 66933034,
            "likes": {
                "disliked": null,
                "liked": null
            },
            "rating": 3.0,
            "stay_parameters": "Stayed May 2010, traveled with family",
            "text": "Me and my family stayed there for 3 nights and it was good. The room we had was big and had a good T.V. The location was great is was close to the train station and not far away from a nice lake. The food isnt that bad but it finishes quickly.The staff where helpfull and nice. The good thing is that there are a few fast food restaurant around such as Mcdonalds and burger king since the hotels restaurant is pretty expensive.",
            "title": "Centrally located",
            "user": "VivekMul"
        },
        {
            "date": "September 6, 2008",
            "detail_rating": {
                "business": null,
                "cleanliness": 5.0,
                "desk": null,
                "front_desk": 5.0,
                "location": 5.0,
                "pool": null,
                "restaurant": null,
                "rooms": 5.0,
                "service": 5.0,
                "sleep": null,
                "value": 4.0
            },
            "helpfulness": 1,
            "id": 19817924,
            "likes": {
                "disliked": "\u2014 without free wifi",
                "liked": "\u2014 cleanliness, and the triple room is big and comfortable for my family."
            },
            "rating": 4.0,
            "stay_parameters": "Stayed August 2008, traveled with family",
            "text": "Its centrally located with walking distance from station. Good clean rooms but low amenities & service. Ideal for 1 or 2 nights, not long stay.",
            "title": "Comfortable stay",
            "user": "KanMacau"
        },
        {
            "date": "October 3, 2007",
            "detail_rating": {
                "business": 3.0,
                "cleanliness": 4.0,
                "desk": null,
                "front_desk": 4.0,
                "location": 3.0,
                "pool": null,
                "restaurant": null,
                "rooms": 3.0,
                "service": null,
                "sleep": null,
                "value": 4.0
            },
            "helpfulness": 6,
            "id": 10034768,
            "likes": {
                "disliked": null,
                "liked": null
            },
            "rating": 3.0,
            "stay_parameters": "Stayed September 2007, traveled as a couple",
            "text": "I stay in the hotel for 2 nights in mid August, with my wife and daughter of 14 years old. It is just a few minutes walk from the train station.",
            "title": "Not worth four-star",
            "user": "stevew918"
        }
    ],
    "slim_ranking": 0.131147540984,
    "stars": 4,
    "tripadvisor": {
        "VISITED": false,
        "country_name": null,
        "locality": null,
        "pic_link": null,
        "street_address": null
    },
    "user_rating": 4.0,
    "variance": {
        "average": 22,
        "excellent": 90,
        "poor": 4,
        "terrible": 3,
        "very good": 100
    }
}