{
    "aka": "Selati Camp Hotel",
    "description": "Selati CampRomance, intimacy, luxury and 5-Star service epitomise Selati Camp. A late 1800\u2019s railway theme with authentic memorabilia evokes images of a time when life moved more slowly, more gently. Eight beautiful suites feature handmade beds draped with mosquito nets, soft linens and antiques. En-suite bathrooms (recently refurbished) have indoor and outdoor showers. Excellent cuisine is enjoyed in the small farmhouse kitchen or intimate outdoor boma and viewing decks overlook a riverbed.",
    "detail_rating": {
        "cleanliness": null,
        "location": null,
        "rooms": null,
        "service": null,
        "sleep": null,
        "value": null
    },
    "location": {
        "city": null,
        "continent": "Africa",
        "country": "South Africa",
        "proposed_city": null,
        "province": null,
        "region": null
    },
    "name": "Sabi Sabi Selati Camp",
    "places": {
        "aka": [],
        "hotel_description": [],
        "hotel_name": []
    },
    "review_count": 65,
    "review_count_current": 5,
    "reviews": [
        {
            "date": "July 25, 2008",
            "detail_rating": {
                "business": null,
                "cleanliness": 5.0,
                "desk": null,
                "front_desk": 5.0,
                "location": 5.0,
                "pool": null,
                "restaurant": null,
                "rooms": 5.0,
                "service": 5.0,
                "sleep": null,
                "value": 5.0
            },
            "helpfulness": 3,
            "id": 18236318,
            "likes": {
                "disliked": null,
                "liked": "\u2014 A real African experience"
            },
            "rating": 5.0,
            "stay_parameters": "Stayed April 2008, traveled as a couple",
            "text": "Our first stop in our four-day stay at Sabi Sabi was Selati Lodge. We loved this place \u2013 it had an old colonial African feel that really worked. Lots of dark timbers, open air lounges with comfy couches, the obligatory open bar and huge independent thatched rooms. We were given a suite (not sure why, but who was I to complain) which featured a huge four poster bed complete with mosquito netting, a lovely lounge, outdoor shower, huge bathroom and a private deck overlooking the plain.",
            "title": "Fabulous African Wildlife Experience",
            "user": "jmlparis"
        },
        {
            "date": "February 23, 2008",
            "detail_rating": {
                "business": null,
                "cleanliness": 5.0,
                "desk": null,
                "front_desk": 5.0,
                "location": 5.0,
                "pool": null,
                "restaurant": null,
                "rooms": 5.0,
                "service": 5.0,
                "sleep": null,
                "value": 5.0
            },
            "helpfulness": 2,
            "id": 13788234,
            "likes": {
                "disliked": null,
                "liked": "\u2014 Service, Style, Adventure"
            },
            "rating": 5.0,
            "stay_parameters": "Stayed February 2008, traveled as a couple",
            "text": "The plain also featured a strategically-placed waterhole. The critters obviously loved it \u2013 we sat down to lunch on the large deck to be entertained by water buck, warthog, impala, buffalo and, when we seemingly weren\u2019t looking, an elephant sidled up to the bog and had a ball spraying water everywhere.",
            "title": "Excellent camp with old Africa charm",
            "user": "AEFH"
        },
        {
            "date": "September 7, 2007",
            "detail_rating": {
                "business": null,
                "cleanliness": 5.0,
                "desk": null,
                "front_desk": 5.0,
                "location": 5.0,
                "pool": null,
                "restaurant": null,
                "rooms": 5.0,
                "service": 5.0,
                "sleep": null,
                "value": 5.0
            },
            "helpfulness": 2,
            "id": 8670896,
            "likes": {
                "disliked": "\u2014 nothing",
                "liked": "\u2014 anything- the game viewing"
            },
            "rating": 5.0,
            "stay_parameters": "Stayed August 2007, traveled as a couple",
            "text": "The food at Selati was really good \u2013 lunch was a buffet with lots of salads, quiche and other stuff. We filled up our plates (naturally), polished it all off then the waiter came round and asked what we wanted for our main course. Ooops. Didn\u2019t realise lunch was three courses. Nothing much to do apart from expand the belt a notch or two and keep going!",
            "title": "Excellent Game viewing and great staff",
            "user": "nytraveler09"
        },
        {
            "date": "January 3, 2007",
            "detail_rating": {
                "business": 3.0,
                "cleanliness": 4.0,
                "desk": null,
                "front_desk": 3.0,
                "location": 2.0,
                "pool": null,
                "restaurant": null,
                "rooms": 4.0,
                "service": 4.0,
                "sleep": null,
                "value": 3.0
            },
            "helpfulness": 4,
            "id": 6548998,
            "likes": {
                "disliked": null,
                "liked": "\u2014 the rooms were gorgeous and the bed comfortable..loved the gas laterns at night"
            },
            "rating": 4.0,
            "stay_parameters": "Stayed December 2006, traveled as a couple",
            "text": "All dinners are communal which gives you a wonderful opportunity to meet people from around the world. We loved it - ended up having very long lunches!!",
            "title": "Intimate setting with old safari feel",
            "user": "travellikecrazy"
        },
        {
            "date": "September 9, 2005",
            "detail_rating": {
                "business": null,
                "cleanliness": 5.0,
                "desk": null,
                "location": null,
                "pool": null,
                "restaurant": null,
                "rooms": 5.0,
                "service": 5.0,
                "sleep": null,
                "value": 5.0
            },
            "helpfulness": 11,
            "id": 3889971,
            "likes": {
                "disliked": null,
                "liked": null
            },
            "rating": 5.0,
            "stay_parameters": "Stayed August 2005",
            "text": "We have been to Africa before and had seen pretty much everything in terms of the Big 5 and other interesting animals, so the thrill for us at Sabi Sabi was getting really close to the animals. There did not seem to be huge herds of animals roaming the park and you often drove for 20 minutes or so without seeing anything (does sighting a drongo bird count? I thought it was funny.) But, when you do see something, you can get really close. Over the next few days we were able to say hello to heaps of rhino, lots of elephant (including lots of babies \u2013 sooooo cute), buffalo, etc.",
            "title": "Amzing Honeymoon experience",
            "user": "GavinManchester"
        }
    ],
    "slim_ranking": 0.8,
    "stars": null,
    "tripadvisor": {
        "VISITED": false,
        "country_name": null,
        "locality": null,
        "pic_link": null,
        "street_address": null
    },
    "user_rating": 4.5,
    "variance": {
        "average": 2,
        "excellent": 55,
        "poor": 2,
        "terrible": 1,
        "very good": 5
    }
}