{
    "aka": "De Londres Eiffel Paris",
    "description": "Independent charming hotel, L'Hotel de Londres Eiffel offers you 30 rooms all equipped with air conditioning with bathroom wc, or shower wc. We are situated at 2 minutes by walk from the Eiffel tower, near rue Cler, near Invalides. Some of our rooms have a view on the Eiffel tower.",
    "detail_rating": {
        "cleanliness": 5.0,
        "location": 5.0,
        "rooms": 4.5,
        "service": 4.5,
        "sleep": 4.5,
        "value": 4.5
    },
    "location": {
        "city": "Paris",
        "continent": "Europe",
        "country": "France",
        "proposed_city": "Paris",
        "province": null,
        "region": "Ile-de-France"
    },
    "name": "Hotel de Londres Eiffel",
    "places": {
        "aka": [
            "Paris"
        ],
        "hotel_description": [],
        "hotel_name": []
    },
    "review_count": 803,
    "review_count_current": 78,
    "reviews": [
        {
            "date": "May 21, 2013",
            "detail_rating": {
                "business": null,
                "cleanliness": 5.0,
                "desk": null,
                "location": 5.0,
                "pool": null,
                "restaurant": null,
                "rooms": 4.0,
                "service": 5.0,
                "sleep": 4.0,
                "value": 5.0
            },
            "helpfulness": null,
            "id": 161416780,
            "likes": {
                "disliked": null,
                "liked": null
            },
            "rating": 5.0,
            "stay_parameters": "Stayed May 2013, traveled as a couple",
            "text": "We recently stayed at this hotel as part of our Rick Steve's tour. The location is wonderful for accessing Metro and bus plus a few short minutes walking distance to Eiffel Tour. Many good restaurants nearby too. The staff at the hotel is extremely friendly, all speak english, and are very helpful for assistance. Very clean rooms and good breakfast.",
            "title": "Great location...great service!",
            "user": "Tammi M"
        },
        {
            "date": "May 9, 2013",
            "detail_rating": {
                "business": null,
                "cleanliness": 5.0,
                "desk": null,
                "location": 5.0,
                "pool": null,
                "restaurant": null,
                "rooms": 5.0,
                "service": 3.0,
                "sleep": 4.0,
                "value": 4.0
            },
            "helpfulness": 3,
            "id": 160142845,
            "likes": {
                "disliked": null,
                "liked": null
            },
            "rating": 4.0,
            "stay_parameters": "Stayed March 2013, traveled with family",
            "text": "We had 2 rooms at this hotel. Ours was a room on the top floor with a view of the Eiffel Tower (top half of it over the french rooftops). Wonderful room, wonderful view. Smallish of course, but that's what nice old buildings in Paris are. Only a minutes walk to the tower, and watching the light show each hour after dark from your own Paris rooftop room is pretty magical. There's something very beautiful about a traditional French rooftop. The staff on the reception desk were very accomodating and helpful in a 'French' manner (there's always that slight feeling of... can't quite decide if it's condescention or disapproval...!), but that's all part of the charm of Paris. It didn't spoil it for us, we were amused by it. The only low point was the 4 of us being \"shooed\" by the kitchen maid from a table for 4 to a tiny table really only big enough for 2, only to have the other table sit empty while we ate. Not sure what that was about, and she literally shooed us with hand gestures and a frown, so we just ate out in quaint cafes instead.",
            "title": "Very quaintly French, in style and attitude. Worth every Euro.",
            "user": "cookies003"
        },
        {
            "date": "May 8, 2013",
            "detail_rating": {
                "business": null,
                "cleanliness": 5.0,
                "desk": null,
                "location": 5.0,
                "pool": null,
                "restaurant": null,
                "rooms": 3.0,
                "service": 5.0,
                "sleep": 4.0,
                "value": 5.0
            },
            "helpfulness": 1,
            "id": 160066833,
            "likes": {
                "disliked": null,
                "liked": null
            },
            "rating": 4.0,
            "stay_parameters": "Stayed February 2013, traveled as a couple",
            "text": "To begin, you CANNOT beat this hotel's location in the 7th. It's about a six to eight minute walk to the metro, and you could not leave the area and be completely content. The neighborhood is STELLAR!",
            "title": "Unbeatable location, small rooms, stellar service!",
            "user": "Philip L"
        },
        {
            "date": "May 5, 2013",
            "detail_rating": {
                "business": null,
                "cleanliness": 5.0,
                "desk": null,
                "location": 5.0,
                "pool": null,
                "restaurant": null,
                "rooms": 4.0,
                "service": 4.0,
                "sleep": 4.0,
                "value": 4.0
            },
            "helpfulness": null,
            "id": 159714931,
            "likes": {
                "disliked": null,
                "liked": null
            },
            "rating": 4.0,
            "stay_parameters": "Stayed June 2012, traveled with family",
            "text": "The staff at Londres Eiffel are uniformly helpful and polite. We had a couple odds and ends problems with the room that were addressed promptly. Staff are more than fluent in English (and tolerated my attempts to speak high-school French).",
            "title": "great location, nice small rooms",
            "user": "Russ L"
        },
        {
            "date": "May 2, 2013",
            "detail_rating": {
                "business": null,
                "cleanliness": 4.0,
                "desk": null,
                "location": 5.0,
                "pool": null,
                "restaurant": null,
                "rooms": 4.0,
                "service": 3.0,
                "sleep": 3.0,
                "value": 4.0
            },
            "helpfulness": 3,
            "id": 159476192,
            "likes": {
                "disliked": null,
                "liked": null
            },
            "rating": 3.0,
            "stay_parameters": "Stayed April 2013, traveled as a couple",
            "text": "The hotel rooms are clean and small--apparently the building housed former construction workers on the Eiffel Tower--and the facilities and amenities are standard. Nothing to knock your socks off here, but up-to-date.",
            "title": "Excellent Location, Adequate Room, Weird Keycard Rule",
            "user": "lec1727"
        },
        {
            "date": "December 6, 2011",
            "detail_rating": {
                "business": null,
                "cleanliness": 5.0,
                "desk": null,
                "location": 3.0,
                "pool": null,
                "restaurant": null,
                "rooms": 5.0,
                "service": 5.0,
                "sleep": 4.0,
                "value": 4.0
            },
            "helpfulness": null,
            "id": 121447872,
            "likes": {
                "disliked": null,
                "liked": null
            },
            "rating": 5.0,
            "stay_parameters": "Stayed November 2011, traveled with family",
            "text": "This is the friendliest hotel I've ever stayed in in Paris. We had a beautiful room with plenty of space (except possibly in the bathroom - it was lovely but no room for toiletries). We didn't opt for breakfast (there is a wonderful little patisserie right around the corner) but it looked very nice. People at the front desk were helpful. There is a great little restaurant (Cafe Constant) right around the corner - perfect for that first night when you're feeling jet lagged. About 3-4 blocks from the nearest metro, we had no problem getting around. And of course the Eiffel Tower is right there, which thrilled my daughter to no end. If you want to stay in the 7th, this is a great choice.",
            "title": "Friendly, cozy place in the 7th",
            "user": "lulusmom"
        },
        {
            "date": "December 5, 2011",
            "detail_rating": {
                "business": null,
                "cleanliness": 5.0,
                "desk": null,
                "location": 5.0,
                "pool": null,
                "restaurant": null,
                "rooms": 5.0,
                "service": 5.0,
                "sleep": 5.0,
                "value": 5.0
            },
            "helpfulness": null,
            "id": 121423060,
            "likes": {
                "disliked": null,
                "liked": null
            },
            "rating": 5.0,
            "stay_parameters": "Stayed November 2011, traveled solo",
            "text": "My client stayed at this hotel and loved it, servie winderful and so friendly, would highly recommend",
            "title": "Very warm hotel",
            "user": "agentone"
        },
        {
            "date": "December 3, 2011",
            "detail_rating": {
                "business": null,
                "cleanliness": 3.0,
                "desk": null,
                "location": 3.0,
                "pool": null,
                "restaurant": null,
                "rooms": 1.0,
                "service": 2.0,
                "sleep": 2.0,
                "value": 2.0
            },
            "helpfulness": 22,
            "id": 121347068,
            "likes": {
                "disliked": null,
                "liked": null
            },
            "rating": 2.0,
            "stay_parameters": "Stayed November 2011, traveled with family",
            "text": "Reading the other reviews I wondered did we stay in the same hotel? While the lobby is nice. The people that work there were nice I did have some serious problems with the hotel. You are no allowed to bring ANY food into the hotel. So all the lovely fruit stands etc you pass you can not bring anything in. No stops at the pastry shop for treats, no wine in your room etc. See the pics of the nice tables in the breakfast room? Don't even think about maybe a night snack there. You are not allowed to eat there except if you pay for their breakfast.",
            "title": "Quirky Rules made me feel we were staying in a hostel",
            "user": "Chitownbigcityfan"
        },
        {
            "date": "December 2, 2011",
            "detail_rating": {
                "business": null,
                "cleanliness": 5.0,
                "desk": null,
                "location": 5.0,
                "pool": null,
                "restaurant": null,
                "rooms": 5.0,
                "service": 5.0,
                "sleep": 5.0,
                "value": 5.0
            },
            "helpfulness": null,
            "id": 121320987,
            "likes": {
                "disliked": null,
                "liked": null
            },
            "rating": 5.0,
            "stay_parameters": "Stayed November 2011, traveled with friends",
            "text": "We had to hide our snacks and then throw them away wrapped up to hide it in our rooms. I would guess they must have a rodent problem? I did not see any but can not think of any other reason? I have stayed at hotels all over the world and have never been told this before. Felt like I was in a hostel.",
            "title": "Excellent accommodations and hospitality",
            "user": "Carol B"
        },
        {
            "date": "December 1, 2011",
            "detail_rating": {
                "business": null,
                "cleanliness": 5.0,
                "desk": null,
                "location": 5.0,
                "pool": null,
                "restaurant": null,
                "rooms": 5.0,
                "service": 5.0,
                "sleep": 5.0,
                "value": 5.0
            },
            "helpfulness": null,
            "id": 121282397,
            "likes": {
                "disliked": null,
                "liked": null
            },
            "rating": 5.0,
            "stay_parameters": "Stayed November 2011, traveled with family",
            "text": "Also I hear they have large rooms. Ours was a match box which I know is normal for Paris but there was no room to put luggage. They have these little closet things to \"hold\" your luggage. My daughter and I had the size just over a carry on and they would not fit in these. Half the room was taken up by a fridge which I have no idea why it is there since you can not bring food into your room?",
            "title": "Wonderful boutique hotel!",
            "user": "LKHKYbum"
        },
        {
            "date": "October 1, 2006",
            "detail_rating": {
                "business": 5.0,
                "cleanliness": 5.0,
                "desk": null,
                "front_desk": 5.0,
                "location": null,
                "pool": null,
                "restaurant": null,
                "rooms": 5.0,
                "service": 5.0,
                "sleep": null,
                "value": 5.0
            },
            "helpfulness": 2,
            "id": 5897769,
            "likes": {
                "disliked": null,
                "liked": "\u2014 the staff"
            },
            "rating": 5.0,
            "stay_parameters": "Stayed September 2006, traveled solo",
            "text": "The experience of staying in this hotel is nothing short of perfect. The staff is extremely friendly and helpful. The accomodations are clean, comfortable, and charming. The location of Hotel Londres-Eiffel is great for site seeing, for shopping, for sipping a vin rouge in the shadow of the Eiffel Tower. You can never get lost because the East Pillar of the Eiffel Tower, which is visible from almost anywhere, always lets you know where your home away from home is. I definitely will go back.",
            "title": "Classy hotel",
            "user": "tswanson"
        },
        {
            "date": "September 15, 2006",
            "detail_rating": {
                "business": 4.0,
                "cleanliness": 5.0,
                "desk": null,
                "front_desk": 5.0,
                "location": 5.0,
                "pool": null,
                "restaurant": null,
                "rooms": 4.0,
                "service": 5.0,
                "sleep": null,
                "value": 4.0
            },
            "helpfulness": 1,
            "id": 5805145,
            "likes": {
                "disliked": null,
                "liked": null
            },
            "rating": 5.0,
            "stay_parameters": "Stayed February 2006, traveled with family",
            "text": "Simply stated.....everything was LOVELY.....everything....we're not even waiting a whole year to return....",
            "title": "Lovely",
            "user": "30thanniversary"
        },
        {
            "date": "August 25, 2006",
            "detail_rating": {
                "business": 5.0,
                "cleanliness": 5.0,
                "desk": null,
                "front_desk": 5.0,
                "location": 5.0,
                "pool": null,
                "restaurant": null,
                "rooms": 4.0,
                "service": 5.0,
                "sleep": null,
                "value": 5.0
            },
            "helpfulness": 7,
            "id": 5709902,
            "likes": {
                "disliked": null,
                "liked": null
            },
            "rating": 5.0,
            "stay_parameters": "Stayed August 2006, traveled with family",
            "text": "We are a family of 2 adults and 3 kids aged 11, 13 and 15. We stayed for four nights at this hotel at the beginning of August, 2006.",
            "title": "Highly Recommend",
            "user": "MHB01"
        },
        {
            "date": "August 22, 2006",
            "detail_rating": {
                "business": 5.0,
                "cleanliness": 5.0,
                "desk": null,
                "front_desk": 5.0,
                "location": 5.0,
                "pool": null,
                "restaurant": null,
                "rooms": 4.0,
                "service": 5.0,
                "sleep": null,
                "value": 5.0
            },
            "helpfulness": 6,
            "id": 5699070,
            "likes": {
                "disliked": "\u2014 Not much of a view from our room",
                "liked": "\u2014 location"
            },
            "rating": 5.0,
            "stay_parameters": "Stayed August 2006, traveled with family",
            "text": "We found it through Trip Advisor, and so it is only fair that I write a review after staying there. Everything I had read on Trip Advisor turned out to be true and we have a great experience at the hotel.",
            "title": "Charming little hotel",
            "user": "rskeen"
        },
        {
            "date": "August 20, 2006",
            "detail_rating": {
                "business": 5.0,
                "cleanliness": 5.0,
                "desk": null,
                "front_desk": 5.0,
                "location": 5.0,
                "pool": null,
                "restaurant": null,
                "rooms": 4.0,
                "service": 5.0,
                "sleep": null,
                "value": 4.0
            },
            "helpfulness": 5,
            "id": 5629484,
            "likes": {
                "disliked": "\u2014 rooms were small",
                "liked": "\u2014 value"
            },
            "rating": 4.0,
            "stay_parameters": "Stayed August 2006, traveled with family",
            "text": "Arnaud was terrific and extremely helpful. The hotel has an elevator, however, the rooms that we were given were not accessible by elevator. Arnaud carried every piece of our 9 pieces of luggage up two flights of stairs for us. When we left, Arnaud was off that day, however we had help bringing the luggage down from the gentleman on duty at the time (his name escapes me right now)",
            "title": "Fabulous value",
            "user": "gimmel1"
        },
        {
            "date": "August 4, 2006",
            "detail_rating": {
                "business": null,
                "cleanliness": 3.0,
                "desk": null,
                "front_desk": 3.0,
                "location": 4.0,
                "pool": null,
                "restaurant": null,
                "rooms": 3.0,
                "service": 2.0,
                "sleep": null,
                "value": 4.0
            },
            "helpfulness": 5,
            "id": 5558748,
            "likes": {
                "disliked": null,
                "liked": null
            },
            "rating": 3.0,
            "stay_parameters": "Stayed July 2006, traveled with family",
            "text": "Stayed here in July during a heat wave. We were happy that the room had air conditioning. Before arriving they had offered a cot for our baby but when we arrived there was an extra bed and no cot. To be fair with did not complain about this, since we found it easier for our son to sleep with us, so we don't know what they would have done had we done so. Our room was on a second floor but the only way to get ther was through a dark staircase that had some winding and weird steps, there was no lift in that area of the hotel. To get to other rooms there was a lift available. On our arrival we were helped to get our heavy suitcases to the room but on departure it was up to us to carry them down the stairs. The breakfast was very poor and had very little choices, I think this is the way it is in most french hotels so it's probably not a particular problem to this one. The ladies who served breakfast spoke nothing but french, so if your french is not too good you might be in a bit of trouble. The reception staff was not particularly helpful to us. I agree with another reviewer who wrote that they cater to USA tourist here so that might have been the problem since we're not Americans. The location is the best thing about this hotel. There are also several restaurants in the area as well as 2 laundrymats and a supermarket just around the corner. They also have free wi-fe internet access which was a plus. If you want a place close to the Eiffel Tower stay here but be sure to ask for a room with lift access. If the location is not an issue for you I'm sure that there are better places you can find.",
            "title": "Good enough hotel",
            "user": "TjLaura"
        },
        {
            "date": "July 30, 2006",
            "detail_rating": {
                "business": null,
                "cleanliness": null,
                "desk": null,
                "location": null,
                "pool": null,
                "restaurant": null,
                "rooms": null,
                "service": null,
                "sleep": null,
                "value": null
            },
            "helpfulness": 8,
            "id": 5529796,
            "likes": {
                "disliked": null,
                "liked": null
            },
            "rating": 4.0,
            "stay_parameters": null,
            "text": "My husband and I stayed here as part of the Rick Steves' one-week tour of Paris. The hotel was very nice and clean. The rooms are small, but nicely kept. Bathroom was larger than we expected, based on the other reviews we read. Nice shower, with excellent water pressure, room 35, on the third floor. Hotel has both a small elevator and stairs. Breakfast was nice, breads, cheese, fruit, yogurt, juices, coffee, etc.",
            "title": "Very nice, pleasant hotel, well-located",
            "user": "MargNashville"
        },
        {
            "date": "July 26, 2006",
            "detail_rating": {
                "business": null,
                "cleanliness": null,
                "desk": null,
                "location": null,
                "pool": null,
                "restaurant": null,
                "rooms": null,
                "service": null,
                "sleep": null,
                "value": null
            },
            "helpfulness": 5,
            "id": 5515223,
            "likes": {
                "disliked": null,
                "liked": null
            },
            "rating": 4.0,
            "stay_parameters": null,
            "text": "Staff was very nice -- weather was in the 90s during three of the days we visited Paris, and the hotel was very nice to take care of my husband's request for ice each afternoon.",
            "title": "A nice stay",
            "user": "JD143"
        },
        {
            "date": "July 24, 2006",
            "detail_rating": {
                "business": 3.0,
                "cleanliness": 4.0,
                "desk": null,
                "front_desk": 2.0,
                "location": 4.0,
                "pool": null,
                "restaurant": null,
                "rooms": 3.0,
                "service": 2.0,
                "sleep": null,
                "value": 3.0
            },
            "helpfulness": 14,
            "id": 5502476,
            "likes": {
                "disliked": null,
                "liked": null
            },
            "rating": 2.0,
            "stay_parameters": "Stayed June 2006, traveled with family",
            "text": "The hair dryer they provided did the job, and I did not have to unpack mine, and we also did not need the power adapter we brought, as the dryer unit also had a 110-volt US-style electrical plug, which we used for charging my husband's shaver and camera battery.",
            "title": "Surprised by all the great reviews",
            "user": "LindyM"
        },
        {
            "date": "July 20, 2006",
            "detail_rating": {
                "business": null,
                "cleanliness": null,
                "desk": null,
                "location": null,
                "pool": null,
                "restaurant": null,
                "rooms": null,
                "service": null,
                "sleep": null,
                "value": null
            },
            "helpfulness": 7,
            "id": 5490474,
            "likes": {
                "disliked": null,
                "liked": null
            },
            "rating": 4.0,
            "stay_parameters": null,
            "text": "I don't think we could have had a better location for a hotel...it is located close to everything, but also enjoys the benefit of being on a quiet street.",
            "title": "A great hotel!",
            "user": "kabie55"
        },
        {
            "date": "July 11, 2006",
            "detail_rating": {
                "business": null,
                "cleanliness": 5.0,
                "desk": null,
                "location": null,
                "pool": null,
                "restaurant": null,
                "rooms": 5.0,
                "service": 5.0,
                "sleep": null,
                "value": 5.0
            },
            "helpfulness": 10,
            "id": 5453390,
            "likes": {
                "disliked": null,
                "liked": null
            },
            "rating": 5.0,
            "stay_parameters": "Stayed July 2006",
            "text": "We had a wonderful two day stay at the Hotel de Londres Eiffel. The location was great with only a short walk to the Eiffel tower. The metro and bus stops were also close. The staff were very helpful with buses, taxis and directions.",
            "title": "Great location and value",
            "user": "Fred Z"
        },
        {
            "date": "June 27, 2006",
            "detail_rating": {
                "business": null,
                "cleanliness": 5.0,
                "desk": null,
                "location": null,
                "pool": null,
                "restaurant": null,
                "rooms": 4.0,
                "service": 4.0,
                "sleep": null,
                "value": 4.0
            },
            "helpfulness": 23,
            "id": 5396161,
            "likes": {
                "disliked": null,
                "liked": null
            },
            "rating": 4.0,
            "stay_parameters": "Stayed June 2006",
            "text": "My husband and I decided to celebrate our 30th Wedding Anniversary in Paris. What a fabulous celebration it turned out to be! Upon our arrival at the hotel we found it to be quite charming. Arnaud greeted us warmly and directed us to our 6th floor room with a wonderful view of the Eiffel Tower. The room was quite small but immaculate. You have to understand that all hotel rooms (except the very expensive ones) are usually small. The mattress on the queen size bed was extremely comfortable. Our bathroom was a nice size and extremely clean. The only downside was the tiny shower. You have to pray that you don\u2019t drop the soap! But what does the size of the room and shower matter \u2013 you are in Paris!! The hotel was in a great location, especially for first time visitors. There were two bus stops very close to the hotel and we found that taking it was so easy. This way you get to see the sights instead of being underground in the subway. Every amenity you could possibly want was within a few blocks. There were grocery stores, bakeries, dry cleaners, wine stores and restaurants all right outside the hotel doors. Rue Cler (the market shopping street) was only a few blocks away. Our favorite little bakery was just up the street on Rue St. Dominique. Every morning my husband and I went there for our caf\u00e9 au lait and croissant. (M-M-M very delicious!) It was very charming and there were a few tables outdoors and inside. The prices were very reasonable. Almost every meal we had in Paris was excellent. We ventured out of the area we stayed in for every meal except the first night when we ate at the Le Fountaine de Mars which was just up the street from the hotel. It was very good and the people were very friendly. They didn\u2019t mind at all that our French was not the best. My husband had a duck with a port wine sauce and I had a delicious salmon with lemon sauce. A few nights later we ate at another terrific Italian place called Casa Bini located in St. Germain. Ask to be seated upstairs where it is a little more romantic. For our 30th Anniversary dinner we decided to go to Le Grand Colbert (the restaurant where \u201cSomething\u2019s Gotta Give\u201d was filmed). It was absolutely beautiful and the food and service were excellent. We can\u2019t wait to go back again. The profiteroles were to die for! On our last night in Paris we ate at another wonderful restaurant located on 73 rue de Seine in St. Germain called City Zen Caf\u00e9. It was a very tiny and cozy place with a spectacular roast duck breast with a plum sauce. I even thought it was delicious and I don\u2019t really enjoy duck. The cr\u00e8me brulee was a let down though. The only meal that we thought was awful was at a restaurant I found in the Access Paris tour book. It was called Relais Due Massif Central and was located near the Bastille. The waiter was rude and it didn\u2019t seem to matter that I had ordered steak because he decided that I had ordered veal and even though I ordered a banana tart he brought me chocolate cake instead. My husband ate the veal and said it was stringy and I thought the beef was very tough. Avoid this restaurant at all costs.",
            "title": "Manhattanites have excellent stay",
            "user": "MM08"
        },
        {
            "date": "June 20, 2006",
            "detail_rating": {
                "business": null,
                "cleanliness": 5.0,
                "desk": null,
                "location": null,
                "pool": null,
                "restaurant": null,
                "rooms": 4.0,
                "service": 5.0,
                "sleep": null,
                "value": 5.0
            },
            "helpfulness": 16,
            "id": 5368356,
            "likes": {
                "disliked": null,
                "liked": null
            },
            "rating": 5.0,
            "stay_parameters": "Stayed June 2006",
            "text": "Forget what people say about Parisians being rude. It generally just isn\u2019t true. People went out of their way to be helpful. My husband was trying to purchase tickets in the metro for the bus and 2 young ladies helped him just at they were running to catch their train. All in all we can\u2019t wait to go back again and wouldn\u2019t hesitate to stay at the Hotel De Londres Eiffel again.",
            "title": "Loved our Stay",
            "user": "LAworld"
        },
        {
            "date": "June 13, 2006",
            "detail_rating": {
                "business": null,
                "cleanliness": 5.0,
                "desk": null,
                "location": null,
                "pool": null,
                "restaurant": null,
                "rooms": 5.0,
                "service": 5.0,
                "sleep": null,
                "value": 5.0
            },
            "helpfulness": 10,
            "id": 5339076,
            "likes": {
                "disliked": null,
                "liked": null
            },
            "rating": 4.0,
            "stay_parameters": "Stayed June 2006",
            "text": "We recently spent four nights with our two children at this small hotel. We booked two rooms. The rooms have everything you need (air con, hair dryer, very clean, quiet), but are very small. The staff is extremely helpful and made excellent dinner reservations for us (our favorite was Le P'tit Troquet). The hotel is surrounded by great food shops, bakeries and restauants. There are also two laundrymats across the street which is especially important when traveling with children. It is an easy walk to the Eiffel Tower and to boat rides on the Seine. We loved to buy a picnic lunch from the local shops and and walk the couple of blocks to the Parc du Champs de Mars. We found it to be a lovely hotel in a quiet and convenient location.",
            "title": "Great location, great value.",
            "user": "DarylFielding"
        },
        {
            "date": "June 4, 2006",
            "detail_rating": {
                "business": null,
                "cleanliness": null,
                "desk": null,
                "location": null,
                "pool": null,
                "restaurant": null,
                "rooms": null,
                "service": null,
                "sleep": null,
                "value": null
            },
            "helpfulness": 13,
            "id": 5297994,
            "likes": {
                "disliked": null,
                "liked": null
            },
            "rating": 5.0,
            "stay_parameters": null,
            "text": "Stayed here on a tour of France. Rooms typically small and parisian, but well appointed and clean. The shower room was very clean and surprisingly big. Common parts not particulary spacious but loads to do nearby including the tower as others have mentioned. The market nearby is fantastic for fresh food, and people watching. And the confit de canard shop opposite is stunning.",
            "title": "Rick Steves Paris Tour Hotel",
            "user": "A TripAdvisor user"
        },
        {
            "date": "May 21, 2006",
            "detail_rating": {
                "business": null,
                "cleanliness": 5.0,
                "desk": null,
                "location": null,
                "pool": null,
                "restaurant": null,
                "rooms": 5.0,
                "service": 5.0,
                "sleep": null,
                "value": 5.0
            },
            "helpfulness": 11,
            "id": 5185660,
            "likes": {
                "disliked": null,
                "liked": null
            },
            "rating": 5.0,
            "stay_parameters": "Stayed May 2006",
            "text": "Made a last min. change to the Hotel de Londres-Eiffel .What a excellent choice! Spotless rooms .Super location. And a wonderful staff! Arnaud who was on duty was Very helpful in making our",
            "title": "Everything was Great!",
            "user": "one4one"
        },
        {
            "date": "May 16, 2006",
            "detail_rating": {
                "business": null,
                "cleanliness": null,
                "desk": null,
                "location": null,
                "pool": null,
                "restaurant": null,
                "rooms": null,
                "service": null,
                "sleep": null,
                "value": null
            },
            "helpfulness": 12,
            "id": 5078327,
            "likes": {
                "disliked": null,
                "liked": null
            },
            "rating": 5.0,
            "stay_parameters": null,
            "text": "Paris stay enjoyable helping set up tours. and let me add Perfect English! On our next trip",
            "title": "HOTEL LONDRES EIFFEL PARIS",
            "user": "A TripAdvisor user"
        },
        {
            "date": "May 13, 2006",
            "detail_rating": {
                "business": null,
                "cleanliness": null,
                "desk": null,
                "location": null,
                "pool": null,
                "restaurant": null,
                "rooms": null,
                "service": null,
                "sleep": null,
                "value": null
            },
            "helpfulness": 5,
            "id": 5065836,
            "likes": {
                "disliked": null,
                "liked": null
            },
            "rating": 3.0,
            "stay_parameters": null,
            "text": "to Paris we will stay at the Hotel de Londres-Effel. Thanks Arnaud and Cedric !",
            "title": "Decent place to stay near Eiffel Tower",
            "user": "A TripAdvisor user"
        },
        {
            "date": "February 12, 2009",
            "detail_rating": {
                "business": null,
                "cleanliness": 4.0,
                "desk": null,
                "location": 5.0,
                "pool": null,
                "restaurant": null,
                "rooms": 2.0,
                "service": 3.0,
                "sleep": null,
                "value": 3.0
            },
            "helpfulness": null,
            "id": 24499532,
            "likes": {
                "disliked": null,
                "liked": null
            },
            "rating": 4.0,
            "stay_parameters": "Stayed June 2008, traveled as a couple",
            "text": "We only had a chance to stay here for one night. Our last night in France. And it was wonderful. I wanted something charming and quant, very parisian for our last night. This was it. The hotel is a very nice and clean place. The staff was friendly and helpful. The room was clean, a bit small but I think we've stayed in smaller rooms in NYC. The breakfast in the morning was a nice finish to the stay.",
            "title": "Smallish room but location was wonderful!",
            "user": "bmanzilla"
        },
        {
            "date": "February 11, 2009",
            "detail_rating": {
                "business": null,
                "cleanliness": 5.0,
                "desk": null,
                "location": 5.0,
                "pool": null,
                "restaurant": null,
                "rooms": 4.0,
                "service": 4.0,
                "sleep": null,
                "value": 4.0
            },
            "helpfulness": null,
            "id": 24467256,
            "likes": {
                "disliked": null,
                "liked": null
            },
            "rating": 4.0,
            "stay_parameters": "Stayed January 2009, traveled as a couple",
            "text": "This is a lovely hotel in anice quiet street. It is two minutes away from the eiffel tower and there are plenty of nice restaurants to go to nearby. The staff were friendly and helpful not minding that we could speak very little french! They were very acoomodating to anything we asked . The rooms were sparkling clean and well decorated. Although it was small i felt that it just added to its cosiness.",
            "title": "Lovely small hotel, great location.",
            "user": "Sally1984"
        },
        {
            "date": "January 26, 2009",
            "detail_rating": {
                "business": 4.0,
                "cleanliness": 5.0,
                "desk": null,
                "front_desk": 5.0,
                "location": 5.0,
                "pool": null,
                "restaurant": null,
                "rooms": 5.0,
                "service": 5.0,
                "sleep": null,
                "value": 5.0
            },
            "helpfulness": null,
            "id": 23925403,
            "likes": {
                "disliked": "\u2014 Nothing",
                "liked": "\u2014 Value for money, beautiful decor, great location, comfort of rooms, friendly staff"
            },
            "rating": 5.0,
            "stay_parameters": "Stayed January 2009, traveled as a couple",
            "text": "Downside was that there was building work going on in the room next to us which meant an early wake up of half eight every morning which we weren't warned about - just as well we were eager to get sightseeing.",
            "title": "Loved This Charming Place",
            "user": "carpediemCanada"
        },
        {
            "date": "January 23, 2009",
            "detail_rating": {
                "business": 3.0,
                "cleanliness": 3.0,
                "desk": null,
                "front_desk": 3.0,
                "location": 3.0,
                "pool": null,
                "restaurant": null,
                "rooms": 3.0,
                "service": 3.0,
                "sleep": null,
                "value": 3.0
            },
            "helpfulness": 6,
            "id": 23834277,
            "likes": {
                "disliked": "\u2014 Overpriced",
                "liked": "\u2014 Location, Location, Location"
            },
            "rating": 2.0,
            "stay_parameters": "Stayed January 2009, traveled as a couple",
            "text": "The room was very small which was fine for me but a big of a squeeze for the other half who found the tiny bath a bit of an experience. Also like to be able to make tea and coffee in the room which we couldn't do.",
            "title": "2nd Time Not As Good",
            "user": "greggcl"
        },
        {
            "date": "January 21, 2009",
            "detail_rating": {
                "business": 5.0,
                "cleanliness": 5.0,
                "desk": null,
                "front_desk": 5.0,
                "location": 5.0,
                "pool": null,
                "restaurant": null,
                "rooms": 5.0,
                "service": 5.0,
                "sleep": null,
                "value": 5.0
            },
            "helpfulness": null,
            "id": 23746112,
            "likes": {
                "disliked": "\u2014 n/a",
                "liked": "\u2014 The charming decoration"
            },
            "rating": 5.0,
            "stay_parameters": "Stayed December 2008, traveled with friends",
            "text": "This was our second time at this hotel. It has such wonderful Parisian charm! The decor is welcoming, cozy, and tasteful.",
            "title": "Perfect !",
            "user": "Jazot"
        },
        {
            "date": "January 18, 2009",
            "detail_rating": {
                "business": 2.0,
                "cleanliness": 4.0,
                "desk": null,
                "front_desk": 3.0,
                "location": 5.0,
                "pool": null,
                "restaurant": null,
                "rooms": 4.0,
                "service": 3.0,
                "sleep": null,
                "value": 3.0
            },
            "helpfulness": null,
            "id": 23669976,
            "likes": {
                "disliked": "\u2014 The smell",
                "liked": "\u2014 The location combined with the prize"
            },
            "rating": 3.0,
            "stay_parameters": "Stayed November 2008, traveled as a couple",
            "text": "We stayed two nights at Londres Eiffel and we were very pleased. Due to an, not surprisingly, sudden AirFrance pilot strike we arrived by car after midnight, but we had called the hotel earlier the same evening to inform them about our late arrival and this was no problem at all. Our room on the top floor was indeed small and had an odd smell of an old basement. Besides from the smell everything was fine and the bathroom was clean and there were plenty of towels. The first morning we had a caf\u00e9 breakfast, but the second morning we decided to go for the hotel buffet breakfast and we were not disappointed, on the contrary, there was plenty to chose from and a bargin compared to a caf\u00e9 breakfast. The staff was not overly friendly, but ok. The room was very quiet and the prize very low, thinking about the fantastic location. One night we had dinner at the tiny restaurant just next door, think it was called \"Chez Alice\" or something like it. Fun experience since the lady had had the place for years and she cooks, waits and does the dishes alone, all while her little dog lies on a chair among the guests.",
            "title": "Location is everything",
            "user": "marictor"
        },
        {
            "date": "December 27, 2008",
            "detail_rating": {
                "business": 3.0,
                "cleanliness": 3.0,
                "desk": null,
                "front_desk": 2.0,
                "location": 5.0,
                "pool": null,
                "restaurant": null,
                "rooms": 3.0,
                "service": 3.0,
                "sleep": null,
                "value": 3.0
            },
            "helpfulness": 1,
            "id": 23026444,
            "likes": {
                "disliked": "\u2014 arrogant reception desk",
                "liked": "\u2014 Location"
            },
            "rating": 3.0,
            "stay_parameters": "Stayed December 2008, traveled with family",
            "text": "I booked the hotel owing to the reviews on this website. Our stay was quite nice and there is a lot on the upside, but also some disappointments.",
            "title": "Ok, A Little Disappointing",
            "user": "JohannVienna"
        },
        {
            "date": "December 10, 2008",
            "detail_rating": {
                "business": 5.0,
                "cleanliness": 5.0,
                "desk": null,
                "front_desk": 3.0,
                "location": 5.0,
                "pool": null,
                "restaurant": null,
                "rooms": 5.0,
                "service": null,
                "sleep": null,
                "value": 4.0
            },
            "helpfulness": 1,
            "id": 22613618,
            "likes": {
                "disliked": "\u2014 Nowhere to get a hot drink!",
                "liked": "\u2014 Location"
            },
            "rating": 4.0,
            "stay_parameters": "Stayed November 2008, traveled as a couple",
            "text": "The Hotel is very good situated in one of the most upscale neighborhoods of Paris. Many nice shops and restaurants are in a short walking distance, the area is not so crowded by tourists as many other areas we have seen. And the view of the Eiffel Tower on the way back to the Hotel after sightseeing or shopping is simply stunning.",
            "title": "Just what we needed",
            "user": "Merman101"
        },
        {
            "date": "December 5, 2008",
            "detail_rating": {
                "business": 4.0,
                "cleanliness": 4.0,
                "desk": null,
                "front_desk": 5.0,
                "location": 5.0,
                "pool": null,
                "restaurant": null,
                "rooms": 4.0,
                "service": 4.0,
                "sleep": null,
                "value": 4.0
            },
            "helpfulness": null,
            "id": 22458296,
            "likes": {
                "disliked": "\u2014 Low Water Pressure",
                "liked": "\u2014 Location"
            },
            "rating": 4.0,
            "stay_parameters": "Stayed October 2007, traveled solo",
            "text": "Our room was extremely small, but more or less comfortable and nice. The bed was ok and the bathroom as well.",
            "title": "Excellent Location",
            "user": "chintsuu"
        },
        {
            "date": "November 25, 2008",
            "detail_rating": {
                "business": 5.0,
                "cleanliness": 5.0,
                "desk": null,
                "front_desk": 5.0,
                "location": 5.0,
                "pool": null,
                "restaurant": null,
                "rooms": 5.0,
                "service": 5.0,
                "sleep": null,
                "value": 5.0
            },
            "helpfulness": 1,
            "id": 22161227,
            "likes": {
                "disliked": "\u2014 Nothing",
                "liked": "\u2014 Staff/Rooms"
            },
            "rating": 5.0,
            "stay_parameters": "Stayed October 2008",
            "text": "I guess we were just a little unlucky with our room, while cleaning i got a glimpse of other rooms and some of them looked much nicer. In a small Hotel like this i expect a more personal or more welcoming atmosphere.",
            "title": "Stay here if you go to Paris!",
            "user": "VersaillesGurl"
        },
        {
            "date": "May 29, 2013",
            "detail_rating": {
                "business": null,
                "cleanliness": 5.0,
                "desk": null,
                "location": 5.0,
                "pool": null,
                "restaurant": null,
                "rooms": 5.0,
                "service": 4.0,
                "sleep": 3.0,
                "value": 3.0
            },
            "helpfulness": 2,
            "id": 162343689,
            "likes": {
                "disliked": null,
                "liked": null
            },
            "rating": 5.0,
            "stay_parameters": "Stayed August 2012, traveled with friends",
            "text": "I stayed in this hotel last year with a group of friends and found it to be very charming.",
            "title": "Charming hotel",
            "user": "Tah_Ta_01"
        },
        {
            "date": "May 29, 2013",
            "detail_rating": {
                "business": null,
                "cleanliness": 5.0,
                "desk": null,
                "location": 5.0,
                "pool": null,
                "restaurant": null,
                "rooms": 5.0,
                "service": 5.0,
                "sleep": 5.0,
                "value": 5.0
            },
            "helpfulness": null,
            "id": 162331364,
            "likes": {
                "disliked": null,
                "liked": null
            },
            "rating": 5.0,
            "stay_parameters": "Stayed May 2013, traveled as a couple",
            "text": "It is nicely maintained and decorated in a very quaint, Parisian style. As it is located so centrally, the rooms are quite small, but that's to be expected.",
            "title": "\"Our whole experience was excellent\"",
            "user": "donald l"
        },
        {
            "date": "May 28, 2013",
            "detail_rating": {
                "business": null,
                "cleanliness": null,
                "desk": null,
                "location": null,
                "pool": null,
                "restaurant": null,
                "rooms": null,
                "service": null,
                "sleep": null,
                "value": null
            },
            "helpfulness": null,
            "id": 162157989,
            "likes": {
                "disliked": null,
                "liked": null
            },
            "rating": 5.0,
            "stay_parameters": null,
            "text": "The staff were really very helpful and I would definitely stay there again!",
            "title": "A great place to stay in Paris",
            "user": "choochoo123"
        },
        {
            "date": "May 27, 2013",
            "detail_rating": {
                "business": null,
                "cleanliness": 5.0,
                "desk": null,
                "location": 5.0,
                "pool": null,
                "restaurant": null,
                "rooms": 4.0,
                "service": 5.0,
                "sleep": 4.0,
                "value": 4.0
            },
            "helpfulness": 1,
            "id": 162050503,
            "likes": {
                "disliked": null,
                "liked": null
            },
            "rating": 5.0,
            "stay_parameters": "Stayed May 2013, traveled as a couple",
            "text": "My wife and myself wanted a completely different experience when it came to picking a hotel stay in Paris, we wanted a neighborhood feel, surrounded by cafe's centrally located to everything, we couldn't have picked a better spot, it was a very pleasant stay, everyone there made us feel at home and were very helpful to our needs, most of our contact was with arnaud and he couldn't have been more helpful, we were on an 18 day drive trip of Europe and this was by far our favorite stop, highly recommend this Hotel and Staff",
            "title": "Great location, and great people!",
            "user": "Jen K"
        },
        {
            "date": "May 23, 2013",
            "detail_rating": {
                "business": null,
                "cleanliness": 5.0,
                "desk": null,
                "location": 5.0,
                "pool": null,
                "restaurant": null,
                "rooms": 4.0,
                "service": 5.0,
                "sleep": 4.0,
                "value": 5.0
            },
            "helpfulness": 1,
            "id": 161626094,
            "likes": {
                "disliked": null,
                "liked": null
            },
            "rating": 5.0,
            "stay_parameters": "Stayed May 2013, traveled as a couple",
            "text": "We loved the hotel's location and the bistro just down the street had great food and excellent service. The rooms are tiny but very clean and nicely decorated. We don't visit Paris to stay in our room. The staff are very nice and helpful.",
            "title": "Charming, romantic and stratigecally located ;)",
            "user": "Kisochka"
        },
        {
            "date": "December 22, 2011",
            "detail_rating": {
                "business": null,
                "cleanliness": 5.0,
                "desk": null,
                "location": 5.0,
                "pool": null,
                "restaurant": null,
                "rooms": 5.0,
                "service": 5.0,
                "sleep": 5.0,
                "value": 5.0
            },
            "helpfulness": 5,
            "id": 121994869,
            "likes": {
                "disliked": null,
                "liked": null
            },
            "rating": 5.0,
            "stay_parameters": "Stayed December 2011, traveled with family",
            "text": "This reasonably-priced and cozy hotel is in a wonderful quiet but thriving neighborhood, close to the Eiffel Tower and to the city center but far from the tourist hordes. The cafes and restaurants are in the area are excellent. Rooms were small but comfortable, and very quiet. Decor was very tasteful and almost all the front desk staff was helpful with multiple questions and directions. A great find!",
            "title": "Excellent Neighborhood, Warm Service",
            "user": "Maggie J"
        },
        {
            "date": "December 21, 2011",
            "detail_rating": {
                "business": null,
                "cleanliness": 5.0,
                "desk": null,
                "location": 5.0,
                "pool": null,
                "restaurant": null,
                "rooms": 4.0,
                "service": 4.0,
                "sleep": 5.0,
                "value": 4.0
            },
            "helpfulness": 3,
            "id": 121945897,
            "likes": {
                "disliked": null,
                "liked": null
            },
            "rating": 4.0,
            "stay_parameters": "Stayed September 2011, traveled as a couple",
            "text": "We stayed in this hotel for one night after spend a week with friends in the 5th. We really liked this hotel. The rooms were clean, modern and comfortable, and the location was perfect. It was an easy stroll to the Eiffel Tower, and Cafe Constant is a brilliant restaurant next door which had been recommended many times to us. The only problem we had was that we requested a shuttle to the airport the next morning and the concierge forgot to book it. However the staff the next morning went out of their way once they realised the error and made sure we got to the airport in time. Despite this small issue, we would definitely recommend it and would stay again.",
            "title": "Good location, nice hotel",
            "user": "AandHSydney"
        },
        {
            "date": "December 18, 2011",
            "detail_rating": {
                "business": null,
                "cleanliness": 5.0,
                "desk": null,
                "location": 5.0,
                "pool": null,
                "restaurant": null,
                "rooms": 4.0,
                "service": 5.0,
                "sleep": 4.0,
                "value": 4.0
            },
            "helpfulness": 3,
            "id": 121864518,
            "likes": {
                "disliked": null,
                "liked": null
            },
            "rating": 5.0,
            "stay_parameters": "Stayed November 2011, traveled with family",
            "text": "We decided to book a last minute trip to Paris for a weekend in November and was very lucky to have found this cute boutique hotel, right next to the Eiffel Tower! We were traveling with a one year (which can always be a little challenging) and from the moment we arrived the staff did everything they could to make our stay as stress free as possible. They gave us milk, let us use their fridge for the baby's food, and even gave us a late check out so the baby could finish her nap. In addition, operating from the front desk, Arno was the BEST tour guide. There wasn't a question he did could not answer and directed us, on more then one occasion, to the best places! The rooms were nice and quiet (we were on the first floor) and the beds were comfortable. There was a great bakery just down the street and it was within walking distant from the metro. When I return to Paris, I will stay here without a doubt. The staff made our first Paris experience very enjoyable...thank you!!",
            "title": "Perfect Location and Amazing Staff",
            "user": "mayday19"
        },
        {
            "date": "December 15, 2011",
            "detail_rating": {
                "business": null,
                "cleanliness": 5.0,
                "desk": null,
                "location": 5.0,
                "pool": null,
                "restaurant": null,
                "rooms": 5.0,
                "service": 5.0,
                "sleep": 5.0,
                "value": 5.0
            },
            "helpfulness": 3,
            "id": 121769445,
            "likes": {
                "disliked": null,
                "liked": null
            },
            "rating": 5.0,
            "stay_parameters": "Stayed December 2011, traveled with family",
            "text": "I stayed at this hotel 3 years ago with 5 friends and was impressed with this (I believe a family) Hotel.",
            "title": "100% Plus..location, service and accomodation",
            "user": "judith c"
        },
        {
            "date": "December 14, 2011",
            "detail_rating": {
                "business": null,
                "cleanliness": 5.0,
                "desk": null,
                "location": 5.0,
                "pool": null,
                "restaurant": null,
                "rooms": 5.0,
                "service": 5.0,
                "sleep": 5.0,
                "value": 5.0
            },
            "helpfulness": 4,
            "id": 121725344,
            "likes": {
                "disliked": null,
                "liked": null
            },
            "rating": 5.0,
            "stay_parameters": "Stayed December 2011, traveled with family",
            "text": "This fall I was travelling with my adult son and heading home from Kenya to Canada.",
            "title": "Excellent hotel",
            "user": "isobel e"
        },
        {
            "date": "June 5, 2013",
            "detail_rating": {
                "business": null,
                "cleanliness": 5.0,
                "desk": null,
                "location": 5.0,
                "pool": null,
                "restaurant": null,
                "rooms": 5.0,
                "service": 5.0,
                "sleep": 5.0,
                "value": 5.0
            },
            "helpfulness": 2,
            "id": 163108326,
            "likes": {
                "disliked": null,
                "liked": null
            },
            "rating": 5.0,
            "stay_parameters": "Stayed May 2013, traveled as a couple",
            "text": "We stayed at Hotel de Londres Eiffel for 5 nights in May and had a wonderful time. Arnaud greeted us when we arrived and spent time with us to orient ourselves with the city as this was our first visit to Paris. He gave us wonderful tips during our stay. The hotel is on a lovely quiet street in the 7th district. A very short walk to the Eiffel tower with many restaurants, transportation, bakeries and stores at our door step. The first night of our stay, we were offered a room with the view of the Eiffel tower and it truly was a magical experience - one that I would recommend if you can. The rooms we stayed in were decorated in such a beautiful Parisian design - it really added to the experience. The staff of the hotel were all so helpful and friendly and went out of their way to make our stay a great. We would definitely stay here again upon our next visit to Paris!",
            "title": "Beautiful Boutique Hotel in a Wonderful Location of Paris!",
            "user": "yogibb"
        },
        {
            "date": "June 2, 2013",
            "detail_rating": {
                "business": null,
                "cleanliness": 4.0,
                "desk": null,
                "location": 5.0,
                "pool": null,
                "restaurant": null,
                "rooms": 5.0,
                "service": 4.0,
                "sleep": 5.0,
                "value": 4.0
            },
            "helpfulness": 2,
            "id": 162790004,
            "likes": {
                "disliked": null,
                "liked": null
            },
            "rating": 5.0,
            "stay_parameters": "Stayed January 2013, traveled as a couple",
            "text": "Stayed here in January and will definitely book this hotel for future stays.",
            "title": "Very enjoyable stay",
            "user": "eight7eleven"
        },
        {
            "date": "May 31, 2013",
            "detail_rating": {
                "business": null,
                "cleanliness": 4.0,
                "desk": null,
                "location": 4.0,
                "pool": null,
                "restaurant": null,
                "rooms": 3.0,
                "service": 5.0,
                "sleep": 4.0,
                "value": 5.0
            },
            "helpfulness": 2,
            "id": 162497918,
            "likes": {
                "disliked": null,
                "liked": null
            },
            "rating": 4.0,
            "stay_parameters": "Stayed May 2013, traveled with family",
            "text": "It is excellently located in a very nice neighbourhood. Upon arrival, we were greeted by a very friendly receptionist who upgraded us for free to the room with the view of the Eiffel Tower, saying it was a shame for it to be empty - how great!!",
            "title": "Great people",
            "user": "Suvabrata"
        },
        {
            "date": "May 30, 2013",
            "detail_rating": {
                "business": null,
                "cleanliness": 4.0,
                "desk": null,
                "location": 5.0,
                "pool": null,
                "restaurant": null,
                "rooms": 4.0,
                "service": 5.0,
                "sleep": 4.0,
                "value": 4.0
            },
            "helpfulness": 1,
            "id": 162483464,
            "likes": {
                "disliked": null,
                "liked": null
            },
            "rating": 5.0,
            "stay_parameters": "Stayed April 2013, traveled solo",
            "text": "The breakfast was basic but perfectly sufficient for starting a day of sightseeing. Only a few minutes walk to the Eiffel Tower and the Seine. The open top bus tours also stop around 10 minutes away.",
            "title": "Charming Boutique Hotel",
            "user": "teresa_asa"
        },
        {
            "date": "May 30, 2013",
            "detail_rating": {
                "business": null,
                "cleanliness": 5.0,
                "desk": null,
                "location": 5.0,
                "pool": null,
                "restaurant": null,
                "rooms": 5.0,
                "service": 5.0,
                "sleep": 5.0,
                "value": 4.0
            },
            "helpfulness": 2,
            "id": 162432496,
            "likes": {
                "disliked": null,
                "liked": null
            },
            "rating": 5.0,
            "stay_parameters": "Stayed April 2013, traveled with family",
            "text": "The area has lots of excellent restaurants, bakeries etc. We particularly enjoyed FL restaurant (right next door) as well as a meal at Cafe Constant down the road.",
            "title": "Gem by the Eiffel Tower",
            "user": "IamChuckC"
        },
        {
            "date": "May 1, 2013",
            "detail_rating": {
                "business": null,
                "cleanliness": 5.0,
                "desk": null,
                "location": 5.0,
                "pool": null,
                "restaurant": null,
                "rooms": 5.0,
                "service": 5.0,
                "sleep": 5.0,
                "value": 5.0
            },
            "helpfulness": null,
            "id": 159347369,
            "likes": {
                "disliked": null,
                "liked": null
            },
            "rating": 5.0,
            "stay_parameters": "Stayed April 2013, traveled with family",
            "text": "I was at the hotel in April 2012, and found the location and price, and service excellent. This April 2013 I visited Paris with my daughter for a week. The room again was faultless, and they organized a twin room with no fuss. The staff were friendly and helpful, and had great recommendations for restaurants. Although with Rue Cler so close you are spoiled for choice when it comes to food! 5 minutes to the Eiffel Tower, 10 minutes by bus to the Louvre, or 20 minutes walk (which is more fun interesting), the hotel is in a great location for tourists.",
            "title": "Second visit, just as good",
            "user": "RBCKiwi"
        },
        {
            "date": "May 1, 2013",
            "detail_rating": {
                "business": null,
                "cleanliness": 5.0,
                "desk": null,
                "location": 5.0,
                "pool": null,
                "restaurant": null,
                "rooms": 4.0,
                "service": 5.0,
                "sleep": 5.0,
                "value": 4.0
            },
            "helpfulness": null,
            "id": 159336643,
            "likes": {
                "disliked": null,
                "liked": null
            },
            "rating": 5.0,
            "stay_parameters": "Stayed April 2013, traveled as a couple",
            "text": "My wife and I stayed here for 10 nights this past month. While small, the rooms are neat, clean, comfortable, and stylish. Very quiet; slept very weel every night. The staff was always helpful, and the included daily breakfast was a highlight of each day we were in Paris. We were just a few blocks from the Eiffel Tower, Rue Cler, and a 15 minute walk to the Ecole Militaire Metro station. Excellent cafes and restaurants abound within a block or two. Highly recommended.",
            "title": "Cherished Memory; Superb Location",
            "user": "Patty1019"
        },
        {
            "date": "April 30, 2013",
            "detail_rating": {
                "business": null,
                "cleanliness": 5.0,
                "desk": null,
                "location": 5.0,
                "pool": null,
                "restaurant": null,
                "rooms": 5.0,
                "service": 5.0,
                "sleep": 5.0,
                "value": 5.0
            },
            "helpfulness": 3,
            "id": 159299911,
            "likes": {
                "disliked": null,
                "liked": null
            },
            "rating": 5.0,
            "stay_parameters": "Stayed April 2013, traveled as a couple",
            "text": "Steve H.",
            "title": "Fabulous hotel!!",
            "user": "C K"
        },
        {
            "date": "April 30, 2013",
            "detail_rating": {
                "business": null,
                "cleanliness": 5.0,
                "desk": null,
                "location": 5.0,
                "pool": null,
                "restaurant": null,
                "rooms": 4.0,
                "service": 5.0,
                "sleep": 5.0,
                "value": 4.0
            },
            "helpfulness": 3,
            "id": 159244429,
            "likes": {
                "disliked": null,
                "liked": null
            },
            "rating": 5.0,
            "stay_parameters": "Stayed April 2013, traveled with family",
            "text": "We just returned from a trip to Paris and just loved this hotel! The location of the hotel couldn't be better, the staff is absolutely wonderful and go out of their way to make your stay the best it can be. The room was very clean and nice. We stayed on the 6th floor and had a view of the Eiffel Tower - best night light ever!! Highly recommend this hotel.",
            "title": "Perfect Location, Perfect Hosts - the Place is Just - Well - Perfect!",
            "user": "Neal W"
        },
        {
            "date": "April 30, 2013",
            "detail_rating": {
                "business": null,
                "cleanliness": 5.0,
                "desk": null,
                "location": 5.0,
                "pool": null,
                "restaurant": null,
                "rooms": 5.0,
                "service": 4.0,
                "sleep": 3.0,
                "value": 4.0
            },
            "helpfulness": null,
            "id": 159224258,
            "likes": {
                "disliked": null,
                "liked": null
            },
            "rating": 4.0,
            "stay_parameters": "Stayed December 2012, traveled with family",
            "text": "My daughter moved to Grenoble, France two years ago and my wife and I planned a visit in April 2013 to meet my granddaughter, While there we decided to stay three days in Paris. I had no idea where anything was in Paris, never having been there, much less any idea where to stay. I used TripAdvisor and found the Hotel de Londres Eiffel, took a chance and booked it primarily for it's location and proximity to the Eiffel Tower.",
            "title": "GREAT LOCATION, NOISY DUE TO CONSTRUCTION",
            "user": "Jonathan D"
        },
        {
            "date": "January 5, 2012",
            "detail_rating": {
                "business": null,
                "cleanliness": 5.0,
                "desk": null,
                "location": 5.0,
                "pool": null,
                "restaurant": null,
                "rooms": 5.0,
                "service": 5.0,
                "sleep": 5.0,
                "value": 5.0
            },
            "helpfulness": 3,
            "id": 122567304,
            "likes": {
                "disliked": null,
                "liked": null
            },
            "rating": 5.0,
            "stay_parameters": "Stayed December 2011, traveled as a couple",
            "text": "My wife and I stayed at Hotel de Londres Eiffel for 3 nights in between Christmas and New Year 2011. We had booked a cheap (185 euro per night) standard double room but we were kindly upgraded to a room on the 5th floor with a view of the top of the Eiffel Tower - a lovely surprise.",
            "title": "Great location",
            "user": "Tarff"
        },
        {
            "date": "January 2, 2012",
            "detail_rating": {
                "business": null,
                "cleanliness": 5.0,
                "desk": null,
                "location": 5.0,
                "pool": null,
                "restaurant": null,
                "rooms": 5.0,
                "service": 5.0,
                "sleep": 5.0,
                "value": 4.0
            },
            "helpfulness": null,
            "id": 122430070,
            "likes": {
                "disliked": null,
                "liked": null
            },
            "rating": 5.0,
            "stay_parameters": "Stayed November 2011, traveled as a couple",
            "text": "The room was small but very clean and beautifully decorated. The bed was very comfy and the small shower/toilet room perfectly adequate. I don't think the hotel has a restaurant, and breakfast was not included in the price. I suppose this could be called a 'boutique' hotel which really means you get a room and nothing else - but when you're in Paris you dont spend a great deal of time hanging around your hotel!",
            "title": "Fabulous stay under the Eiffel Tower!",
            "user": "GATraveljunkies"
        },
        {
            "date": "January 1, 2012",
            "detail_rating": {
                "business": null,
                "cleanliness": 5.0,
                "desk": null,
                "location": 5.0,
                "pool": null,
                "restaurant": null,
                "rooms": 3.0,
                "service": 4.0,
                "sleep": 3.0,
                "value": 4.0
            },
            "helpfulness": 5,
            "id": 122346211,
            "likes": {
                "disliked": null,
                "liked": null
            },
            "rating": 4.0,
            "stay_parameters": "Stayed December 2011, traveled with family",
            "text": "The location is one of the main highlights - it is located round across the road from a mid-sized supermarket, and just round the corner from a busy street containing a bakers, many restaurants, pharmacy etc. But the main attraction is the Eiffel Tower - visible from the higher floors of the hotel, and a short 3/4 minute walk away.",
            "title": "Would stay again.",
            "user": "familyof4Melbourne"
        },
        {
            "date": "December 27, 2011",
            "detail_rating": {
                "business": null,
                "cleanliness": 5.0,
                "desk": null,
                "location": 5.0,
                "pool": null,
                "restaurant": null,
                "rooms": 5.0,
                "service": 5.0,
                "sleep": 5.0,
                "value": 5.0
            },
            "helpfulness": 2,
            "id": 122160954,
            "likes": {
                "disliked": null,
                "liked": null
            },
            "rating": 5.0,
            "stay_parameters": "Stayed December 2011, traveled with family",
            "text": "Nearest Metro station is Ecole Militaire, which is a 7/8 minute walk away from the Eiffel Tower. With a metro station so close it gives you access to all of the main Paris attractions within 20 minutes.",
            "title": "top location - lovely staff",
            "user": "s p"
        },
        {
            "date": "December 25, 2011",
            "detail_rating": {
                "business": null,
                "cleanliness": 5.0,
                "desk": null,
                "location": 3.0,
                "pool": null,
                "restaurant": null,
                "rooms": 5.0,
                "service": 5.0,
                "sleep": 5.0,
                "value": 4.0
            },
            "helpfulness": null,
            "id": 122084074,
            "likes": {
                "disliked": null,
                "liked": null
            },
            "rating": 5.0,
            "stay_parameters": "Stayed December 2011, traveled solo",
            "text": "A fantastic, fairly cheap hotel and one I would certainly recommend to couples.",
            "title": "Impeccable! Really enjoyed my stay there!",
            "user": "JacWong"
        },
        {
            "date": "April 8, 2009",
            "detail_rating": {
                "business": null,
                "cleanliness": 4.0,
                "desk": null,
                "location": 5.0,
                "pool": null,
                "restaurant": null,
                "rooms": 4.0,
                "service": 4.0,
                "sleep": null,
                "value": 5.0
            },
            "helpfulness": null,
            "id": 27677531,
            "likes": {
                "disliked": null,
                "liked": null
            },
            "rating": 4.0,
            "stay_parameters": "Stayed December 2008, traveled as a couple",
            "text": "My husband booked this hotel online for about 80 euros per night and once we arrived, I was shocked by the great find! The room, though small, was cozy, cute and warm. It had a flat screen tv, desk, and two small wardrobes on either side of the bed. The bed was comfortable.",
            "title": "Great value in Paris",
            "user": "LuvSLO"
        },
        {
            "date": "March 23, 2009",
            "detail_rating": {
                "business": null,
                "cleanliness": 4.0,
                "desk": null,
                "location": 5.0,
                "pool": null,
                "restaurant": null,
                "rooms": 4.0,
                "service": 5.0,
                "sleep": null,
                "value": 4.0
            },
            "helpfulness": null,
            "id": 26657949,
            "likes": {
                "disliked": null,
                "liked": null
            },
            "rating": 5.0,
            "stay_parameters": "Stayed March 2009, traveled as a couple",
            "text": "The bathroom was also small, but sufficient. We had a towel warming rack which was very convenient on the cold winter days. Toiletries are provided which was very nice.",
            "title": "Excellent location, friendly hotel",
            "user": "nocwodi"
        },
        {
            "date": "February 23, 2009",
            "detail_rating": {
                "business": null,
                "cleanliness": 5.0,
                "desk": null,
                "location": 5.0,
                "pool": null,
                "restaurant": null,
                "rooms": 5.0,
                "service": 5.0,
                "sleep": null,
                "value": 5.0
            },
            "helpfulness": 2,
            "id": 25017550,
            "likes": {
                "disliked": null,
                "liked": null
            },
            "rating": 5.0,
            "stay_parameters": "Stayed February 2009, traveled with family",
            "text": "Our room rate included breakfast which consisted of croissants and baguettes, juice, cereal, yogurt and the like...a typical hotel breakfast in Europe.",
            "title": "Great value, service, location in the heart of Paris",
            "user": "biggyboy123"
        },
        {
            "date": "February 17, 2009",
            "detail_rating": {
                "business": 5.0,
                "cleanliness": 5.0,
                "desk": null,
                "front_desk": 5.0,
                "location": 5.0,
                "pool": null,
                "restaurant": null,
                "rooms": 4.0,
                "service": 4.0,
                "sleep": null,
                "value": 5.0
            },
            "helpfulness": null,
            "id": 24651705,
            "likes": {
                "disliked": "\u2014 no view from our room",
                "liked": "\u2014 price, location, cleanliness"
            },
            "rating": 5.0,
            "stay_parameters": "Stayed October 2008, traveled as a couple",
            "text": "The most fabulous part about the hotel is its proximity to the Eiffel Tower. It was about a 10 minute walk from the hotel and for that kind of location I am surprised we weren't paying more. The staff wasn't very helpful in the way of restaurant recommendations which was a little bothersome, but no that big of a deal because we had free internet in the room and could search for restaurants. Overall, great stay, great price and great value. I would highly recommend this property especially if you can get it at a discounted rate like we did.",
            "title": "Loved it!",
            "user": "trifriends"
        },
        {
            "date": "February 16, 2009",
            "detail_rating": {
                "business": 5.0,
                "cleanliness": 5.0,
                "desk": null,
                "front_desk": 5.0,
                "location": 5.0,
                "pool": null,
                "restaurant": null,
                "rooms": 5.0,
                "service": 5.0,
                "sleep": null,
                "value": 5.0
            },
            "helpfulness": 2,
            "id": 24628548,
            "likes": {
                "disliked": "\u2014 Nothing--except I wish we could have stayed longer!",
                "liked": "\u2014 locationm, cleanliness, comfort of room, friendliness of staff, value"
            },
            "rating": 5.0,
            "stay_parameters": "Stayed January 2009, traveled as a couple",
            "text": "Excellent 3 star hotel. My wife and I stayed 3 nights after reading all of the reviews on Trip Advisor. Small room, but very clean, and well presented. Supermarket about 1 minute around the corner, and the Eiffel Tower a 10 minute walk down the Champs de Mars. The absolute find was the restaurant next door (Chez Agnes), and if you are lucky you will get a table. Would recommend this hotel to anyone - the only reason it is not 4 star is because it does not have all the fancy facilities.",
            "title": "What a Gem?",
            "user": "gailtj"
        },
        {
            "date": "December 13, 2011",
            "detail_rating": {
                "business": null,
                "cleanliness": 4.0,
                "desk": null,
                "location": 5.0,
                "pool": null,
                "restaurant": null,
                "rooms": 4.0,
                "service": 5.0,
                "sleep": 4.0,
                "value": 5.0
            },
            "helpfulness": 1,
            "id": 121691224,
            "likes": {
                "disliked": null,
                "liked": null
            },
            "rating": 5.0,
            "stay_parameters": "Stayed December 2011, traveled as a couple",
            "text": "It has been a wonderful holiday and their amiability made our stay one of the best I remember in any other hotel. Their kindness and attention was impressive.",
            "title": "The best of Par\u00eds",
            "user": "javier M"
        },
        {
            "date": "December 9, 2011",
            "detail_rating": {
                "business": null,
                "cleanliness": 5.0,
                "desk": null,
                "location": 5.0,
                "pool": null,
                "restaurant": null,
                "rooms": 4.0,
                "service": 5.0,
                "sleep": 5.0,
                "value": 4.0
            },
            "helpfulness": 2,
            "id": 121576969,
            "likes": {
                "disliked": null,
                "liked": null
            },
            "rating": 5.0,
            "stay_parameters": "Stayed December 2011, traveled as a couple",
            "text": "The rooms are clean, normal size for Paris. We had a problem with the reservation (our fault) we reserved a night less than we should have and they reserved a room in another hotel in case they didnt have one for us in their hotel, they took care of everything.",
            "title": "Cozy place in fantastic location",
            "user": "tetarpa"
        },
        {
            "date": "December 9, 2011",
            "detail_rating": {
                "business": null,
                "cleanliness": 5.0,
                "desk": null,
                "location": 5.0,
                "pool": null,
                "restaurant": null,
                "rooms": 5.0,
                "service": 5.0,
                "sleep": 5.0,
                "value": 5.0
            },
            "helpfulness": 1,
            "id": 121561685,
            "likes": {
                "disliked": null,
                "liked": null
            },
            "rating": 5.0,
            "stay_parameters": "Stayed November 2011, traveled with friends",
            "text": "I was very pleased with the extraordinary treatment received by the gentlemen at the front desk during the day and night (I\u2019m sorry I don\u2019t know their names).",
            "title": "Exceptional Value",
            "user": "Babalou88"
        },
        {
            "date": "December 8, 2011",
            "detail_rating": {
                "business": null,
                "cleanliness": 4.0,
                "desk": null,
                "location": 3.0,
                "pool": null,
                "restaurant": null,
                "rooms": 4.0,
                "service": 4.0,
                "sleep": 4.0,
                "value": 4.0
            },
            "helpfulness": null,
            "id": 121521690,
            "likes": {
                "disliked": null,
                "liked": null
            },
            "rating": 4.0,
            "stay_parameters": "Stayed December 2011, traveled on business",
            "text": "I have no doubt I will stay there again in next visits and will recommend it to everybody.",
            "title": "Cozy and nice",
            "user": "SedaTanova"
        },
        {
            "date": "December 6, 2011",
            "detail_rating": {
                "business": null,
                "cleanliness": 5.0,
                "desk": null,
                "location": 5.0,
                "pool": null,
                "restaurant": null,
                "rooms": 4.0,
                "service": 5.0,
                "sleep": 5.0,
                "value": 5.0
            },
            "helpfulness": 1,
            "id": 121475174,
            "likes": {
                "disliked": null,
                "liked": null
            },
            "rating": 5.0,
            "stay_parameters": "Stayed November 2011, traveled as a couple",
            "text": "Un saludo desde Espa\u00f1a,",
            "title": "Great Hotel, Great Location",
            "user": "Kevin H"
        },
        {
            "date": "November 13, 2008",
            "detail_rating": {
                "business": null,
                "cleanliness": null,
                "desk": null,
                "location": null,
                "pool": null,
                "restaurant": null,
                "rooms": null,
                "service": null,
                "sleep": null,
                "value": null
            },
            "helpfulness": 2,
            "id": 21827367,
            "likes": {
                "disliked": null,
                "liked": null
            },
            "rating": 4.0,
            "stay_parameters": null,
            "text": "Hotel Londres Eiffel is a very nice hotel. We stayed there recently and will definitely stay there again when we are in Paris. It was peaceful and quiet. We wondered if anyone else was staying there-they were. It gives on a small narrow street. The nice gentleman at the desk accommodated us with a request we made for a room with the view of the Eiffel Tower. We had a good laugh when we opened the window: we could only see the very top of it! But we didn't mind because we could walk over and see it's lighted spendor in the evening with its blue and white lights twinkling. The room was small but very comfortable:a small desk, a small closet on each side of the bed sufficient for 2 people. We slept in a large and comfortable queen size bed. The bathroom is modern and very clean but quite small. We had a shower stall and I'm glad that I lost 5 lbs before our trip. If you are tall and a little overweight ask for a tub. I would have given the hotel 5 stars but I gave it only 4 because of the size of the bathroom. The hotel is near Rue Cler: a pedestrian street filled with cafes,boutiques and a dry cleaner who will do a large wash for the modest sum of 10 Euros and no shrinkage. Au Bon Marche on Rue Cler is a bistrot that serves very good food at reasonnable prices. The people working there are very nice and friendly. The metro stop for the hotel is Ecole Militaire. If you stop at La Motte Piquet you will have a long walk but that's nice too if you're not too tired.Bon Voyage",
            "title": "Very French",
            "user": "Escargot21"
        },
        {
            "date": "November 12, 2008",
            "detail_rating": {
                "business": 5.0,
                "cleanliness": 5.0,
                "desk": null,
                "front_desk": 3.0,
                "location": 5.0,
                "pool": null,
                "restaurant": null,
                "rooms": 3.0,
                "service": 3.0,
                "sleep": null,
                "value": 4.0
            },
            "helpfulness": 1,
            "id": 21794439,
            "likes": {
                "disliked": null,
                "liked": "\u2014 Location"
            },
            "rating": 3.0,
            "stay_parameters": "Stayed September 2008, traveled as a couple",
            "text": "My wife and I visited Paris for the first time in September and we pretty much got what we expected at this hotel. The room was small but clean with a nice bathroom. We had a room with a view of the Effiel Tower which was really pretty, especially at night.",
            "title": "Great Location, Only the Basics",
            "user": "Justpassingthru37"
        },
        {
            "date": "November 9, 2008",
            "detail_rating": {
                "business": 5.0,
                "cleanliness": 5.0,
                "desk": null,
                "front_desk": 5.0,
                "location": 5.0,
                "pool": null,
                "restaurant": null,
                "rooms": 4.0,
                "service": 4.0,
                "sleep": null,
                "value": 4.0
            },
            "helpfulness": null,
            "id": 21663688,
            "likes": {
                "disliked": null,
                "liked": "\u2014 location"
            },
            "rating": 4.0,
            "stay_parameters": "Stayed November 2008, traveled as a couple",
            "text": "The only surprise we had came at checkout, when we found out that the daily breakfast service is not included with the price of the room. Probably would have opted for local fare had we known.",
            "title": "Just what I wanted",
            "user": "moykky"
        },
        {
            "date": "October 31, 2008",
            "detail_rating": {
                "business": null,
                "cleanliness": 4.0,
                "desk": null,
                "front_desk": 4.0,
                "location": 5.0,
                "pool": null,
                "restaurant": null,
                "rooms": 4.0,
                "service": null,
                "sleep": null,
                "value": 3.0
            },
            "helpfulness": null,
            "id": 21440108,
            "likes": {
                "disliked": "\u2014 Room reallocation",
                "liked": "\u2014 location"
            },
            "rating": 3.0,
            "stay_parameters": "Stayed October 2008, traveled as a couple",
            "text": "We chose this hotel mostly for its location which proved to be wonderful. The neighborhood offers a nice choice of restaurants, shops and cafes and the Metro is only a brief walk away (10 minutes). We really felt safe in this residential neighborhood at all hours.",
            "title": "Great little place - a bit overpriced",
            "user": "eeteee"
        },
        {
            "date": "October 23, 2008",
            "detail_rating": {
                "business": 5.0,
                "cleanliness": 5.0,
                "desk": null,
                "front_desk": 5.0,
                "location": 5.0,
                "pool": null,
                "restaurant": null,
                "rooms": 5.0,
                "service": 5.0,
                "sleep": null,
                "value": 5.0
            },
            "helpfulness": null,
            "id": 21126017,
            "likes": {
                "disliked": "\u2014 The size of the room",
                "liked": "\u2014 The decoration"
            },
            "rating": 5.0,
            "stay_parameters": "Stayed September 2008, traveled as a couple",
            "text": "Great hotel for sleeping and honeymooning. It has great location, it is comfortable, it is quiet. Staff is friendly and helpfull. Wifi is free and Eifel tower is just outside. Will come again!",
            "title": "Perfect for a romantic weekend in Paris ....",
            "user": "djukfish"
        }
    ],
    "slim_ranking": 0.0156162855549,
    "stars": null,
    "tripadvisor": {
        "VISITED": false,
        "country_name": null,
        "locality": null,
        "pic_link": null,
        "street_address": null
    },
    "user_rating": 4.5,
    "variance": {
        "average": 43,
        "excellent": 550,
        "poor": 11,
        "terrible": 5,
        "very good": 194
    }
}