{
    "aka": "Hilton Phuket Arcadia Hotel Karon",
    "description": "The resort is located on the island\u2019s west coast and offers a range of fun and relaxation options for parents and children alike. The resort sprawls over 75-acres landscaped gardens, right on the golden sands of Karon Beach. The resort is conveniently located to four world-class golf courses, elephant riding, scuba diving, ancient golden temples and an abundance of shopping areas. It is the place that you\u2019d rather be with your family for next holiday.",
    "detail_rating": {
        "cleanliness": 4.5,
        "location": 4.0,
        "rooms": 4.0,
        "service": 4.0,
        "sleep": 4.5,
        "value": 4.0
    },
    "location": {
        "city": "Karon",
        "continent": "Asia",
        "country": "Thailand",
        "proposed_city": null,
        "province": null,
        "region": null
    },
    "name": "Hilton Phuket Arcadia Resort & Spa",
    "places": {
        "aka": [
            "Phuket",
            "Arcadia"
        ],
        "hotel_description": [],
        "hotel_name": [
            "Phuket",
            "Arcadia"
        ]
    },
    "review_count": 1372,
    "review_count_current": 20,
    "reviews": [
        {
            "date": "February 1, 2009",
            "detail_rating": {
                "business": null,
                "cleanliness": null,
                "desk": null,
                "location": null,
                "pool": null,
                "restaurant": null,
                "rooms": null,
                "service": null,
                "sleep": null,
                "value": null
            },
            "helpfulness": null,
            "id": 24075149,
            "likes": {
                "disliked": null,
                "liked": null
            },
            "rating": 5.0,
            "stay_parameters": null,
            "text": "Most has already been said by other reviewers. What I am going to add is what I have not seen written by others. We stayed for our honeymoon for two weeks here.",
            "title": "beautiful hotel",
            "user": "screenname060309"
        },
        {
            "date": "January 24, 2009",
            "detail_rating": {
                "business": null,
                "cleanliness": null,
                "desk": null,
                "location": null,
                "pool": null,
                "restaurant": null,
                "rooms": null,
                "service": null,
                "sleep": null,
                "value": null
            },
            "helpfulness": null,
            "id": 23855154,
            "likes": {
                "disliked": null,
                "liked": null
            },
            "rating": 4.0,
            "stay_parameters": null,
            "text": "The check-in was very fast.",
            "title": "Better then Expected, but still to expensive!",
            "user": "JamesVki"
        },
        {
            "date": "January 21, 2009",
            "detail_rating": {
                "business": null,
                "cleanliness": null,
                "desk": null,
                "location": null,
                "pool": null,
                "restaurant": null,
                "rooms": null,
                "service": null,
                "sleep": null,
                "value": null
            },
            "helpfulness": null,
            "id": 23746590,
            "likes": {
                "disliked": null,
                "liked": null
            },
            "rating": 4.0,
            "stay_parameters": null,
            "text": "Pools. The hotel has three pools, two of which have two sections, an upper and a lower connected via waterfalls and slides. The horizon pool closest to the beach is the smallest, yet the only one with deep section where you can dive. Basic free scuba lessons are also given at this pool. The shallow parts of different pools have different depths.",
            "title": "Huge hotel",
            "user": "basses4"
        },
        {
            "date": "January 13, 2009",
            "detail_rating": {
                "business": null,
                "cleanliness": null,
                "desk": null,
                "location": null,
                "pool": null,
                "restaurant": null,
                "rooms": null,
                "service": null,
                "sleep": null,
                "value": null
            },
            "helpfulness": null,
            "id": 23510631,
            "likes": {
                "disliked": null,
                "liked": null
            },
            "rating": 5.0,
            "stay_parameters": null,
            "text": "Rooms. I asked to see different rooms during my visit, partially because I wanted to know what room I can choose next time. There are three wings with their rooms called Andaman, Saitong and Lotus wings. The buildings were built about 25, 10, and 7 years ago, respectively, and the older the wing, the lower the rate. The Lotus rooms are larger than the other two. They have newer furniture and are most expensive. To be honest, I did not see any reason why would anyone not choose Andaman rooms. The only thing was lack of separate showers and bathtubs there. I personally do not like baths and we never used it. One should bear in mind that I had very short visit to the other rooms (Lotus and Andaman). We had a cockroach in our room one night. Also the drain of the sink became very slow, which we did not bother to mention. Nevertheless, there might be more significant differences between different room types, which we could not detect. All types of rooms had 2",
            "title": "Fantastic hotel! Highly recommend!",
            "user": "Fleebee85"
        },
        {
            "date": "January 13, 2009",
            "detail_rating": {
                "business": null,
                "cleanliness": null,
                "desk": null,
                "location": null,
                "pool": null,
                "restaurant": null,
                "rooms": null,
                "service": null,
                "sleep": null,
                "value": null
            },
            "helpfulness": null,
            "id": 23509318,
            "likes": {
                "disliked": null,
                "liked": null
            },
            "rating": 5.0,
            "stay_parameters": null,
            "text": "sliding doors to the bathroom, one from the corridor and one from the room itself. Some light would therefore light up the room if somebody uses the bathroom. We were not disturbed by this but I can imagine that some guests would. The TV sets were rather old in all types of rooms, but again we did not care.",
            "title": "Great Hotel",
            "user": "Superbuyer"
        },
        {
            "date": "January 8, 2009",
            "detail_rating": {
                "business": null,
                "cleanliness": null,
                "desk": null,
                "location": null,
                "pool": null,
                "restaurant": null,
                "rooms": null,
                "service": null,
                "sleep": null,
                "value": null
            },
            "helpfulness": null,
            "id": 23369939,
            "likes": {
                "disliked": null,
                "liked": null
            },
            "rating": 5.0,
            "stay_parameters": null,
            "text": "Have just come back from the Hilton Arcadia in Phuket. (stayed from 21st Dec 2008 till 3rd Jan 2009) There was a large group of us about 6 adults and about 10 kids all ranging from ages 7 to 19.",
            "title": "Amazing Amazing Amazing!!!",
            "user": "Cheryl1963"
        },
        {
            "date": "January 7, 2009",
            "detail_rating": {
                "business": null,
                "cleanliness": null,
                "desk": null,
                "location": null,
                "pool": null,
                "restaurant": null,
                "rooms": null,
                "service": null,
                "sleep": null,
                "value": null
            },
            "helpfulness": null,
            "id": 23356822,
            "likes": {
                "disliked": null,
                "liked": null
            },
            "rating": 5.0,
            "stay_parameters": null,
            "text": "Ok when we arrived we all thought oh my god it is so big we will never get to know our way around but there are 3 wings, we were in the Andaman wing which is where it is all happening so we were pleased that we had booked this wing. The Saitong and Lotus wing is quieter and from what i have heard the rooms are nicer looking but we had 3 in a room and it was absolutely fine. The grounds are fabulous very well kept and the food is excellent especially breakfast as there is so much choice. During the day we sunbathed at the Horizon Pool which is the nearest pool to the beach. The beach is just across the road and even though the road is busy there was a guard who took you across so no problems there. The Hilton Hotel is based in Karon which is not as big as Phuket but is a lot more civilised with really good restaurants everywhere. We did go to Patong which was really busy and full of traffic - but you have to go there to experience it!!!! especially Bangler Street!!! (plenty of Lady Boys).",
            "title": "Great Hotel",
            "user": "MandC"
        },
        {
            "date": "January 7, 2009",
            "detail_rating": {
                "business": null,
                "cleanliness": null,
                "desk": null,
                "location": null,
                "pool": null,
                "restaurant": null,
                "rooms": null,
                "service": null,
                "sleep": null,
                "value": null
            },
            "helpfulness": null,
            "id": 23352852,
            "likes": {
                "disliked": null,
                "liked": null
            },
            "rating": 3.0,
            "stay_parameters": null,
            "text": "Overall a fab hotel would definitely go there again - great to go with a group of friends.",
            "title": "Good but let down by a rude receptionist",
            "user": "Sjc462"
        },
        {
            "date": "December 15, 2008",
            "detail_rating": {
                "business": null,
                "cleanliness": null,
                "desk": null,
                "location": null,
                "pool": null,
                "restaurant": null,
                "rooms": null,
                "service": null,
                "sleep": null,
                "value": null
            },
            "helpfulness": null,
            "id": 22740940,
            "likes": {
                "disliked": null,
                "liked": null
            },
            "rating": 4.0,
            "stay_parameters": null,
            "text": "Our third stay at this excellent hotel and due to my Hhonors enjoyed upgraded room and exec club use....... The many previous reviews state how good this hotel is and the staff are and have always been great......",
            "title": "great hotel, great kids club",
            "user": "popey22"
        },
        {
            "date": "December 9, 2008",
            "detail_rating": {
                "business": null,
                "cleanliness": null,
                "desk": null,
                "location": null,
                "pool": null,
                "restaurant": null,
                "rooms": null,
                "service": null,
                "sleep": null,
                "value": null
            },
            "helpfulness": null,
            "id": 22587997,
            "likes": {
                "disliked": null,
                "liked": null
            },
            "rating": 4.0,
            "stay_parameters": null,
            "text": "For dinner do yourself a favour and on leaving the hotel on the beach road turn left and enjoy a 15min walk to Kata ... just after entering Kata 5 mins down on the left you will find a very white and spotlessly clean restaurant called Eurodeli \u2026\u2026\u2026 Great food from Thailand / International , great chef / owner and fascinating open kitchen\u2026\u2026 Best food in Thailand.",
            "title": "Hilton stay from a very recent 'Strandee' Perspective. Yorkshire, UK.",
            "user": "GraceyNY"
        },
        {
            "date": "November 2, 2008",
            "detail_rating": {
                "business": 1.0,
                "cleanliness": 5.0,
                "desk": null,
                "front_desk": 5.0,
                "location": 5.0,
                "pool": null,
                "restaurant": null,
                "rooms": 5.0,
                "service": 5.0,
                "sleep": null,
                "value": 5.0
            },
            "helpfulness": 7,
            "id": 21471921,
            "likes": {
                "disliked": "\u2014 prices for bar room serice and meals, internet prices the plus plus mentality",
                "liked": "\u2014 rooms service, views staff"
            },
            "rating": 5.0,
            "stay_parameters": "Stayed October 2008, traveled as a couple",
            "text": "Stayed 16 Nights in October, Paid for an upgraded to Deluxe Plus Seaview Room and was placed in Lotus wing. Room was awesome view was great.",
            "title": "Great Hotel Great Location Great Staff Great rooms Huge credit charge deposit th",
            "user": "SteveBarnes58"
        },
        {
            "date": "October 21, 2008",
            "detail_rating": {
                "business": 5.0,
                "cleanliness": 5.0,
                "desk": null,
                "front_desk": 5.0,
                "location": 5.0,
                "pool": null,
                "restaurant": null,
                "rooms": 5.0,
                "service": 5.0,
                "sleep": null,
                "value": 5.0
            },
            "helpfulness": 8,
            "id": 21066560,
            "likes": {
                "disliked": null,
                "liked": "\u2014 Immaculate rooms and great service"
            },
            "rating": 5.0,
            "stay_parameters": "Stayed July 2008, traveled as a couple",
            "text": "Staff very freindly, The included breakfast was great, tried both breakfast restaurants and both were equally good. I have only two complaints to make about the hotel. The first was that I was required to put a 20000 baht deposit down effectively locking up nearly one thousand Au dollars.",
            "title": "GREAT place to stay - A Perfect Honeymoon!",
            "user": "redkatiebean"
        },
        {
            "date": "October 8, 2008",
            "detail_rating": {
                "business": null,
                "cleanliness": 5.0,
                "desk": null,
                "front_desk": 5.0,
                "location": 4.0,
                "pool": null,
                "restaurant": null,
                "rooms": 4.0,
                "service": 4.0,
                "sleep": null,
                "value": 5.0
            },
            "helpfulness": 3,
            "id": 20720815,
            "likes": {
                "disliked": "\u2014 slightly cramped",
                "liked": "\u2014 balcony"
            },
            "rating": 3.0,
            "stay_parameters": "Stayed September 2008, traveled with family",
            "text": "This could put a sizable dent in some peoples spending money and presented issues on check out as they had used a credit/Debit card and the money had actully been transferred not just locked up causing the hotel to refund me 20000 baht in cash.",
            "title": "staff need more training",
            "user": "jbhooch"
        },
        {
            "date": "October 1, 2008",
            "detail_rating": {
                "business": 5.0,
                "cleanliness": 5.0,
                "desk": null,
                "front_desk": 4.0,
                "location": 5.0,
                "pool": null,
                "restaurant": null,
                "rooms": 5.0,
                "service": 5.0,
                "sleep": null,
                "value": 5.0
            },
            "helpfulness": 3,
            "id": 20520014,
            "likes": {
                "disliked": "\u2014 The restuarant prices for lunch & dinner",
                "liked": "\u2014 The 5 pools"
            },
            "rating": 5.0,
            "stay_parameters": "Stayed September 2008, traveled as a couple",
            "text": "The habit of adding ten percent service charge then 7 per cent VAt made the already expensive items even more expensive.",
            "title": "Loved the Hilton Arcadia",
            "user": "jdelor"
        },
        {
            "date": "September 23, 2008",
            "detail_rating": {
                "business": 4.0,
                "cleanliness": 5.0,
                "desk": null,
                "front_desk": 5.0,
                "location": 5.0,
                "pool": null,
                "restaurant": null,
                "rooms": 5.0,
                "service": 5.0,
                "sleep": null,
                "value": 4.0
            },
            "helpfulness": 3,
            "id": 20298537,
            "likes": {
                "disliked": null,
                "liked": null
            },
            "rating": 4.0,
            "stay_parameters": "Stayed August 2008, traveled as a couple",
            "text": "An example is Small singha Beer 220 baht Plus Plus ends up nearly 250 baht which I might add is avalable at the 7 11 300 metres away for 20-25 baht",
            "title": "Relaxing all in one sunshine holiday!",
            "user": "1709"
        },
        {
            "date": "December 6, 2008",
            "detail_rating": {
                "business": 4.0,
                "cleanliness": 5.0,
                "desk": null,
                "front_desk": 5.0,
                "location": 4.0,
                "pool": null,
                "restaurant": null,
                "rooms": 5.0,
                "service": 5.0,
                "sleep": null,
                "value": 4.0
            },
            "helpfulness": 8,
            "id": 22489341,
            "likes": {
                "disliked": null,
                "liked": null
            },
            "rating": 5.0,
            "stay_parameters": "Stayed December 2008, traveled with family",
            "text": "My family (2 adults, 3 kids) stayed in the Twin Deluxe Plus Seaview room from 2-5 Dec 08.",
            "title": "Excellent Room and Phuket from a Vegetarian family's perspective",
            "user": "cchanmen"
        },
        {
            "date": "December 2, 2008",
            "detail_rating": {
                "business": null,
                "cleanliness": null,
                "desk": null,
                "location": null,
                "pool": null,
                "restaurant": null,
                "rooms": null,
                "service": null,
                "sleep": null,
                "value": null
            },
            "helpfulness": 4,
            "id": 22374074,
            "likes": {
                "disliked": null,
                "liked": null
            },
            "rating": 4.0,
            "stay_parameters": null,
            "text": "We really liked our room in the Lotus Wing. Considering that two of my kids were 3 and under, the hotel readily agreed to let us all stay in one room. They pushed the 2 queen-sized beds together and gave us a 3rd single bed (which we didn't use). The room was lovely, and had a decent view of Karon Beach and the Andaman Sea.",
            "title": "Nice Relaxing Weekend",
            "user": "wlluthy"
        },
        {
            "date": "November 19, 2008",
            "detail_rating": {
                "business": 5.0,
                "cleanliness": 5.0,
                "desk": null,
                "front_desk": 5.0,
                "location": 5.0,
                "pool": null,
                "restaurant": null,
                "rooms": 5.0,
                "service": 5.0,
                "sleep": null,
                "value": 5.0
            },
            "helpfulness": 5,
            "id": 22013569,
            "likes": {
                "disliked": "\u2014 A little distant from the 'touristy areas'",
                "liked": "\u2014 Spacious, luxurious, high-end resort"
            },
            "rating": 5.0,
            "stay_parameters": "Stayed October 2008, traveled with friends",
            "text": "None of the hotels along Karon Beach have direct access to the beach, as there is a 2-lane (sometimes busy) road that separates the beach from the buildings. Though we would have preferred direct beach access, this wasn't a problem. The public Karon Beach gets busy after 11am, but not as crowded as Patong. You can rent deck chairs and umbrella for 200 baht (per party, I believe) for the whole day. Just plop yourself down on an empty chair, and someone will find you for payment. There're also masseurs who operate from tents along the back of the beach. 250 baht for 30mins. Very relaxing with the cool sea breeze and sounds of the waves.",
            "title": "What a beautiful surprise! And so private!",
            "user": "waynay6405"
        },
        {
            "date": "November 14, 2008",
            "detail_rating": {
                "business": 3.0,
                "cleanliness": 4.0,
                "desk": null,
                "front_desk": 4.0,
                "location": 4.0,
                "pool": null,
                "restaurant": null,
                "rooms": 4.0,
                "service": 3.0,
                "sleep": null,
                "value": 4.0
            },
            "helpfulness": 5,
            "id": 21841196,
            "likes": {
                "disliked": "\u2014 the noisey road next to the pool",
                "liked": "\u2014 selection of pools"
            },
            "rating": 4.0,
            "stay_parameters": "Stayed October 2008, traveled with family",
            "text": "We had breakfast at the hotel's Sails buffet restaurant. Decent spread. As a vegetarian family, we were able to find enough to make a full breakfast.",
            "title": "enjoyable but got robbed!",
            "user": "suzyDorset"
        },
        {
            "date": "November 4, 2008",
            "detail_rating": {
                "business": 5.0,
                "cleanliness": 5.0,
                "desk": null,
                "front_desk": 5.0,
                "location": 5.0,
                "pool": null,
                "restaurant": null,
                "rooms": 5.0,
                "service": 5.0,
                "sleep": null,
                "value": 5.0
            },
            "helpfulness": 5,
            "id": 21523436,
            "likes": {
                "disliked": "\u2014 nothing",
                "liked": "\u2014 large rooms"
            },
            "rating": 5.0,
            "stay_parameters": "Stayed October 2008, traveled with family",
            "text": "We highly recommend the hotel's Thai Thai restaurant -- great food, good service. Thai Thai had a wider selection of vegetarian options than we encountered at other eateries in Phuket. Unfortunately they only open at 6pm for dinner.",
            "title": "Magnificent never wanted to leave!",
            "user": "AussieBelle"
        }
    ],
    "slim_ranking": 0.205882352941,
    "stars": 4.5,
    "tripadvisor": {
        "VISITED": false,
        "country_name": null,
        "locality": null,
        "pic_link": null,
        "street_address": null
    },
    "user_rating": 4.0,
    "variance": {
        "average": 182,
        "excellent": 619,
        "poor": 69,
        "terrible": 29,
        "very good": 473
    }
}