{
    "aka": "Aloft Montreal Airport Hotel Montreal",
    "description": "Aloft Montreal Airport is a bold new hotel featuring loft-inspired design with French Canadian flair! We're at the doorstep of Montreal's international airport and 15 minutes from downtown's culture.",
    "detail_rating": {
        "cleanliness": null,
        "location": null,
        "rooms": null,
        "service": null,
        "sleep": null,
        "value": null
    },
    "location": {
        "city": "Montreal",
        "continent": null,
        "country": "Canada",
        "proposed_city": null,
        "province": null,
        "region": null
    },
    "name": "Aloft Montreal Airport",
    "places": {
        "aka": [],
        "hotel_description": [],
        "hotel_name": []
    },
    "review_count": 297,
    "review_count_current": 20,
    "reviews": [
        {
            "date": "April 9, 2009",
            "detail_rating": {
                "business": null,
                "cleanliness": 5.0,
                "desk": null,
                "location": 5.0,
                "pool": null,
                "restaurant": null,
                "rooms": 5.0,
                "service": 4.0,
                "sleep": null,
                "value": 4.0
            },
            "helpfulness": null,
            "id": 27724509,
            "likes": {
                "disliked": null,
                "liked": null
            },
            "rating": 5.0,
            "stay_parameters": "Stayed March 2009, traveled as a couple",
            "text": "We stayed there for one night and used their version of 'Park, stay, and fly'. We were able to leave our car for one week and use their shuttle service.",
            "title": "Great stay - just by the airport",
            "user": "ombrelle"
        },
        {
            "date": "April 1, 2009",
            "detail_rating": {
                "business": null,
                "cleanliness": 5.0,
                "desk": null,
                "location": 5.0,
                "pool": null,
                "restaurant": null,
                "rooms": 5.0,
                "service": 5.0,
                "sleep": null,
                "value": 5.0
            },
            "helpfulness": 1,
            "id": 27227622,
            "likes": {
                "disliked": null,
                "liked": null
            },
            "rating": 5.0,
            "stay_parameters": "Stayed March 2009, traveled as a couple",
            "text": "The room had one really comfy king bed, mini fridge, alarm clock, coffee machine, one bottle of water, a real plug in blow dryer, magazines, numeric safe. There wasn't much closet space, so nat ideal for long stays. Only 4 hangers. The fan on the heat/air unit is noisy, but that kept the airplane noise to a minimum. The planes didn't bother us much as they are few in the evening and the airport shuts down from 1 am till 7 am.",
            "title": "A wonderful discovery",
            "user": "Lefty_59"
        },
        {
            "date": "April 1, 2009",
            "detail_rating": {
                "business": null,
                "cleanliness": 5.0,
                "desk": null,
                "location": 5.0,
                "pool": null,
                "restaurant": null,
                "rooms": 4.0,
                "service": 5.0,
                "sleep": null,
                "value": 5.0
            },
            "helpfulness": null,
            "id": 27225911,
            "likes": {
                "disliked": null,
                "liked": null
            },
            "rating": 4.0,
            "stay_parameters": "Stayed March 2009, traveled as a couple",
            "text": "The shower didn't have much pressure, but it was a beautiful walk-in shower.",
            "title": "What a cool place; very ultra-modern",
            "user": "eaglecountry"
        },
        {
            "date": "March 19, 2009",
            "detail_rating": {
                "business": null,
                "cleanliness": 4.0,
                "desk": null,
                "location": 3.0,
                "pool": null,
                "restaurant": null,
                "rooms": 4.0,
                "service": 3.0,
                "sleep": null,
                "value": 5.0
            },
            "helpfulness": null,
            "id": 26422322,
            "likes": {
                "disliked": null,
                "liked": null
            },
            "rating": 4.0,
            "stay_parameters": "Stayed March 2009, traveled on business",
            "text": "There is a small inside pool, but with windows facing the lobby and bar. Not to interested in getting in my bathing suit to swim in front of everybody.",
            "title": "Nice, but no restaurant, far from transit, and don't leave anything behind",
            "user": "anacaona1804"
        },
        {
            "date": "January 4, 2009",
            "detail_rating": {
                "business": 4.0,
                "cleanliness": 5.0,
                "desk": null,
                "front_desk": 4.0,
                "location": 3.0,
                "pool": null,
                "restaurant": null,
                "rooms": 5.0,
                "service": 3.0,
                "sleep": null,
                "value": 4.0
            },
            "helpfulness": 1,
            "id": 23269535,
            "likes": {
                "disliked": "\u2014 noise from aircraft overhead",
                "liked": "\u2014 amazingly comfortable bed and blanket"
            },
            "rating": 4.0,
            "stay_parameters": "Stayed January 2009",
            "text": "The lobby bar is nice but noisy.",
            "title": "Cool decor and well appointed facilities",
            "user": "TBoneSteak84"
        },
        {
            "date": "June 10, 2009",
            "detail_rating": {
                "business": null,
                "cleanliness": 5.0,
                "desk": null,
                "location": 3.0,
                "pool": null,
                "restaurant": null,
                "rooms": 5.0,
                "service": 5.0,
                "sleep": null,
                "value": 5.0
            },
            "helpfulness": null,
            "id": 32024874,
            "likes": {
                "disliked": null,
                "liked": null
            },
            "rating": 5.0,
            "stay_parameters": "Stayed May 2009, traveled with family",
            "text": "We stayed at the Aloft for 3 nights during a short visit to Montr\u00e9al to visit friends and relatives. Whenever I am visiting big cities with a rental car I book hotels near or at the airport because the rates, convenience and ample parking (and I am also an airline 'enthusiast'). Without traffic (even though this is a rare occurance) Its only a 20 minute drive to downtown Montr\u00e9al. When we stepped in the lobby after a long drive from Rochester NY we felt like we just walked into 'Chalum's Cantina' (fictional Bar in Star Wars Movies) on the Planet 'Tatooine', expecting to see Aliens from the entire Universe sitting around the Lava Lamps sipping Out-of-this-world-cocktails. The d\u00e9cor, the music (not too loud \u2013 just perfect) and the lighting created the perfect urban, hip Disco/Dance/Chill atmosphere. You feel relaxed almost immediately. I was never surprised by any Hotel Lobby in such a way. Check-in was smooth, relaxed and in 2 minutes we had the key-cards to our 2 rooms on the 4th floor. I cannot go too much into details about this hotel, otherwise this review would be several pages long. The room was, especially the setup, was very unusual and quite smart as well. There is almost nothing to complain about this hotel, even though I always find something. It is by far the most interesting 3-star Airport Hotel I have ever stayed at \u2013 right down to the smallest details! (biggest flat screen TV's, softest toilet paper, biggest (rain-)showers, etc. etc.).",
            "title": "What a pleasant surprise!",
            "user": "Jetstream1958"
        },
        {
            "date": "June 7, 2009",
            "detail_rating": {
                "business": null,
                "cleanliness": 5.0,
                "desk": null,
                "location": 4.0,
                "pool": null,
                "restaurant": null,
                "rooms": 5.0,
                "service": 3.0,
                "sleep": null,
                "value": 5.0
            },
            "helpfulness": null,
            "id": 31809385,
            "likes": {
                "disliked": null,
                "liked": null
            },
            "rating": 4.0,
            "stay_parameters": "Stayed June 2009, traveled on business",
            "text": "What a refreshing change to the stuffy, old fashioned Seventies Time-warp Hotels like Quality and Comfort Inns, Econolodes, Motel 6, Travelodges, etc.!",
            "title": "Fun and Funky",
            "user": "Alicetas"
        },
        {
            "date": "June 3, 2009",
            "detail_rating": {
                "business": null,
                "cleanliness": 5.0,
                "desk": null,
                "location": 4.0,
                "pool": null,
                "restaurant": null,
                "rooms": 5.0,
                "service": 4.0,
                "sleep": null,
                "value": 4.0
            },
            "helpfulness": null,
            "id": 31524919,
            "likes": {
                "disliked": null,
                "liked": null
            },
            "rating": 4.0,
            "stay_parameters": "Stayed May 2009, traveled as a couple",
            "text": "If you are looking for a good Downtown location \u2013 forget it! Otherwise the Aloft is THE hotel to stay at in Montreal \u2013 Try it! You will like it!",
            "title": "Funky place for a stop over",
            "user": "Trevor H"
        },
        {
            "date": "June 1, 2009",
            "detail_rating": {
                "business": null,
                "cleanliness": 5.0,
                "desk": null,
                "location": 4.0,
                "pool": null,
                "restaurant": null,
                "rooms": 5.0,
                "service": 4.0,
                "sleep": null,
                "value": 5.0
            },
            "helpfulness": null,
            "id": 31349529,
            "likes": {
                "disliked": null,
                "liked": null
            },
            "rating": 5.0,
            "stay_parameters": "Stayed May 2009, traveled solo",
            "text": "Stayed here en route to another destination and was happily surprised to find a different hotel. I liked the 24 hr fitness room and the bar was good. Shuttles run to and from the airport every 15 minutes. I didn't want to wait the 15 minutes and asked the staff member to call me a cab. She was a little put out by this and claimed my 5 minute ride would be 3 times the actual rate. Except for this silly grumpy am staffer - the visit was comfortable and I will be stopping in again.",
            "title": "Fun, sleek, relaxing - a good deal near the airport",
            "user": "WeekendWanderer11"
        },
        {
            "date": "May 26, 2009",
            "detail_rating": {
                "business": null,
                "cleanliness": 5.0,
                "desk": null,
                "location": 5.0,
                "pool": null,
                "restaurant": null,
                "rooms": 5.0,
                "service": 4.0,
                "sleep": null,
                "value": 5.0
            },
            "helpfulness": 1,
            "id": 30849976,
            "likes": {
                "disliked": null,
                "liked": null
            },
            "rating": 4.0,
            "stay_parameters": "Stayed May 2009, traveled on business",
            "text": "We needed a convienent place to stay near the airport, and made our choice based on the feedback we read here. We enjoyed the layout and the decor - really refreshing from the standard fair in most hotels. We checked in close to midnight and it was very quick - much appreciated after a long day of travel. I've already recommended this place to a few friends who travel on business, and I will be back myself.",
            "title": "Efficient at being, On the grounds of the Airport, Better then Average",
            "user": "CWipes"
        },
        {
            "date": "September 14, 2008",
            "detail_rating": {
                "business": 4.0,
                "cleanliness": 5.0,
                "desk": null,
                "front_desk": 5.0,
                "location": 4.0,
                "pool": null,
                "restaurant": null,
                "rooms": 4.0,
                "service": 4.0,
                "sleep": null,
                "value": 5.0
            },
            "helpfulness": null,
            "id": 20075819,
            "likes": {
                "disliked": "\u2014 I was only there one night due to a cancelled flight.",
                "liked": "\u2014 Funky Boutique appeal and younger (mid 20's to 40's) crowd."
            },
            "rating": 4.0,
            "stay_parameters": "Stayed September 2008, traveled on business",
            "text": "Boutique appeal, only three months old! Billard table, pool, fireplace, bar, meeting area/lounge (both indoor and out) and more. Coffee/tea, pastries, and light fanfare available at all times in lobby area. You'll never go hungry in the middle of the night, and there's always a bite to eat while rushing to catch that 6 AM flight.",
            "title": "Bliss at ALoft! Great stop-over hotel.",
            "user": "ArtTravelsNJ"
        },
        {
            "date": "September 11, 2008",
            "detail_rating": {
                "business": 5.0,
                "cleanliness": 5.0,
                "desk": null,
                "front_desk": 5.0,
                "location": 5.0,
                "pool": null,
                "restaurant": null,
                "rooms": 5.0,
                "service": 5.0,
                "sleep": null,
                "value": 5.0
            },
            "helpfulness": null,
            "id": 19992524,
            "likes": {
                "disliked": "\u2014 not located near any sights",
                "liked": "\u2014 clean and brand new"
            },
            "rating": 5.0,
            "stay_parameters": "Stayed September 2008, traveled on business",
            "text": "In room accommodations include free wi-fi service (ask for code at the desk), flat screen TV, alarm clock, \"real\" hair-dryers (not those \"on the wall\" hair dryers that leave you struggling with the short coiled cords and that make your hair look like frizz city - you ladies know what I'm talking about)... Bliss beauty products (yes, \"the\" Bliss spa products), magazines, coffee/tea maker, iron & ironing board.",
            "title": "Love Aloft",
            "user": "Erin L"
        },
        {
            "date": "September 8, 2008",
            "detail_rating": {
                "business": null,
                "cleanliness": 5.0,
                "desk": null,
                "front_desk": 4.0,
                "location": null,
                "pool": null,
                "restaurant": null,
                "rooms": 4.0,
                "service": null,
                "sleep": null,
                "value": 4.0
            },
            "helpfulness": null,
            "id": 19866701,
            "likes": {
                "disliked": null,
                "liked": null
            },
            "rating": 4.0,
            "stay_parameters": "Stayed August 2008, traveled as a couple",
            "text": "City-like \"Loft\" appeal with painted cement ceilings. Plenty of room for your lap-top and a spot to plug in your hand-held game device.",
            "title": "Quiet",
            "user": "debideck"
        },
        {
            "date": "August 30, 2008",
            "detail_rating": {
                "business": 4.0,
                "cleanliness": 4.0,
                "desk": null,
                "front_desk": 3.0,
                "location": 4.0,
                "pool": null,
                "restaurant": null,
                "rooms": 4.0,
                "service": 4.0,
                "sleep": null,
                "value": 4.0
            },
            "helpfulness": null,
            "id": 19541332,
            "likes": {
                "disliked": "\u2014 Pity ceiling looked unfinished",
                "liked": "\u2014 Minimum fuss, maximum comfort"
            },
            "rating": 4.0,
            "stay_parameters": "Stayed August 2008, traveled on business",
            "text": "So, if you're not sure if you're in the mood for work or play, this place offers both... Oh yeah, and a great comfy bed too!",
            "title": "Good stopover hotel",
            "user": "Froglady9"
        },
        {
            "date": "August 24, 2008",
            "detail_rating": {
                "business": 5.0,
                "cleanliness": 4.0,
                "desk": null,
                "front_desk": 4.0,
                "location": 4.0,
                "pool": null,
                "restaurant": null,
                "rooms": 4.0,
                "service": 3.0,
                "sleep": null,
                "value": 4.0
            },
            "helpfulness": null,
            "id": 19316251,
            "likes": {
                "disliked": null,
                "liked": null
            },
            "rating": 4.0,
            "stay_parameters": "Stayed August 2008, traveled on business",
            "text": "Highly recommend this hotel for business travelers.",
            "title": "New, clean, modern",
            "user": "EnragedCoconut"
        },
        {
            "date": "December 29, 2008",
            "detail_rating": {
                "business": 5.0,
                "cleanliness": 5.0,
                "desk": null,
                "front_desk": 4.0,
                "location": 4.0,
                "pool": null,
                "restaurant": null,
                "rooms": 5.0,
                "service": null,
                "sleep": null,
                "value": null
            },
            "helpfulness": 1,
            "id": 23066783,
            "likes": {
                "disliked": null,
                "liked": "\u2014 Clean, new, good price/value, & location"
            },
            "rating": 5.0,
            "stay_parameters": "Stayed October 2008",
            "text": "This new hotel adjacent to airport and expressway will appeal to those doing that long drive from Ontario and points west to the Maritime provinces in particular. It saves you the drive downtown and you avoid the far lower quality just as expensive motels that line the highway 20 towards Quebec City.",
            "title": "Tastefully modern",
            "user": "roomtoview"
        },
        {
            "date": "October 25, 2008",
            "detail_rating": {
                "business": 5.0,
                "cleanliness": 5.0,
                "desk": null,
                "front_desk": 4.0,
                "location": 4.0,
                "pool": null,
                "restaurant": null,
                "rooms": 4.0,
                "service": 3.0,
                "sleep": null,
                "value": 4.0
            },
            "helpfulness": 1,
            "id": 21194111,
            "likes": {
                "disliked": "\u2014 Communication befor stay, Lack of gift shop",
                "liked": "\u2014 Proximity to airport, size of room, comfortable bed and bath products"
            },
            "rating": 4.0,
            "stay_parameters": "Stayed October 2008, traveled as a couple",
            "text": "It is tastefully modern with lots of wood, light, and modern devices. e.g a massive LCD screen and neat attachment box so that you can plug your own electronics into the screen.",
            "title": "Great stopover hotel",
            "user": "Judybat16"
        },
        {
            "date": "October 20, 2008",
            "detail_rating": {
                "business": 5.0,
                "cleanliness": 5.0,
                "desk": null,
                "front_desk": 5.0,
                "location": 4.0,
                "pool": null,
                "restaurant": null,
                "rooms": 5.0,
                "service": 4.0,
                "sleep": null,
                "value": 4.0
            },
            "helpfulness": 2,
            "id": 21018210,
            "likes": {
                "disliked": "\u2014 no housekeeping to call for extra towels and blankets",
                "liked": "\u2014 24hr gym & the room"
            },
            "rating": 5.0,
            "stay_parameters": "Stayed October 2008, traveled with family",
            "text": "The shower is quite open with one clear glass wall/door facing the rest of the bathroom and on a side wall the frosted glass allows in light.",
            "title": "Aloft = Wonderful~",
            "user": "5abb"
        },
        {
            "date": "October 18, 2008",
            "detail_rating": {
                "business": 5.0,
                "cleanliness": 5.0,
                "desk": null,
                "front_desk": 4.0,
                "location": 4.0,
                "pool": null,
                "restaurant": null,
                "rooms": 5.0,
                "service": 4.0,
                "sleep": null,
                "value": 5.0
            },
            "helpfulness": 1,
            "id": 20984844,
            "likes": {
                "disliked": "\u2014 Distance from City",
                "liked": "\u2014 Modern, Clean Design"
            },
            "rating": 5.0,
            "stay_parameters": "Stayed July 2008, traveled on business",
            "text": "Beds were comfortable. Airport noise was not noticed. The lobby area is designed to hang out in and socialize.",
            "title": "Great Concept and Value",
            "user": "flyhighandlight"
        },
        {
            "date": "October 13, 2008",
            "detail_rating": {
                "business": 4.0,
                "cleanliness": 4.0,
                "desk": null,
                "front_desk": 3.0,
                "location": 4.0,
                "pool": null,
                "restaurant": null,
                "rooms": 4.0,
                "service": 3.0,
                "sleep": null,
                "value": 4.0
            },
            "helpfulness": null,
            "id": 20852549,
            "likes": {
                "disliked": "\u2014 Quality of service provided by staff is inconsistent - poor ventilation in the rooms",
                "liked": "\u2014 The green philosphy and the overall functionality of the concept"
            },
            "rating": 4.0,
            "stay_parameters": "Stayed October 2008, traveled as a couple",
            "text": "In summary; it is great value to some of the other options around. This concept will work well for Starwood.",
            "title": "A green philosophy plus cool vibes",
            "user": "marxusboy"
        }
    ],
    "slim_ranking": 0.364705882353,
    "stars": 3,
    "tripadvisor": {
        "VISITED": false,
        "country_name": null,
        "locality": null,
        "pic_link": null,
        "street_address": null
    },
    "user_rating": 4.0,
    "variance": {
        "average": 43,
        "excellent": 72,
        "poor": 20,
        "terrible": 9,
        "very good": 153
    }
}