{
    "aka": null,
    "description": null,
    "detail_rating": {
        "cleanliness": null,
        "location": null,
        "rooms": null,
        "service": null,
        "sleep": null,
        "value": null
    },
    "location": {
        "city": null,
        "continent": "Europe",
        "country": "Belgium",
        "proposed_city": null,
        "province": null,
        "region": "Wallonia"
    },
    "name": "Ibis Brussels Waterloo",
    "places": {
        "aka": [],
        "hotel_description": [],
        "hotel_name": [
            "Brussels",
            "Waterloo"
        ]
    },
    "review_count": 174,
    "review_count_current": 3,
    "reviews": [
        {
            "date": "March 4, 2008",
            "detail_rating": {
                "business": 5.0,
                "cleanliness": 3.0,
                "desk": null,
                "front_desk": 4.0,
                "location": 3.0,
                "pool": null,
                "restaurant": null,
                "rooms": 3.0,
                "service": 3.0,
                "sleep": null,
                "value": 3.0
            },
            "helpfulness": null,
            "id": 14036488,
            "likes": {
                "disliked": "\u2014 n/a",
                "liked": "\u2014 Breakfast buffet"
            },
            "rating": 3.0,
            "stay_parameters": "Stayed February 2008, traveled on business",
            "text": "I've stayed here for 3 nights on Feb 2008. It was average just like what it costs - and like every retail hotels, they got standard facilities within rooms. However they got great breakfast buffet offered included in the price. The staff were very helpful and kind although some of them don't really speak English and sometimes found difficulties communicate with them. But why blame since it was in Belgium!",
            "title": "OK",
            "user": "Zu Y"
        },
        {
            "date": "April 17, 2007",
            "detail_rating": {
                "business": 3.0,
                "cleanliness": 4.0,
                "desk": null,
                "front_desk": 4.0,
                "location": 3.0,
                "pool": null,
                "restaurant": null,
                "rooms": 3.0,
                "service": 3.0,
                "sleep": null,
                "value": 3.0
            },
            "helpfulness": 2,
            "id": 7379334,
            "likes": {
                "disliked": "\u2014 Smallish breakfast, bland decor",
                "liked": "\u2014 Predictability, pet-friendliness, proximity to destination"
            },
            "rating": 3.0,
            "stay_parameters": "Stayed April 2007, traveled on business",
            "text": "Well come back if I have to live in Waterloo again.",
            "title": "It's an Ibis. Reasonably priced blandness rules.",
            "user": "BelgoNederAmi"
        },
        {
            "date": "January 5, 2006",
            "detail_rating": {
                "business": null,
                "cleanliness": null,
                "desk": null,
                "location": null,
                "pool": null,
                "restaurant": null,
                "rooms": null,
                "service": null,
                "sleep": null,
                "value": null
            },
            "helpfulness": 2,
            "id": 4326063,
            "likes": {
                "disliked": null,
                "liked": null
            },
            "rating": 5.0,
            "stay_parameters": null,
            "text": "Accor has done a great job of establishing consistency in Ibis hotels across Europe.",
            "title": "Stop over at Ibis Hotel Waterloo.",
            "user": "A TripAdvisor user"
        }
    ],
    "slim_ranking": 0.8,
    "stars": 3,
    "tripadvisor": {
        "VISITED": false,
        "country_name": null,
        "locality": null,
        "pic_link": null,
        "street_address": null
    },
    "user_rating": 3.5,
    "variance": {
        "average": 62,
        "excellent": 22,
        "poor": 16,
        "terrible": 2,
        "very good": 72
    }
}