{
    "aka": "Asia Center Of Japan Hotel",
    "description": null,
    "detail_rating": {
        "cleanliness": null,
        "location": null,
        "rooms": null,
        "service": null,
        "sleep": null,
        "value": null
    },
    "location": {
        "city": null,
        "continent": "Asia",
        "country": "Japan",
        "proposed_city": "Asia",
        "province": null,
        "region": "Kanto"
    },
    "name": "Hotel Asia Center of Japan",
    "places": {
        "aka": [
            "Asia",
            "Of"
        ],
        "hotel_description": [],
        "hotel_name": [
            "Asia"
        ]
    },
    "review_count": 253,
    "review_count_current": 14,
    "reviews": [
        {
            "date": "April 26, 2008",
            "detail_rating": {
                "business": 5.0,
                "cleanliness": 4.0,
                "desk": null,
                "front_desk": 4.0,
                "location": 4.0,
                "pool": null,
                "restaurant": null,
                "rooms": 3.0,
                "service": 5.0,
                "sleep": null,
                "value": 5.0
            },
            "helpfulness": 1,
            "id": 15375293,
            "likes": {
                "disliked": "\u2014 relatively small rooms (12sqm)",
                "liked": "\u2014 location and price"
            },
            "rating": 4.0,
            "stay_parameters": "Stayed April 2008, traveled as a couple",
            "text": "We stayed in this hotel for 7 nights (first time in Tokyo). It is perfectly located as you have very good access to the subway within 5 minutes walking distance. (there are 3 lines crossing here at the \"Aoyama 1-chome\"-station: Ginza-line/Hanzomon-line/Oedo-line. That makes it very easy to get arround in Tokyo from here in short distances: 5-10 minutes train-ride to Shinjuku, Shibuya or Ginza)- 15minutes walk to night-life area Roppongi",
            "title": "best low-budget deal in Tokyo",
            "user": "larsb18"
        },
        {
            "date": "April 8, 2008",
            "detail_rating": {
                "business": 5.0,
                "cleanliness": 5.0,
                "desk": null,
                "front_desk": 5.0,
                "location": 4.0,
                "pool": null,
                "restaurant": null,
                "rooms": 4.0,
                "service": 5.0,
                "sleep": null,
                "value": 4.0
            },
            "helpfulness": 1,
            "id": 14882495,
            "likes": {
                "disliked": "\u2014 Corridors smell of smoke but bearable - this is Japan and you need to accept that in Japan smoking in public places has not been outlawed in the same way as the UK /USA.",
                "liked": "\u2014 Clean rooms, good accommodation, very helpful staff."
            },
            "rating": 5.0,
            "stay_parameters": "Stayed April 2008, traveled as a couple",
            "text": "rooms are very small, which did not bother us as we did not stay much in our hotel - only for sleeping.",
            "title": "ACOJ Fully Meets Expectations",
            "user": "NickJK"
        },
        {
            "date": "March 10, 2008",
            "detail_rating": {
                "business": null,
                "cleanliness": null,
                "desk": null,
                "location": null,
                "pool": null,
                "restaurant": null,
                "rooms": null,
                "service": null,
                "sleep": null,
                "value": null
            },
            "helpfulness": 2,
            "id": 14177450,
            "likes": {
                "disliked": null,
                "liked": null
            },
            "rating": 4.0,
            "stay_parameters": null,
            "text": "Very quit and safe area with mostly residential buildings and some embassies in the neighborhood.",
            "title": "Clean, great price, good location",
            "user": "ACSydney"
        },
        {
            "date": "March 2, 2008",
            "detail_rating": {
                "business": 3.0,
                "cleanliness": 4.0,
                "desk": null,
                "front_desk": 4.0,
                "location": 4.0,
                "pool": null,
                "restaurant": null,
                "rooms": 3.0,
                "service": 4.0,
                "sleep": null,
                "value": 5.0
            },
            "helpfulness": 2,
            "id": 14000298,
            "likes": {
                "disliked": "\u2014 A little difficult to get to from the airport.",
                "liked": "\u2014 THe Price"
            },
            "rating": 4.0,
            "stay_parameters": "Stayed May 2007, traveled with family",
            "text": "The reception staff are very friendly and speak a very good English. E.g. they helped us in booking a tea ceremony at the \"Sado Kaikan\" (They made the full fax correspondence and even made a translated print-out of the location map.)",
            "title": "Great Little Find",
            "user": "BonnieMax"
        },
        {
            "date": "January 8, 2008",
            "detail_rating": {
                "business": 5.0,
                "cleanliness": 4.0,
                "desk": null,
                "front_desk": 4.0,
                "location": 4.0,
                "pool": null,
                "restaurant": null,
                "rooms": 3.0,
                "service": 4.0,
                "sleep": null,
                "value": 5.0
            },
            "helpfulness": 2,
            "id": 12430022,
            "likes": {
                "disliked": null,
                "liked": null
            },
            "rating": 5.0,
            "stay_parameters": "Stayed December 2007, traveled as a couple",
            "text": "The room rates are at an unbeatable low price of only arround 70 EURO per night - a real bargain for a 3*-hotel in Tokyo! The money saved we rather spent with good japanese food :-)",
            "title": "Good choice in Tokyo",
            "user": "Zuckerbussi"
        },
        {
            "date": "November 4, 2007",
            "detail_rating": {
                "business": 4.0,
                "cleanliness": 4.0,
                "desk": null,
                "front_desk": 4.0,
                "location": 3.0,
                "pool": null,
                "restaurant": null,
                "rooms": 4.0,
                "service": 4.0,
                "sleep": null,
                "value": 4.0
            },
            "helpfulness": 2,
            "id": 10591848,
            "likes": {
                "disliked": null,
                "liked": "\u2014 Pretty good value"
            },
            "rating": 4.0,
            "stay_parameters": "Stayed July 2007, traveled with friends",
            "text": "First hotel we stayed at in Tokyo (note: after living in Kanazawa for 6 weeks). The subway station is easily accessible, but doesn't have escalators near the exits close to the hotel- which made dragging all our luggage around a bit of a chore at some points.",
            "title": "Good value",
            "user": "ibmman"
        },
        {
            "date": "September 25, 2007",
            "detail_rating": {
                "business": 3.0,
                "cleanliness": 4.0,
                "desk": null,
                "front_desk": 5.0,
                "location": 4.0,
                "pool": null,
                "restaurant": null,
                "rooms": 4.0,
                "service": 4.0,
                "sleep": null,
                "value": 4.0
            },
            "helpfulness": 2,
            "id": 10002161,
            "likes": {
                "disliked": "\u2014 Small rooms, but perfectly adequate.",
                "liked": "\u2014 Clean, centrally located, good value."
            },
            "rating": 4.0,
            "stay_parameters": "Stayed August 2007, traveled solo",
            "text": "The hotel is easy to find once you've found it before but when you're heading there for the first time- definitely have the directions handy. It's a walk from the station, but not bad. People in the area are very likely to be helpful if you approach them, or are likely to approach you and ask if you need help if you look lost enough (as was the case with us). As you'll see when you get there, the area is a big business area, although there's a cafe or two and a few convenience stores close to the hotel.",
            "title": "Loved the Asia",
            "user": "treksandy"
        },
        {
            "date": "September 23, 2007",
            "detail_rating": {
                "business": 3.0,
                "cleanliness": 3.0,
                "desk": null,
                "front_desk": 4.0,
                "location": 3.0,
                "pool": null,
                "restaurant": null,
                "rooms": 3.0,
                "service": 3.0,
                "sleep": null,
                "value": 4.0
            },
            "helpfulness": 1,
            "id": 8864046,
            "likes": {
                "disliked": null,
                "liked": null
            },
            "rating": 3.0,
            "stay_parameters": "Stayed September 2007, traveled with friends",
            "text": "The staff speaks english well, and the room, while small, was big enough (we had 3 people, 2 double beds). Internet access was free and worked. We also had a small refrigerator and hot water pot.",
            "title": "Clean and Tidy, with OK location",
            "user": "Rambaldi_Macguffin"
        },
        {
            "date": "July 24, 2007",
            "detail_rating": {
                "business": null,
                "cleanliness": null,
                "desk": null,
                "location": null,
                "pool": null,
                "restaurant": null,
                "rooms": null,
                "service": null,
                "sleep": null,
                "value": null
            },
            "helpfulness": 2,
            "id": 8229349,
            "likes": {
                "disliked": null,
                "liked": null
            },
            "rating": 4.0,
            "stay_parameters": null,
            "text": "Overall, the experience lived up the apparent reputation of a decent place for the money- decent location and a pretty good rate.",
            "title": "Excellent for budget travelers",
            "user": "Montana Business Man"
        },
        {
            "date": "February 18, 2007",
            "detail_rating": {
                "business": null,
                "cleanliness": 5.0,
                "desk": null,
                "front_desk": 5.0,
                "location": 5.0,
                "pool": null,
                "restaurant": null,
                "rooms": 5.0,
                "service": 5.0,
                "sleep": null,
                "value": 5.0
            },
            "helpfulness": 5,
            "id": 6810126,
            "likes": {
                "disliked": "\u2014 Room size",
                "liked": "\u2014 Price/location"
            },
            "rating": 5.0,
            "stay_parameters": "Stayed February 2007, traveled as a couple",
            "text": "Stayed in the Hotel Asia for 5 nights.",
            "title": "Can't beat it for the price..",
            "user": "dfgdave"
        },
        {
            "date": "December 10, 2007",
            "detail_rating": {
                "business": 4.0,
                "cleanliness": 5.0,
                "desk": null,
                "front_desk": 5.0,
                "location": 5.0,
                "pool": null,
                "restaurant": null,
                "rooms": 5.0,
                "service": 5.0,
                "sleep": null,
                "value": 5.0
            },
            "helpfulness": 6,
            "id": 11432483,
            "likes": {
                "disliked": "\u2014 No free breakfast",
                "liked": "\u2014 Great value, good location, good service"
            },
            "rating": 5.0,
            "stay_parameters": "Stayed October 2007, traveled as a couple",
            "text": "I stayed at the Hotel Asia Center of Japan for 3 nights in a twin room. The twin room is a decent size for Japanese hotels. The bathroom however was cramped but had a high tech toilet with bidet function. Free internet is also available in the rooms. The hotel is located 5 mins from the subway and 15 mins from Roppongi which is a tourist hotspot. The rooms and hotel were very clean, staff spoke excellent English and were very helpful with restaurant suggestions. Breakfast is not included but there was free bottled water available in the lobby. There are many nearby restaurants to choose from as well as banks and 24hr convenience stores. The area is very safe and quiet at night. I will definitely stay here when I visit Tokyo again.",
            "title": "Great value, excellent area to stay in",
            "user": "GGSTU"
        },
        {
            "date": "February 18, 2007",
            "detail_rating": {
                "business": 4.0,
                "cleanliness": 3.0,
                "desk": null,
                "front_desk": 5.0,
                "location": 5.0,
                "pool": null,
                "restaurant": null,
                "rooms": 2.0,
                "service": 4.0,
                "sleep": null,
                "value": 4.0
            },
            "helpfulness": 8,
            "id": 6809194,
            "likes": {
                "disliked": null,
                "liked": null
            },
            "rating": 4.0,
            "stay_parameters": "Stayed February 2007",
            "text": "The staff were great and most helpful. The front desk folks were good at speaking English though my wife is Japanese and that certainly helped. The place is clean and the halls only had a slight smell of smoke which didn't bother either of us. We found the breakfast most convient and reasonable considering we were in a pricey area of Tokyo.",
            "title": "Reasonable rates and fantastic location!",
            "user": "tourist2007"
        },
        {
            "date": "December 13, 2006",
            "detail_rating": {
                "business": 5.0,
                "cleanliness": 5.0,
                "desk": null,
                "front_desk": 5.0,
                "location": 4.0,
                "pool": null,
                "restaurant": null,
                "rooms": 4.0,
                "service": 4.0,
                "sleep": null,
                "value": 4.0
            },
            "helpfulness": 3,
            "id": 6436805,
            "likes": {
                "disliked": "\u2014 TV",
                "liked": "\u2014 Low price"
            },
            "rating": 5.0,
            "stay_parameters": "Stayed November 2006, traveled as a couple",
            "text": "The area is great and the subway most convenient. One item to note is that many subways do not have escalators or elevators so travelers that tend to pack heavy, like us, will lug big suitcases up a lot of steps if arriving/departing from the hotel by the subway as we do. My suggestion is to resist the urge to pack heavy and take advantage of the washers and dryers at the hotel. Your back will thank you for a lighter suitcase!",
            "title": "Thank you for a great stay Tripadvisors!",
            "user": "Phil-on-the-move"
        },
        {
            "date": "October 29, 2006",
            "detail_rating": {
                "business": 5.0,
                "cleanliness": 5.0,
                "desk": null,
                "front_desk": 5.0,
                "location": 5.0,
                "pool": null,
                "restaurant": null,
                "rooms": 4.0,
                "service": 5.0,
                "sleep": null,
                "value": 5.0
            },
            "helpfulness": 8,
            "id": 6025380,
            "likes": {
                "disliked": "\u2014 Avoid the restaurant it is overpriced and there are great restaurants nearby",
                "liked": "\u2014 Good value"
            },
            "rating": 4.0,
            "stay_parameters": "Stayed March 2006, traveled as a couple",
            "text": "Not much else to say except this is now our hotel of choice in Tokyo. We aren't budget travellers per se but do recognize a good deal and this is one of them. Since all we do is basically sleep in the hotel the money we save is better spent on excellent sushi/sashimi, sake and shopping.",
            "title": "Fantasic budget hotel, Great location",
            "user": "ChrisandJen"
        }
    ],
    "slim_ranking": 0.164835164835,
    "stars": 2.5,
    "tripadvisor": {
        "VISITED": false,
        "country_name": null,
        "locality": null,
        "pic_link": null,
        "street_address": null
    },
    "user_rating": 4.0,
    "variance": {
        "average": 34,
        "excellent": 87,
        "poor": 5,
        "terrible": 3,
        "very good": 124
    }
}