{
    "aka": "Harrah`s New Orleans Hotel",
    "description": null,
    "detail_rating": {
        "cleanliness": 4.5,
        "location": 4.5,
        "rooms": 4.5,
        "service": 4.5,
        "sleep": 4.5,
        "value": 4.5
    },
    "location": {
        "city": "New Orleans",
        "continent": null,
        "country": "United States",
        "proposed_city": "Orleans",
        "province": null,
        "region": null
    },
    "name": "Harrah's New Orleans",
    "places": {
        "aka": [
            "Orleans"
        ],
        "hotel_description": [],
        "hotel_name": [
            "Orleans"
        ]
    },
    "review_count": 630,
    "review_count_current": 17,
    "reviews": [
        {
            "date": "April 23, 2007",
            "detail_rating": {
                "business": null,
                "cleanliness": 4.0,
                "desk": null,
                "front_desk": 1.0,
                "location": 3.0,
                "pool": null,
                "restaurant": null,
                "rooms": 5.0,
                "service": 1.0,
                "sleep": null,
                "value": 3.0
            },
            "helpfulness": 4,
            "id": 7417356,
            "likes": {
                "disliked": "\u2014 The front desk was positively awful",
                "liked": "\u2014 Beautiful Marble"
            },
            "rating": 4.0,
            "stay_parameters": "Stayed February 2007, traveled on business",
            "text": "We were comped at room at Harrah's . Had arranged for an early check in and confirmed the room type and early check in the day before. Upon arrival the room type and early check-in were not available...the front desk was totally inept. Advised us they would call us on our cell phones when the room was available and estimated a delay of about an hour...Three hours later when we called them the room was still not available...and also was not smoking as we had requested or a King bed...we eventually received the suite we had arranged...It was a very nice room...Mardi Gras Suite...nice color scheme with subtle useage of purple green and gold( mardi gras) colors in the decor. flat screen TV, dining room table, sitting area, nice useage of marble in the bathroom ,wet bar...it faced a courtyard that had a bit of noise from a jazz group but it wasn't excessive. An apology for our being inconvienced would have been nice but it was never offered. I'll definitely stay here again...but only if I don't have an pressing plans or engagements and can afford to not have access to lodging till the evening of day of arrival.",
            "title": "Suite Sweet?",
            "user": "ssful"
        },
        {
            "date": "February 5, 2007",
            "detail_rating": {
                "business": 5.0,
                "cleanliness": 5.0,
                "desk": null,
                "front_desk": 5.0,
                "location": 5.0,
                "pool": null,
                "restaurant": null,
                "rooms": 5.0,
                "service": 5.0,
                "sleep": null,
                "value": 5.0
            },
            "helpfulness": 2,
            "id": 6748751,
            "likes": {
                "disliked": null,
                "liked": null
            },
            "rating": 5.0,
            "stay_parameters": "Stayed February 2007, traveled with friends",
            "text": "This is one of the nicer Harrah's properties that I have stayed at. The rooms were beautiful, very well appointed. Being a diamond member of Harrah's Total rewards program, I was upgraded to s suite for free. The staff was excellent everwhere--front desk, housekeeping, valet, everyone!! The valet charges $25 to $35 per night to keep your car which i thought was high, but not uncommon for New Orleans. I love this casino. It so classy and upscale, yet so comfortable. The main bar in the middle of the casino is awesome. The only down side is that it's quite a hike to Bourbon Street. I will definetly stay at this hotel again.",
            "title": "One of the nicer Harrahs",
            "user": "CTPJ"
        },
        {
            "date": "October 20, 2007",
            "detail_rating": {
                "business": null,
                "cleanliness": 5.0,
                "desk": null,
                "front_desk": 4.0,
                "location": 4.0,
                "pool": null,
                "restaurant": null,
                "rooms": 5.0,
                "service": 4.0,
                "sleep": null,
                "value": 4.0
            },
            "helpfulness": 2,
            "id": 10163262,
            "likes": {
                "disliked": "\u2014 Not a thing.",
                "liked": "\u2014 Everything about our room!"
            },
            "rating": 5.0,
            "stay_parameters": "Stayed October 2007, traveled with family",
            "text": "This was our first stay at the Harrah's hotel in New Orleans.",
            "title": "WOW",
            "user": "Realaloha"
        },
        {
            "date": "October 2, 2007",
            "detail_rating": {
                "business": 3.0,
                "cleanliness": 5.0,
                "desk": null,
                "front_desk": 1.0,
                "location": 4.0,
                "pool": null,
                "restaurant": null,
                "rooms": 4.0,
                "service": 2.0,
                "sleep": null,
                "value": 2.0
            },
            "helpfulness": 7,
            "id": 10033098,
            "likes": {
                "disliked": "\u2014 The checking in/reservation process. The lies that the night manager told us.",
                "liked": "\u2014 The nice, clean new rooms"
            },
            "rating": 2.0,
            "stay_parameters": "Stayed September 2007, traveled as a couple",
            "text": "Our room had a great view of the bridge and city.",
            "title": "Reservations are a conceptual thing here....",
            "user": "WMUTraveler"
        },
        {
            "date": "September 19, 2007",
            "detail_rating": {
                "business": 5.0,
                "cleanliness": 5.0,
                "desk": null,
                "front_desk": 5.0,
                "location": 5.0,
                "pool": null,
                "restaurant": null,
                "rooms": 5.0,
                "service": 5.0,
                "sleep": null,
                "value": 5.0
            },
            "helpfulness": 3,
            "id": 8753818,
            "likes": {
                "disliked": "\u2014 no pool",
                "liked": "\u2014 location"
            },
            "rating": 5.0,
            "stay_parameters": "Stayed May 2007, traveled as a couple",
            "text": "The service at this property is outstanding - the employees here are friendly and helpful.",
            "title": "INCREDIBLE HOTEL !!!!",
            "user": "scsokrboi"
        },
        {
            "date": "September 16, 2007",
            "detail_rating": {
                "business": null,
                "cleanliness": 5.0,
                "desk": null,
                "front_desk": 5.0,
                "location": 5.0,
                "pool": null,
                "restaurant": null,
                "rooms": 5.0,
                "service": 5.0,
                "sleep": null,
                "value": 4.0
            },
            "helpfulness": 2,
            "id": 8723919,
            "likes": {
                "disliked": null,
                "liked": null
            },
            "rating": 4.0,
            "stay_parameters": "Stayed August 2007, traveled as a couple",
            "text": "The hotel is absolutely beautiful from the lobby to the bathrooms. Large deep soaking tub, separate shower - I loved that after a late night (early morning) return to the room.",
            "title": "Nice Hotel with a great location",
            "user": "Danny F"
        },
        {
            "date": "September 12, 2007",
            "detail_rating": {
                "business": 5.0,
                "cleanliness": 5.0,
                "desk": null,
                "front_desk": 5.0,
                "location": 5.0,
                "pool": null,
                "restaurant": null,
                "rooms": 5.0,
                "service": 5.0,
                "sleep": null,
                "value": 5.0
            },
            "helpfulness": 3,
            "id": 8703289,
            "likes": {
                "disliked": "\u2014 Nothing",
                "liked": "\u2014 The Bathroom"
            },
            "rating": 5.0,
            "stay_parameters": "Stayed August 2007, traveled solo",
            "text": "The location is great as it is only a walk across the street to the casino, a block from the Mississippi and a few blocks to Bourbon Street and the French Quarter.",
            "title": "Awesome Hotel in an Awewsome City",
            "user": "leenabeena"
        },
        {
            "date": "August 16, 2007",
            "detail_rating": {
                "business": 5.0,
                "cleanliness": 5.0,
                "desk": null,
                "front_desk": 5.0,
                "location": 5.0,
                "pool": null,
                "restaurant": null,
                "rooms": 5.0,
                "service": 5.0,
                "sleep": null,
                "value": 5.0
            },
            "helpfulness": null,
            "id": 8436105,
            "likes": {
                "disliked": "\u2014 cannot think of anything",
                "liked": "\u2014 the view and the bed"
            },
            "rating": 5.0,
            "stay_parameters": "Stayed August 2007, traveled as a couple",
            "text": "This was my 5th or 6th time and it just keeps getting better.",
            "title": "Luxury at its Best",
            "user": "pokerlady"
        },
        {
            "date": "July 20, 2007",
            "detail_rating": {
                "business": 4.0,
                "cleanliness": 4.0,
                "desk": null,
                "front_desk": 5.0,
                "location": 5.0,
                "pool": null,
                "restaurant": null,
                "rooms": 5.0,
                "service": 5.0,
                "sleep": null,
                "value": 5.0
            },
            "helpfulness": 5,
            "id": 8194212,
            "likes": {
                "disliked": "\u2014 no pool",
                "liked": "\u2014 Comfortable spacious rooms"
            },
            "rating": 5.0,
            "stay_parameters": "Stayed June 2007, traveled with friends",
            "text": "Sometimes I am with my husband and other times with my girlfriend. No matter, you are still treated like royalty. My personal opinion is that they have the best rooms of any casino hotel either in New Orleans or on the Gulf Coast.",
            "title": "Harrah's Hotel New Olreans, La",
            "user": "K F"
        },
        {
            "date": "July 12, 2007",
            "detail_rating": {
                "business": 4.0,
                "cleanliness": 5.0,
                "desk": null,
                "front_desk": 5.0,
                "location": 5.0,
                "pool": null,
                "restaurant": null,
                "rooms": 5.0,
                "service": 5.0,
                "sleep": null,
                "value": 4.0
            },
            "helpfulness": 4,
            "id": 8106230,
            "likes": {
                "disliked": "\u2014 ??",
                "liked": "\u2014 classy place"
            },
            "rating": 5.0,
            "stay_parameters": "Stayed July 2007, traveled as a couple",
            "text": "Absolutely Wonderful! I've stayed here a number of times.....each being better than the last. If your looking for Southern Hospitality, you'll get it here! As you enter and depart the hotel you'll be showered with \"Good Morning, Good Afternoon, Have a Great Evening\". The rooms are beautifully decorated, comfortable, and cozy. The only negative would be that this hotel does not have a pool.",
            "title": "New and great",
            "user": "zocko"
        },
        {
            "date": "June 14, 2007",
            "detail_rating": {
                "business": null,
                "cleanliness": 5.0,
                "desk": null,
                "front_desk": 5.0,
                "location": 5.0,
                "pool": null,
                "restaurant": null,
                "rooms": 5.0,
                "service": 5.0,
                "sleep": null,
                "value": 5.0
            },
            "helpfulness": 1,
            "id": 7848111,
            "likes": {
                "disliked": "\u2014 Service at Fuddruckers in casino",
                "liked": "\u2014 Plush accomodations, friendly staff"
            },
            "rating": 4.0,
            "stay_parameters": "Stayed June 2007, traveled as a couple",
            "text": "Stayed at the new Harrah's hotel across Poydrus from the casino. scored a 23rd floor corner suite. ((Diamond member)) It doesn't get any better than this. Had a window on two sides so we could see the river and business district. The bathroom was at least 10x12. Soaker tub, walk in shower. Had two big screen TV's.",
            "title": "Luxurious",
            "user": "ForneyNan"
        },
        {
            "date": "April 28, 2007",
            "detail_rating": {
                "business": null,
                "cleanliness": 5.0,
                "desk": null,
                "front_desk": 5.0,
                "location": 4.0,
                "pool": null,
                "restaurant": null,
                "rooms": 5.0,
                "service": 5.0,
                "sleep": null,
                "value": 5.0
            },
            "helpfulness": 8,
            "id": 7479932,
            "likes": {
                "disliked": "\u2014 Their cab service",
                "liked": "\u2014 The comfort and service"
            },
            "rating": 5.0,
            "stay_parameters": "Stayed April 2007, traveled with family",
            "text": "Sitting room with a table, couch, bar etc.Had dinner at the French restaurant downatairs. Great food. there's an underground walkway to the casino in case it's raining. Had an overall great time, restaurants weren't crowded, Bourban Street was still hopping. Still see some buildings boarded up. Looks like N.O. is back in business.",
            "title": "Superb!",
            "user": "Lovethatcity"
        },
        {
            "date": "February 28, 2008",
            "detail_rating": {
                "business": null,
                "cleanliness": 5.0,
                "desk": null,
                "front_desk": 4.0,
                "location": 5.0,
                "pool": null,
                "restaurant": null,
                "rooms": 5.0,
                "service": 4.0,
                "sleep": null,
                "value": 5.0
            },
            "helpfulness": 1,
            "id": 13912818,
            "likes": {
                "disliked": null,
                "liked": null
            },
            "rating": 5.0,
            "stay_parameters": "Stayed February 2008, traveled as a couple",
            "text": "We just stayed one night at Harrah's, booked through harrahs.com. Hotel was very impressive, not vanilla like Vegas' Harrah's property. It was like Rio or Paris LV properties, for comparison. They let us check in early, no problem. As other reviewers note, rooms are spacious with big foyer area, large bathroom with private toilet. Big jacuzzi tub and big shower. Nice Gilchrist & Soames toiletries like other high-end Harrah's properties. Hotel is very new so everything sleek, clean. Used fitness center, which had nice equipment and towels ready for you on the machines. Our room had a great view of the bend in the river looking toward the French Quarter. Great location, walked everywhere in French Quarter and close to CBD attractions also. Ate at the buffet's Sunday jazz champagne brunch, which I would definitely recommend.",
            "title": "Great stay at Harrah's",
            "user": "steptravel"
        },
        {
            "date": "February 24, 2008",
            "detail_rating": {
                "business": 5.0,
                "cleanliness": 5.0,
                "desk": null,
                "front_desk": 5.0,
                "location": 5.0,
                "pool": null,
                "restaurant": null,
                "rooms": 5.0,
                "service": null,
                "sleep": null,
                "value": null
            },
            "helpfulness": 1,
            "id": 13806191,
            "likes": {
                "disliked": null,
                "liked": "\u2014 Bed!!"
            },
            "rating": 5.0,
            "stay_parameters": "Stayed February 2008, traveled as a couple",
            "text": "This is a very nice hotel. The staff were very friendly and approachable. The room was lovely and spacious. The bed was so comfortable, pillows great, linens noticeably of quality, and the comforter just the right weight. The bathroom is huge, and I loved the strength of the shower!",
            "title": "Not Just for Gamblers.",
            "user": "timidtravelerUs"
        },
        {
            "date": "January 30, 2008",
            "detail_rating": {
                "business": null,
                "cleanliness": null,
                "desk": null,
                "location": null,
                "pool": null,
                "restaurant": null,
                "rooms": null,
                "service": null,
                "sleep": null,
                "value": null
            },
            "helpfulness": 1,
            "id": 13129149,
            "likes": {
                "disliked": null,
                "liked": null
            },
            "rating": 2.0,
            "stay_parameters": null,
            "text": "The hotel is located one block from Canal Street. It was a great location, especially if you like to venture out of French Quarter. We walked to Cafe du Monde every morning by taking the riverwalk, probably about 1/2 mile. So we got our share of the French Quarter experience.",
            "title": "There is segregation and really bad food at the buffet!",
            "user": "PaindeMie"
        },
        {
            "date": "January 3, 2008",
            "detail_rating": {
                "business": null,
                "cleanliness": null,
                "desk": null,
                "location": null,
                "pool": null,
                "restaurant": null,
                "rooms": null,
                "service": null,
                "sleep": null,
                "value": 5.0
            },
            "helpfulness": 1,
            "id": 12308917,
            "likes": {
                "disliked": "\u2014 $5 water, long hike to casino or parking",
                "liked": "\u2014 Pretty, new, tasteful rooms"
            },
            "rating": 5.0,
            "stay_parameters": "Stayed December 2007, traveled as a couple",
            "text": "We also walked the other way to go to WWII museum, formerly DDay Museum. Another easy pleasant walk. We caught the St Charles trolley 3 blocks away and went and saw the Garden district.",
            "title": "Very nice",
            "user": "srizzuto"
        },
        {
            "date": "December 31, 2007",
            "detail_rating": {
                "business": null,
                "cleanliness": 5.0,
                "desk": null,
                "front_desk": 5.0,
                "location": 5.0,
                "pool": null,
                "restaurant": null,
                "rooms": 5.0,
                "service": 5.0,
                "sleep": null,
                "value": 5.0
            },
            "helpfulness": 4,
            "id": 12154681,
            "likes": {
                "disliked": "\u2014 I have no complaints.",
                "liked": "\u2014 Beautiful facility with excellent service."
            },
            "rating": 5.0,
            "stay_parameters": "Stayed December 2007, traveled solo",
            "text": "I recommend this hotel. Great location and great rooms. .",
            "title": "First rate",
            "user": "chellasmith"
        }
    ],
    "slim_ranking": 0.221476510067,
    "stars": 4,
    "tripadvisor": {
        "VISITED": false,
        "country_name": null,
        "locality": null,
        "pic_link": null,
        "street_address": null
    },
    "user_rating": 4.0,
    "variance": {
        "average": 52,
        "excellent": 359,
        "poor": 30,
        "terrible": 32,
        "very good": 157
    }
}