{
    "aka": "Hotel Listel Shinjuku Tokyo",
    "description": null,
    "detail_rating": {
        "cleanliness": 4.0,
        "location": 3.5,
        "rooms": 3.5,
        "service": 3.5,
        "sleep": 3.5,
        "value": 3.5
    },
    "location": {
        "city": null,
        "continent": null,
        "country": null,
        "proposed_city": "Tokyo",
        "province": null,
        "region": null
    },
    "name": "Hotel Listel Shinjuku",
    "places": {
        "aka": [
            "Tokyo"
        ],
        "hotel_description": [],
        "hotel_name": []
    },
    "review_count": 208,
    "review_count_current": 4,
    "reviews": [
        {
            "date": "April 16, 2008",
            "detail_rating": {
                "business": null,
                "cleanliness": null,
                "desk": null,
                "location": null,
                "pool": null,
                "restaurant": null,
                "rooms": null,
                "service": null,
                "sleep": null,
                "value": null
            },
            "helpfulness": null,
            "id": 15071608,
            "likes": {
                "disliked": null,
                "liked": null
            },
            "rating": 3.0,
            "stay_parameters": null,
            "text": "Hotel was just what right for what i needed. Was cheap by tokyo standards, near the bars/clubs of shinjuku and very much a 'local area'. The hotel itself was great for singletravellers. Its small compact, but very clean and fairly modern. All tv channels were in japanese but was too busy exploring tokyo instead! Make sure you ask for a room in the main building and not the annexe part. The main thing that this hotel fell down on was service. I expereinced great hospitaility everywhere i went in tokyo (even if they didnt speak english!) but the staff in this hotel were very un-friendly and not wishing to help. I arrived at the hotel at 10am but the room wasnt ready until 2pm. I was made to wait as were all the other guests. Then suprisingly enough right on 2pm ALL the rooms suddenly became available! Miraculous! You can pay extra to check in early, and i would have done but for the way they went about it. Brisk 10-15 min walk to the main shinsuku station which is a great platform from which to explore tokyo.",
            "title": "Good hotel, bad management",
            "user": "qprjames"
        },
        {
            "date": "May 20, 2007",
            "detail_rating": {
                "business": null,
                "cleanliness": null,
                "desk": null,
                "location": null,
                "pool": null,
                "restaurant": null,
                "rooms": null,
                "service": null,
                "sleep": null,
                "value": null
            },
            "helpfulness": null,
            "id": 7656177,
            "likes": {
                "disliked": null,
                "liked": null
            },
            "rating": 4.0,
            "stay_parameters": null,
            "text": "Oh and dont bother paying extra for breakfast. It was very poor!!!",
            "title": "Great location",
            "user": "David1220"
        },
        {
            "date": "September 24, 2006",
            "detail_rating": {
                "business": null,
                "cleanliness": null,
                "desk": null,
                "location": null,
                "pool": null,
                "restaurant": null,
                "rooms": null,
                "service": null,
                "sleep": null,
                "value": null
            },
            "helpfulness": null,
            "id": 5833383,
            "likes": {
                "disliked": null,
                "liked": null
            },
            "rating": 2.0,
            "stay_parameters": null,
            "text": "Booked online at their webiste. Standard room. Stall but comfortable. No closet, just a hook that can hang about 5 items. Few TV Channels, none in English. Typical small Japanese bathroom. However, all very functional, and great value for Tokyo, and awesome location walking distance to Shinjuku. When to arrive at Shinjuki Station, just take a taxi for 660 Yen, don't try to find if your first trip to Tokyo. However, once there, easy to get around and great location to shopping, night life etc! I would absolutely recommend and stay there again. Breakfast was buffet style, mostly Japanese but eggs, toast and Japanese ham/bacon available. Inluded in price. Noon \"late check out\" included with a two night stay. P.S. A/C worked fine, and I slept great!",
            "title": "Not My Cup of Green Tea",
            "user": "DLCharactr"
        },
        {
            "date": "August 29, 2005",
            "detail_rating": {
                "business": null,
                "cleanliness": null,
                "desk": null,
                "location": null,
                "pool": null,
                "restaurant": null,
                "rooms": null,
                "service": null,
                "sleep": null,
                "value": null
            },
            "helpfulness": null,
            "id": 3813267,
            "likes": {
                "disliked": null,
                "liked": null
            },
            "rating": 4.0,
            "stay_parameters": null,
            "text": "I chose this hotel because I found a couple of reviews on the web that said it was a decent hotel. Although the room was typical for Japanese standards (very clean, small, hard bed, toilet that squirts warm water), the overall experience was uninviting. The worst thing for me is the 10:00 am check out time. When I'm on vacation, that's usually the time I wake up. And at 10:02 that day, I got a call from the front desk that it was check out time and I needed to come down now.",
            "title": "Fantastic value, good location!",
            "user": "Boop2"
        }
    ],
    "slim_ranking": 0.608695652174,
    "stars": 3,
    "tripadvisor": {
        "VISITED": false,
        "country_name": null,
        "locality": null,
        "pic_link": null,
        "street_address": null
    },
    "user_rating": 3.5,
    "variance": {
        "average": 72,
        "excellent": 15,
        "poor": 13,
        "terrible": 7,
        "very good": 101
    }
}