{
  "id": "004",
  "title": "berlin pool sauna wellness",
  "description": "Which hotels in Berlin have a pool, sauna or a wellness area?",
  "narrative": "The hotel of a relevant review has to be in Berlin, Germany. The review has to describe, that the hotel has a pool, a sauna or a wellness area."
}