{
    "aka": null,
    "description": "The suites in our brand-new University City property come in studio and one-bedroom sizes, all with top amenities and modern, attractive decor. Each suite includes a full kitchen with a refrigerator, microwave and twin-burner stove, and features separate living and sleeping areas with all the comforts of home and more.",
    "detail_rating": {
        "cleanliness": null,
        "location": null,
        "rooms": null,
        "service": null,
        "sleep": null,
        "value": null
    },
    "location": {
        "city": "Philadelphia",
        "continent": null,
        "country": "United States",
        "proposed_city": "University",
        "province": null,
        "region": null
    },
    "name": "Homewood Suites University City",
    "places": {
        "aka": [],
        "hotel_description": [
            "University"
        ],
        "hotel_name": [
            "Homewood",
            "University"
        ]
    },
    "review_count": 131,
    "review_count_current": 20,
    "reviews": [
        {
            "date": "October 9, 2012",
            "detail_rating": {
                "business": null,
                "cleanliness": 5.0,
                "desk": null,
                "location": 5.0,
                "pool": null,
                "restaurant": null,
                "rooms": 5.0,
                "service": 5.0,
                "sleep": 5.0,
                "value": 3.0
            },
            "helpfulness": null,
            "id": 142386497,
            "likes": {
                "disliked": null,
                "liked": null
            },
            "rating": 5.0,
            "stay_parameters": "Stayed October 2012, traveled with family",
            "text": "A great location right across the street from the west end of UPenn. Easy walk to all of campus. Hotel is only 5 months old, all new, smells/looks new& clean. Very large rooms, nice kitchen area, all modern.",
            "title": "Great Location at UPenn, Brand New Hotel",
            "user": "rj_traveler_58"
        },
        {
            "date": "October 1, 2012",
            "detail_rating": {
                "business": null,
                "cleanliness": 5.0,
                "desk": null,
                "location": 5.0,
                "pool": null,
                "restaurant": null,
                "rooms": 5.0,
                "service": 5.0,
                "sleep": 5.0,
                "value": 4.0
            },
            "helpfulness": null,
            "id": 141797046,
            "likes": {
                "disliked": null,
                "liked": null
            },
            "rating": 5.0,
            "stay_parameters": "Stayed September 2012, traveled with family",
            "text": "The staff was very friendly and helpful.",
            "title": "Old School Charm; New School Feel",
            "user": "ViajeroESQ"
        },
        {
            "date": "October 1, 2012",
            "detail_rating": {
                "business": null,
                "cleanliness": 5.0,
                "desk": null,
                "location": 5.0,
                "pool": null,
                "restaurant": null,
                "rooms": 5.0,
                "service": 5.0,
                "sleep": 5.0,
                "value": 5.0
            },
            "helpfulness": null,
            "id": 141795493,
            "likes": {
                "disliked": null,
                "liked": null
            },
            "rating": 5.0,
            "stay_parameters": "Stayed October 2012, traveled as a couple",
            "text": "Very nice grocery store just one block away. Good for supplies.",
            "title": "Just great",
            "user": "Sonia H"
        },
        {
            "date": "September 26, 2012",
            "detail_rating": {
                "business": null,
                "cleanliness": 5.0,
                "desk": null,
                "location": 5.0,
                "pool": null,
                "restaurant": null,
                "rooms": 5.0,
                "service": 5.0,
                "sleep": 5.0,
                "value": 4.0
            },
            "helpfulness": null,
            "id": 141370383,
            "likes": {
                "disliked": null,
                "liked": null
            },
            "rating": 5.0,
            "stay_parameters": "Stayed September 2012, traveled on business",
            "text": "Hotel has a few kinks to work out as a new building, gut the staff is doing well.",
            "title": "Thoroughly enjoyed my stay",
            "user": "JenNEU03"
        },
        {
            "date": "September 14, 2012",
            "detail_rating": {
                "business": null,
                "cleanliness": 5.0,
                "desk": null,
                "location": 4.0,
                "pool": null,
                "restaurant": null,
                "rooms": 5.0,
                "service": 5.0,
                "sleep": 5.0,
                "value": 5.0
            },
            "helpfulness": 1,
            "id": 140263152,
            "likes": {
                "disliked": null,
                "liked": null
            },
            "rating": 5.0,
            "stay_parameters": "Stayed September 2012, traveled on business",
            "text": "Breakfast was so-so, trying to make too fancy (southwest eggs, quiche, etc), need to have \"just plain eggs\" each day as an option.",
            "title": "Wonderful! So clean & New!!!!!",
            "user": "Christine D"
        },
        {
            "date": "November 4, 2012",
            "detail_rating": {
                "business": null,
                "cleanliness": 5.0,
                "desk": null,
                "location": 4.0,
                "pool": null,
                "restaurant": null,
                "rooms": 5.0,
                "service": 5.0,
                "sleep": 5.0,
                "value": 5.0
            },
            "helpfulness": null,
            "id": 144512743,
            "likes": {
                "disliked": null,
                "liked": null
            },
            "rating": 5.0,
            "stay_parameters": "Stayed November 2012, traveled with family",
            "text": "Usually spend many hours reviewing different choices. This time, no choice on account of Hurricane Sandy. Needed a place to stay where there was heat and power. Called up Hilton toll free and went with what they had. And lucked out with a superb property.",
            "title": "Very pleasant surprise",
            "user": "nyeze"
        },
        {
            "date": "October 29, 2012",
            "detail_rating": {
                "business": null,
                "cleanliness": 5.0,
                "desk": null,
                "location": 5.0,
                "pool": null,
                "restaurant": null,
                "rooms": 5.0,
                "service": 5.0,
                "sleep": 5.0,
                "value": 5.0
            },
            "helpfulness": 1,
            "id": 143984943,
            "likes": {
                "disliked": null,
                "liked": null
            },
            "rating": 5.0,
            "stay_parameters": "Stayed October 2012, traveled with family",
            "text": "Hotel is new and of course what's not to love about new. Very nice pool/hot tub set up -- very airy, high ceiling, skylight. Warm indoor pool. Same with the gym. Breakfast was good -- on par with Hampton Inn style (I consider them the \"gold standard\" of free breakfast providers). Staff very friendly and helpful. Special shout out to Chris at the Front Desk -- exceptionally friendly and helpful.",
            "title": "Wonderful Hotel",
            "user": "aliza727"
        },
        {
            "date": "October 24, 2012",
            "detail_rating": {
                "business": null,
                "cleanliness": 5.0,
                "desk": null,
                "location": 5.0,
                "pool": null,
                "restaurant": null,
                "rooms": 5.0,
                "service": 5.0,
                "sleep": 5.0,
                "value": 5.0
            },
            "helpfulness": 1,
            "id": 143641140,
            "likes": {
                "disliked": null,
                "liked": null
            },
            "rating": 5.0,
            "stay_parameters": "Stayed October 2012, traveled as a couple",
            "text": "Rooms are nice. Bed very comfy. The kitchenette set up is nicely done. Nice LCD TVs in the bedroom and living rooms.",
            "title": "Excellent Homewood Suites",
            "user": "NYTripper088"
        },
        {
            "date": "October 19, 2012",
            "detail_rating": {
                "business": null,
                "cleanliness": 5.0,
                "desk": null,
                "location": 5.0,
                "pool": null,
                "restaurant": null,
                "rooms": 5.0,
                "service": 4.0,
                "sleep": 5.0,
                "value": 5.0
            },
            "helpfulness": null,
            "id": 143242023,
            "likes": {
                "disliked": null,
                "liked": null
            },
            "rating": 4.0,
            "stay_parameters": "Stayed October 2012, traveled on business",
            "text": "Valet (no self parking) seemed a little pricely at $39/night -- maybe a little disrespectful of me to think that $39 is more of a New York / Boston / DC price level. Also 2 out of the 3 nights, only one valet attendant working so not particular fast -- he did try his best so not his fault.",
            "title": "Very nice",
            "user": "Latitia R"
        },
        {
            "date": "October 16, 2012",
            "detail_rating": {
                "business": null,
                "cleanliness": 4.0,
                "desk": null,
                "location": 3.0,
                "pool": null,
                "restaurant": null,
                "rooms": 5.0,
                "service": 5.0,
                "sleep": null,
                "value": 4.0
            },
            "helpfulness": null,
            "id": 142979377,
            "likes": {
                "disliked": null,
                "liked": null
            },
            "rating": 5.0,
            "stay_parameters": "Stayed October 2012",
            "text": "Area is generally safe although on the outer ring of \"safe to walk alone at night\" and was advised not to walk to far up Walnut St from where we were at night. Certainly not unsafe, just wanted to point out it's not \"Old City\" safe for those unfamiliar to Philly which I was.",
            "title": "Nice one",
            "user": "Cocoooonut"
        },
        {
            "date": "November 20, 2012",
            "detail_rating": {
                "business": null,
                "cleanliness": 5.0,
                "desk": null,
                "location": 3.0,
                "pool": null,
                "restaurant": null,
                "rooms": 5.0,
                "service": 5.0,
                "sleep": 5.0,
                "value": 4.0
            },
            "helpfulness": null,
            "id": 145852200,
            "likes": {
                "disliked": null,
                "liked": null
            },
            "rating": 4.0,
            "stay_parameters": "Stayed November 2012, traveled as a couple",
            "text": "This hotel is great -- new, clean, with a helpful, friendly staff. The rooms are large and comfortable. The complementary breakfast offers a nice selection. The only downside (hence the 4 stars) is the location which is not within walking distance of center city and the historic areas. It is only a short subway ride away though with the subway stop 2 blocks away.",
            "title": "Great hotel, but not that convenient...",
            "user": "KATHLEEN A"
        },
        {
            "date": "November 20, 2012",
            "detail_rating": {
                "business": null,
                "cleanliness": 5.0,
                "desk": null,
                "location": 5.0,
                "pool": null,
                "restaurant": null,
                "rooms": 5.0,
                "service": 5.0,
                "sleep": 5.0,
                "value": 5.0
            },
            "helpfulness": null,
            "id": 145808176,
            "likes": {
                "disliked": null,
                "liked": null
            },
            "rating": 5.0,
            "stay_parameters": "Stayed October 2012, traveled with family",
            "text": "I needed a place to stay with my two girls for 6 weeks. My daughter was receiving treatment at the Children's Hospital of Philadelphia. I am so glad I picked this hotel. The staff were kind and friendly and went out of their way to make our stay the best. The shuttle drivers Darnell, Tyrez, and Tyrone took us to and from the hospital daily. They became our friends and driving each day was the highlight of our day. The food was excellent each day. Thanks so much to CJ, Stacey, April, Amanda, and Anna. They always stopped by our table to say hi. The housekeeping crew was excellent and made our room looked wonderful. Tanya was such a dear person always checking on us when we went to the swimming pool. At the front desk Chris, Shekel, Amanda were always professional. The managers Gary, Pat, and Irene made us feel like a welcomed guest each day. The valet Zach had such a friendly, positive attitude. The whole staff made our stay the absolute best from start to finish. I have never been treated so well in a hotel.",
            "title": "Treated like family",
            "user": "Krystin M"
        },
        {
            "date": "November 19, 2012",
            "detail_rating": {
                "business": null,
                "cleanliness": 5.0,
                "desk": null,
                "location": 3.0,
                "pool": null,
                "restaurant": null,
                "rooms": 5.0,
                "service": 5.0,
                "sleep": 5.0,
                "value": 5.0
            },
            "helpfulness": null,
            "id": 145744672,
            "likes": {
                "disliked": null,
                "liked": null
            },
            "rating": 5.0,
            "stay_parameters": "Stayed November 2012, traveled on business",
            "text": "This is a very new and clean hotel with great amenities. The room was very nice; the fitness and business center were excellent; the breakfast and dinner were top notch.",
            "title": "What a Great Hotel and Exceptional staff",
            "user": "Nguyen V"
        },
        {
            "date": "November 13, 2012",
            "detail_rating": {
                "business": null,
                "cleanliness": 5.0,
                "desk": null,
                "location": 5.0,
                "pool": null,
                "restaurant": null,
                "rooms": 5.0,
                "service": 5.0,
                "sleep": 5.0,
                "value": 5.0
            },
            "helpfulness": 1,
            "id": 145311503,
            "likes": {
                "disliked": null,
                "liked": null
            },
            "rating": 5.0,
            "stay_parameters": "Stayed November 2012, traveled as a couple",
            "text": "However, what is most important is the professionalism of the staff. They are courteous, professional and dedicated to their guests. Hats off to April and Amanda who have gone out of their way to ensure my stay was an enjoyable one.",
            "title": "Wonderful Gem in University City",
            "user": "FeBrews"
        },
        {
            "date": "November 11, 2012",
            "detail_rating": {
                "business": null,
                "cleanliness": 5.0,
                "desk": null,
                "location": 5.0,
                "pool": null,
                "restaurant": null,
                "rooms": 5.0,
                "service": 5.0,
                "sleep": 5.0,
                "value": 4.0
            },
            "helpfulness": 1,
            "id": 145149029,
            "likes": {
                "disliked": null,
                "liked": null
            },
            "rating": 5.0,
            "stay_parameters": "Stayed October 2012, traveled with family",
            "text": "I will definitely return to this hotel for future trips.",
            "title": "Wonderful property-will be back",
            "user": "My4cats"
        },
        {
            "date": "December 26, 2012",
            "detail_rating": {
                "business": null,
                "cleanliness": 5.0,
                "desk": null,
                "location": 4.0,
                "pool": null,
                "restaurant": null,
                "rooms": 4.0,
                "service": 5.0,
                "sleep": 4.0,
                "value": 4.0
            },
            "helpfulness": null,
            "id": 148104405,
            "likes": {
                "disliked": null,
                "liked": null
            },
            "rating": 4.0,
            "stay_parameters": "Stayed December 2012, traveled with family",
            "text": "This brand-spanking-new hotel in West Philadelphia at the heart of the UPenn campus is an outstanding option for individuals or families seeking more space and comfort than a traditional hotel room is capable of providing.",
            "title": "Excellent option in hotel-poor West Philadelphia",
            "user": "travelwiz13"
        },
        {
            "date": "December 5, 2012",
            "detail_rating": {
                "business": null,
                "cleanliness": 5.0,
                "desk": null,
                "location": 5.0,
                "pool": null,
                "restaurant": null,
                "rooms": 5.0,
                "service": 5.0,
                "sleep": 5.0,
                "value": 5.0
            },
            "helpfulness": 1,
            "id": 146829324,
            "likes": {
                "disliked": null,
                "liked": null
            },
            "rating": 5.0,
            "stay_parameters": "Stayed November 2012, traveled as a couple",
            "text": "Rooms are clean and modern with very well-supplied kitchens, including full-sized fridge-freezers and dishwashers.",
            "title": "An amazing gem in University City",
            "user": "PhillyCodeHound"
        },
        {
            "date": "December 3, 2012",
            "detail_rating": {
                "business": null,
                "cleanliness": 5.0,
                "desk": null,
                "location": 4.0,
                "pool": null,
                "restaurant": null,
                "rooms": 4.0,
                "service": 4.0,
                "sleep": 5.0,
                "value": 4.0
            },
            "helpfulness": 3,
            "id": 146720445,
            "likes": {
                "disliked": null,
                "liked": null
            },
            "rating": 4.0,
            "stay_parameters": "Stayed November 2012, traveled on business",
            "text": "Beds are comfortable with white linens and nice pillows.",
            "title": "Perfect alternative to Sheraton or Hilton in University City",
            "user": "TravelingLightly"
        },
        {
            "date": "December 2, 2012",
            "detail_rating": {
                "business": null,
                "cleanliness": 5.0,
                "desk": null,
                "location": 4.0,
                "pool": null,
                "restaurant": null,
                "rooms": 5.0,
                "service": 5.0,
                "sleep": 5.0,
                "value": 5.0
            },
            "helpfulness": null,
            "id": 146645690,
            "likes": {
                "disliked": null,
                "liked": null
            },
            "rating": 5.0,
            "stay_parameters": "Stayed November 2012, traveled with family",
            "text": "Hot breakfast is available seven days a week, and a hot dinner Monday-Thursday. Both are complimentary. I do think that the hotel could do a better job with the hot breakfast options -- higher-quality ingredients and more creative, healthier choices would be nice.",
            "title": "Really Great",
            "user": "BobField"
        },
        {
            "date": "November 22, 2012",
            "detail_rating": {
                "business": null,
                "cleanliness": 5.0,
                "desk": null,
                "location": 4.0,
                "pool": null,
                "restaurant": null,
                "rooms": 4.0,
                "service": 4.0,
                "sleep": 4.0,
                "value": 4.0
            },
            "helpfulness": null,
            "id": 145940518,
            "likes": {
                "disliked": null,
                "liked": null
            },
            "rating": 4.0,
            "stay_parameters": "Stayed October 2012, traveled on business",
            "text": "All staff were incredibly friendly and helpful. At about the same price as the tired and rundown Sheraton in West Philadelphia, one would be crazy not to choose this hotel over the Sheraton.",
            "title": "Great stay at Homeward Suites",
            "user": "prasan68"
        }
    ],
    "slim_ranking": 0.166666666667,
    "stars": 3,
    "tripadvisor": {
        "VISITED": false,
        "country_name": null,
        "locality": null,
        "pic_link": null,
        "street_address": null
    },
    "user_rating": 4.5,
    "variance": {
        "average": 8,
        "excellent": 77,
        "poor": 3,
        "terrible": 3,
        "very good": 40
    }
}