{
    "aka": "Residenza Paolo Vi Hotel Rome",
    "description": "The Residenza Paolo VI, established in the premises of an Augustinian Monastery, was inaugurated at the beginning of the Holy Year 2000. The genius loci and the charm of tradition are still alive in its ancient walls to make this property your \u201cprivate\u201d heaven in Rome, far away from chaos, yet situated in the pulsing heart of the Eternal City. Rome has many hotels, but only one of them stands directly on St. Peter\u2019s Square (Vatican): Residenza Paolo VI, the ideal place for those wishing to stay in the heart of the Christendom,St. Peter\u2019s Basilica",
    "detail_rating": {
        "cleanliness": null,
        "location": null,
        "rooms": null,
        "service": null,
        "sleep": null,
        "value": null
    },
    "location": {
        "city": "Rome",
        "continent": "Europe",
        "country": "Italy",
        "proposed_city": "Rome",
        "province": null,
        "region": "Lazio"
    },
    "name": "Residenza Paolo VI",
    "places": {
        "aka": [
            "Rome"
        ],
        "hotel_description": [
            "Rome"
        ],
        "hotel_name": []
    },
    "review_count": 169,
    "review_count_current": 18,
    "reviews": [
        {
            "date": "March 8, 2008",
            "detail_rating": {
                "business": null,
                "cleanliness": null,
                "desk": null,
                "location": null,
                "pool": null,
                "restaurant": null,
                "rooms": null,
                "service": null,
                "sleep": null,
                "value": null
            },
            "helpfulness": 1,
            "id": 14150359,
            "likes": {
                "disliked": null,
                "liked": null
            },
            "rating": 5.0,
            "stay_parameters": null,
            "text": "Wonderful location, delightful service. Have zero complaints.",
            "title": "the best",
            "user": "moviegal3"
        },
        {
            "date": "February 14, 2008",
            "detail_rating": {
                "business": 5.0,
                "cleanliness": 5.0,
                "desk": null,
                "front_desk": 5.0,
                "location": 5.0,
                "pool": null,
                "restaurant": null,
                "rooms": 5.0,
                "service": 5.0,
                "sleep": null,
                "value": 5.0
            },
            "helpfulness": 2,
            "id": 13549228,
            "likes": {
                "disliked": "\u2014 no complaints at all",
                "liked": "\u2014 Location, staff, large beds, breakfast included, roofdeck view"
            },
            "rating": 5.0,
            "stay_parameters": "Stayed October 2007, traveled as a couple",
            "text": "I would highly recommend this hotel for it's amazing location just yards from St. Peter's square, helpful and polite staff, large beds (which is hard to find in Rome!), and absolutely beautiful view of St. Peter's dome from the hotel's roof deck. The afternoon we arrived in Rome, (after our flight was delayed from NYC 3 hours) would have been our only opportunity to see the Vatican museum including the Sistine Chapel; and had it not been for the hotel's prime location there is no way we would have made it in. As for distances to attractions....St. Peters Square is literally across the street; it's about a 5 minute walk to the Vatican Museum entrance (minus time waiting on the long line); and less than 15 min walk to Castel St. Angelo. We stayed on this side of the city 1 night before a cruise, and on the other side of the city closer to the Colusseun for 1 night after our cruise. Best experience ever!",
            "title": "You can't get any closer!",
            "user": "day1420"
        },
        {
            "date": "June 28, 2007",
            "detail_rating": {
                "business": null,
                "cleanliness": 5.0,
                "desk": null,
                "front_desk": 5.0,
                "location": 5.0,
                "pool": null,
                "restaurant": null,
                "rooms": 5.0,
                "service": 4.0,
                "sleep": null,
                "value": 3.0
            },
            "helpfulness": 4,
            "id": 8019363,
            "likes": {
                "disliked": null,
                "liked": "\u2014 Location"
            },
            "rating": 5.0,
            "stay_parameters": "Stayed June 2007, traveled with family",
            "text": "Perfect location across the street from the Vatican. The view from the terrace is phenomenal. The breakfast was very elegant. (My family was very excited about the fact that they had eggs and bacon.)",
            "title": "Great Hotel",
            "user": "Elmhurst"
        },
        {
            "date": "June 22, 2007",
            "detail_rating": {
                "business": 3.0,
                "cleanliness": 5.0,
                "desk": null,
                "front_desk": 5.0,
                "location": 5.0,
                "pool": null,
                "restaurant": null,
                "rooms": 3.0,
                "service": 5.0,
                "sleep": null,
                "value": 4.0
            },
            "helpfulness": 2,
            "id": 7960431,
            "likes": {
                "disliked": "\u2014 The room was small but it wasn't a problem to us at all",
                "liked": "\u2014 Location"
            },
            "rating": 5.0,
            "stay_parameters": "Stayed June 2007, traveled as a couple",
            "text": "The rooms were very clean and quite roomy. Please note: You get what you pay for. I had a party of 6 that we split into 2 triple rooms.",
            "title": "Peter, I can see your house from here",
            "user": "coolinshot"
        },
        {
            "date": "January 12, 2007",
            "detail_rating": {
                "business": null,
                "cleanliness": null,
                "desk": null,
                "location": null,
                "pool": null,
                "restaurant": null,
                "rooms": null,
                "service": null,
                "sleep": null,
                "value": null
            },
            "helpfulness": 2,
            "id": 6584470,
            "likes": {
                "disliked": null,
                "liked": null
            },
            "rating": 4.0,
            "stay_parameters": null,
            "text": "Excellent hotel.",
            "title": "Great little place - but read on...",
            "user": "entshop"
        },
        {
            "date": "April 29, 2006",
            "detail_rating": {
                "business": null,
                "cleanliness": 5.0,
                "desk": null,
                "location": null,
                "pool": null,
                "restaurant": null,
                "rooms": 3.0,
                "service": 3.0,
                "sleep": null,
                "value": 2.0
            },
            "helpfulness": 7,
            "id": 5018702,
            "likes": {
                "disliked": null,
                "liked": null
            },
            "rating": 3.0,
            "stay_parameters": "Stayed April 2006",
            "text": "If you are planning to visit the Vatican museums, Sistine Chapel and/or St. Peter's, you absolutely cannot stay any closer. The Paolo VI is literally across the street from the exit of Piazza San Pietro (St. Peter's Square). When we finished our exhausting and hot, but very worthwhile tour of the Vatican museums and Sistine Chapel, we literally walked out the exit, crossed the street and were in our room with our feet up within 5 minutes.",
            "title": "Great location, odd hotel",
            "user": "free101girl"
        },
        {
            "date": "August 5, 2005",
            "detail_rating": {
                "business": null,
                "cleanliness": null,
                "desk": null,
                "location": null,
                "pool": null,
                "restaurant": null,
                "rooms": null,
                "service": null,
                "sleep": null,
                "value": null
            },
            "helpfulness": 18,
            "id": 3740005,
            "likes": {
                "disliked": null,
                "liked": null
            },
            "rating": 5.0,
            "stay_parameters": null,
            "text": "However, this is a very expensive hotel with few amenities. We paid EUR340 for one night in a Deluxe room, including buffet breakfast and tax. (By the way, a Deluxe room is not the cheapest room. I believe the cheapest room was around EUR300.)",
            "title": "Exceptional!",
            "user": "A TripAdvisor user"
        },
        {
            "date": "November 1, 2004",
            "detail_rating": {
                "business": null,
                "cleanliness": 5.0,
                "desk": null,
                "location": null,
                "pool": null,
                "restaurant": null,
                "rooms": 5.0,
                "service": 5.0,
                "sleep": null,
                "value": 4.0
            },
            "helpfulness": 28,
            "id": 2799104,
            "likes": {
                "disliked": null,
                "liked": null
            },
            "rating": 5.0,
            "stay_parameters": "Stayed April 2004",
            "text": "Our room was totally charmless. It reminded me of a room in a well-maintained retirement home. The floor was light-colored marble, with three inexpensive \"Oriental\" throw rugs scattered about. The room's cherry furnishings were very plain -- obviously new but not particularly high-end.",
            "title": "Magnificent",
            "user": "melissa2566"
        },
        {
            "date": "January 17, 2010",
            "detail_rating": {
                "business": null,
                "cleanliness": 4.0,
                "desk": null,
                "location": 5.0,
                "pool": null,
                "restaurant": null,
                "rooms": 3.0,
                "service": 4.0,
                "sleep": null,
                "value": 3.0
            },
            "helpfulness": 1,
            "id": 53667901,
            "likes": {
                "disliked": null,
                "liked": null
            },
            "rating": 4.0,
            "stay_parameters": "Stayed November 2009, traveled solo",
            "text": "A solo traveller (although meeting friends in Rome), this was a superb central spot; opposite St Peters Square with fantastic views of the dome at night.",
            "title": "Comfortable, central & welcoming",
            "user": "mrjohnsondog"
        },
        {
            "date": "August 16, 2009",
            "detail_rating": {
                "business": null,
                "cleanliness": null,
                "desk": null,
                "location": null,
                "pool": null,
                "restaurant": null,
                "rooms": null,
                "service": null,
                "sleep": null,
                "value": null
            },
            "helpfulness": null,
            "id": 37852572,
            "likes": {
                "disliked": null,
                "liked": null
            },
            "rating": 5.0,
            "stay_parameters": null,
            "text": "Rooms were small (but I was a single) and a little noisy, but nothing that a pair of earplugs couldn't put right.",
            "title": "Very pleased",
            "user": "characterisdestiny"
        },
        {
            "date": "June 26, 2008",
            "detail_rating": {
                "business": 5.0,
                "cleanliness": 5.0,
                "desk": null,
                "front_desk": 2.0,
                "location": 4.0,
                "pool": null,
                "restaurant": null,
                "rooms": 3.0,
                "service": 3.0,
                "sleep": null,
                "value": 2.0
            },
            "helpfulness": 1,
            "id": 17255700,
            "likes": {
                "disliked": "\u2014 Room size",
                "liked": "\u2014 Roof terrace view"
            },
            "rating": 3.0,
            "stay_parameters": "Stayed May 2008, traveled as a couple",
            "text": "Clean and well equipped with a lovely little \"daily prayer\" posted through your door each morning as the hotel is owned by Vatican Accommodations it is mainly (but by no means exclusively) frequented by priests and their families.",
            "title": "Loved the roof-top terrace view",
            "user": "vjd69"
        },
        {
            "date": "June 1, 2008",
            "detail_rating": {
                "business": 1.0,
                "cleanliness": 1.0,
                "desk": null,
                "front_desk": 1.0,
                "location": 1.0,
                "pool": null,
                "restaurant": null,
                "rooms": 1.0,
                "service": 1.0,
                "sleep": null,
                "value": 1.0
            },
            "helpfulness": 6,
            "id": 16573058,
            "likes": {
                "disliked": "\u2014 the racism of the staff",
                "liked": "\u2014 nothing"
            },
            "rating": 1.0,
            "stay_parameters": "Stayed May 2008, traveled as a couple",
            "text": "Lovely choice at breakfast time and a cracking roof top terrace.",
            "title": "racism at Paolo VI",
            "user": "dyebob"
        },
        {
            "date": "March 9, 2008",
            "detail_rating": {
                "business": 5.0,
                "cleanliness": 5.0,
                "desk": null,
                "front_desk": 5.0,
                "location": 5.0,
                "pool": null,
                "restaurant": null,
                "rooms": 5.0,
                "service": 5.0,
                "sleep": null,
                "value": 5.0
            },
            "helpfulness": 9,
            "id": 14163860,
            "likes": {
                "disliked": "\u2014 there was nothing I didn't like",
                "liked": "\u2014 nothing"
            },
            "rating": 5.0,
            "stay_parameters": "Stayed February 2008, traveled on business",
            "text": "I'd stay again.",
            "title": "Nice, Elegant Hotel with a great location",
            "user": "BMazz"
        },
        {
            "date": "October 28, 2006",
            "detail_rating": {
                "business": 2.0,
                "cleanliness": 5.0,
                "desk": null,
                "front_desk": 5.0,
                "location": 5.0,
                "pool": null,
                "restaurant": null,
                "rooms": 5.0,
                "service": 5.0,
                "sleep": null,
                "value": 5.0
            },
            "helpfulness": 2,
            "id": 6020833,
            "likes": {
                "disliked": "\u2014 Lack of broadband internet access",
                "liked": "\u2014 Location, charm and staff"
            },
            "rating": 5.0,
            "stay_parameters": "Stayed October 2006, traveled on business",
            "text": "I just returned from a stay at the Residenza Paolo VI, and will never stay anywhere else in Rome. I gather from some of the reviews and photos that I was fortunate to have a deluxe room, which was comfortable, beautiful, quiet, and spotless. It had a marble floor, and a couple of lovely oriental rugs; damask drapes; and simple, but attractive, furniture. There were casement windows -- a delightful contrast to the sealed-in windows in typical modern hotels. I cannot speak for the other rooms in the hotel, but my experience was delightful. The front desk staff was incredibly helpful and charming. I felt safe (the front door is locked in the evening), and the location -- just off one side of Piazza San Pietro -- was incredible. We strolled right from breakfast over to the papal audience in front of St. Peter's. The breakfast room is particularly beautiful, and the buffet breakfast was ample and delicious. Service in the breakfast room was pleasant, but on the relaxed side. Not a big problem, as the more impatient among us could just walk a few feet and pour ourselves a cup of coffee. The view from the terrace is matchless. There are a lot of good restaurants in the area, and a taxi stand right across the square. I recommend the hotel very, very highly, and I am a frequent business traveller with high standards.",
            "title": "The only place I will stay in Rome from now on",
            "user": "CatherineNY"
        },
        {
            "date": "July 24, 2006",
            "detail_rating": {
                "business": null,
                "cleanliness": null,
                "desk": null,
                "location": null,
                "pool": null,
                "restaurant": null,
                "rooms": null,
                "service": null,
                "sleep": null,
                "value": null
            },
            "helpfulness": 1,
            "id": 5504333,
            "likes": {
                "disliked": null,
                "liked": null
            },
            "rating": 1.0,
            "stay_parameters": null,
            "text": "Do not be taken in by the great marketing for this hotel, pity it doesnt live up to it.",
            "title": "Not worth the Money",
            "user": "FERNGT3"
        },
        {
            "date": "June 3, 2006",
            "detail_rating": {
                "business": null,
                "cleanliness": 3.0,
                "desk": null,
                "location": null,
                "pool": null,
                "restaurant": null,
                "rooms": 2.0,
                "service": 2.0,
                "sleep": null,
                "value": 1.0
            },
            "helpfulness": 4,
            "id": 5294759,
            "likes": {
                "disliked": null,
                "liked": null
            },
            "rating": 2.0,
            "stay_parameters": "Stayed May 2006",
            "text": "Overpriced, rooms tiny, air conditioning poor, lift archaic, terrace tiny, appears on photos much better than it actually is.",
            "title": "Very Disappointed with my \"cell\"",
            "user": "Tim M"
        },
        {
            "date": "May 15, 2006",
            "detail_rating": {
                "business": null,
                "cleanliness": 3.0,
                "desk": null,
                "location": null,
                "pool": null,
                "restaurant": null,
                "rooms": 1.0,
                "service": 2.0,
                "sleep": null,
                "value": 1.0
            },
            "helpfulness": 12,
            "id": 5077236,
            "likes": {
                "disliked": null,
                "liked": null
            },
            "rating": 1.0,
            "stay_parameters": "Stayed May 2006",
            "text": "I suggest you look elsewhere unless you absolutely must be about 500yds from St Peters Square.",
            "title": "TINY tiny teeny-tiny rooms - 2 star hotel",
            "user": "snooky"
        },
        {
            "date": "May 11, 2006",
            "detail_rating": {
                "business": null,
                "cleanliness": 5.0,
                "desk": null,
                "location": null,
                "pool": null,
                "restaurant": null,
                "rooms": 2.0,
                "service": 3.0,
                "sleep": null,
                "value": 2.0
            },
            "helpfulness": 7,
            "id": 5049557,
            "likes": {
                "disliked": null,
                "liked": null
            },
            "rating": 3.0,
            "stay_parameters": "Stayed November 2005",
            "text": "Breakfast is OK.",
            "title": "Not as marketed on websites",
            "user": "Conoula"
        }
    ],
    "slim_ranking": 0.0905511811024,
    "stars": 4,
    "tripadvisor": {
        "VISITED": false,
        "country_name": null,
        "locality": null,
        "pic_link": null,
        "street_address": null
    },
    "user_rating": 4.5,
    "variance": {
        "average": 10,
        "excellent": 95,
        "poor": 5,
        "terrible": 5,
        "very good": 54
    }
}