{
    "aka": "Aisia Zita Lekeitio",
    "description": null,
    "detail_rating": {
        "cleanliness": null,
        "location": null,
        "rooms": null,
        "service": null,
        "sleep": null,
        "value": null
    },
    "location": {
        "city": null,
        "continent": "Europe",
        "country": "Spain",
        "proposed_city": null,
        "province": null,
        "region": "Basque Country"
    },
    "name": "Aisia Zita Hotel Emperatriz",
    "places": {
        "aka": [],
        "hotel_description": [],
        "hotel_name": []
    },
    "review_count": 90,
    "review_count_current": 11,
    "reviews": [
        {
            "date": "August 24, 2007",
            "detail_rating": {
                "business": 5.0,
                "cleanliness": 5.0,
                "desk": null,
                "front_desk": 5.0,
                "location": 5.0,
                "pool": null,
                "restaurant": null,
                "rooms": 5.0,
                "service": 5.0,
                "sleep": null,
                "value": 5.0
            },
            "helpfulness": 1,
            "id": 8492814,
            "likes": {
                "disliked": null,
                "liked": null
            },
            "rating": 5.0,
            "stay_parameters": "Stayed July 2007, traveled as a couple",
            "text": "We chose Lekeitio by chance to experience a small seaside town in the Basque Country and it is highly recommended. The hotel is really a gem - fantastic rooms, fantastic views (choose a seaview room), fantastic service. A hotel built where the last empress of Austria/Hungary lived - the hotel has many details from the era including a photo of Emperatriz Zita in the reception. Go to Lekeitio, enjoy the fresh air and freindly people and stay at Emperatriz Zita",
            "title": "What a fantastic place",
            "user": "Trane&Trane"
        },
        {
            "date": "July 28, 2007",
            "detail_rating": {
                "business": null,
                "cleanliness": 5.0,
                "desk": null,
                "front_desk": 5.0,
                "location": 5.0,
                "pool": null,
                "restaurant": null,
                "rooms": 5.0,
                "service": 5.0,
                "sleep": null,
                "value": 5.0
            },
            "helpfulness": 1,
            "id": 8249358,
            "likes": {
                "disliked": null,
                "liked": null
            },
            "rating": 5.0,
            "stay_parameters": "Stayed July 2007, traveled as a couple",
            "text": "When we this summer decided to go to the basque region for the third time, Lekeitio was one of the places we for sure wanted to vist again - mainly because of this hotel, and the huge room and balcony!",
            "title": "Our third visit!",
            "user": "Livus"
        },
        {
            "date": "December 12, 2006",
            "detail_rating": {
                "business": 4.0,
                "cleanliness": 4.0,
                "desk": null,
                "front_desk": 2.0,
                "location": 5.0,
                "pool": null,
                "restaurant": null,
                "rooms": 4.0,
                "service": 4.0,
                "sleep": null,
                "value": null
            },
            "helpfulness": 3,
            "id": 6432937,
            "likes": {
                "disliked": null,
                "liked": "\u2014 the view, the room, and the fact that the room service did not wake us up in the mornings"
            },
            "rating": 4.0,
            "stay_parameters": "Stayed November 2006, traveled as a couple",
            "text": "Ok, the hotel may have faded a bit (I still find it very nice), but you can\u00b4t beat the balcony and the view! Overlooking the pittoresque town and harbour, a small island, people relaxing on the beach just down below... Have some vino tinto, read a good book and enjoy the calming sound of the waves! Oh happiness =)",
            "title": "Time to relax",
            "user": "beaujolais31"
        },
        {
            "date": "May 30, 2006",
            "detail_rating": {
                "business": null,
                "cleanliness": null,
                "desk": null,
                "location": null,
                "pool": null,
                "restaurant": null,
                "rooms": null,
                "service": null,
                "sleep": null,
                "value": null
            },
            "helpfulness": 2,
            "id": 5236832,
            "likes": {
                "disliked": null,
                "liked": null
            },
            "rating": 4.0,
            "stay_parameters": null,
            "text": "We had some very relaxing days in room 305, and would highly recomment it! Especially if you want to take it easy and chill out for some days.",
            "title": "Peaceful setting",
            "user": "denverflora"
        },
        {
            "date": "December 17, 2005",
            "detail_rating": {
                "business": null,
                "cleanliness": 3.0,
                "desk": null,
                "location": null,
                "pool": null,
                "restaurant": null,
                "rooms": 3.0,
                "service": 3.0,
                "sleep": null,
                "value": 5.0
            },
            "helpfulness": 6,
            "id": 4246927,
            "likes": {
                "disliked": null,
                "liked": null
            },
            "rating": 4.0,
            "stay_parameters": "Stayed September 2005",
            "text": "Last summer we stayed on our \"tour basque\" also in Lekeitio.",
            "title": "Perfect location in quiet Basque seaside village",
            "user": "bakio"
        },
        {
            "date": "September 29, 2005",
            "detail_rating": {
                "business": null,
                "cleanliness": 2.0,
                "desk": null,
                "location": null,
                "pool": null,
                "restaurant": null,
                "rooms": 2.0,
                "service": 3.0,
                "sleep": null,
                "value": 4.0
            },
            "helpfulness": 3,
            "id": 3946977,
            "likes": {
                "disliked": null,
                "liked": null
            },
            "rating": 3.0,
            "stay_parameters": "Stayed September 2005",
            "text": "In many ways, the Zita is a hidden gem. Leikitio is a small Basque summer seaside town, which I am sure not very many tourists from other countries find themselves. The Zita dominates the beach and is a modern, but very grand building, with many rooms offering sea views. The common areas are very beautiful but the rooms themselves are disappointing - twin beds pushed together in double rooms and bathrooms which are way past their best. There is a small thermal spa in the basement with a tiny jacuzzi and a thermal pool, but again, it is all faded glamour, the spa clearly hasn't been done up for years and it is a far cry from sparkling spas in most hotels nowadays. Staff are friendly and breakfasts are fine. All in all, I would not choose to stay there again but it is fine overall.",
            "title": "Faded Glamour",
            "user": "Holly29"
        },
        {
            "date": "September 8, 2009",
            "detail_rating": {
                "business": null,
                "cleanliness": 5.0,
                "desk": null,
                "location": 5.0,
                "pool": null,
                "restaurant": null,
                "rooms": 4.0,
                "service": 4.0,
                "sleep": null,
                "value": 4.0
            },
            "helpfulness": null,
            "id": 40166711,
            "likes": {
                "disliked": null,
                "liked": null
            },
            "rating": 4.0,
            "stay_parameters": "Stayed September 2009, traveled as a couple",
            "text": "My girlfriend and I just stayed for 2 nights at the Zita hotel in Lekeitio. We read every review possible on the place, and we had our apprehensions because of words like 'faded' and 'aged'. While these are slightly true (it's no Holiday Inn Express, people), it only adds to the allure of the place. You could say the hallway carpets could use a good shampooing, but otherwise the guest rooms were simple but stately. Fine local furniture, hardwood floors, gorgeous marble baths -- the essense of Basque charm. Besides Zita, there is no other noteworthy beachside hotel in town.",
            "title": "Best place to stay in Lekeitio - and we searched around!",
            "user": "konkoski"
        },
        {
            "date": "July 25, 2009",
            "detail_rating": {
                "business": null,
                "cleanliness": 5.0,
                "desk": null,
                "location": 5.0,
                "pool": null,
                "restaurant": null,
                "rooms": 5.0,
                "service": 5.0,
                "sleep": null,
                "value": 4.0
            },
            "helpfulness": null,
            "id": 35722426,
            "likes": {
                "disliked": null,
                "liked": null
            },
            "rating": 5.0,
            "stay_parameters": "Stayed July 2009, traveled as a couple",
            "text": "We were treated very graciously, upgraded to a junior suite, and situated with a balcony overlooking the incredible bay (we had only asked for a seaview room until check-in). The rates were competitive for this time of year, and worth every cent. We went on to stay a couple nights in San Sebastian, but wish we could have stayed longer at the Zita.",
            "title": "Slightly faded in its glamour but is spotlessly clean, the staff friendly and the meals seriously good.",
            "user": "RedSilver"
        },
        {
            "date": "June 9, 2009",
            "detail_rating": {
                "business": null,
                "cleanliness": 5.0,
                "desk": null,
                "location": 5.0,
                "pool": null,
                "restaurant": null,
                "rooms": 3.0,
                "service": 3.0,
                "sleep": null,
                "value": 3.0
            },
            "helpfulness": 1,
            "id": 31921556,
            "likes": {
                "disliked": null,
                "liked": null
            },
            "rating": 3.0,
            "stay_parameters": "Stayed May 2009, traveled as a couple",
            "text": "The Emperatriz Zita is a grand hotel in the old style that would appeal to persons middle aged and above. We are early sixties and were there for four nights and it was just about right, some older clientele were there for many weeks at a time. The hotel is slightly faded in its glamour but is spotlessly clean, the staff friendly and the meals seriously good. (And seriously good value too). The breakfast buffet was well presented and well stocked.",
            "title": "Best Location on the Bay of Biscay",
            "user": "Janet McPherson"
        },
        {
            "date": "September 9, 2008",
            "detail_rating": {
                "business": 5.0,
                "cleanliness": 5.0,
                "desk": null,
                "front_desk": 5.0,
                "location": 5.0,
                "pool": null,
                "restaurant": null,
                "rooms": 5.0,
                "service": 5.0,
                "sleep": null,
                "value": 5.0
            },
            "helpfulness": null,
            "id": 19944008,
            "likes": {
                "disliked": null,
                "liked": "\u2014 Location and fabulous views!"
            },
            "rating": 5.0,
            "stay_parameters": "Stayed August 2008, traveled as a couple",
            "text": "Our room, which was a mini suite with balcony and sea view, was spacious with a large bathroom containing jacuzzi bath/shower. The tiny harbour is alongside and the hotel sits on a sandy beach, which connects to the slightly larger beach by walking along the sand at low tide. Surrounding the harbour there are tapas bars and the odd restaurant. The hotel has a spa associated but was down in the basement - we were not tempted to try it, possibly as the weather was too fine while we were there.",
            "title": "Best Vacation Spot Ever!!!",
            "user": "nodata"
        },
        {
            "date": "October 22, 2007",
            "detail_rating": {
                "business": null,
                "cleanliness": 5.0,
                "desk": null,
                "front_desk": 5.0,
                "location": 5.0,
                "pool": null,
                "restaurant": null,
                "rooms": 3.0,
                "service": null,
                "sleep": null,
                "value": 5.0
            },
            "helpfulness": null,
            "id": 10220030,
            "likes": {
                "disliked": null,
                "liked": null
            },
            "rating": 4.0,
            "stay_parameters": "Stayed October 2007",
            "text": "Lekeitio has little to speak of in terms of other things to do. Gernika is worth a visit. A note to the wise for travellers by car from either San Sebastian or Bilbao, there is a route from Durango to Markina, after which look for the left turn through Mereludi to Lekeitio which is by far the fastest route to the town. Intuitively road maps do not suggest this route",
            "title": "Lovely location",
            "user": "Kay_Billcar"
        }
    ],
    "slim_ranking": 0.666666666667,
    "stars": 3,
    "tripadvisor": {
        "VISITED": false,
        "country_name": null,
        "locality": null,
        "pic_link": null,
        "street_address": null
    },
    "user_rating": 3.0,
    "variance": {
        "average": 21,
        "excellent": 8,
        "poor": 13,
        "terrible": 24,
        "very good": 24
    }
}