{
    "aka": "Dar Al Masyaf At Madinat Jumeirah Hotel",
    "description": null,
    "detail_rating": {
        "cleanliness": 5.0,
        "location": 5.0,
        "rooms": 5.0,
        "service": 5.0,
        "sleep": 5.0,
        "value": 5.0
    },
    "location": {
        "city": "Dubai",
        "continent": "Middle East",
        "country": "United Arab Emirates",
        "proposed_city": null,
        "province": null,
        "region": null
    },
    "name": "Dar Al Masyaf at Madinat Jumeirah",
    "places": {
        "aka": [],
        "hotel_description": [],
        "hotel_name": []
    },
    "review_count": 1475,
    "review_count_current": 20,
    "reviews": [
        {
            "date": "October 10, 2009",
            "detail_rating": {
                "business": null,
                "cleanliness": null,
                "desk": null,
                "location": null,
                "pool": null,
                "restaurant": null,
                "rooms": null,
                "service": null,
                "sleep": null,
                "value": null
            },
            "helpfulness": null,
            "id": 46465854,
            "likes": {
                "disliked": null,
                "liked": null
            },
            "rating": 5.0,
            "stay_parameters": null,
            "text": "sorry this review is very late but after reading all the other reviews thought i must say have much we enjoyed our stay last june.",
            "title": "loved it",
            "user": "chelsea1996"
        },
        {
            "date": "October 5, 2009",
            "detail_rating": {
                "business": null,
                "cleanliness": 5.0,
                "desk": null,
                "location": 5.0,
                "pool": null,
                "restaurant": null,
                "rooms": 5.0,
                "service": 5.0,
                "sleep": null,
                "value": 4.0
            },
            "helpfulness": null,
            "id": 45927591,
            "likes": {
                "disliked": null,
                "liked": null
            },
            "rating": 5.0,
            "stay_parameters": "Stayed September 2009, traveled with family",
            "text": "we went for 14 days and stayed in villa 18 and had the best time ever our butler ning done everything she could for us.",
            "title": "Fantastic Resort (Except for Cots)",
            "user": "Bev_and_Leo"
        },
        {
            "date": "October 1, 2009",
            "detail_rating": {
                "business": null,
                "cleanliness": 5.0,
                "desk": null,
                "location": 5.0,
                "pool": null,
                "restaurant": null,
                "rooms": 5.0,
                "service": 5.0,
                "sleep": null,
                "value": 5.0
            },
            "helpfulness": null,
            "id": 45597235,
            "likes": {
                "disliked": null,
                "liked": null
            },
            "rating": 5.0,
            "stay_parameters": "Stayed September 2009, traveled as a couple",
            "text": "while we were there they had the offer of 30% off in the resturants if you paid by visa and this helped alot.",
            "title": "World-class resort",
            "user": "prospero1b"
        },
        {
            "date": "September 21, 2009",
            "detail_rating": {
                "business": null,
                "cleanliness": null,
                "desk": null,
                "location": null,
                "pool": null,
                "restaurant": null,
                "rooms": null,
                "service": null,
                "sleep": null,
                "value": null
            },
            "helpfulness": 2,
            "id": 43255538,
            "likes": {
                "disliked": null,
                "liked": null
            },
            "rating": 5.0,
            "stay_parameters": null,
            "text": "We made some good friends and have stayed in touch since we left and that all because we would all meet up for the drinks between 6-8 each night.",
            "title": "You couldnt ask for more, a truely wonderful experience",
            "user": "BarnetHertfordshire"
        },
        {
            "date": "September 15, 2009",
            "detail_rating": {
                "business": null,
                "cleanliness": 5.0,
                "desk": null,
                "location": 5.0,
                "pool": null,
                "restaurant": null,
                "rooms": 5.0,
                "service": 5.0,
                "sleep": null,
                "value": 5.0
            },
            "helpfulness": 1,
            "id": 41857823,
            "likes": {
                "disliked": null,
                "liked": null
            },
            "rating": 5.0,
            "stay_parameters": "Stayed September 2009, traveled as a couple",
            "text": "we liked it so much we are going back for another 2 weeks at the being on june and taking my mother in law as well as she will be 80 years of age while we are there.",
            "title": "Amazing......",
            "user": "napierlouise"
        },
        {
            "date": "August 26, 2009",
            "detail_rating": {
                "business": null,
                "cleanliness": 4.0,
                "desk": null,
                "location": 5.0,
                "pool": null,
                "restaurant": null,
                "rooms": 4.0,
                "service": 4.0,
                "sleep": null,
                "value": 4.0
            },
            "helpfulness": null,
            "id": 38826874,
            "likes": {
                "disliked": null,
                "liked": null
            },
            "rating": 4.0,
            "stay_parameters": "Stayed June 2009, traveled with family",
            "text": "We stayed for a few days in the hotel and availed of their Summer Promotion (where two kids below 15 years of age stay with parents for free). I have to say that for that rate, it was so worth it. Checking in was a very, very pleasant experience. We were led to the main lobby by a friendly bellboy and was immediately given cool towels to freshen up. From the main lobby, we were directed towards the buggy station to be taken to our room. We were greeted by our private butler for the night, were warmly welcomed, checked-in and were led to our room, where refreshing drinks awaited us!",
            "title": "Summer offer was worth it.",
            "user": "PopsyTurvy"
        },
        {
            "date": "August 21, 2009",
            "detail_rating": {
                "business": null,
                "cleanliness": 5.0,
                "desk": null,
                "location": 4.0,
                "pool": null,
                "restaurant": null,
                "rooms": 5.0,
                "service": 1.0,
                "sleep": null,
                "value": 3.0
            },
            "helpfulness": 2,
            "id": 38377160,
            "likes": {
                "disliked": null,
                "liked": null
            },
            "rating": 3.0,
            "stay_parameters": "Stayed August 2009, traveled with family",
            "text": "The private butlers we had throughout our stay were always so friendly and helpful. The wait for the buggy ride is always not more than a 5-minute wait. The whole Madinat Jumeirah (Mina Salam, Al Qasr, Dar Al Masyaf, Madinat Souk) property is beautiful. During our stay, we tried most of the restaurants in Dar Al Masyaf/Al Qasr area and a couple of other restaurants/bars in Madinat Souk and they're all basically good.",
            "title": "Charming villas, but disappointing service!",
            "user": "Jsmami"
        },
        {
            "date": "August 20, 2009",
            "detail_rating": {
                "business": null,
                "cleanliness": null,
                "desk": null,
                "location": null,
                "pool": null,
                "restaurant": null,
                "rooms": null,
                "service": null,
                "sleep": null,
                "value": null
            },
            "helpfulness": 2,
            "id": 38227474,
            "likes": {
                "disliked": null,
                "liked": null
            },
            "rating": 5.0,
            "stay_parameters": null,
            "text": "The only comment I have is the pool bar in the hotel. We went there to have drinks while watching the sunset but sitting at the bar put us off: alcohol bottles could use some dusting off, plastic cups look so worn out they should be replaced, the bartenders' work area could use some renovation! They look dull and dirty!",
            "title": "Utopia!",
            "user": "gowerguy"
        },
        {
            "date": "August 17, 2009",
            "detail_rating": {
                "business": null,
                "cleanliness": 5.0,
                "desk": null,
                "location": 5.0,
                "pool": null,
                "restaurant": null,
                "rooms": 5.0,
                "service": 5.0,
                "sleep": null,
                "value": 4.0
            },
            "helpfulness": 1,
            "id": 37958784,
            "likes": {
                "disliked": null,
                "liked": null
            },
            "rating": 5.0,
            "stay_parameters": "Stayed August 2009, traveled with family",
            "text": "Aside from that observation above, Dar Al Masyaf is worth the experience!",
            "title": "Prepare to be spoilt!",
            "user": "MrsJWiltshire"
        },
        {
            "date": "August 15, 2009",
            "detail_rating": {
                "business": null,
                "cleanliness": 5.0,
                "desk": null,
                "location": 5.0,
                "pool": null,
                "restaurant": null,
                "rooms": 5.0,
                "service": 5.0,
                "sleep": null,
                "value": 5.0
            },
            "helpfulness": 1,
            "id": 37772348,
            "likes": {
                "disliked": null,
                "liked": null
            },
            "rating": 5.0,
            "stay_parameters": "Stayed June 2009, traveled as a couple",
            "text": "We toured the area in a buggy from JBH and fell in love with the peaceful setting of the complex. So we decided to make a very bold decision - to change our flights and book a room for one night in Madinet Jumeirah in the last minute.",
            "title": "Best Hotel in Dubai...Amazing",
            "user": "beany26"
        },
        {
            "date": "September 11, 2009",
            "detail_rating": {
                "business": null,
                "cleanliness": 5.0,
                "desk": null,
                "location": 5.0,
                "pool": null,
                "restaurant": null,
                "rooms": 5.0,
                "service": 5.0,
                "sleep": null,
                "value": 4.0
            },
            "helpfulness": 2,
            "id": 40790859,
            "likes": {
                "disliked": null,
                "liked": null
            },
            "rating": 5.0,
            "stay_parameters": "Stayed August 2006, traveled as a couple",
            "text": "This place is complete paradise. You have everything right at your fingertips (Butler service makes sure of it!) and at the same time you still have a great deal of privacy. A ton of amazing restaurants to choose from along with nice and trendy lounges. Super clean pools and beach. Very beautiful and very calm. Huge property... be prepared to walk, take a buggy or 'boat'. Close to great shopping and even more great restaurants!",
            "title": "Perfect",
            "user": "TwiceTheLove"
        },
        {
            "date": "September 5, 2009",
            "detail_rating": {
                "business": null,
                "cleanliness": 5.0,
                "desk": null,
                "location": 3.0,
                "pool": null,
                "restaurant": null,
                "rooms": 5.0,
                "service": null,
                "sleep": null,
                "value": 5.0
            },
            "helpfulness": null,
            "id": 39839636,
            "likes": {
                "disliked": null,
                "liked": null
            },
            "rating": 5.0,
            "stay_parameters": "Stayed August 2009, traveled with family",
            "text": "What a fabulous experience. We were lucky to get a upgrade to a Suite which was fantastic. All the staff were highly professional, nothing was too much. This was our 4th time in Dubai, stayed previously at Al Qasr and Jumeriah Beach. This was definitely the best.",
            "title": "a nice time",
            "user": "EnglandJanie"
        },
        {
            "date": "September 4, 2009",
            "detail_rating": {
                "business": null,
                "cleanliness": 5.0,
                "desk": null,
                "location": 5.0,
                "pool": null,
                "restaurant": null,
                "rooms": 5.0,
                "service": 5.0,
                "sleep": null,
                "value": 4.0
            },
            "helpfulness": 1,
            "id": 39755780,
            "likes": {
                "disliked": null,
                "liked": null
            },
            "rating": 5.0,
            "stay_parameters": "Stayed March 2009, traveled with family",
            "text": "Would highly recommend it for all.",
            "title": "We Love this Hotel",
            "user": "vemar"
        },
        {
            "date": "September 1, 2009",
            "detail_rating": {
                "business": null,
                "cleanliness": null,
                "desk": null,
                "location": null,
                "pool": null,
                "restaurant": null,
                "rooms": null,
                "service": null,
                "sleep": null,
                "value": null
            },
            "helpfulness": 1,
            "id": 39485348,
            "likes": {
                "disliked": null,
                "liked": null
            },
            "rating": 5.0,
            "stay_parameters": null,
            "text": "The room, the grounds, the restaurants and the views are all amazing, this is my second trip to the Madinat and we love it. The room is spacious, clean and well equipt, you are also so well looked after by the staff. The Dar Al Masyaf summerhouses have there own staff with lobby area, between 6 - 8 in the evening they hold a complimentry drinks service, you can anything you like from the branded drinks they also have on offer champagne. Our daughter was so well treated as well, on arrival she received a teddy bear and complimentry tolietry set, and every night on her pillow she received other little things like rubber ducks, lip balm, games and sweets. The villas also share private pools which are always so peaceful if you like to get away from the bussle of the large al qsar pool. The food was wonderful, we particularly liked the mina a salam buffet restaurant with its outdoor eating area with the view of the Burj al arab. We didnt find the drinks or food overly priced which we did expect as it is Dubai. Transport around the large hotel complex is either by golf buggy or by the little boats around the waterways, the water taxis are a lovely novelty. On the Madinat complex, it has its own souk with restaurants and shops, this gives you a different aspect as it does actually feel as though you are venturing out away from the hotel for a meal or drink. The hotel also has a very professional spa, the massage is a real treat. Although we will be trying another hotel next year, we will be back.",
            "title": "fantastic hotel",
            "user": "louise12399"
        },
        {
            "date": "August 26, 2009",
            "detail_rating": {
                "business": null,
                "cleanliness": 5.0,
                "desk": null,
                "location": 5.0,
                "pool": null,
                "restaurant": null,
                "rooms": 5.0,
                "service": 5.0,
                "sleep": null,
                "value": 4.0
            },
            "helpfulness": null,
            "id": 38842309,
            "likes": {
                "disliked": null,
                "liked": null
            },
            "rating": 5.0,
            "stay_parameters": "Stayed August 2009, traveled with family",
            "text": "have just returned from a week at dar al masyaf and cant believe how wonderful this place is !! as i work in the travel industry i have very high standards of customer service, but i was impressed by how polite, friendly and professional that all of the staff were at this resort. we stayed in villa 19 room 9 and had the most wonderful team of butlers, pool boy, lifeguard, buggy and abra drivers, special mention must go to john,connie and eduardo for their outstanding customer service skills, they are a credit to the company. the check in procedure was swift and very easy even though we arrived at 2am, we were taken by buggie to our villa and talked through the half board option and shown to our room very quickly. the rooms in this villa were beautiful and very spacious, every evening your butler would serve you free drinks for an hour before dinner which in dubai is a fantastic perk as prices are quite high, around fifteen pounds for two drinks. the private pool is just feet outside your door and was never any more than ten people there, also an abra station right outside the door so never had to walk far. resteraunts included in the half board option were fantastic, plenty of choice and something for everyone, even fussy eaters like me! would highly reccomed mj's steak house, must have been one of the best meals i ever had. got lost in the souk a few times before we found our way to where we wanted to be but all just part of the fun. beach area has wonderful day beds and only a short stroll to the warmest sea, felt like going into a bath! we have stayed in a few hotels in dubai over the years including the neighbouring burj al arab but can say that i will never stay anywhere else in dubai again after experiencing the dar al masyaf as it is a fantastic hotel, cant wait to my next visit.",
            "title": "We loved it",
            "user": "Nickowens"
        },
        {
            "date": "August 15, 2009",
            "detail_rating": {
                "business": null,
                "cleanliness": null,
                "desk": null,
                "location": null,
                "pool": null,
                "restaurant": null,
                "rooms": null,
                "service": null,
                "sleep": null,
                "value": null
            },
            "helpfulness": 1,
            "id": 37769711,
            "likes": {
                "disliked": null,
                "liked": null
            },
            "rating": 5.0,
            "stay_parameters": null,
            "text": "Absolutely incredible!!",
            "title": "Out of this world!!!!",
            "user": "Dublin25Ireland"
        },
        {
            "date": "August 11, 2009",
            "detail_rating": {
                "business": null,
                "cleanliness": 5.0,
                "desk": null,
                "location": 5.0,
                "pool": null,
                "restaurant": null,
                "rooms": 5.0,
                "service": 5.0,
                "sleep": null,
                "value": 5.0
            },
            "helpfulness": 1,
            "id": 37391443,
            "likes": {
                "disliked": null,
                "liked": null
            },
            "rating": 5.0,
            "stay_parameters": "Stayed July 2009, traveled as a couple",
            "text": "The Villa was amazing very spacious fabulous bathrooms and balconys, fresh fruit in your room every day",
            "title": "beautiful place, wonderful stay",
            "user": "EA93"
        },
        {
            "date": "August 11, 2009",
            "detail_rating": {
                "business": null,
                "cleanliness": 5.0,
                "desk": null,
                "location": 5.0,
                "pool": null,
                "restaurant": null,
                "rooms": 5.0,
                "service": 5.0,
                "sleep": null,
                "value": 4.0
            },
            "helpfulness": 2,
            "id": 37368757,
            "likes": {
                "disliked": null,
                "liked": null
            },
            "rating": 5.0,
            "stay_parameters": "Stayed August 2009, traveled with family",
            "text": "The service was second to none the setting was divine! upon reading some of the negative reviews on this place I have to wonder were they staying in the same place I was!",
            "title": "Stunning Stay",
            "user": "AMP2008London"
        },
        {
            "date": "August 11, 2009",
            "detail_rating": {
                "business": null,
                "cleanliness": 5.0,
                "desk": null,
                "location": 5.0,
                "pool": null,
                "restaurant": null,
                "rooms": 5.0,
                "service": 5.0,
                "sleep": null,
                "value": 5.0
            },
            "helpfulness": 3,
            "id": 37355298,
            "likes": {
                "disliked": null,
                "liked": null
            },
            "rating": 5.0,
            "stay_parameters": "Stayed August 2009, traveled as a couple",
            "text": "I have stayed in a lot of top class hotels from The Bay hotel in Cape town to the Prague Mandarin Oriental and WOW this by far outshines them all!",
            "title": "Absolutely awesome! The best place i've ever stayed!",
            "user": "Mathmagic"
        },
        {
            "date": "August 7, 2009",
            "detail_rating": {
                "business": null,
                "cleanliness": 5.0,
                "desk": null,
                "location": 5.0,
                "pool": null,
                "restaurant": null,
                "rooms": 5.0,
                "service": 5.0,
                "sleep": null,
                "value": 5.0
            },
            "helpfulness": 1,
            "id": 36974245,
            "likes": {
                "disliked": null,
                "liked": null
            },
            "rating": 5.0,
            "stay_parameters": "Stayed June 2009, traveled as a couple",
            "text": "The butlers in the villa could not do enough for you. Each evening we enjoyed complimentary drinks in the courtyard, you can choose from a glass of Moet to a bottle of beer!",
            "title": "splendid",
            "user": "SUCRES"
        }
    ],
    "slim_ranking": 0.00639658848614,
    "stars": 5,
    "tripadvisor": {
        "VISITED": false,
        "country_name": null,
        "locality": null,
        "pic_link": null,
        "street_address": null
    },
    "user_rating": 5.0,
    "variance": {
        "average": 43,
        "excellent": 1291,
        "poor": 15,
        "terrible": 11,
        "very good": 115
    }
}