{
    "aka": "Sonesta Great Bay Beach Resort And Casino",
    "description": "Overlooking beautiful Great Bay Harbor and a short, 10-minute walk from the exciting capital of Philipsburg, Sonesta Great Bay Beach Resort & Casino offers the best of both worlds: great shopping, dining and entertainment in a quaint downtown setting, and a tropical escape within a beach front oasis. With spectacular views, unparalleled service, a full range of amenities and a mile of white, sandy beach, the Sonesta Beach Resort provides the ultimate Caribbean experience.",
    "detail_rating": {
        "cleanliness": 4.0,
        "location": 4.5,
        "rooms": 3.5,
        "service": 3.5,
        "sleep": 4.0,
        "value": 3.5
    },
    "location": {
        "city": null,
        "continent": null,
        "country": "Caribbean",
        "proposed_city": "Bay",
        "province": null,
        "region": null
    },
    "name": "Sonesta Great Bay Beach Resort & Casino",
    "places": {
        "aka": [
            "Bay"
        ],
        "hotel_description": [
            "Bay",
            "Philipsburg"
        ],
        "hotel_name": [
            "Bay"
        ]
    },
    "review_count": 1542,
    "review_count_current": 20,
    "reviews": [
        {
            "date": "August 20, 2012",
            "detail_rating": {
                "business": null,
                "cleanliness": 5.0,
                "desk": null,
                "location": 5.0,
                "pool": null,
                "restaurant": null,
                "rooms": 5.0,
                "service": 5.0,
                "sleep": 5.0,
                "value": 5.0
            },
            "helpfulness": null,
            "id": 137742221,
            "likes": {
                "disliked": null,
                "liked": null
            },
            "rating": 5.0,
            "stay_parameters": "Stayed August 2012, traveled with friends",
            "text": "The staff at Sonesta Great Bay Resort was excellent. They absolutelty made my trip. There was just never a dull moment. The resort was beautiful, the room was beautiful, the pools, the beach, the drinks, the food...all of it was superb.",
            "title": "A good time was had by all",
            "user": "Taryn M"
        },
        {
            "date": "August 20, 2012",
            "detail_rating": {
                "business": null,
                "cleanliness": 1.0,
                "desk": null,
                "location": 2.0,
                "pool": null,
                "restaurant": null,
                "rooms": 2.0,
                "service": 1.0,
                "sleep": 1.0,
                "value": 1.0
            },
            "helpfulness": null,
            "id": 137741410,
            "likes": {
                "disliked": null,
                "liked": null
            },
            "rating": 1.0,
            "stay_parameters": "Stayed August 2012, traveled with family",
            "text": "Special shout out to the animation staff for keeping the good times going - Kevin, Denroy",
            "title": "RUN FOR THE HILLS!",
            "user": "LEELOOBABY"
        },
        {
            "date": "August 13, 2012",
            "detail_rating": {
                "business": null,
                "cleanliness": 3.0,
                "desk": null,
                "location": 4.0,
                "pool": null,
                "restaurant": null,
                "rooms": 3.0,
                "service": 1.0,
                "sleep": 1.0,
                "value": 1.0
            },
            "helpfulness": 10,
            "id": 137091686,
            "likes": {
                "disliked": null,
                "liked": null
            },
            "rating": 1.0,
            "stay_parameters": "Stayed June 2012, traveled as a couple",
            "text": "Special shout out to the bartenders - Nigel and Alex for bringing out the sunshine",
            "title": "The Staff made this place unbearable, couldn't wait to leave!",
            "user": "Meli_Vacays"
        },
        {
            "date": "August 12, 2012",
            "detail_rating": {
                "business": null,
                "cleanliness": 4.0,
                "desk": null,
                "location": 4.0,
                "pool": null,
                "restaurant": null,
                "rooms": 3.0,
                "service": 4.0,
                "sleep": 4.0,
                "value": 4.0
            },
            "helpfulness": 5,
            "id": 136999245,
            "likes": {
                "disliked": null,
                "liked": null
            },
            "rating": 3.0,
            "stay_parameters": "Stayed August 2012, traveled as a couple",
            "text": "Special shout out to Camille and Ruffino - for going the extra step to make meals feel special",
            "title": "Your vacation is what you make it, not what the hotel makes it - awesome time",
            "user": "eveline_4u"
        },
        {
            "date": "August 12, 2012",
            "detail_rating": {
                "business": null,
                "cleanliness": 4.0,
                "desk": null,
                "location": 5.0,
                "pool": null,
                "restaurant": null,
                "rooms": 4.0,
                "service": 4.0,
                "sleep": 5.0,
                "value": 5.0
            },
            "helpfulness": 3,
            "id": 136992947,
            "likes": {
                "disliked": null,
                "liked": null
            },
            "rating": 4.0,
            "stay_parameters": "Stayed August 2012, traveled as a couple",
            "text": "If i could give zero stars, I would! The minute we arrived there were 2 leaks in the ceilings in the lobby....I already felt this could be a sign. Reception staff were lax, unhelpful, borderline rude. We arrived at 1 pm and were told to come back at 2:30 pm. We went back at 2 pm, and were told \" i said 2:30 pm\". I mean, who does that??? What ever happened to common courtesy.The room was ready at 3:15 pm, furthermore, the resort wasn't even full!",
            "title": "honeymooners had a great time",
            "user": "rlwilber2"
        },
        {
            "date": "August 23, 2012",
            "detail_rating": {
                "business": null,
                "cleanliness": 3.0,
                "desk": null,
                "location": 2.0,
                "pool": null,
                "restaurant": null,
                "rooms": 2.0,
                "service": 1.0,
                "sleep": 3.0,
                "value": 1.0
            },
            "helpfulness": 2,
            "id": 138152313,
            "likes": {
                "disliked": null,
                "liked": null
            },
            "rating": 1.0,
            "stay_parameters": "Stayed August 2012, traveled with friends",
            "text": "I usually pick one all-inclusive trip a year. This year my friend and I picked Sonesta Great Bay. Upon arrival at the hotel there was one receptionist that either didn't know what she was doing or was just very slow. We could see from our folder that we were originally set up to be in a room on the 4th floor. She put us on the 1st floor. Since we were in a mountain view, this put us below grade. It was like staying in a basement. One morning upon opening the curtains, a worker was right outside our sliding door watering the plants, not to mention the only road surrounding the island was 50 feet away. There was only 2 bottles of water in our refrigerator (supposed to be stocked with sodas, beers, and liquor). When we continuously complained, we were moved 3 days into our trip to an oceanview room, which was much better. However, the air conditioner leaked large puddles all over the tile floor.",
            "title": "Can't Believe Anyone would rate high",
            "user": "Deb C"
        },
        {
            "date": "August 23, 2012",
            "detail_rating": {
                "business": null,
                "cleanliness": 3.0,
                "desk": null,
                "location": 3.0,
                "pool": null,
                "restaurant": null,
                "rooms": 3.0,
                "service": 1.0,
                "sleep": 3.0,
                "value": 3.0
            },
            "helpfulness": 2,
            "id": 138093727,
            "likes": {
                "disliked": null,
                "liked": null
            },
            "rating": 1.0,
            "stay_parameters": "Stayed August 2012, traveled with friends",
            "text": "The staff continuously complained about the new management that the said took over a couple of months ago. There was a very limited amount of selection of alcoholic drinks. We requested guavaberry liquor, which is the island's known drink, and were told management took that away. The service at the buffet was hit or miss. Patricia was a good waitress so look for her. As far as the food, the buffet was mainly the same foods over and over. There was only one other restaurant on the site, Molasses, and it was only open a couple nights a week. The food and service was fairly good there.",
            "title": "Sonesta not so Great Bay",
            "user": "Lenee1980"
        },
        {
            "date": "August 22, 2012",
            "detail_rating": {
                "business": null,
                "cleanliness": 2.0,
                "desk": null,
                "location": 5.0,
                "pool": null,
                "restaurant": null,
                "rooms": 2.0,
                "service": 2.0,
                "sleep": 2.0,
                "value": 1.0
            },
            "helpfulness": 1,
            "id": 138053728,
            "likes": {
                "disliked": null,
                "liked": null
            },
            "rating": 2.0,
            "stay_parameters": "Stayed August 2012, traveled with family",
            "text": "You have to use a paper card to get a pool towel and if you loose the paper card you pay $10, not to mention that half the time you go for a towel no personnel or towels would be there.",
            "title": "Not what we were expecting!",
            "user": "Gina M"
        },
        {
            "date": "August 22, 2012",
            "detail_rating": {
                "business": null,
                "cleanliness": 1.0,
                "desk": null,
                "location": 3.0,
                "pool": null,
                "restaurant": null,
                "rooms": 1.0,
                "service": 1.0,
                "sleep": 1.0,
                "value": 1.0
            },
            "helpfulness": null,
            "id": 138012199,
            "likes": {
                "disliked": null,
                "liked": null
            },
            "rating": 1.0,
            "stay_parameters": "Stayed August 2012, traveled with friends",
            "text": "The beach is nice, but don't let the color of the water fool you. It is very murky (not sure if it's the abundance of salt). If you do go in the water definitely take advantage of the raft rental. You pay a $5 deposit for a very nice raft. They give you your $5 when you bring it back.",
            "title": "Very dissapointed!",
            "user": "Kaylan E"
        },
        {
            "date": "August 21, 2012",
            "detail_rating": {
                "business": null,
                "cleanliness": 5.0,
                "desk": null,
                "location": 5.0,
                "pool": null,
                "restaurant": null,
                "rooms": 5.0,
                "service": 4.0,
                "sleep": 5.0,
                "value": 4.0
            },
            "helpfulness": null,
            "id": 137948549,
            "likes": {
                "disliked": null,
                "liked": null
            },
            "rating": 4.0,
            "stay_parameters": "Stayed August 2012, traveled as a couple",
            "text": "Our favorite part of the vacation was a sailing trip on the Random Wind. It was only $99 per person if you book yourself and is well worth the excursion. We also enjoyed a taxi trip to Orient Beach. The sand there is powdery soft and the water is crystal clear and warm. There is a portion of the beach that is nude, but it's down the end, separated, and you may walk down there without removing your clothes.",
            "title": "great vacation",
            "user": "Ana B"
        },
        {
            "date": "August 21, 2012",
            "detail_rating": {
                "business": null,
                "cleanliness": 3.0,
                "desk": null,
                "location": 4.0,
                "pool": null,
                "restaurant": null,
                "rooms": 3.0,
                "service": 3.0,
                "sleep": 3.0,
                "value": 3.0
            },
            "helpfulness": 1,
            "id": 137942534,
            "likes": {
                "disliked": null,
                "liked": null
            },
            "rating": 3.0,
            "stay_parameters": "Stayed August 2012, traveled as a couple",
            "text": "We stayed here from 8/11-8/18 and really had no problems. We were in one of the timeshare units (Studio room 263) and it met our needs. We did not do the all-inclusive package as we don't like feeling limited to just the resort. Rather we prefer to go out and about and explore on our own. We did not have as much interaction with staff as others who have commented, but we did not have any issues with the staff that we did have contact with. Granted, they were not overly friendly or helpful, but I can not say that anyone was rude either. We ate at the beach cafe a couple times and had the breakfast buffet one time. The food was good, but the buffet was pricey. Over $40 for 2 people. A bit much for breakfast I think.",
            "title": "Met our needs",
            "user": "mcaribbean"
        },
        {
            "date": "August 21, 2012",
            "detail_rating": {
                "business": null,
                "cleanliness": 4.0,
                "desk": null,
                "location": 5.0,
                "pool": null,
                "restaurant": null,
                "rooms": 4.0,
                "service": 4.0,
                "sleep": 4.0,
                "value": 5.0
            },
            "helpfulness": 3,
            "id": 137884970,
            "likes": {
                "disliked": null,
                "liked": null
            },
            "rating": 5.0,
            "stay_parameters": "Stayed August 2012, traveled with friends",
            "text": "Our room was adequate. It was clean and there was NO mildew smell that so many others mention. Always had good water pressure and plenty of hot water. The view from our room was gorgeous! We weren't crazy about the beach here. The sand is large grains of crushed shells and it does get deep quickly. The water was a beautiful turquoise, but it always seemed cloudy. We only spent a couple days here.",
            "title": "Awesome 50th Birthday celebration",
            "user": "Kara D"
        },
        {
            "date": "August 20, 2012",
            "detail_rating": {
                "business": null,
                "cleanliness": 1.0,
                "desk": null,
                "location": 4.0,
                "pool": null,
                "restaurant": null,
                "rooms": 2.0,
                "service": 1.0,
                "sleep": 3.0,
                "value": 2.0
            },
            "helpfulness": 3,
            "id": 137838187,
            "likes": {
                "disliked": null,
                "liked": null
            },
            "rating": 2.0,
            "stay_parameters": "Stayed August 2012, traveled as a couple",
            "text": "We rented a car for a day from the Hertz at the hotel and had no problems. Driving on the island took some getting used to, but wasn't too bad. We went to Orient Beach which was very nice. Also a must do is to go to Maho Beach to watch the planes. Lots of fun and a beautiful beach, although small. We also did a day trip to Anguilla by taking the ferry from Marigot. I highly recommend making the trip. Shoal Bay is the most beautiful beach!! Just make sure to take your passport. You will need it to get into Anguilla.",
            "title": "Very disappointed!",
            "user": "EMC112"
        },
        {
            "date": "August 20, 2012",
            "detail_rating": {
                "business": null,
                "cleanliness": 3.0,
                "desk": null,
                "location": 3.0,
                "pool": null,
                "restaurant": null,
                "rooms": 2.0,
                "service": 2.0,
                "sleep": 4.0,
                "value": 3.0
            },
            "helpfulness": 1,
            "id": 137811883,
            "likes": {
                "disliked": null,
                "liked": null
            },
            "rating": 3.0,
            "stay_parameters": "Stayed August 2012, traveled with family",
            "text": "Do not take taxis, but use the buses instead. They only charge $2 a person (one way). You have to walk to Back Street in Philipsburg to catch a bus, but it's really easy. They display the location they are going to in the window. Wave to them to stop and get on. Be sure to ask the driver to alert you when you get to the stop that you need. We found all of the drivers to be very nice and helpful in getting us to our destination.",
            "title": "Awesome island, subpar staff (except Animators and select bartenders), average hotel",
            "user": "Robert G"
        },
        {
            "date": "August 20, 2012",
            "detail_rating": {
                "business": null,
                "cleanliness": 1.0,
                "desk": null,
                "location": 5.0,
                "pool": null,
                "restaurant": null,
                "rooms": 1.0,
                "service": 4.0,
                "sleep": 2.0,
                "value": 2.0
            },
            "helpfulness": 3,
            "id": 137805058,
            "likes": {
                "disliked": null,
                "liked": null
            },
            "rating": 2.0,
            "stay_parameters": "Stayed August 2012, traveled with family",
            "text": "This is definitely not a 5 star resort, but it's also not a total dump. If you're just looking for a place to crash after a long day of exploring, then give this place a try. If you're planning to just stay at the resort all week, you may want to look for something else. And if you're the kind of person who expects to be treated like royalty and complains about every little thing, do everyone a favor and just stay home.",
            "title": "Hotel was awful but Animators and the Island were amazing!",
            "user": "Andrea G"
        },
        {
            "date": "August 29, 2012",
            "detail_rating": {
                "business": null,
                "cleanliness": 4.0,
                "desk": null,
                "location": 4.0,
                "pool": null,
                "restaurant": null,
                "rooms": 4.0,
                "service": 2.0,
                "sleep": 4.0,
                "value": 4.0
            },
            "helpfulness": 7,
            "id": 138828993,
            "likes": {
                "disliked": null,
                "liked": null
            },
            "rating": 4.0,
            "stay_parameters": "Stayed August 2012, traveled as a couple",
            "text": "My fiance and I spent a week here in August 2012. Let me just say at the outset that we are budget travelers and do not expect the Ritz when we are paying budget prices.",
            "title": "Not many complaints",
            "user": "heathergreg"
        },
        {
            "date": "August 27, 2012",
            "detail_rating": {
                "business": null,
                "cleanliness": 3.0,
                "desk": null,
                "location": 5.0,
                "pool": null,
                "restaurant": null,
                "rooms": 3.0,
                "service": 4.0,
                "sleep": 3.0,
                "value": 4.0
            },
            "helpfulness": 3,
            "id": 138604786,
            "likes": {
                "disliked": null,
                "liked": null
            },
            "rating": 4.0,
            "stay_parameters": "Stayed August 2012, traveled as a couple",
            "text": "BEACH: The hotel is on a long strip of beach with gorgeous teal blue water. The water is not crystal clear (probably because the waves are so strong) but it is still very beautiful. The beach leading to the water is very steep and the sand is somewhat coarse, but these were not significant issues since the beach is so gorgeous otherwise. You can rent a float from the hotel to take into the ocean and lay on- my fiance found that very relaxing. There was a very faint smell of sewage every once in awhile as we were laying on the beach, which we overheard other couples notice as well. It wasn't strong enough to really bother us though and it wasn't there all the time. The \"island ladies\" were a little annoying to me because they were so loud talking amongst themselves when I really just wanted to relax and not hear voices right in my ear. The hotel needs to get rid of them. We saw them asking people to go up to the buffet and bring them back free food! Don't expect the person who mans the beach towel stand to be there very often. It was frustrating when we went down there at 9 or 10 am and no one was there to hand out towels. Luckily, we had packed our own and used them. There were a couple island dogs roaming around the beach. They were sweet and harmless but it was extremely depressing to see what bad shape they were in. We gladly snuck them some food and water from the buffet. This island needs an SPCA or something to take these poor dogs in.",
            "title": "Great Place",
            "user": "Letitia W"
        },
        {
            "date": "August 26, 2012",
            "detail_rating": {
                "business": null,
                "cleanliness": 3.0,
                "desk": null,
                "location": 4.0,
                "pool": null,
                "restaurant": null,
                "rooms": 2.0,
                "service": 2.0,
                "sleep": 2.0,
                "value": 2.0
            },
            "helpfulness": 6,
            "id": 138441336,
            "likes": {
                "disliked": null,
                "liked": null
            },
            "rating": 2.0,
            "stay_parameters": "Stayed July 2012, traveled solo",
            "text": "FOOD: This place is a meat lover's dream. I am not a meat lover, but was always able to find something to eat. Unfortunately, there is no pasta ever at any meal, at least not while we were there. There is always chicken or ribs or lamb or roast beef for lunch and dinner at the buffet. They have great fresh salad foods and decent desserts. I am a VERY picky eater and I never went hungry, so that should say something. The quality of their meat was excellent, too. The best place to eat though, in my opinion, is the grill down by the pool during lunch. They have pizza, burgers, hot dogs and french fries. However, they did run out of french fries one day, which was a little irritating because that just should not happen at a hotel that advertises itself as all-inclusive. They actually ran out of other things as well, like beach towels and certain drinks, so I think that's why this annoyed me. My fiance and I began to theorize that they have allotted a certain amount of each item to be used each day, and once it's used they just tell you they are all out of that.",
            "title": "Sonesta Great Bay is barely two stars",
            "user": "sbp0713"
        },
        {
            "date": "August 25, 2012",
            "detail_rating": {
                "business": null,
                "cleanliness": 4.0,
                "desk": null,
                "location": 5.0,
                "pool": null,
                "restaurant": null,
                "rooms": 5.0,
                "service": 3.0,
                "sleep": 5.0,
                "value": 5.0
            },
            "helpfulness": 4,
            "id": 138331164,
            "likes": {
                "disliked": null,
                "liked": null
            },
            "rating": 5.0,
            "stay_parameters": "Stayed August 2012, traveled as a couple",
            "text": "DRINKS: Totally watered down so your best bet is wine or beer. I don't think there was any alcohol at all in my daiquiris or margaritas. Never had banana daiquiri mix which was annoying.",
            "title": "great bay great food great people great location great vacation",
            "user": "joe-sanda"
        },
        {
            "date": "August 24, 2012",
            "detail_rating": {
                "business": null,
                "cleanliness": 3.0,
                "desk": null,
                "location": 5.0,
                "pool": null,
                "restaurant": null,
                "rooms": 3.0,
                "service": 4.0,
                "sleep": 3.0,
                "value": 4.0
            },
            "helpfulness": 1,
            "id": 138263210,
            "likes": {
                "disliked": null,
                "liked": null
            },
            "rating": 3.0,
            "stay_parameters": "Stayed August 2012, traveled as a couple",
            "text": "ROOMS: Very modern and clean. AC worked great. A few tiny ants in the bathroom sink but nothing too bad. Only bad thing was that when I went to turn on the shower for the first time, the handle completely came off. I just put it back on loosely and made it work. It should really be fixed though. They only forgot to replace our bath towels one time and as soon as we requested more, they came right away with more. The room safe is in a very inconvenient spot- it's in the closet on the floor almost. It was a pain to keep bending down in that closet to get stuff in and out of it. I want to be lazy on vacation...",
            "title": "Carribean Vacation",
            "user": "Colleen B"
        }
    ],
    "slim_ranking": 0.384615384615,
    "stars": 3.5,
    "tripadvisor": {
        "VISITED": false,
        "country_name": null,
        "locality": null,
        "pic_link": null,
        "street_address": null
    },
    "user_rating": 3.5,
    "variance": {
        "average": 289,
        "excellent": 319,
        "poor": 179,
        "terrible": 139,
        "very good": 616
    }
}