{
    "aka": "Rohet Garh Hotel Rohet",
    "description": null,
    "detail_rating": {
        "cleanliness": null,
        "location": null,
        "rooms": null,
        "service": null,
        "sleep": null,
        "value": null
    },
    "location": {
        "city": "Rohet",
        "continent": "Asia",
        "country": "India",
        "proposed_city": null,
        "province": null,
        "region": "Rajasthan"
    },
    "name": "Rohet Garh",
    "places": {
        "aka": [],
        "hotel_description": [],
        "hotel_name": []
    },
    "review_count": 161,
    "review_count_current": 9,
    "reviews": [
        {
            "date": "February 15, 2007",
            "detail_rating": {
                "business": null,
                "cleanliness": 5.0,
                "desk": null,
                "front_desk": 4.0,
                "location": 3.0,
                "pool": null,
                "restaurant": null,
                "rooms": 5.0,
                "service": 4.0,
                "sleep": null,
                "value": 4.0
            },
            "helpfulness": 2,
            "id": 6797594,
            "likes": {
                "disliked": "\u2014 Average breakfast",
                "liked": "\u2014 The interesting rooms and the garden"
            },
            "rating": 4.0,
            "stay_parameters": "Stayed January 2007, traveled as a couple",
            "text": "Leaving aside all the literary associations, Rohet Garh, 40km outside Jodhpur in Rajasthan is a great place to retreat from the pressures of touring India. A former sprawling fortified maharajah's residence built around a beautiful garden which the owners have turned into a luxurious hotel. The rooms are spacious and comfortable; ours which was once part of the stables had lovely window seats overlooking a lake and the bathrooms are large with modern fittings and great shower.",
            "title": "A peaceful garden paradise",
            "user": "Intrepidtoo"
        },
        {
            "date": "February 9, 2007",
            "detail_rating": {
                "business": null,
                "cleanliness": 5.0,
                "desk": null,
                "front_desk": 4.0,
                "location": 4.0,
                "pool": null,
                "restaurant": null,
                "rooms": 4.0,
                "service": 4.0,
                "sleep": null,
                "value": 4.0
            },
            "helpfulness": 1,
            "id": 6766649,
            "likes": {
                "disliked": "\u2014 Didn't stay long enough !",
                "liked": "\u2014 Authentic surrounds"
            },
            "rating": 4.0,
            "stay_parameters": "Stayed January 2007, traveled as a couple",
            "text": "You are welcomed with tea on the shady lawns and the owners take delight in greeting their guests and making them feel welcomed to their family home. Meals are served in a rather nonedescript room by the swimming pool. The food is good but not exceptional and the breakfast is really only average.",
            "title": "Wonderful Heritage Hotel",
            "user": "El_Sueno"
        },
        {
            "date": "January 17, 2007",
            "detail_rating": {
                "business": null,
                "cleanliness": null,
                "desk": null,
                "location": null,
                "pool": null,
                "restaurant": null,
                "rooms": null,
                "service": null,
                "sleep": null,
                "value": null
            },
            "helpfulness": 2,
            "id": 6613087,
            "likes": {
                "disliked": null,
                "liked": null
            },
            "rating": 5.0,
            "stay_parameters": null,
            "text": "I'd firmly agree with the previous review. This is a lovely and authentic heritage hotel less than an hour's drive south of Jodhpur, making it a great place to stay en route to or from southern Rajasthan. We only stayed one night and it wasn't really enough - we should have stayed longer, but at least this means that we'll have to return sometime !",
            "title": "Loved it",
            "user": "ErinSamuel"
        },
        {
            "date": "December 6, 2006",
            "detail_rating": {
                "business": null,
                "cleanliness": 4.0,
                "desk": null,
                "front_desk": 5.0,
                "location": 3.0,
                "pool": null,
                "restaurant": null,
                "rooms": 4.0,
                "service": 4.0,
                "sleep": null,
                "value": 4.0
            },
            "helpfulness": 1,
            "id": 6340826,
            "likes": {
                "disliked": "\u2014 Not for the intense traveller",
                "liked": "\u2014 Relaxed welcoming atmosphere"
            },
            "rating": 4.0,
            "stay_parameters": "Stayed October 2006, traveled as a couple",
            "text": "The beautifully manicured lawn and large swimming pool make the outside areas a joy to relax in. The restaurant offers good, authentic Rajasthani food and the stable houses a collection of beautiful Marwari horses.",
            "title": "A welcome respite",
            "user": "tirnie"
        },
        {
            "date": "September 18, 2006",
            "detail_rating": {
                "business": null,
                "cleanliness": 3.0,
                "desk": null,
                "front_desk": 3.0,
                "location": 4.0,
                "pool": null,
                "restaurant": null,
                "rooms": 3.0,
                "service": 1.0,
                "sleep": null,
                "value": 2.0
            },
            "helpfulness": 7,
            "id": 5812762,
            "likes": {
                "disliked": null,
                "liked": null
            },
            "rating": 2.0,
            "stay_parameters": "Stayed August 2006",
            "text": "The jeep safari is excellent and well worth the effort, especially if your guide is as knowledgeable as ours was. The only disappointment was the Kerala massage which was truly forgettable !",
            "title": "seriously disappointing",
            "user": "RPD"
        },
        {
            "date": "December 30, 2005",
            "detail_rating": {
                "business": null,
                "cleanliness": null,
                "desk": null,
                "location": null,
                "pool": null,
                "restaurant": null,
                "rooms": null,
                "service": null,
                "sleep": null,
                "value": null
            },
            "helpfulness": 2,
            "id": 4311453,
            "likes": {
                "disliked": null,
                "liked": null
            },
            "rating": 5.0,
            "stay_parameters": null,
            "text": "Rohet Garh was the highlight of our Rajasthan trip. It's off the beaten track although a few travel companies do take their tours here if only for a night. We travelled independently and treated ourselves to 3 nights - and would happily have stayed longer. The aristocratic owners have not only converted their palatial property for tourists, they are attempting sustainable tourism for the 70 or so surrounding villages still under their care. The grounds, common rooms and hotel rooms are individual (they have 2-3 painters who are brothers who have a full-time job handpainting and decoarting the rooms), spacious and relaxing. Very enjoyable for instance is the open verandah bar where on comfortable sofas you can sip a drink. We had a 2-storeyed suite with a verandah with swing and a rooftop terrace with a view of the peacocks which wander into the garden towards evening. We went on the village safari - our only real opportunity to see some rural alternatives- and one of us went riding at dawn; there are very well kept stables.",
            "title": "Rohet Garh",
            "user": "brs"
        },
        {
            "date": "March 6, 2005",
            "detail_rating": {
                "business": null,
                "cleanliness": null,
                "desk": null,
                "location": null,
                "pool": null,
                "restaurant": null,
                "rooms": null,
                "service": null,
                "sleep": null,
                "value": null
            },
            "helpfulness": 7,
            "id": 3255402,
            "likes": {
                "disliked": null,
                "liked": null
            },
            "rating": 3.0,
            "stay_parameters": null,
            "text": "Yet what we enjoyed most was that we could wander around the village of Rohet unaccosted. The village is tidy and non-obtrusive ( a very welcome change) and we enjoyed going into the local shops and were even invited into a few homes. The shop on the hotel grounds sells handcrafts made locally and part of the profits go to a local charity. This policy can only be applauded and permeated our entire stay.",
            "title": "confortable",
            "user": "ldtc2"
        },
        {
            "date": "January 31, 2005",
            "detail_rating": {
                "business": null,
                "cleanliness": null,
                "desk": null,
                "location": null,
                "pool": null,
                "restaurant": null,
                "rooms": null,
                "service": null,
                "sleep": null,
                "value": null
            },
            "helpfulness": 7,
            "id": 3101132,
            "likes": {
                "disliked": null,
                "liked": null
            },
            "rating": 2.0,
            "stay_parameters": null,
            "text": "If, like us, you feel you deserve a break from deserts and palaces and museums and camels - then book yourself a few days of paradise here!",
            "title": "Skip it",
            "user": "A TripAdvisor user"
        },
        {
            "date": "December 24, 2004",
            "detail_rating": {
                "business": null,
                "cleanliness": 4.0,
                "desk": null,
                "location": null,
                "pool": null,
                "restaurant": null,
                "rooms": 4.0,
                "service": 3.0,
                "sleep": null,
                "value": 5.0
            },
            "helpfulness": 6,
            "id": 2943176,
            "likes": {
                "disliked": null,
                "liked": null
            },
            "rating": 5.0,
            "stay_parameters": "Stayed December 2004",
            "text": "Our rooms were comfortable and clean. While we had just come from a fabulous Heritage Hotel in Dungarpur, we were a bit disappointed once we got to Rohet but this was due to the fact that our previous hotel ( Udai Bilas Palace, Dungarpur) had been so spectacular.",
            "title": "Real India",
            "user": "KayandPeter"
        }
    ],
    "slim_ranking": 1.0,
    "stars": 3,
    "tripadvisor": {
        "VISITED": false,
        "country_name": null,
        "locality": null,
        "pic_link": null,
        "street_address": null
    },
    "user_rating": 4.5,
    "variance": {
        "average": 13,
        "excellent": 89,
        "poor": 10,
        "terrible": 0,
        "very good": 49
    }
}