{
    "aka": "Staybridge Suites--Wilmington/Newark Hotel Newark",
    "description": "At the Staybridge Suites Wilmington Newark Hotel, in Wilmington Newark DE, we strive to make every guest feel welcome & comfortable! Located directly off of I-95 & State Highway 273, our Wilmington Newark Hotel in Wilmington Newark DE is conveniently accessible. With Free High Speed Internet Access & 24-hour business center, Hot Breakfast Buffet, Free Laundry Services, Evening Receptions, & Exercise Room set the Staybridge Suites Wilmington Newark, in Wilmington Newark DE apart from other area hotel options. Select the Staybridge Suites Wilmington Newark, in Wilmington Newark DE for accommodations when visiting Astra Zeneca, Du Pont, Christiana Hospital, or several other area corporations. For shoppers, we are less than 3 miles from Christiana Mall, and for those craving excitement, we are just 5 miles from Delaware Park Racetrack & Slots. Choose Staybridge Suites Wilmington Newark DE Hotel for your needs when attending events at the University of Delaware, Wilmington College, or Delaware State University. Whether you need lodging for a mid-week business trip, weekend fun, or relocation, remember the Staybridge Suites Wilmington Newark Hotel in Wilmington Newark DE.",
    "detail_rating": {
        "cleanliness": null,
        "location": null,
        "rooms": null,
        "service": null,
        "sleep": null,
        "value": null
    },
    "location": {
        "city": "Newark",
        "continent": null,
        "country": "United States",
        "proposed_city": "Newark",
        "province": null,
        "region": null
    },
    "name": "Staybridge Suites--Wilmington/Newark",
    "places": {
        "aka": [
            "Wilmington",
            "Newark"
        ],
        "hotel_description": [
            "Wilmington",
            "Newark",
            "Christiana",
            "Delaware",
            "University"
        ],
        "hotel_name": [
            "Wilmington",
            "Newark"
        ]
    },
    "review_count": 88,
    "review_count_current": 20,
    "reviews": [
        {
            "date": "July 28, 2011",
            "detail_rating": {
                "business": null,
                "cleanliness": 5.0,
                "desk": null,
                "location": null,
                "pool": null,
                "restaurant": null,
                "rooms": null,
                "service": 4.0,
                "sleep": 5.0,
                "value": 4.0
            },
            "helpfulness": 1,
            "id": 115913959,
            "likes": {
                "disliked": null,
                "liked": null
            },
            "rating": 4.0,
            "stay_parameters": "Stayed July 2011, traveled on business",
            "text": "This is a standard Staybridge Suites, and a result, quite comfortable for a business stay. I checked in early and the front desk manager personally visited a room that had just been cleaned to confirm that it was ready. I stayed in a studio, which is more spacious than typical hotel rooms, with a small kitchenette, a sitting area, and a bathroom alcove. The bed seemed new and was great. The only two minor negatives I observed were thin walls, as I clearly heard the next door tv at medium volume, and the fact that the hotel is physically connected and adjacent to a lower quality Ramada Inn, sharing one pool. However, I would stay here again.",
            "title": "Comfortable Stay",
            "user": "newrock"
        },
        {
            "date": "June 21, 2011",
            "detail_rating": {
                "business": null,
                "cleanliness": 5.0,
                "desk": null,
                "location": null,
                "pool": null,
                "restaurant": null,
                "rooms": null,
                "service": 5.0,
                "sleep": 5.0,
                "value": 5.0
            },
            "helpfulness": 2,
            "id": 114614789,
            "likes": {
                "disliked": null,
                "liked": null
            },
            "rating": 5.0,
            "stay_parameters": "Stayed June 2011, traveled with family",
            "text": "We just spent 10 days there and the combination of price and amenities can't be beat. Ashleigh at the front desk and the weekday morning woman at the breakfast bar are the type of people you wished were at every hotel",
            "title": "Great accommodations",
            "user": "venicepaul"
        },
        {
            "date": "May 6, 2011",
            "detail_rating": {
                "business": null,
                "cleanliness": 5.0,
                "desk": null,
                "location": 5.0,
                "pool": null,
                "restaurant": null,
                "rooms": 5.0,
                "service": 5.0,
                "sleep": 5.0,
                "value": 5.0
            },
            "helpfulness": 1,
            "id": 107172924,
            "likes": {
                "disliked": null,
                "liked": null
            },
            "rating": 5.0,
            "stay_parameters": "Stayed May 2011, traveled on business",
            "text": "Was in a room by elevator. Worried about noise. Able to shut bedroom door, no noise, slept great. Low fat yogurt and skim milk on free breakfast buffet. Toiletries & snacks available. Easy to get to and near work locations. Very nice employees at front desk. Easy free parking.",
            "title": "Good night's sleep in a conveniently located hotel.",
            "user": "KBEBirmimgham_AL"
        },
        {
            "date": "May 5, 2011",
            "detail_rating": {
                "business": null,
                "cleanliness": 5.0,
                "desk": null,
                "location": 5.0,
                "pool": null,
                "restaurant": null,
                "rooms": 5.0,
                "service": 5.0,
                "sleep": 5.0,
                "value": 5.0
            },
            "helpfulness": null,
            "id": 106975401,
            "likes": {
                "disliked": null,
                "liked": null
            },
            "rating": 5.0,
            "stay_parameters": "Stayed April 2011, traveled on business",
            "text": "I stayed at this hotel for a long term business assignment. They treated me like a king. Very comfortable and convenient. Free, excellent breakfast vailable every day. Free laundry available. All under the same roof. I would go there again without hesitation.",
            "title": "Staybridge Suites Newark is 1st Rate",
            "user": "rcroweme"
        },
        {
            "date": "December 30, 2010",
            "detail_rating": {
                "business": null,
                "cleanliness": 4.0,
                "desk": null,
                "location": 4.0,
                "pool": null,
                "restaurant": null,
                "rooms": 4.0,
                "service": 4.0,
                "sleep": 4.0,
                "value": 4.0
            },
            "helpfulness": null,
            "id": 91168152,
            "likes": {
                "disliked": null,
                "liked": null
            },
            "rating": 4.0,
            "stay_parameters": "Stayed December 2010, traveled as a couple",
            "text": "We were very reluctant to try this hotel because it was part of the Holiday Inn chain and we had some bad experiences with Holiday Inn hotels, however we were very glad that we did. The staff were very friendly and helpful and the rooms very clean. The only slight negative was the breakfast which had a few unidenitifiable hot dishes, but at least there was a waffle iron.",
            "title": "Haven from the storm",
            "user": "4states"
        },
        {
            "date": "October 21, 2011",
            "detail_rating": {
                "business": null,
                "cleanliness": 4.0,
                "desk": null,
                "location": 4.0,
                "pool": null,
                "restaurant": null,
                "rooms": 4.0,
                "service": 4.0,
                "sleep": 4.0,
                "value": 3.0
            },
            "helpfulness": null,
            "id": 119543349,
            "likes": {
                "disliked": null,
                "liked": null
            },
            "rating": 4.0,
            "stay_parameters": "Stayed October 2011, traveled on business",
            "text": "For my business trip and stay which lasted two months, this was a great place to set up camp.",
            "title": "Convience and Accomodating",
            "user": "James R"
        },
        {
            "date": "October 19, 2011",
            "detail_rating": {
                "business": null,
                "cleanliness": 5.0,
                "desk": null,
                "location": 5.0,
                "pool": null,
                "restaurant": null,
                "rooms": 5.0,
                "service": 5.0,
                "sleep": 5.0,
                "value": 5.0
            },
            "helpfulness": null,
            "id": 119497050,
            "likes": {
                "disliked": null,
                "liked": null
            },
            "rating": 5.0,
            "stay_parameters": "Stayed October 2011, traveled on business",
            "text": "The breakfast buffet was served at an hour that a working person can enjoy and still be on the job early. Evening social hour also served its purpose.",
            "title": "9th wonder of the world",
            "user": "Leonard D"
        },
        {
            "date": "October 18, 2011",
            "detail_rating": {
                "business": null,
                "cleanliness": 1.0,
                "desk": null,
                "location": 1.0,
                "pool": null,
                "restaurant": null,
                "rooms": 1.0,
                "service": 1.0,
                "sleep": 1.0,
                "value": 1.0
            },
            "helpfulness": 1,
            "id": 119461316,
            "likes": {
                "disliked": null,
                "liked": null
            },
            "rating": 1.0,
            "stay_parameters": "Stayed October 2011, traveled with family",
            "text": "Rooms were clean, and the staff did the extra things to make me feel at home, as much as could be under the circumstances.",
            "title": "Over booked our reservation and relocated us at the Days Inn in Wilmington, Del",
            "user": "Carol B"
        },
        {
            "date": "October 17, 2011",
            "detail_rating": {
                "business": null,
                "cleanliness": 5.0,
                "desk": null,
                "location": 5.0,
                "pool": null,
                "restaurant": null,
                "rooms": 5.0,
                "service": 5.0,
                "sleep": 5.0,
                "value": 5.0
            },
            "helpfulness": null,
            "id": 119398865,
            "likes": {
                "disliked": null,
                "liked": null
            },
            "rating": 4.0,
            "stay_parameters": "Stayed October 2011, traveled with family",
            "text": "Business functions could be carried out with no issues.",
            "title": "Great Service",
            "user": "gary b"
        },
        {
            "date": "October 2, 2011",
            "detail_rating": {
                "business": null,
                "cleanliness": 5.0,
                "desk": null,
                "location": 5.0,
                "pool": null,
                "restaurant": null,
                "rooms": 5.0,
                "service": 5.0,
                "sleep": 5.0,
                "value": 5.0
            },
            "helpfulness": null,
            "id": 118857302,
            "likes": {
                "disliked": null,
                "liked": null
            },
            "rating": 5.0,
            "stay_parameters": "Stayed September 2011, traveled as a couple",
            "text": "It worked for me.",
            "title": "Excellent",
            "user": "dnlthibault"
        },
        {
            "date": "November 17, 2011",
            "detail_rating": {
                "business": null,
                "cleanliness": 5.0,
                "desk": null,
                "location": 5.0,
                "pool": null,
                "restaurant": null,
                "rooms": 5.0,
                "service": 4.0,
                "sleep": 5.0,
                "value": 4.0
            },
            "helpfulness": null,
            "id": 120721980,
            "likes": {
                "disliked": null,
                "liked": null
            },
            "rating": 4.0,
            "stay_parameters": "Stayed November 2011, traveled with family",
            "text": "We are Priority Club members and had reserved a two bedroom suite about a month in advance. When we arrived there were apparently no two bedroom suites available. The young woman at the front desk, who was very apologetic, told us that there were a number of families staying there long-term, thus the room shortage. The hotel should coordinate its online reservations to reflect this type of problem. Meanwhile, we were accommodated in two separate suites, which worked out fine, and were compensated for our trouble by a much lower room rate.",
            "title": "Good, but not perfect.",
            "user": "Bandlady"
        },
        {
            "date": "November 12, 2011",
            "detail_rating": {
                "business": null,
                "cleanliness": 5.0,
                "desk": null,
                "location": 5.0,
                "pool": null,
                "restaurant": null,
                "rooms": 5.0,
                "service": 5.0,
                "sleep": 5.0,
                "value": 5.0
            },
            "helpfulness": null,
            "id": 120505281,
            "likes": {
                "disliked": null,
                "liked": null
            },
            "rating": 5.0,
            "stay_parameters": "Stayed November 2011, traveled on business",
            "text": "The rooms were quite clean and the beds were very comfortable. The breakfast was what we've become accustomed to at this type of hotel, and it was well presented and fresh.",
            "title": "Nice spot to Relax",
            "user": "beth m"
        },
        {
            "date": "October 24, 2011",
            "detail_rating": {
                "business": null,
                "cleanliness": 5.0,
                "desk": null,
                "location": 4.0,
                "pool": null,
                "restaurant": null,
                "rooms": 5.0,
                "service": 4.0,
                "sleep": 5.0,
                "value": 4.0
            },
            "helpfulness": null,
            "id": 119683079,
            "likes": {
                "disliked": null,
                "liked": null
            },
            "rating": 5.0,
            "stay_parameters": "Stayed June 2011, traveled with family",
            "text": "If I were to stay here again, I would be sure to call close to arrival to be sure I would receive the proper room",
            "title": "It was truely a Blessing to my family.",
            "user": "Felicia B"
        },
        {
            "date": "October 24, 2011",
            "detail_rating": {
                "business": null,
                "cleanliness": 5.0,
                "desk": null,
                "location": 5.0,
                "pool": null,
                "restaurant": null,
                "rooms": 5.0,
                "service": 4.0,
                "sleep": 4.0,
                "value": 5.0
            },
            "helpfulness": null,
            "id": 119681749,
            "likes": {
                "disliked": null,
                "liked": null
            },
            "rating": 4.0,
            "stay_parameters": "Stayed October 2011, traveled on business",
            "text": "This is a nice place to shop with so many places to choose from.So many restaurants ....just awesome location. The staff there were pleasant and polite.",
            "title": "Nice & Convenient",
            "user": "Erin H"
        },
        {
            "date": "October 24, 2011",
            "detail_rating": {
                "business": null,
                "cleanliness": 5.0,
                "desk": null,
                "location": 4.0,
                "pool": null,
                "restaurant": null,
                "rooms": 4.0,
                "service": 5.0,
                "sleep": 3.0,
                "value": null
            },
            "helpfulness": 1,
            "id": 119671446,
            "likes": {
                "disliked": null,
                "liked": null
            },
            "rating": 3.0,
            "stay_parameters": "Stayed September 2011, traveled on business",
            "text": "They were so helpful it you needed anything!",
            "title": "average",
            "user": "elizabeth t"
        },
        {
            "date": "September 23, 2011",
            "detail_rating": {
                "business": null,
                "cleanliness": 4.0,
                "desk": null,
                "location": 4.0,
                "pool": null,
                "restaurant": null,
                "rooms": 4.0,
                "service": 5.0,
                "sleep": 4.0,
                "value": 4.0
            },
            "helpfulness": null,
            "id": 118491131,
            "likes": {
                "disliked": null,
                "liked": null
            },
            "rating": 4.0,
            "stay_parameters": "Stayed September 2011, traveled as a couple",
            "text": "Really nice hotel except that entrance was hard to find with its proximity to Ramada.You guys need a sign so people bypass Ramada and experience your great hotel. Upon arriving we were greeted with smiles n friendly attitude by Ashley P. which meant a lot since we were on the road for hours. When we left we accidentally left our GPS device in the room and phoned various times for someone to check the room. Ashley was the only one who took the initiative to personally locate it since it had already been removed from the room. We cant tell you how much we appreciated her \"Over n above work attitude\" n honesty to get the GPS returned to us. She is the type of employee you really need to appreciate since customers will always return.",
            "title": "Good Hotel n fantastic employee Ashley P",
            "user": "Carolina120"
        },
        {
            "date": "September 18, 2011",
            "detail_rating": {
                "business": null,
                "cleanliness": null,
                "desk": null,
                "location": 5.0,
                "pool": null,
                "restaurant": null,
                "rooms": 5.0,
                "service": 5.0,
                "sleep": null,
                "value": 5.0
            },
            "helpfulness": null,
            "id": 118270449,
            "likes": {
                "disliked": null,
                "liked": null
            },
            "rating": 5.0,
            "stay_parameters": "Stayed September 2011, traveled solo",
            "text": "As someone who spends many nights in hotels, this one was particularly clean and well-maintained. There was even a BBQ dinner w/ wine and beer. Staff, especially the assistant general manager, was very friendly and professional. When I missed breakfast, she offered to go into the kitchen to get me a banana and muffin. When I thought I had left a bracelet, she immediately went to check out my vacated room. Just when you think service is dead, someone surprises you! Hotel is definitely a good find in this area.",
            "title": "Clean, well-maintained, great service",
            "user": "roadwarrior48570"
        },
        {
            "date": "September 14, 2011",
            "detail_rating": {
                "business": null,
                "cleanliness": null,
                "desk": null,
                "location": 4.0,
                "pool": null,
                "restaurant": null,
                "rooms": 5.0,
                "service": 4.0,
                "sleep": null,
                "value": 5.0
            },
            "helpfulness": null,
            "id": 118111116,
            "likes": {
                "disliked": null,
                "liked": null
            },
            "rating": 4.0,
            "stay_parameters": "Stayed January 2011, traveled on business",
            "text": "I stayed here for a night while on travel for business and was very impressed. The room was huge! They also provided a very nice dinner when I checked in which was nice becasue it was snowing and I didn't want to have to drive anymore. The breakfast was really fantastic too!",
            "title": "Huge Rooms!",
            "user": "Seahawksman"
        },
        {
            "date": "August 28, 2011",
            "detail_rating": {
                "business": null,
                "cleanliness": 5.0,
                "desk": null,
                "location": null,
                "pool": null,
                "restaurant": null,
                "rooms": null,
                "service": 4.0,
                "sleep": 5.0,
                "value": 5.0
            },
            "helpfulness": null,
            "id": 117362831,
            "likes": {
                "disliked": null,
                "liked": null
            },
            "rating": 4.0,
            "stay_parameters": "Stayed August 2011, traveled with family",
            "text": "I made a reservation here for my family as we were driving home from Virginia Beach to avoid Hurricane Irene -- although I had never stayed at a Staybridge Suites, I picked it because it had the two-room suite for a great price, and the free breakfast. There were several other suite hotels nearby so I took a chance on the unfamiliar.",
            "title": "GREAT place for families, glad we found it!",
            "user": "marcellusmom"
        },
        {
            "date": "August 12, 2011",
            "detail_rating": {
                "business": null,
                "cleanliness": 5.0,
                "desk": null,
                "location": null,
                "pool": null,
                "restaurant": null,
                "rooms": null,
                "service": 5.0,
                "sleep": 5.0,
                "value": 5.0
            },
            "helpfulness": null,
            "id": 116614401,
            "likes": {
                "disliked": null,
                "liked": null
            },
            "rating": 5.0,
            "stay_parameters": "Stayed June 2011, traveled on business",
            "text": "I stayed there with my husband, two kids and my parents so there were six of us altogether. We arrived fairly late at night and were anxious to get settled in for the night. My first impression was that the decor was beautiful in the lobby/dining area. I continued to be impressed when we got to our room. The \"living room\" had more than enough space for the fold-out couch when it was opened, leaving enough room to walk around it (a problem we had encountered more than once at other suite hotels), and both of the bedrooms were spacious as well. Everything was perfectly clean and neat and looked new.",
            "title": "Service goes above and beyond",
            "user": "Scott S"
        }
    ],
    "slim_ranking": 0.190476190476,
    "stars": 3,
    "tripadvisor": {
        "VISITED": false,
        "country_name": null,
        "locality": null,
        "pic_link": null,
        "street_address": null
    },
    "user_rating": 4.5,
    "variance": {
        "average": 2,
        "excellent": 55,
        "poor": 3,
        "terrible": 3,
        "very good": 25
    }
}