{
    "aka": "Vendome Hotel Nice",
    "description": "A private house; renovated, with air conditioning - 500 m from beaches, in city center.",
    "detail_rating": {
        "cleanliness": 4.0,
        "location": 4.5,
        "rooms": 3.5,
        "service": 4.0,
        "sleep": 4.0,
        "value": 4.0
    },
    "location": {
        "city": null,
        "continent": "Europe",
        "country": "France",
        "proposed_city": "Nice",
        "province": null,
        "region": "Provence"
    },
    "name": "Hotel Vendome",
    "places": {
        "aka": [
            "Nice"
        ],
        "hotel_description": [],
        "hotel_name": []
    },
    "review_count": 248,
    "review_count_current": 20,
    "reviews": [
        {
            "date": "October 15, 2009",
            "detail_rating": {
                "business": null,
                "cleanliness": 4.0,
                "desk": null,
                "location": 4.0,
                "pool": null,
                "restaurant": null,
                "rooms": 4.0,
                "service": 5.0,
                "sleep": null,
                "value": 4.0
            },
            "helpfulness": null,
            "id": 46943263,
            "likes": {
                "disliked": null,
                "liked": null
            },
            "rating": 4.0,
            "stay_parameters": "Stayed September 2009, traveled with friends",
            "text": "What a little gem. A bit difficult initially to find as hidden away behind a row of shops built in what was its main entrance! The hotel is enchanting. The staff on the desk were friendly and very helpful. There were four of us - two couples, arriving at different times and leaving on different days! Thought that might give them problems - but everything went perfectly. We had rooms on the top floor with large (but basic) balconies - unexpected but most welcome. The rooms were both lovely, clean and with everything you needed. Breakfast was super. A great continental buffet breakfast with plenty of everything, constantly refreshed. The dining room is small, so best to get there early just to make sure of a seat. Ten minutes walk to the Promenade des Anglais and all attractions. Five minutes walk from the bus station - 20 minutes from rail station.",
            "title": "Lovely, friendly hotel in good location",
            "user": "weefyuk"
        },
        {
            "date": "September 29, 2009",
            "detail_rating": {
                "business": null,
                "cleanliness": 4.0,
                "desk": null,
                "location": 3.0,
                "pool": null,
                "restaurant": null,
                "rooms": 4.0,
                "service": 4.0,
                "sleep": null,
                "value": 4.0
            },
            "helpfulness": null,
            "id": 45433572,
            "likes": {
                "disliked": null,
                "liked": null
            },
            "rating": 4.0,
            "stay_parameters": "Stayed September 2009, traveled as a couple",
            "text": "Stayed for 3 nights. Tucked out of the way, friendly staff who spoke good english. A loverly building, very french. Had a great room with a balcony on the first floor (room 102)",
            "title": "VERY GOOD",
            "user": "TREKNorthYorkshire"
        },
        {
            "date": "September 19, 2009",
            "detail_rating": {
                "business": null,
                "cleanliness": 3.0,
                "desk": null,
                "location": 4.0,
                "pool": null,
                "restaurant": null,
                "rooms": 4.0,
                "service": 5.0,
                "sleep": null,
                "value": 4.0
            },
            "helpfulness": 2,
            "id": 42834901,
            "likes": {
                "disliked": null,
                "liked": null
            },
            "rating": 4.0,
            "stay_parameters": "Stayed September 2009, traveled as a couple",
            "text": "Could do with a bit of TLC in places but good value we thought.",
            "title": "Very good hotel for a week in Nice",
            "user": "kathAberdeenUK"
        },
        {
            "date": "July 15, 2009",
            "detail_rating": {
                "business": null,
                "cleanliness": 4.0,
                "desk": null,
                "location": 4.0,
                "pool": null,
                "restaurant": null,
                "rooms": 3.0,
                "service": 3.0,
                "sleep": null,
                "value": null
            },
            "helpfulness": null,
            "id": 34804910,
            "likes": {
                "disliked": null,
                "liked": null
            },
            "rating": 3.0,
            "stay_parameters": "Stayed May 2009, traveled as a couple",
            "text": "We have just returned from a week's holiday in Hotel vendome. We were not pleased with the first 2 rooms offered...first one on 4th floor ...very tiny and little light, 2nd one on 2nd floor..a bit bigger but less light. My husband continued to ask for something better and we eventually got an excellent room on 5th floor...Room 504...worth mentioning!!!! A huge and lovely bathroom, a tiny hallway for coats...a huge balcony with table and chairs( if we'd wanted breakfast in our room for example. ) A fair bit of space for moving around and a light and airy room. We were delighted!!!!! It has to be said however that there was a problem with the occasional ant...they must have lived in the walls...and got through the cracks...which we eventually tried to block as well as we could!!!! There was tea/coffee facilities as well which is unusual in a French hotel from our experience. Hotel staff very pleasant and helpful! The breakfast was excellent although the breakfast lounge was too small for the numbers using it. It was continental breakfast but with cereals and yoghurt in addition. Nice is a beautiful city with plenty to do and see. Weather was excellent in 2nd week of september...it broke as we were leaving....",
            "title": "Potentially a lovely hotel, but overpriced.",
            "user": "Quirindi"
        },
        {
            "date": "May 31, 2009",
            "detail_rating": {
                "business": null,
                "cleanliness": 4.0,
                "desk": null,
                "location": 4.0,
                "pool": null,
                "restaurant": null,
                "rooms": 2.0,
                "service": 3.0,
                "sleep": null,
                "value": 4.0
            },
            "helpfulness": null,
            "id": 31219098,
            "likes": {
                "disliked": null,
                "liked": null
            },
            "rating": 3.0,
            "stay_parameters": "Stayed May 2009, traveled as a couple",
            "text": "Nice beaches are pretty horrible....big stones!!!!! But if you were willing to take a train along the coast to Antibes or any of several resorts along the coast...eg Cannes and nearabouts....there was beautiful sandy beaches. Trains very easy to use and cheap!!! Monte Carlo is worth a trip for only 3-4 euros...and 20 minutes trip...but just do the prince's Palace and the old town..they are very attractive and worth a look!!!.the coast is very built up just now...you can see very little..and the noise of construction..as well as dust make it quite unpleasant. Most expensive beer of the holiday in square behing the Casino....7 euros each for 1/2 pint!!!!!!",
            "title": "Good location, could be good.....but",
            "user": "Johnboy99"
        },
        {
            "date": "August 20, 2008",
            "detail_rating": {
                "business": null,
                "cleanliness": null,
                "desk": null,
                "front_desk": 1.0,
                "location": 3.0,
                "pool": null,
                "restaurant": null,
                "rooms": null,
                "service": null,
                "sleep": null,
                "value": 1.0
            },
            "helpfulness": 5,
            "id": 19151527,
            "likes": {
                "disliked": null,
                "liked": null
            },
            "rating": 1.0,
            "stay_parameters": "Stayed August 2008, traveled solo",
            "text": "booked the hotel through their site, arrived on time only to find out they overbooked and offered to send me to a hotel \"around the corner\" that was actually 6 blocks away. they did not offer transportation. but the worst part is that they told me the other hotel (Grand Hotel de Florence) was more expensive, and that they were doing me a great favor by not charging me the difference. of course, when i arrived and asked the hotel their rates, they were 20 Euro cheaper. I had to then get on the phone and haggle with the manager to get my money back by walking back to the Hotel Vendome. a horrible experience, and probably something this hotel does often, where they get to capture additional revenue by upselling more inexpensive hotels to people who don't know better to check the rate.",
            "title": "Bad Business Strategy",
            "user": "lgoler"
        },
        {
            "date": "July 12, 2008",
            "detail_rating": {
                "business": null,
                "cleanliness": 4.0,
                "desk": null,
                "front_desk": 5.0,
                "location": 4.0,
                "pool": null,
                "restaurant": null,
                "rooms": 4.0,
                "service": 4.0,
                "sleep": null,
                "value": 3.0
            },
            "helpfulness": 1,
            "id": 17812154,
            "likes": {
                "disliked": "\u2014 noise from corridor and other rooms",
                "liked": "\u2014 bathroom, balcony"
            },
            "rating": 4.0,
            "stay_parameters": "Stayed July 2008, traveled as a couple",
            "text": "The hotel is located about 10 minutes walk to the beach or the bus station, within easy reach of everything one really wants to visit! Matisse museum is 10-15 minutes away by bus (bus stop 3 minutes walk), Old Nice about 10 minutes walk as well.",
            "title": "Not a bad place to stay",
            "user": "Beamy"
        },
        {
            "date": "April 17, 2008",
            "detail_rating": {
                "business": null,
                "cleanliness": 3.0,
                "desk": null,
                "front_desk": 4.0,
                "location": 4.0,
                "pool": null,
                "restaurant": null,
                "rooms": 2.0,
                "service": null,
                "sleep": null,
                "value": 2.0
            },
            "helpfulness": 2,
            "id": 15100993,
            "likes": {
                "disliked": "\u2014 Noise and tackiness of rooms",
                "liked": "\u2014 Nothing"
            },
            "rating": 2.0,
            "stay_parameters": "Stayed April 2008, traveled on business",
            "text": "The room was recently renovated, light with high seilings, a bit small though, very plain basic decor (which was a bit disappointing for this kind of historical building but OK), balcony was a plus, bathroom was sparkling clean and new, great shower (with very unreliable showerscreen though).",
            "title": "Needs much improvement",
            "user": "marieantoinetteUK"
        },
        {
            "date": "February 22, 2008",
            "detail_rating": {
                "business": null,
                "cleanliness": null,
                "desk": null,
                "location": null,
                "pool": null,
                "restaurant": null,
                "rooms": null,
                "service": null,
                "sleep": null,
                "value": null
            },
            "helpfulness": 2,
            "id": 13763165,
            "likes": {
                "disliked": null,
                "liked": null
            },
            "rating": 4.0,
            "stay_parameters": null,
            "text": "Some details really make the room look cheap (like plastic cups instead of glasses for drinks or bathroom), or lack of bedside chests to keep trinkets and pyjamas in. Lift was quite small (3 slim people could squeeze in but not more). The sound insulation of the balcony was very good , but not of the rest (we were blessed with quiet neighbours in the first 3 days of our stay, last 2 days we were not, so no good sleep in the end).",
            "title": "Excellent all round hotel with ample breakfasts!",
            "user": "windsorsoup"
        },
        {
            "date": "September 9, 2007",
            "detail_rating": {
                "business": null,
                "cleanliness": null,
                "desk": null,
                "location": null,
                "pool": null,
                "restaurant": null,
                "rooms": null,
                "service": null,
                "sleep": null,
                "value": null
            },
            "helpfulness": 5,
            "id": 8681964,
            "likes": {
                "disliked": null,
                "liked": null
            },
            "rating": 4.0,
            "stay_parameters": null,
            "text": "The reception staff were very helpful. The maids were doing job OK, but opened the door without knocking - a bit embarrasing.",
            "title": "Lovely old hotel",
            "user": "Hyperplanners"
        },
        {
            "date": "February 22, 2010",
            "detail_rating": {
                "business": null,
                "cleanliness": 4.0,
                "desk": null,
                "location": 5.0,
                "pool": null,
                "restaurant": null,
                "rooms": 3.0,
                "service": 4.0,
                "sleep": 4.0,
                "value": 5.0
            },
            "helpfulness": 2,
            "id": 56770683,
            "likes": {
                "disliked": null,
                "liked": null
            },
            "rating": 4.0,
            "stay_parameters": "Stayed February 2010, traveled as a couple",
            "text": "Stayed in Hotel Vendome for 2 nights at end of Feb \u201910 at the time of the Nice Carnival. This was a coincidence for us that the Carnival was on and the city was buzzing.",
            "title": "Excellent for the money we paid",
            "user": "caitni2000"
        },
        {
            "date": "February 4, 2010",
            "detail_rating": {
                "business": null,
                "cleanliness": 4.0,
                "desk": null,
                "location": 3.0,
                "pool": null,
                "restaurant": null,
                "rooms": 3.0,
                "service": 3.0,
                "sleep": 4.0,
                "value": 4.0
            },
            "helpfulness": null,
            "id": 55200754,
            "likes": {
                "disliked": null,
                "liked": null
            },
            "rating": 3.0,
            "stay_parameters": "Stayed January 2010, traveled as a couple",
            "text": "Myself and a friend booked B&B rate through travel republic at 50GBP per night and spent our weekend in Nice, Cannes and Monaco. Nice surpassed them both as a quaint little town with a lot to see and a lot going on.",
            "title": "Nice hotel, nice location, nice staff",
            "user": "pomdor"
        },
        {
            "date": "January 20, 2010",
            "detail_rating": {
                "business": null,
                "cleanliness": null,
                "desk": null,
                "location": null,
                "pool": null,
                "restaurant": null,
                "rooms": null,
                "service": null,
                "sleep": null,
                "value": null
            },
            "helpfulness": null,
            "id": 53971263,
            "likes": {
                "disliked": null,
                "liked": null
            },
            "rating": 3.0,
            "stay_parameters": null,
            "text": "The hotel was in a fantastic location for the city centre and the old town and promenade. Our room was very clean and comfortable. Walls were quite thin and neighbors woke us in the morning as they left their rooms but we were glad of the alarm to encourage us to start the day and we found no problems at night. Breakfast was good with a selection of 3 cereals, a big bowl of fruit salad, orange juice, ham, cheese and warm scrambled egg, a selection of white and brown bread rolls, pastries/croissants and delicious local jams. Coffee was out of a machine and teabags and milk provided.",
            "title": "Hotel Vendome (Nice)",
            "user": "evolver"
        },
        {
            "date": "January 18, 2010",
            "detail_rating": {
                "business": null,
                "cleanliness": 5.0,
                "desk": null,
                "location": 5.0,
                "pool": null,
                "restaurant": null,
                "rooms": 5.0,
                "service": 3.0,
                "sleep": null,
                "value": 5.0
            },
            "helpfulness": 1,
            "id": 53776324,
            "likes": {
                "disliked": null,
                "liked": null
            },
            "rating": 5.0,
            "stay_parameters": "Stayed January 2010, traveled as a couple",
            "text": "There was only 1 elevator and its an old building with a lot of old original features. A possible problem for some, no problem to us as everything functioned as intended. We were able to park our rental car on the premises at a rate per day and the staff were very friendly and helpful with advice and suggestions.",
            "title": "I really liked my stay at the Vendome",
            "user": "goodtimes71"
        },
        {
            "date": "October 30, 2009",
            "detail_rating": {
                "business": null,
                "cleanliness": 5.0,
                "desk": null,
                "location": 5.0,
                "pool": null,
                "restaurant": null,
                "rooms": 4.0,
                "service": 4.0,
                "sleep": null,
                "value": 5.0
            },
            "helpfulness": null,
            "id": 48132981,
            "likes": {
                "disliked": null,
                "liked": null
            },
            "rating": 4.0,
            "stay_parameters": "Stayed October 2009, traveled with friends",
            "text": "I plan to recommend this hotel to family and friends and intend to return there myself. Great value for money.",
            "title": "Lovely, beautiful Hotel, extremely helpful reception staff",
            "user": "LizzyLanarkshire"
        },
        {
            "date": "April 14, 2009",
            "detail_rating": {
                "business": null,
                "cleanliness": 5.0,
                "desk": null,
                "location": 5.0,
                "pool": null,
                "restaurant": null,
                "rooms": 4.0,
                "service": 5.0,
                "sleep": null,
                "value": 5.0
            },
            "helpfulness": null,
            "id": 27982531,
            "likes": {
                "disliked": null,
                "liked": null
            },
            "rating": 4.0,
            "stay_parameters": "Stayed April 2009, traveled as a couple",
            "text": "We have just returned from our three night stay at the Vendome. The location is fantastic- five minutes to the old town and five minutes to the train station. The rooms are a little small but it has everything you need. We were upgraded to a top floor room with a terrace! The service is excellent and the breakfast(despite other reviews) is great! There are many good restaurants to choose from notably \"The Pelican\". We are looking forward to our next stay in Nice and at the Hotel Vendome.",
            "title": "Lovely hotel,fantastic location",
            "user": "HildaSurrey"
        },
        {
            "date": "April 7, 2009",
            "detail_rating": {
                "business": null,
                "cleanliness": 5.0,
                "desk": null,
                "location": 3.0,
                "pool": null,
                "restaurant": null,
                "rooms": 3.0,
                "service": 5.0,
                "sleep": null,
                "value": 3.0
            },
            "helpfulness": 3,
            "id": 27555243,
            "likes": {
                "disliked": null,
                "liked": null
            },
            "rating": 3.0,
            "stay_parameters": "Stayed April 2009, traveled as a couple",
            "text": "Just back from a trip to NICE, stayed in the Vendome hotel. Not much to shout about there comfortwise but the staff are very friendly and helpful. Rooms are very small - just enough room to get around - bed very comfortable though. Breakfast room is another story - don't expect much - it's very cramped - seats about 20 persons and if you get into one of the inner seats you wont be able to get out unless everyone around you gets up to let you move. Expect to wait for a while - there's not enough seating at busy times.",
            "title": "Bare essentials",
            "user": "junketeer82"
        },
        {
            "date": "December 8, 2008",
            "detail_rating": {
                "business": 3.0,
                "cleanliness": 4.0,
                "desk": null,
                "front_desk": 3.0,
                "location": 4.0,
                "pool": null,
                "restaurant": null,
                "rooms": 3.0,
                "service": 3.0,
                "sleep": null,
                "value": 5.0
            },
            "helpfulness": 5,
            "id": 22556534,
            "likes": {
                "disliked": "\u2014 Nothing came to mind",
                "liked": "\u2014 Loved the architecture and price"
            },
            "rating": 5.0,
            "stay_parameters": "Stayed December 2008, traveled on business",
            "text": "The hotel is approx 500 metres from the beach - it's not on a hill so no problem to walkers.",
            "title": "What a lovely hotel - Want to go back",
            "user": "Grosvenorthehound"
        },
        {
            "date": "November 3, 2008",
            "detail_rating": {
                "business": 3.0,
                "cleanliness": 2.0,
                "desk": null,
                "front_desk": 2.0,
                "location": 3.0,
                "pool": null,
                "restaurant": null,
                "rooms": 2.0,
                "service": 1.0,
                "sleep": null,
                "value": 1.0
            },
            "helpfulness": 2,
            "id": 21508700,
            "likes": {
                "disliked": "\u2014 Service, small rooms, service, squeaky floors, service, paper-thin walls",
                "liked": "\u2014 Location - average 15 mins walk from everywhere important"
            },
            "rating": 1.0,
            "stay_parameters": "Stayed November 2008, traveled with family",
            "text": "The city is beautiful and well worth taking the open topped tour bus - goes for approx 1.5 hours and you get to see all the sights - commentary in various languages included via headphones.",
            "title": "Disappointing Overall",
            "user": "Monkzie"
        },
        {
            "date": "September 18, 2008",
            "detail_rating": {
                "business": 2.0,
                "cleanliness": 4.0,
                "desk": null,
                "front_desk": 5.0,
                "location": 4.0,
                "pool": null,
                "restaurant": null,
                "rooms": 3.0,
                "service": 4.0,
                "sleep": null,
                "value": 4.0
            },
            "helpfulness": 1,
            "id": 20168069,
            "likes": {
                "disliked": null,
                "liked": "\u2014 The massive balcony"
            },
            "rating": 4.0,
            "stay_parameters": "Stayed September 2008, traveled as a couple",
            "text": "The hotels advertise day trips to Monaco/Monte Carlo and Cannes - these are approx 70 euro per person for about half a day - forget these - the train station is about 1 kilometer from the hotel - you can go to Monaco/Monte Carlo for 3.30 euro per person return and take all the time you like there - trains go every hour all day - likewise if you want to go to Cannes and see how the filmstars live - it costs just over 5 euro return and its only about a half hours journey- well worth going to see these places, they are something else. Any body need any other info - please contact me",
            "title": "Great location, lovely staff",
            "user": "paleone"
        }
    ],
    "slim_ranking": 0.211267605634,
    "stars": 3,
    "tripadvisor": {
        "VISITED": false,
        "country_name": null,
        "locality": null,
        "pic_link": null,
        "street_address": null
    },
    "user_rating": 4.0,
    "variance": {
        "average": 47,
        "excellent": 59,
        "poor": 16,
        "terrible": 5,
        "very good": 121
    }
}