{
    "aka": "Homestead Miami Blue Lagoon Hotel",
    "description": null,
    "detail_rating": {
        "cleanliness": null,
        "location": null,
        "rooms": null,
        "service": null,
        "sleep": null,
        "value": null
    },
    "location": {
        "city": "Miami",
        "continent": null,
        "country": "United States",
        "proposed_city": "Miami",
        "province": null,
        "region": null
    },
    "name": "Extended Stay America - Miami - Airport - Blue Lagoon",
    "places": {
        "aka": [
            "Homestead",
            "Miami"
        ],
        "hotel_description": [],
        "hotel_name": [
            "Miami"
        ]
    },
    "review_count": 170,
    "review_count_current": 3,
    "reviews": [
        {
            "date": "January 8, 2004",
            "detail_rating": {
                "business": null,
                "cleanliness": null,
                "desk": null,
                "location": null,
                "pool": null,
                "restaurant": null,
                "rooms": null,
                "service": null,
                "sleep": null,
                "value": null
            },
            "helpfulness": 9,
            "id": 1543473,
            "likes": {
                "disliked": null,
                "liked": null
            },
            "rating": 3.0,
            "stay_parameters": null,
            "text": "We stayed here for 3 nights and basically this is a friendly place.",
            "title": "Friendly place",
            "user": "lizzylizzy"
        },
        {
            "date": "July 29, 2003",
            "detail_rating": {
                "business": null,
                "cleanliness": null,
                "desk": null,
                "location": null,
                "pool": null,
                "restaurant": null,
                "rooms": null,
                "service": null,
                "sleep": null,
                "value": null
            },
            "helpfulness": 13,
            "id": 1151659,
            "likes": {
                "disliked": null,
                "liked": null
            },
            "rating": 4.0,
            "stay_parameters": null,
            "text": "People working here are very nice and try to help. We were given a huge room with 2 beds without extra charge. Unfortunately the room was robbed by the previous occupant and we had almost nothing left but the hotel staff were nice to get us every thing we asked for: blankets, saucer pans, knives and forks, clock, remote control, etc. But I think the management should be more strict in checking the room amanities to make sure every thing is there.",
            "title": "lik home away from home",
            "user": "A TripAdvisor user"
        },
        {
            "date": "July 9, 2003",
            "detail_rating": {
                "business": null,
                "cleanliness": null,
                "desk": null,
                "location": null,
                "pool": null,
                "restaurant": null,
                "rooms": null,
                "service": null,
                "sleep": null,
                "value": null
            },
            "helpfulness": 12,
            "id": 1132506,
            "likes": {
                "disliked": null,
                "liked": null
            },
            "rating": 4.0,
            "stay_parameters": null,
            "text": "In 2002 we spent close to 5 days there,we had a great time.The rooms were clean and the service good.The shuttle driver and the desk employer were more than helpful.We will definitely stay there again.",
            "title": "Homestead - Great place to stay!",
            "user": "Robin922"
        }
    ],
    "slim_ranking": 0.557251908397,
    "stars": 2,
    "tripadvisor": {
        "VISITED": false,
        "country_name": null,
        "locality": null,
        "pic_link": null,
        "street_address": null
    },
    "user_rating": 3.5,
    "variance": {
        "average": 43,
        "excellent": 35,
        "poor": 17,
        "terrible": 17,
        "very good": 58
    }
}