{
    "aka": "Super 8 Hagerstown/Halfway Area Hotel",
    "description": null,
    "detail_rating": {
        "cleanliness": null,
        "location": null,
        "rooms": null,
        "service": null,
        "sleep": null,
        "value": null
    },
    "location": {
        "city": "Hagerstown",
        "continent": null,
        "country": "United States",
        "proposed_city": "Hagerstown",
        "province": null,
        "region": null
    },
    "name": "Super 8 Hagerstown/Halfway Area",
    "places": {
        "aka": [
            "Hagerstown"
        ],
        "hotel_description": [],
        "hotel_name": [
            "Hagerstown"
        ]
    },
    "review_count": 150,
    "review_count_current": 15,
    "reviews": [
        {
            "date": "June 14, 2006",
            "detail_rating": {
                "business": null,
                "cleanliness": null,
                "desk": null,
                "location": null,
                "pool": null,
                "restaurant": null,
                "rooms": null,
                "service": null,
                "sleep": null,
                "value": null
            },
            "helpfulness": 3,
            "id": 5347154,
            "likes": {
                "disliked": null,
                "liked": null
            },
            "rating": 5.0,
            "stay_parameters": null,
            "text": "We were hesitant about staying at a Super 8, but we were pleasantly surprised by what we found. The rooms were exceptionally clean. The continental breakfast was nice too - they had a decent selection (muffins, bagels, cereal, etc.) I definitely recommend this hotel.",
            "title": "Very clean",
            "user": "A TripAdvisor user"
        },
        {
            "date": "April 20, 2006",
            "detail_rating": {
                "business": null,
                "cleanliness": 5.0,
                "desk": null,
                "location": null,
                "pool": null,
                "restaurant": null,
                "rooms": 5.0,
                "service": 5.0,
                "sleep": null,
                "value": 5.0
            },
            "helpfulness": 3,
            "id": 4991900,
            "likes": {
                "disliked": null,
                "liked": null
            },
            "rating": 5.0,
            "stay_parameters": "Stayed April 2006",
            "text": "\"Pride of Super 8\" Indeed, it is. Room is clean, bright and spacious and so is the lobby/common area. Breakfast is more than adequate. which included juices, hot beverages, bagel/toast, hot and cold cereal etc. There is fridge and microwave in room, so very convenient. The staff are very helpful. The 2 senior citizens at the front desk are very efficient, no problem at all. It is one of the better motor inns of any franchise I have ever stayed. Excellent value. Definitely will return if in the same area.",
            "title": "Excellent place to stay",
            "user": "Alwaysask"
        },
        {
            "date": "April 2, 2006",
            "detail_rating": {
                "business": null,
                "cleanliness": 4.0,
                "desk": null,
                "location": null,
                "pool": null,
                "restaurant": null,
                "rooms": 4.0,
                "service": 3.0,
                "sleep": null,
                "value": 4.0
            },
            "helpfulness": 3,
            "id": 4827413,
            "likes": {
                "disliked": null,
                "liked": null
            },
            "rating": 4.0,
            "stay_parameters": "Stayed March 2006",
            "text": "Spent 1 night here on way to Virginia, very clean room, well back from the interstates and very quiet, friendly and efficient check in and out. King size bed had oversized pillows which were nice and very comfortable. Very good value for the money. Would stay there again if in the area.",
            "title": "Very nice place",
            "user": "countrypaws"
        },
        {
            "date": "October 18, 2005",
            "detail_rating": {
                "business": null,
                "cleanliness": 5.0,
                "desk": null,
                "location": null,
                "pool": null,
                "restaurant": null,
                "rooms": 5.0,
                "service": 3.0,
                "sleep": null,
                "value": 5.0
            },
            "helpfulness": 4,
            "id": 4031297,
            "likes": {
                "disliked": null,
                "liked": null
            },
            "rating": 5.0,
            "stay_parameters": "Stayed October 2005",
            "text": "Four of us shared 2 rooms for one night on October 7th. The place is very new, extremely clean and comfortable. Breakfast was very adequate and included with the room. The only downsides, which were relatively insignificant, were the man working the desk appeared to be a senior citizen and was somewhat slow with checkin; and our two rooms were at extreme opposite ends of the motel. But they were connected by a pleasant, indoor, carpeted hallway. We also noticed a coin laundry room which would be handy for longer stays. Overall, a great choice.",
            "title": "great stopover",
            "user": "rosensuesue"
        },
        {
            "date": "October 9, 2005",
            "detail_rating": {
                "business": null,
                "cleanliness": 3.0,
                "desk": null,
                "location": null,
                "pool": null,
                "restaurant": null,
                "rooms": 3.0,
                "service": 3.0,
                "sleep": null,
                "value": 3.0
            },
            "helpfulness": 4,
            "id": 4002139,
            "likes": {
                "disliked": null,
                "liked": null
            },
            "rating": 3.0,
            "stay_parameters": "Stayed October 2005, traveled on business",
            "text": "Nothing fancy -- it's a Super 8, after all, not the Ritz -- but a clean (looked almost new), comfortable place right off the highway. Breakfast was available in the morning, but I got up a little later. Had good water pressure in the morning. Would return if I'm ever back in the area. Only hitch was, arriving at about 3 a.m., the computer had already marked me as a no-show, so it took the clerk several minutes to re-find me. Worked out fine, though.",
            "title": "Fine place",
            "user": "BPTtraveler"
        },
        {
            "date": "April 27, 2008",
            "detail_rating": {
                "business": 5.0,
                "cleanliness": 5.0,
                "desk": null,
                "front_desk": 5.0,
                "location": 3.0,
                "pool": null,
                "restaurant": null,
                "rooms": 5.0,
                "service": 5.0,
                "sleep": null,
                "value": 5.0
            },
            "helpfulness": null,
            "id": 15394368,
            "likes": {
                "disliked": "\u2014 Truckstop",
                "liked": "\u2014 Clean, smart, well equipped, everything works"
            },
            "rating": 5.0,
            "stay_parameters": "Stayed April 2008, traveled solo",
            "text": "Busy truckstop area but the Super 8 is just sufficiently distanced from the truck park for comfort. Smartly maintained property, all the services work well, Good sized room, well equipped with fridge, microwave and hairdryer. Excellent modern, clean bathroom, in which they have installed those one-piece moulded bathtub/shower units, hence easy to keep clean, nowhere for mould to accumulate.",
            "title": "Super Super8",
            "user": "Aztec_Tripper"
        },
        {
            "date": "March 17, 2008",
            "detail_rating": {
                "business": 5.0,
                "cleanliness": 5.0,
                "desk": null,
                "front_desk": 5.0,
                "location": 4.0,
                "pool": null,
                "restaurant": null,
                "rooms": 5.0,
                "service": 5.0,
                "sleep": null,
                "value": 5.0
            },
            "helpfulness": null,
            "id": 14336851,
            "likes": {
                "disliked": null,
                "liked": "\u2014 super clean and good room layout"
            },
            "rating": 5.0,
            "stay_parameters": "Stayed March 2008, traveled with family",
            "text": "Wifi is consistently good. Nice laundry room. Manager on front desk (Phyllis) says all their front desk staff have been with them since opening some years back. Staff seem happy in their work, are friendly and helpful. Breakfast is smartly presented, and regularly topped up.",
            "title": "Excellent place to stay",
            "user": "MommyTravel78"
        },
        {
            "date": "March 15, 2008",
            "detail_rating": {
                "business": null,
                "cleanliness": 5.0,
                "desk": null,
                "front_desk": 5.0,
                "location": 5.0,
                "pool": null,
                "restaurant": null,
                "rooms": 5.0,
                "service": 5.0,
                "sleep": null,
                "value": 5.0
            },
            "helpfulness": null,
            "id": 14309036,
            "likes": {
                "disliked": null,
                "liked": "\u2014 first floor.. easy to find off rt 81"
            },
            "rating": 5.0,
            "stay_parameters": "Stayed March 2008, traveled solo",
            "text": "Overall, an excellent motel. I liked it so much I extended my stay to 3 days. If only all motels were this good...!",
            "title": "Dog-friendly Hotel",
            "user": "havinfunintheSun2007"
        },
        {
            "date": "March 1, 2008",
            "detail_rating": {
                "business": 5.0,
                "cleanliness": 5.0,
                "desk": null,
                "front_desk": 5.0,
                "location": 5.0,
                "pool": null,
                "restaurant": null,
                "rooms": 4.0,
                "service": 5.0,
                "sleep": null,
                "value": 4.0
            },
            "helpfulness": null,
            "id": 13956215,
            "likes": {
                "disliked": "\u2014 lack of food variety within walking distance",
                "liked": "\u2014 friendliness and cleanliness"
            },
            "rating": 5.0,
            "stay_parameters": "Stayed February 2008, traveled on business",
            "text": "Super clean place...It had a hairdryer and a fridge and a microwave (which we never expected). The floor was super clean and the bathroom was well maintained. The beds were better than mine at home!!",
            "title": "Very enjoyable second visit.",
            "user": "We2Geocachers"
        },
        {
            "date": "February 20, 2008",
            "detail_rating": {
                "business": 5.0,
                "cleanliness": 5.0,
                "desk": null,
                "front_desk": 5.0,
                "location": 5.0,
                "pool": null,
                "restaurant": null,
                "rooms": 5.0,
                "service": 5.0,
                "sleep": null,
                "value": 3.0
            },
            "helpfulness": null,
            "id": 13704741,
            "likes": {
                "disliked": "\u2014 Nothing stood out.",
                "liked": "\u2014 Close to the highway, it was clean."
            },
            "rating": 5.0,
            "stay_parameters": "Stayed February 2008, traveled as a couple",
            "text": "I'm giving this place 5 stars... first timer traveling with my dogs..so had no idea what to expect...Very friendly/ Very clean.. easy to find...first floor room...dogs permitted in the room...plus they had a very nice side yard to walk them at..",
            "title": "Thumbs Up for this motel",
            "user": "Patches01033"
        },
        {
            "date": "July 31, 2007",
            "detail_rating": {
                "business": null,
                "cleanliness": 4.0,
                "desk": null,
                "front_desk": 4.0,
                "location": 4.0,
                "pool": null,
                "restaurant": null,
                "rooms": 4.0,
                "service": 4.0,
                "sleep": null,
                "value": 4.0
            },
            "helpfulness": null,
            "id": 8266127,
            "likes": {
                "disliked": null,
                "liked": "\u2014 Clean & Cheap"
            },
            "rating": 4.0,
            "stay_parameters": "Stayed July 2007, traveled with family",
            "text": "Spent one night here on the way to VA Beach. Check in was quick & easy. The room was clean & well maintained. The staff in the morning was very friendly. The breakfast selection wasn't the best, but hey it was free.",
            "title": "Clean & Friendly",
            "user": "ZiggleOhio"
        },
        {
            "date": "July 30, 2007",
            "detail_rating": {
                "business": null,
                "cleanliness": 5.0,
                "desk": null,
                "front_desk": 5.0,
                "location": 4.0,
                "pool": null,
                "restaurant": null,
                "rooms": 4.0,
                "service": 5.0,
                "sleep": null,
                "value": 5.0
            },
            "helpfulness": null,
            "id": 8262917,
            "likes": {
                "disliked": "\u2014 n/a",
                "liked": "\u2014 had everything we needed, and great service too"
            },
            "rating": 4.0,
            "stay_parameters": "Stayed July 2007, traveled on business",
            "text": "paid 61.00 for a weekend night, great service, spacious room, has refrig, and microwave to meet food needs,",
            "title": "great little motel, has what you need and everything else nearby",
            "user": "digger4612"
        },
        {
            "date": "March 6, 2007",
            "detail_rating": {
                "business": null,
                "cleanliness": 3.0,
                "desk": null,
                "front_desk": 4.0,
                "location": 3.0,
                "pool": null,
                "restaurant": null,
                "rooms": 4.0,
                "service": null,
                "sleep": null,
                "value": 4.0
            },
            "helpfulness": 1,
            "id": 6925634,
            "likes": {
                "disliked": null,
                "liked": null
            },
            "rating": 3.0,
            "stay_parameters": "Stayed February 2007, traveled with family",
            "text": "easy parking near room, handicapped access roll in if you need it,",
            "title": "Got layover",
            "user": "BobOttawa"
        },
        {
            "date": "November 4, 2006",
            "detail_rating": {
                "business": null,
                "cleanliness": 5.0,
                "desk": null,
                "front_desk": 5.0,
                "location": 1.0,
                "pool": null,
                "restaurant": null,
                "rooms": 2.0,
                "service": 5.0,
                "sleep": null,
                "value": 3.0
            },
            "helpfulness": 2,
            "id": 6056806,
            "likes": {
                "disliked": "\u2014 Truck stop next door",
                "liked": "\u2014 Front desk staff"
            },
            "rating": 3.0,
            "stay_parameters": "Stayed October 2006, traveled solo",
            "text": "very friendly staff, 1/4 mile east is everything else you may want to do from all major eateries incl, outback, and ruby tuesday, and we suggest shoney seafood buffet on weekend.",
            "title": "Be sure to bring sleep mask & ear plugs",
            "user": "SusieLou"
        },
        {
            "date": "August 7, 2006",
            "detail_rating": {
                "business": null,
                "cleanliness": 4.0,
                "desk": null,
                "front_desk": 5.0,
                "location": 4.0,
                "pool": null,
                "restaurant": null,
                "rooms": 4.0,
                "service": 4.0,
                "sleep": null,
                "value": 4.0
            },
            "helpfulness": 2,
            "id": 5575001,
            "likes": {
                "disliked": "\u2014 Couldn't get a king bed",
                "liked": "\u2014 Location close to our activities"
            },
            "rating": 5.0,
            "stay_parameters": "Stayed August 2006, traveled as a couple",
            "text": "mall with movies and all major chain store such as penneys etc..... motel had what we needed as a couple for a evening on business trip.",
            "title": "Just like the reviewers said!!!",
            "user": "redskinboy"
        }
    ],
    "slim_ranking": 0.45,
    "stars": 2,
    "tripadvisor": {
        "VISITED": false,
        "country_name": null,
        "locality": null,
        "pic_link": null,
        "street_address": null
    },
    "user_rating": 4.0,
    "variance": {
        "average": 27,
        "excellent": 59,
        "poor": 5,
        "terrible": 1,
        "very good": 58
    }
}