{
    "aka": "Hotel De Mercedes Cebu/Cebu City",
    "description": null,
    "detail_rating": {
        "cleanliness": null,
        "location": null,
        "rooms": null,
        "service": null,
        "sleep": null,
        "value": null
    },
    "location": {
        "city": null,
        "continent": "Asia",
        "country": "Philippines",
        "proposed_city": null,
        "province": null,
        "region": null
    },
    "name": "Hotel de Mercedes",
    "places": {
        "aka": [
            "Mercedes",
            "Cebu",
            "Cebu"
        ],
        "hotel_description": [],
        "hotel_name": [
            "Mercedes"
        ]
    },
    "review_count": 24,
    "review_count_current": 8,
    "reviews": [
        {
            "date": "September 19, 2008",
            "detail_rating": {
                "business": 2.0,
                "cleanliness": 2.0,
                "desk": null,
                "front_desk": 3.0,
                "location": 5.0,
                "pool": null,
                "restaurant": null,
                "rooms": 2.0,
                "service": 3.0,
                "sleep": null,
                "value": 2.0
            },
            "helpfulness": 2,
            "id": 20187375,
            "likes": {
                "disliked": "\u2014 defective facilities",
                "liked": "\u2014 safe place"
            },
            "rating": 2.0,
            "stay_parameters": "Stayed August 2008",
            "text": "funny because were all excited to stay in this hotel but only to discover that this hotel had poor lighting, the shower was not good, the hot was not functioning anymore, the seat cover of the bowl in the CR was detached, were not sure if the beddings were freshly placed because my companion felt itchiness, she was so sensitive to dust, lastly the aircon was not that cold anymore, you have to wait for hours to feel coolness in your room, but all in all, its okay, were safe.",
            "title": "funny",
            "user": "maybe734"
        },
        {
            "date": "February 18, 2008",
            "detail_rating": {
                "business": 4.0,
                "cleanliness": 4.0,
                "desk": null,
                "front_desk": 5.0,
                "location": 5.0,
                "pool": null,
                "restaurant": null,
                "rooms": 4.0,
                "service": 5.0,
                "sleep": null,
                "value": 3.0
            },
            "helpfulness": 2,
            "id": 13662996,
            "likes": {
                "disliked": "\u2014 rooms have ordinary furnishing",
                "liked": "\u2014 location, price"
            },
            "rating": 2.0,
            "stay_parameters": "Stayed September 2007, traveled with friends",
            "text": "stayed in a de luxe room for about $20 back in 2007. it was bare for the most part and unpretentious, but it suited us fine. the hotel is near the nightlife hub in cebu and we enjoyed hopping from one place to the next and then back to the hotel for comfort food and sleep.",
            "title": "cheap and friendly hotel in cebu, not the best, but would do",
            "user": "karmic_tramp"
        },
        {
            "date": "April 21, 2007",
            "detail_rating": {
                "business": null,
                "cleanliness": null,
                "desk": null,
                "location": null,
                "pool": null,
                "restaurant": null,
                "rooms": null,
                "service": null,
                "sleep": null,
                "value": null
            },
            "helpfulness": 3,
            "id": 7405386,
            "likes": {
                "disliked": null,
                "liked": null
            },
            "rating": 1.0,
            "stay_parameters": null,
            "text": "I booked this Hotel with Asia Rooms. On arrival was shown to a room with no refrigerator, I had thought that I had one when I booked. They said I could move to a room with a fridge for an extra cost, which I did. The room was crap, everything was falling apart. Could not get to sleep because of the noise from a Disco next door. Went to breakfast and was told that I would have to pay as I had booked through Asia Rooms even though the price I paid for the upgraded hovel with a fridge was the rack rate with breakfast. I checked out and moved to The Vacation Inn. Do not stay here!",
            "title": "Not Reccomended",
            "user": "TJEmerson"
        },
        {
            "date": "March 6, 2010",
            "detail_rating": {
                "business": null,
                "cleanliness": 2.0,
                "desk": null,
                "location": 1.0,
                "pool": null,
                "restaurant": null,
                "rooms": 1.0,
                "service": 2.0,
                "sleep": 1.0,
                "value": 2.0
            },
            "helpfulness": 1,
            "id": 57877553,
            "likes": {
                "disliked": null,
                "liked": null
            },
            "rating": 1.0,
            "stay_parameters": "Stayed February 2010, traveled with friends",
            "text": "If you like to rough it on a scale of camping and want cheap then stay here.",
            "title": "If You Like It Rough",
            "user": "Alohaal"
        },
        {
            "date": "February 9, 2010",
            "detail_rating": {
                "business": null,
                "cleanliness": 2.0,
                "desk": null,
                "location": 3.0,
                "pool": null,
                "restaurant": null,
                "rooms": 4.0,
                "service": 2.0,
                "sleep": 4.0,
                "value": 3.0
            },
            "helpfulness": 2,
            "id": 55547634,
            "likes": {
                "disliked": null,
                "liked": null
            },
            "rating": 2.0,
            "stay_parameters": "Stayed January 2010, traveled solo",
            "text": "Lots of bugs in the rooms, little unknown guys, misquitos and cockroaches dwell here.",
            "title": "Even a budget hotel should be better than this",
            "user": "lindamae10"
        },
        {
            "date": "January 17, 2010",
            "detail_rating": {
                "business": null,
                "cleanliness": 4.0,
                "desk": null,
                "location": 3.0,
                "pool": null,
                "restaurant": null,
                "rooms": 3.0,
                "service": 4.0,
                "sleep": null,
                "value": 4.0
            },
            "helpfulness": 1,
            "id": 53647773,
            "likes": {
                "disliked": null,
                "liked": null
            },
            "rating": 3.0,
            "stay_parameters": "Stayed January 2010, traveled solo",
            "text": "I had a delux room for 1 night. The bed sheets were ancient with many holes. The bed was substandard, the room was delipated with crusty stuff on the shower and sink.",
            "title": "Ok Hotel",
            "user": "ricknz"
        },
        {
            "date": "March 12, 2009",
            "detail_rating": {
                "business": null,
                "cleanliness": 3.0,
                "desk": null,
                "location": 5.0,
                "pool": null,
                "restaurant": null,
                "rooms": 3.0,
                "service": 3.0,
                "sleep": null,
                "value": 5.0
            },
            "helpfulness": 2,
            "id": 26045726,
            "likes": {
                "disliked": null,
                "liked": null
            },
            "rating": 4.0,
            "stay_parameters": "Stayed July 2008, traveled solo",
            "text": "The TV did not work. Rundown airconditioning and non at all in the lobby.",
            "title": "Perfect voor fun and safety",
            "user": "andre44"
        },
        {
            "date": "January 20, 2009",
            "detail_rating": {
                "business": null,
                "cleanliness": null,
                "desk": null,
                "location": null,
                "pool": null,
                "restaurant": null,
                "rooms": null,
                "service": null,
                "sleep": null,
                "value": null
            },
            "helpfulness": 4,
            "id": 23718515,
            "likes": {
                "disliked": null,
                "liked": null
            },
            "rating": 1.0,
            "stay_parameters": null,
            "text": "No internet.",
            "title": "Used to Be",
            "user": "Freded"
        }
    ],
    "slim_ranking": 0.75,
    "stars": null,
    "tripadvisor": {
        "VISITED": false,
        "country_name": null,
        "locality": null,
        "pic_link": null,
        "street_address": null
    },
    "user_rating": 2.5,
    "variance": {
        "average": 10,
        "excellent": 0,
        "poor": 6,
        "terrible": 5,
        "very good": 3
    }
}