{
    "aka": "Soi Safari Lodge Kenya",
    "description": null,
    "detail_rating": {
        "cleanliness": null,
        "location": null,
        "rooms": null,
        "service": null,
        "sleep": null,
        "value": null
    },
    "location": {
        "city": null,
        "continent": "Africa",
        "country": "Kenya",
        "proposed_city": null,
        "province": null,
        "region": null
    },
    "name": "Soi Safari Lodge",
    "places": {
        "aka": [],
        "hotel_description": [],
        "hotel_name": []
    },
    "review_count": 19,
    "review_count_current": 5,
    "reviews": [
        {
            "date": "May 11, 2013",
            "detail_rating": {
                "business": null,
                "cleanliness": 1.0,
                "desk": null,
                "location": 3.0,
                "pool": null,
                "restaurant": null,
                "rooms": 2.0,
                "service": 1.0,
                "sleep": 1.0,
                "value": 1.0
            },
            "helpfulness": 1,
            "id": 160380249,
            "likes": {
                "disliked": null,
                "liked": null
            },
            "rating": 1.0,
            "stay_parameters": "Stayed June 2012, traveled with friends",
            "text": "Dirty, dirty, dirty....lots of bugs . Holes in mosquito nets:( lack good customer service, very depressing. We stayed in July 2009. it was just opened. pool was good according to our friends who visited us. They stayed in campground in tent. cheap. Our room was so basic and so expensive. Last night we did not even stayed in room, but slept in our car.",
            "title": "Stay in camp instead",
            "user": "Aruba2004"
        },
        {
            "date": "January 15, 2013",
            "detail_rating": {
                "business": null,
                "cleanliness": 3.0,
                "desk": null,
                "location": 4.0,
                "pool": null,
                "restaurant": null,
                "rooms": 3.0,
                "service": 3.0,
                "sleep": 3.0,
                "value": 3.0
            },
            "helpfulness": 1,
            "id": 149727770,
            "likes": {
                "disliked": null,
                "liked": null
            },
            "rating": 3.0,
            "stay_parameters": "Stayed January 2013, traveled as a couple",
            "text": "Food was not good, but we felt bad for all those hungry kids running outside when we had throw away bunch of food from our plates. lake is so dirty, the only nice thing that we saw fish eagle.",
            "title": "Nice place to stay while in Baringo",
            "user": "Paul414"
        },
        {
            "date": "January 1, 2013",
            "detail_rating": {
                "business": null,
                "cleanliness": 2.0,
                "desk": null,
                "location": 4.0,
                "pool": null,
                "restaurant": null,
                "rooms": 3.0,
                "service": 3.0,
                "sleep": 3.0,
                "value": 3.0
            },
            "helpfulness": 1,
            "id": 148492840,
            "likes": {
                "disliked": null,
                "liked": null
            },
            "rating": 2.0,
            "stay_parameters": "Stayed December 2012, traveled with friends",
            "text": "we would not not recommend this hotel to anyone!",
            "title": "Only the Most Basic of Service and Accommodations",
            "user": "GailGarber"
        },
        {
            "date": "December 27, 2012",
            "detail_rating": {
                "business": null,
                "cleanliness": 3.0,
                "desk": null,
                "location": 5.0,
                "pool": null,
                "restaurant": null,
                "rooms": 3.0,
                "service": 3.0,
                "sleep": 2.0,
                "value": 4.0
            },
            "helpfulness": null,
            "id": 148132395,
            "likes": {
                "disliked": null,
                "liked": null
            },
            "rating": 2.0,
            "stay_parameters": "Stayed August 2012, traveled on business",
            "text": "I visited this place last week and its a quite place where one can sight view lake baringo.Since it was on low season,i managed to enjoy the space and though their rooms are ok....they dont have instant hot showers.one has to await for the timings when they can heat the water on their cisterns otherwise the workers were cool and kind",
            "title": "Potential oasis after a long drive from Nairobi",
            "user": "Kufunda"
        },
        {
            "date": "September 27, 2012",
            "detail_rating": {
                "business": null,
                "cleanliness": 3.0,
                "desk": null,
                "location": 4.0,
                "pool": null,
                "restaurant": null,
                "rooms": 2.0,
                "service": 3.0,
                "sleep": 4.0,
                "value": 3.0
            },
            "helpfulness": 1,
            "id": 141390407,
            "likes": {
                "disliked": null,
                "liked": null
            },
            "rating": 3.0,
            "stay_parameters": "Stayed September 2012, traveled solo",
            "text": "We had originally planned to stay at another accommodation in the Lake Baringo area, but high flood waters forced the closure of that facility. We arrived late evening at the Soi Safari Lodge and were given rooms with no windows other than a small one in the bathroom that reminded me of a dungeon. The next night we were upgraded to better rooms with a view of the lake. There were three captive ostriches on the grounds that we enjoyed watching, however, we would have preferred them to be wild. The facility also houses other captive animals included some Grey Crowned Cranes that had clipped wings that I found offensive. I understand that they also house an African Fish Eagle. The service was only somewhat average and the food - not so great. However, I don't think there is anywhere else to stay in this small, depressed community. If I were to visit again, I would skip Lake Baringo.",
            "title": "Lovely situation but service only basic!",
            "user": "SVfromUK"
        }
    ],
    "slim_ranking": 0.666666666667,
    "stars": null,
    "tripadvisor": {
        "VISITED": false,
        "country_name": null,
        "locality": null,
        "pic_link": null,
        "street_address": null
    },
    "user_rating": 3.5,
    "variance": {
        "average": 3,
        "excellent": 8,
        "poor": 6,
        "terrible": 1,
        "very good": 1
    }
}