{
    "aka": "Turnberry, a Luxury Collection Resort, Scotland Hotel Turnberry",
    "description": "Nestled within an 800 acre estate with views overlooking the rugged Ayrshire coastline, Turnberry Resort is an enchanting destination. Turnberry is the world\u2019s original golf resort with over a century of hospitality and tradition. It is scene of some of the most memorable moments in Open history, the championship Ailsa course is a legend in the game. Complimented by The Turnberry Performance Academy, an outstanding teaching facility offering a holistic approach to the game of golf; Turnberry is one of the most magnificent destinations for golf breaks in Scotland.With a range of outstanding accommodation, championship golf, a relaxing ESPA spa, six restaurants & bars and thrilling outdoor pursuits at Turnberry Adventures, Turnberry boasts a myriad of activities for travelers, golfers and families. The resort enjoys a spectacular coastal setting with breathtaking views of the Isle of Arran, Ailsa Craig and the Irish Sea.",
    "detail_rating": {
        "cleanliness": 4.5,
        "location": 5.0,
        "rooms": 4.5,
        "service": 4.5,
        "sleep": 4.5,
        "value": 4.5
    },
    "location": {
        "city": null,
        "continent": "Europe",
        "country": "United Kingdom (UK)",
        "proposed_city": null,
        "province": null,
        "region": null
    },
    "name": "Turnberry, A Luxury Collection Resort, Scotland",
    "places": {
        "aka": [],
        "hotel_description": [],
        "hotel_name": []
    },
    "review_count": 584,
    "review_count_current": 20,
    "reviews": [
        {
            "date": "July 31, 2012",
            "detail_rating": {
                "business": null,
                "cleanliness": 5.0,
                "desk": null,
                "location": 5.0,
                "pool": null,
                "restaurant": null,
                "rooms": 5.0,
                "service": 5.0,
                "sleep": 4.0,
                "value": 4.0
            },
            "helpfulness": null,
            "id": 135868358,
            "likes": {
                "disliked": null,
                "liked": null
            },
            "rating": 5.0,
            "stay_parameters": "Stayed February 2012, traveled with family",
            "text": "We stayed here as a family of four during half term holidays and used my Starwood points at last.",
            "title": "A wonderful, if a little expensive hotel",
            "user": "RSL72"
        },
        {
            "date": "July 28, 2012",
            "detail_rating": {
                "business": null,
                "cleanliness": 4.0,
                "desk": null,
                "location": 5.0,
                "pool": null,
                "restaurant": null,
                "rooms": 5.0,
                "service": 4.0,
                "sleep": 2.0,
                "value": 3.0
            },
            "helpfulness": null,
            "id": 135650804,
            "likes": {
                "disliked": null,
                "liked": null
            },
            "rating": 2.0,
            "stay_parameters": "Stayed July 2012, traveled with family",
            "text": "The room was wonderful although the view was not. There was an enclosed sleeping areas with two beds and a TV for our children which was perfect for some quite time and privacy. Bathroom was spacious clean and well equipped. Comfortable bed too.",
            "title": "An absolutely lovely hotel but a major mistake was not attended properly",
            "user": "ifrflyer"
        },
        {
            "date": "July 26, 2012",
            "detail_rating": {
                "business": null,
                "cleanliness": 5.0,
                "desk": null,
                "location": 5.0,
                "pool": null,
                "restaurant": null,
                "rooms": 5.0,
                "service": 4.0,
                "sleep": 5.0,
                "value": 3.0
            },
            "helpfulness": null,
            "id": 135454712,
            "likes": {
                "disliked": null,
                "liked": null
            },
            "rating": 4.0,
            "stay_parameters": "Stayed July 2012, traveled with friends",
            "text": "Breakfast was superb - kippers, traditional, lean foods, variety, quality and service was excellent.",
            "title": "Great Golf Vacation",
            "user": "RoseHessB"
        },
        {
            "date": "July 23, 2012",
            "detail_rating": {
                "business": null,
                "cleanliness": 1.0,
                "desk": null,
                "location": 4.0,
                "pool": null,
                "restaurant": null,
                "rooms": 3.0,
                "service": 2.0,
                "sleep": 3.0,
                "value": 2.0
            },
            "helpfulness": 1,
            "id": 135155748,
            "likes": {
                "disliked": null,
                "liked": null
            },
            "rating": 2.0,
            "stay_parameters": "Stayed July 2012, traveled as a couple",
            "text": "Dinner one night was also excellent and we were well attended to by waiters.",
            "title": "Not a 5 Star Hotel",
            "user": "BBeuka"
        },
        {
            "date": "July 18, 2012",
            "detail_rating": {
                "business": null,
                "cleanliness": 5.0,
                "desk": null,
                "location": 5.0,
                "pool": null,
                "restaurant": null,
                "rooms": 4.0,
                "service": 5.0,
                "sleep": 3.0,
                "value": 2.0
            },
            "helpfulness": 1,
            "id": 134676288,
            "likes": {
                "disliked": null,
                "liked": null
            },
            "rating": 3.0,
            "stay_parameters": "Stayed July 2012, traveled as a couple",
            "text": "Afternoon tea was pleasant with excellent views of the gardens, golf course and the waterfront.",
            "title": "Service done right",
            "user": "StevieK15"
        },
        {
            "date": "August 22, 2012",
            "detail_rating": {
                "business": null,
                "cleanliness": null,
                "desk": null,
                "location": null,
                "pool": null,
                "restaurant": null,
                "rooms": null,
                "service": null,
                "sleep": null,
                "value": null
            },
            "helpfulness": 1,
            "id": 137980365,
            "likes": {
                "disliked": null,
                "liked": null
            },
            "rating": 3.0,
            "stay_parameters": null,
            "text": "I like the attachment to the detail visible in this hotel and its perfect management. We did not find it easy to locate though Turnberry is small. This hotel could be better indicated!",
            "title": "Very classy place! P.S. from 2nd Swisstraveller: or what you would expect...",
            "user": "Travellersfromswitzerland"
        },
        {
            "date": "August 18, 2012",
            "detail_rating": {
                "business": null,
                "cleanliness": null,
                "desk": null,
                "location": null,
                "pool": null,
                "restaurant": null,
                "rooms": null,
                "service": null,
                "sleep": null,
                "value": null
            },
            "helpfulness": null,
            "id": 137556975,
            "likes": {
                "disliked": null,
                "liked": null
            },
            "rating": 4.0,
            "stay_parameters": null,
            "text": "When arriving at the hotel entrance we were asked for valet parking. The suitcases were taken swiftly at the car by kilted bellmen and appeared miraculously in our room. The receptionist informed us that we were upgraded but 15 minutes were needed for \"final touches\"! We took seats in the \u201ctea room\u201d with a view on the golf course and studied the menus of the various outlets.",
            "title": "Our second visit",
            "user": "Kitesurfer101"
        },
        {
            "date": "August 18, 2012",
            "detail_rating": {
                "business": null,
                "cleanliness": 4.0,
                "desk": null,
                "location": 5.0,
                "pool": null,
                "restaurant": null,
                "rooms": 2.0,
                "service": 4.0,
                "sleep": 3.0,
                "value": 2.0
            },
            "helpfulness": 1,
            "id": 137520628,
            "likes": {
                "disliked": null,
                "liked": null
            },
            "rating": 3.0,
            "stay_parameters": "Stayed August 2012, traveled as a couple",
            "text": "P.S. from the 2nd Swisstraveller: the key was received after telling the receptionist that we renounce to an upgrade and wish to have the room we booked.",
            "title": "Rather Dissappointing",
            "user": "madison74"
        },
        {
            "date": "August 14, 2012",
            "detail_rating": {
                "business": null,
                "cleanliness": 5.0,
                "desk": null,
                "location": 5.0,
                "pool": null,
                "restaurant": null,
                "rooms": 5.0,
                "service": 5.0,
                "sleep": 5.0,
                "value": 5.0
            },
            "helpfulness": null,
            "id": 137204169,
            "likes": {
                "disliked": null,
                "liked": null
            },
            "rating": 5.0,
            "stay_parameters": "Stayed August 2012, traveled as a couple",
            "text": "Eventually, we go the key to our room that was big indeed with a bathroom of the same size: big free standing bath tube, separate cabins for shower and toilet, heated floor, great products (lemon grass?) for shower, hair and body. The room had no view - we had view from the lobby, restaurants and swimming pool compensating for this drawback. The room included cattle, tea, coffee and biscuits selection as well as free Wi-Fi",
            "title": "Superb",
            "user": "KentManKent"
        },
        {
            "date": "August 12, 2012",
            "detail_rating": {
                "business": null,
                "cleanliness": 5.0,
                "desk": null,
                "location": 5.0,
                "pool": null,
                "restaurant": null,
                "rooms": 2.0,
                "service": 3.0,
                "sleep": 2.0,
                "value": 1.0
            },
            "helpfulness": 2,
            "id": 136995076,
            "likes": {
                "disliked": null,
                "liked": null
            },
            "rating": 2.0,
            "stay_parameters": "Stayed August 2012, traveled with friends",
            "text": "In the evening, we decided for \"1906\". It was a good choice, we were welcomed in French language (Scotland was allied with France for centuries with number of Queens of French origin). Windows were closed at our request (the rain started), Freshly baked selection of breads (so difficult to spot in Scotland!) appeared immediately. The service was perfect, food very good and the bill in accordance.",
            "title": "Luxury hotel in need of major training and upgrading",
            "user": "wendydunblane"
        },
        {
            "date": "August 12, 2012",
            "detail_rating": {
                "business": null,
                "cleanliness": null,
                "desk": null,
                "location": null,
                "pool": null,
                "restaurant": null,
                "rooms": null,
                "service": null,
                "sleep": null,
                "value": null
            },
            "helpfulness": null,
            "id": 136986095,
            "likes": {
                "disliked": null,
                "liked": null
            },
            "rating": 4.0,
            "stay_parameters": null,
            "text": "Beautiful property with stunning views including a 12 hole pitch and putt on the front lawn. Service was excellent. The only reason I didn't give 5 stars is the lack of central a/c which is a pet peeve of mine even though I know it is not needed 9-10 months out of the year. Luxury property's including pebble beach should have this amenity.",
            "title": "Great Views when clear",
            "user": "consultant3"
        },
        {
            "date": "August 10, 2012",
            "detail_rating": {
                "business": null,
                "cleanliness": null,
                "desk": null,
                "location": null,
                "pool": null,
                "restaurant": null,
                "rooms": null,
                "service": null,
                "sleep": null,
                "value": null
            },
            "helpfulness": null,
            "id": 136829830,
            "likes": {
                "disliked": null,
                "liked": null
            },
            "rating": 5.0,
            "stay_parameters": null,
            "text": "Reading some of the Tripadvisor reviews you could wonder if we stayed at the same hotel. Perhaps we were lucky and we did upgrade to a seaview room - but we had a fabulous time and very much enjoyed our stay. Perhaps because the majority of guests are golfers the hotel had a very relaxed atmosphere. All members of staff throughout the hotel, spa and golf course/club house were friendly and courteous. The room was beautiful - great bed, fantastic view and plenty of space. While we didn't have any treatments in the Spa it seemed well appointed with a good pool and lounge areas. We had dinner in the Ailsa lounge which was more relaxed than the fine dining restaurant but very good. Breakfast was great and lunch in the club house lounge was very well done. If I had to point out any niggles that might bother some fusspots some of the paintwork in our room and along the corridors was a bit scuffed/grubby but the overall experience was so good and staff so helpful and friendly this didn't matter one bit. It is quite expensive but for treat I would heartily recommend it to anyone - golfer or not.",
            "title": "Excellent Stay",
            "user": "NorthernIrelandRosie"
        },
        {
            "date": "August 9, 2012",
            "detail_rating": {
                "business": null,
                "cleanliness": null,
                "desk": null,
                "location": null,
                "pool": null,
                "restaurant": null,
                "rooms": null,
                "service": null,
                "sleep": null,
                "value": null
            },
            "helpfulness": null,
            "id": 136754153,
            "likes": {
                "disliked": null,
                "liked": null
            },
            "rating": 5.0,
            "stay_parameters": null,
            "text": "LOVED this hotel. Fortunate to have one of the rooms facing the golf course and sea. My room was newly updated and extremely comfortable. Loved the balcony and the windows that opened and allowed for fresh air. Loved the radiant heated floors in the bathroom. Both the room and the bathroom were quite spacious. Loved the charm and beauty of Turberry. Would definitely return.",
            "title": "A Must if You're in Scotland",
            "user": "CJMTraveler"
        },
        {
            "date": "August 1, 2012",
            "detail_rating": {
                "business": null,
                "cleanliness": null,
                "desk": null,
                "location": null,
                "pool": null,
                "restaurant": null,
                "rooms": null,
                "service": null,
                "sleep": null,
                "value": null
            },
            "helpfulness": null,
            "id": 135975896,
            "likes": {
                "disliked": null,
                "liked": null
            },
            "rating": 5.0,
            "stay_parameters": null,
            "text": "we arived at the spa reception for our spa day the receptionist was smilling and helpful we had a cup of tea as we were early.We had our treatments a facial and a back neck and shoulder massage which was excellent lovely and relaxing the therapists are very professional we had herbal tea in the relaxation area which was lovely nice and relaxed we sat by the pool until time for lunch in the grand tea lounge which overlooks the golfcourse we had a great view of the seniors open which was on the atmosphere was great.My friend and myself had a walk around the hotel and headed back to the spa for a dip in the pool and the sauna i would definately recommend a spa day at turnberry staff helpful and friendly .",
            "title": "spa day 29th July 2012",
            "user": "kirsteenfyfe"
        },
        {
            "date": "July 31, 2012",
            "detail_rating": {
                "business": null,
                "cleanliness": null,
                "desk": null,
                "location": null,
                "pool": null,
                "restaurant": null,
                "rooms": null,
                "service": null,
                "sleep": null,
                "value": null
            },
            "helpfulness": null,
            "id": 135880151,
            "likes": {
                "disliked": null,
                "liked": null
            },
            "rating": 5.0,
            "stay_parameters": null,
            "text": "This is a beautiful hotel - right on the water with a direct view of Ailsa Craig, a gorgeous golf course, fabulous breakfast (served in the grand dining roon), amazing service and very comfortable rooms. The spa is worth a trip for a massage (reasonable pricing), the restaurant is dynamite - do not miss the afternoon tea if you have the time.",
            "title": "Relax and enjoy the service and the view",
            "user": "ecotait"
        },
        {
            "date": "July 9, 2012",
            "detail_rating": {
                "business": null,
                "cleanliness": 5.0,
                "desk": null,
                "location": 5.0,
                "pool": null,
                "restaurant": null,
                "rooms": 5.0,
                "service": 5.0,
                "sleep": 5.0,
                "value": 5.0
            },
            "helpfulness": 1,
            "id": 133890565,
            "likes": {
                "disliked": null,
                "liked": null
            },
            "rating": 5.0,
            "stay_parameters": "Stayed May 2012, traveled as a couple",
            "text": "From the first moment we arrived, we felt welcomed and comfortable. When we arrived at Turnberry, we were escorted to the reception area by the gentleman in Highland garb. Rather than the typical hotel counter you generally see in reception areas, we were ushered into an office with a desk and two chairs. Nice touch. The reception person was the same one who then showed us to our room, pointed out where everything was in the hotel, where everything was in our room, etc. It was nice, like having our very own host who made sure we were cared for.",
            "title": "Can't wait to go back",
            "user": "pjmorrison"
        },
        {
            "date": "July 7, 2012",
            "detail_rating": {
                "business": null,
                "cleanliness": null,
                "desk": null,
                "location": null,
                "pool": null,
                "restaurant": null,
                "rooms": null,
                "service": null,
                "sleep": null,
                "value": null
            },
            "helpfulness": null,
            "id": 133650840,
            "likes": {
                "disliked": null,
                "liked": null
            },
            "rating": 4.0,
            "stay_parameters": null,
            "text": "We stayed in the Norman suite, which is enormous. The living room has a wall of windows facing the ocean, with a beautiful view of the grounds, the golf courses, the beach, lighthouse, and the two nearby islands. The bedroom has a similar view, just smaller windows. Spacious closet and comfy bed, with bottled water on our nightstands each day. The bathroom was enormous and well laid out.",
            "title": "Very nice but not perfect",
            "user": "DrkecCO"
        },
        {
            "date": "July 5, 2012",
            "detail_rating": {
                "business": null,
                "cleanliness": 5.0,
                "desk": null,
                "location": 5.0,
                "pool": null,
                "restaurant": null,
                "rooms": 3.0,
                "service": 5.0,
                "sleep": 3.0,
                "value": 4.0
            },
            "helpfulness": null,
            "id": 133493937,
            "likes": {
                "disliked": null,
                "liked": null
            },
            "rating": 4.0,
            "stay_parameters": "Stayed June 2012, traveled as a couple",
            "text": "Tea time: we tried the hotel's afternoon tea, which is supposed to be award-winning. It was very good; the only thing that surprised me was that there wasn't a smidge of chocolate anywhere on the tray. Nevertheless, it didn't stop me from having tea several times during our stay.",
            "title": "Very nice but not quite perfect!",
            "user": "Angrydoc"
        },
        {
            "date": "June 29, 2012",
            "detail_rating": {
                "business": null,
                "cleanliness": 5.0,
                "desk": null,
                "location": 5.0,
                "pool": null,
                "restaurant": null,
                "rooms": 3.0,
                "service": 5.0,
                "sleep": 4.0,
                "value": 4.0
            },
            "helpfulness": null,
            "id": 133040749,
            "likes": {
                "disliked": null,
                "liked": null
            },
            "rating": 5.0,
            "stay_parameters": "Stayed June 2012, traveled with friends",
            "text": "Indoor pool and spa: It felt WONDERFUL, especially after an unseasonably warm day. Pool area has glass walls and a lovely view of the outdoors, yet feels very private. Nice. The massage treatment rooms felt a little cramped, although the massage itself was very good. The rooms need some kind of soothing music - it seemed odd to have a massage without it, especially when there was so much attention to detail with everything else.",
            "title": "Great Old Lady",
            "user": "LeftGoose"
        },
        {
            "date": "June 26, 2012",
            "detail_rating": {
                "business": null,
                "cleanliness": 4.0,
                "desk": null,
                "location": 4.0,
                "pool": null,
                "restaurant": null,
                "rooms": 2.0,
                "service": 1.0,
                "sleep": 3.0,
                "value": 2.0
            },
            "helpfulness": 1,
            "id": 132828166,
            "likes": {
                "disliked": null,
                "liked": null
            },
            "rating": 2.0,
            "stay_parameters": "Stayed June 2012, traveled on business",
            "text": "Breakfast buffet: very good, with a nice variety of items available. Also available were cooked items from the breakfast menu - also very good.",
            "title": "Nowhere near a 5 Star Hotel...",
            "user": "WanderlustEdinburgh"
        }
    ],
    "slim_ranking": 0.666666666667,
    "stars": 5,
    "tripadvisor": {
        "VISITED": false,
        "country_name": null,
        "locality": null,
        "pic_link": null,
        "street_address": null
    },
    "user_rating": 4.5,
    "variance": {
        "average": 59,
        "excellent": 355,
        "poor": 33,
        "terrible": 12,
        "very good": 125
    }
}