{
    "aka": "Accor Rennes Centre Pre Botte",
    "description": "Located in a quiet street in the heart of the city, a few minute walk from the historical and cultural sites of Rennes. Nestled in an old printing shop (heritage facade). Bar. Meeting facilities. Rooms for disabled guests.",
    "detail_rating": {
        "cleanliness": null,
        "location": null,
        "rooms": null,
        "service": null,
        "sleep": null,
        "value": null
    },
    "location": {
        "city": null,
        "continent": "Europe",
        "country": "France",
        "proposed_city": "Rennes",
        "province": null,
        "region": "Brittany"
    },
    "name": "Mercure Rennes Centre Parlement",
    "places": {
        "aka": [
            "Rennes"
        ],
        "hotel_description": [
            "Rennes",
            "Bar"
        ],
        "hotel_name": [
            "Rennes"
        ]
    },
    "review_count": 240,
    "review_count_current": 7,
    "reviews": [
        {
            "date": "December 9, 2006",
            "detail_rating": {
                "business": 4.0,
                "cleanliness": 4.0,
                "desk": null,
                "front_desk": 4.0,
                "location": 4.0,
                "pool": null,
                "restaurant": null,
                "rooms": 4.0,
                "service": 4.0,
                "sleep": null,
                "value": null
            },
            "helpfulness": null,
            "id": 6353060,
            "likes": {
                "disliked": null,
                "liked": null
            },
            "rating": 4.0,
            "stay_parameters": "Stayed November 2006",
            "text": "We just stayed in this hotel, great location, wonderful service, very nice rooms.",
            "title": "Great location",
            "user": "lbi8332"
        },
        {
            "date": "February 3, 2006",
            "detail_rating": {
                "business": null,
                "cleanliness": 4.0,
                "desk": null,
                "location": null,
                "pool": null,
                "restaurant": null,
                "rooms": 4.0,
                "service": 3.0,
                "sleep": null,
                "value": 4.0
            },
            "helpfulness": 5,
            "id": 4412445,
            "likes": {
                "disliked": null,
                "liked": null
            },
            "rating": 3.0,
            "stay_parameters": "Stayed November 2005",
            "text": "Stayed at this hotel October 31-November 5 2005. The property is located right in the center of town, great location on a quiet side street. You are able to walk to many resturants and shops. Near the Galleries Layfayette. The rooms were small, as most european rooms are, but very clean. The bathroom had a full tub and shower. The amenities were fine. The bed was not the most comfortable for me, but my husband slept fine. There was free wireless internet access during most hours. The daily breakfast, 10 euro consisted of various breads, cheese, fruit, meat (cold), boiled eggs, cereal. It was fine. There is primarily business clientale. There is a bar, but it is pretty quiet. The staff was very professional, not overly friendly, but efficient, and a quick check in and out. There is parking in the hotel garage, no fee for guest, but it fills up fast. We were able to park our car, leave it and walk through town. I was able to book the room for 88 euro per night, which was a great value for the room. I would definitely stay at the property again.",
            "title": "Nice, Quiet Hotel",
            "user": "traveljo"
        },
        {
            "date": "August 6, 2009",
            "detail_rating": {
                "business": null,
                "cleanliness": 4.0,
                "desk": null,
                "location": 5.0,
                "pool": null,
                "restaurant": null,
                "rooms": 4.0,
                "service": 4.0,
                "sleep": null,
                "value": 5.0
            },
            "helpfulness": null,
            "id": 36911228,
            "likes": {
                "disliked": null,
                "liked": null
            },
            "rating": 4.0,
            "stay_parameters": "Stayed July 2009, traveled as a couple",
            "text": "In a fine town for touring but without a surplus of charming tourist hotels, this business hotel offers a perfectly good option for tourists and its weekend specials are unbeatable. I had marked a price of 150 euros per night as the rate for our two night stay and thought it a good rate for the amenities provided and then found that I was actually being charged150 euros (or 75 euros a night) for the TWO nights of our stay--a phenomenol price for what was a good room in a fine location with a terrific breakfast (included)in a lovely, airy breakfast room We loved Rennes and we were thoroughly pleased with the Mercure Pre Botte and its terrific low rates.",
            "title": "Super deal, business hotel fine for tourists",
            "user": "FloridaTravelmum"
        },
        {
            "date": "July 6, 2009",
            "detail_rating": {
                "business": null,
                "cleanliness": 5.0,
                "desk": null,
                "location": 5.0,
                "pool": null,
                "restaurant": null,
                "rooms": 4.0,
                "service": 4.0,
                "sleep": null,
                "value": 4.0
            },
            "helpfulness": 1,
            "id": 34064184,
            "likes": {
                "disliked": null,
                "liked": null
            },
            "rating": 4.0,
            "stay_parameters": "Stayed June 2009, traveled as a couple",
            "text": "I found it hard to find a great hotel on the web in Rennes but as we had to stay in Rennes opted for the Pre Botte based on Trip Advisor comments. The hotel is clean, comfortable, has parking and is centrally located to the attractive city centre. Breakfast service was friendly and food plentiful and I would not hesitate to recommend this hotel if you need to stay in Rennes.",
            "title": "Perfectly Good",
            "user": "LuxuryLoverLondon"
        },
        {
            "date": "April 13, 2009",
            "detail_rating": {
                "business": null,
                "cleanliness": 4.0,
                "desk": null,
                "location": 4.0,
                "pool": null,
                "restaurant": null,
                "rooms": 3.0,
                "service": 3.0,
                "sleep": null,
                "value": 3.0
            },
            "helpfulness": 1,
            "id": 27945370,
            "likes": {
                "disliked": null,
                "liked": null
            },
            "rating": 3.0,
            "stay_parameters": "Stayed March 2009, traveled on business",
            "text": "This is a nice hotel , well placed for city centre and main rail station. Its has clean comfortable rooms.",
            "title": "Well placed hotel",
            "user": "WandererManchester"
        },
        {
            "date": "October 31, 2008",
            "detail_rating": {
                "business": null,
                "cleanliness": 4.0,
                "desk": null,
                "front_desk": 5.0,
                "location": 5.0,
                "pool": null,
                "restaurant": null,
                "rooms": 4.0,
                "service": 4.0,
                "sleep": null,
                "value": 5.0
            },
            "helpfulness": 2,
            "id": 21424390,
            "likes": {
                "disliked": null,
                "liked": "\u2014 Location"
            },
            "rating": 5.0,
            "stay_parameters": "Stayed September 2008, traveled as a couple",
            "text": "This hotel occupies the former premises of the 'Ouest-France' newspaper, which provides slightly larger rooms than usual, and is in a great central location for exploring Rennes. It's also got good, secure underground parking, should you be touring the area by car, as we were.",
            "title": "Great place for 'Le Weekend'",
            "user": "CrestaRider"
        },
        {
            "date": "July 19, 2008",
            "detail_rating": {
                "business": 3.0,
                "cleanliness": 4.0,
                "desk": null,
                "front_desk": 5.0,
                "location": 4.0,
                "pool": null,
                "restaurant": null,
                "rooms": 4.0,
                "service": 3.0,
                "sleep": null,
                "value": 4.0
            },
            "helpfulness": 1,
            "id": 18036320,
            "likes": {
                "disliked": null,
                "liked": "\u2014 Location"
            },
            "rating": 4.0,
            "stay_parameters": "Stayed July 2008, traveled on business",
            "text": "We only stayed one night, but wished we'd stayed more as there is lots to see and do in Rennes. The shopping is great, particularly shoes, and the food market is fantastic, all a short walk from the hotel.",
            "title": "Very central and great staff",
            "user": "Junkster"
        }
    ],
    "slim_ranking": 0.147058823529,
    "stars": 4,
    "tripadvisor": {
        "VISITED": false,
        "country_name": null,
        "locality": null,
        "pic_link": null,
        "street_address": null
    },
    "user_rating": 4.0,
    "variance": {
        "average": 40,
        "excellent": 56,
        "poor": 7,
        "terrible": 5,
        "very good": 132
    }
}