{
    "aka": null,
    "description": "Want to live like a local while staying in Chicago? The Guesthouse Hotel offers an affordable and comfortable place to lay your head during your visit to our city! A family-owned, boutique hotel, The Guesthouse Hotel features spacious, high-end accommodations centrally located in a hip, bustling Northside neighborhood that still has easy access to Downtown shopping, restaurants, and activities. Our units feature either three bedrooms and two bathrooms or two bedrooms and two bathrooms-and a pull-out couch-to easily accommodate up to six to eight guests. You can whip up a meal in the fully-equipped gourmet kitchen (we're happy to point you towards a local Farmers Market or grocery store) or, when the weather calls for it, use the grill on your private terrace. Other highlights include an inviting living and dining area; spacious and elegantly decorated bedrooms; a spa-like master bathroom with a steam shower; a fireplace; a plasma television with cable; free Wifi; a free garage parking space; in addition to an array of other amenities and comforts. The Guesthouse Hotel has an excellent location in the vibrant Andersonville neighborhood, one of Chicago's most beloved neighborhoods. We're also nestled close to Lincoln Square, another neighborhood that brings the small-town vibe to the big city. The Guesthouse Hotel is just a short hop away from Wrigley Field, as well as public transportation (bus and train), which allows convenient access to downtown Chicago and tourist attractions (Feel free to ask us for dining, shopping, and tourist recommendations!) The affordable luxury of The Guesthouse Hotel and our unique location provide the perfect rental accommodation for travelers who want the comforts and independence of their own home while enjoying all that Chicago and its local culture has to offer.",
    "detail_rating": {
        "cleanliness": null,
        "location": null,
        "rooms": null,
        "service": null,
        "sleep": null,
        "value": null
    },
    "location": {
        "city": "Chicago",
        "continent": null,
        "country": "United States",
        "proposed_city": null,
        "province": null,
        "region": null
    },
    "name": "The Guesthouse Hotel",
    "places": {
        "aka": [],
        "hotel_description": [
            "Chicago",
            "Lincoln"
        ],
        "hotel_name": []
    },
    "review_count": 21,
    "review_count_current": 12,
    "reviews": [
        {
            "date": "July 20, 2013",
            "detail_rating": {
                "business": null,
                "cleanliness": 5.0,
                "desk": null,
                "location": 4.0,
                "pool": null,
                "restaurant": null,
                "rooms": 5.0,
                "service": 5.0,
                "sleep": null,
                "value": 5.0
            },
            "helpfulness": null,
            "id": 168256347,
            "likes": {
                "disliked": null,
                "liked": null
            },
            "rating": 5.0,
            "stay_parameters": "Stayed June 2013",
            "text": "Stayed here for 4 nights in June 2013 as part of a group of 3 couples and our own 14 month old son.",
            "title": "As good as it gets!",
            "user": "RoryMc"
        },
        {
            "date": "May 15, 2013",
            "detail_rating": {
                "business": null,
                "cleanliness": null,
                "desk": null,
                "location": null,
                "pool": null,
                "restaurant": null,
                "rooms": null,
                "service": null,
                "sleep": null,
                "value": null
            },
            "helpfulness": 1,
            "id": 160813359,
            "likes": {
                "disliked": null,
                "liked": null
            },
            "rating": 5.0,
            "stay_parameters": null,
            "text": "We arrived after a long flight from Ireland to a hot and humid Chicago, weary after our travels.",
            "title": "Still a great place to stay!",
            "user": "Nancy G"
        },
        {
            "date": "May 13, 2013",
            "detail_rating": {
                "business": null,
                "cleanliness": 5.0,
                "desk": null,
                "location": 5.0,
                "pool": null,
                "restaurant": null,
                "rooms": 5.0,
                "service": 5.0,
                "sleep": 5.0,
                "value": 5.0
            },
            "helpfulness": null,
            "id": 160566210,
            "likes": {
                "disliked": null,
                "liked": null
            },
            "rating": 5.0,
            "stay_parameters": "Stayed April 2013, traveled on business",
            "text": "We were instantly revived by the lovely Aircon that hit us on entering and by the luxury of this apartment (4th floor front)",
            "title": "Outstanding Andersonville",
            "user": "Lynda1929"
        },
        {
            "date": "May 12, 2013",
            "detail_rating": {
                "business": null,
                "cleanliness": 5.0,
                "desk": null,
                "location": 5.0,
                "pool": null,
                "restaurant": null,
                "rooms": 5.0,
                "service": 5.0,
                "sleep": 5.0,
                "value": 5.0
            },
            "helpfulness": null,
            "id": 160468452,
            "likes": {
                "disliked": null,
                "liked": null
            },
            "rating": 5.0,
            "stay_parameters": "Stayed April 2013, traveled with family",
            "text": "Amazing high ceilings, very spacious and modern kitchen and dining area, high tech entertainment system, BBQ and deck, a SAUNA in our bathroom! These are just some of the things that made this apartment probably a contender for the best accomadations we have ever stayed in. :)",
            "title": "Outstanding guesthouse with exceptional customer service!",
            "user": "SB1Chicago"
        },
        {
            "date": "May 7, 2013",
            "detail_rating": {
                "business": null,
                "cleanliness": 4.0,
                "desk": null,
                "location": 4.0,
                "pool": null,
                "restaurant": null,
                "rooms": 4.0,
                "service": 5.0,
                "sleep": 5.0,
                "value": 5.0
            },
            "helpfulness": null,
            "id": 159966213,
            "likes": {
                "disliked": null,
                "liked": null
            },
            "rating": 5.0,
            "stay_parameters": "Stayed April 2013, traveled with friends",
            "text": "Very child friendly with oceans of space was a real plus for us.",
            "title": "A great week with friends",
            "user": "BearsBrighton"
        },
        {
            "date": "April 18, 2013",
            "detail_rating": {
                "business": null,
                "cleanliness": 5.0,
                "desk": null,
                "location": 4.0,
                "pool": null,
                "restaurant": null,
                "rooms": 5.0,
                "service": 5.0,
                "sleep": 5.0,
                "value": 5.0
            },
            "helpfulness": null,
            "id": 158153667,
            "likes": {
                "disliked": null,
                "liked": null
            },
            "rating": 5.0,
            "stay_parameters": "Stayed April 2013, traveled with family",
            "text": "We rented a three bedroom, two bath unit for four nights and could not be happier! We have rented condos all over the world through various means. Andersonville Guesthouse was fantastic! From the first contact through checkout everything was professional and easy. Lovely finishes, good location, and very, very clean. The huge steam shower in the master was a huge hit with my husband and our adult children. My husband is in a wheelchair and it was wonderful access from the front door all through the condo... not an easy thing to find in a vacation rental! The Andersonville area is cute and full of restaurants and shops, and a grocery store is a few blocks away. The Guesthouse will be our home away from home anytime we visit our daughter in Chicago!",
            "title": "Chicago Area Gem!",
            "user": "ChrisC54_13"
        },
        {
            "date": "April 11, 2013",
            "detail_rating": {
                "business": null,
                "cleanliness": 5.0,
                "desk": null,
                "location": 4.0,
                "pool": null,
                "restaurant": null,
                "rooms": 5.0,
                "service": 5.0,
                "sleep": 5.0,
                "value": 5.0
            },
            "helpfulness": null,
            "id": 157432757,
            "likes": {
                "disliked": null,
                "liked": null
            },
            "rating": 5.0,
            "stay_parameters": "Stayed April 2013, traveled with family",
            "text": "We just stayed at Andersonville Guesthouse for four nights and had a wonderful experience. The apartment was beautiful and well maintained. The apartment was spacious and had a fully stocked kitchen. The garage was perfect. It was great not to have to search for street parking. This was a great home away from home. This was an ideal place to stay if you want to be on the north side where there are few nice hotels and where parking can be a challenge. We would definitely stay here again.",
            "title": "Great Place to stay in North side Chicago",
            "user": "ArizonaMom54"
        },
        {
            "date": "April 8, 2013",
            "detail_rating": {
                "business": null,
                "cleanliness": 5.0,
                "desk": null,
                "location": 5.0,
                "pool": null,
                "restaurant": null,
                "rooms": 5.0,
                "service": 5.0,
                "sleep": null,
                "value": 5.0
            },
            "helpfulness": null,
            "id": 157022503,
            "likes": {
                "disliked": null,
                "liked": null
            },
            "rating": 5.0,
            "stay_parameters": "Stayed March 2013",
            "text": "I rented out the 2 bedroom suite Mar 28th-Apr 1st for my 30th birthday and my experience was amazing. The place was more then I expected. I had everything I could possibly think of to be able to cook clean and entertain my guest. My guest had no trouble finding parking (since it was the weekend they didn't have to pay the meter which was a added bonus for them). The check-in and Check-out process was very well explained in the email I actually enjoyed learning all the codes and going in and out without having to take keys with me (because of the lock box outside my room). I will never forget my birthday and my stay at Andersonville Guesthouse and how easy and nice the experience was definitely plan on going back one day.",
            "title": "Best birthday weekend ever!!!!",
            "user": "Trust_inhimonly"
        },
        {
            "date": "March 1, 2013",
            "detail_rating": {
                "business": null,
                "cleanliness": 5.0,
                "desk": null,
                "location": 3.0,
                "pool": null,
                "restaurant": null,
                "rooms": 5.0,
                "service": 5.0,
                "sleep": 5.0,
                "value": 5.0
            },
            "helpfulness": null,
            "id": 153453850,
            "likes": {
                "disliked": null,
                "liked": null
            },
            "rating": 5.0,
            "stay_parameters": "Stayed February 2013, traveled with family",
            "text": "As long we you don't mind being Andersonville, this is the place you should stay at. High sealings, garage spot, fully stocked kitchens are just a few of the reasons you should stay there. You would be silly to not consider staying here.",
            "title": "Best Value....and Best Quality",
            "user": "Jeff S"
        },
        {
            "date": "February 20, 2013",
            "detail_rating": {
                "business": null,
                "cleanliness": 5.0,
                "desk": null,
                "location": 5.0,
                "pool": null,
                "restaurant": null,
                "rooms": 5.0,
                "service": 5.0,
                "sleep": 5.0,
                "value": 5.0
            },
            "helpfulness": 1,
            "id": 152662790,
            "likes": {
                "disliked": null,
                "liked": null
            },
            "rating": 5.0,
            "stay_parameters": "Stayed February 2013, traveled with family",
            "text": "There is nothing like Andersonville Guest House anywhere in Chicago. I recently had my family stay here for my wedding. It was so nice to have both sides of the family in the same location. They appreciated having such a large place to stay, saving money by cooking 'at home' and not eating out every meal, and they were able to experience our lovely neighborhood, with a parking spot. The guest house is far more economical than a hotel downtown (which will charge you at least $30 a night for parking) and it is definitely nicer! I could not recommend the Andersonville Guest House more highly. My family can't wait to come back and visit!",
            "title": "Great accommodations in a lovely neighborhood!",
            "user": "Nichole54"
        },
        {
            "date": "January 29, 2013",
            "detail_rating": {
                "business": null,
                "cleanliness": 5.0,
                "desk": null,
                "location": 4.0,
                "pool": null,
                "restaurant": null,
                "rooms": 5.0,
                "service": 5.0,
                "sleep": 5.0,
                "value": 5.0
            },
            "helpfulness": 2,
            "id": 150921576,
            "likes": {
                "disliked": null,
                "liked": null
            },
            "rating": 5.0,
            "stay_parameters": "Stayed January 2013, traveled with family",
            "text": "I stayed here with my sister and my niece for a week in January. We have stayed in variouse vacation rentals in Chicago and I have to say THIS IS THE BEST!!! The units were niceley decorated, the kitchen had everything you needed to actually cook, the cable had everything you need to keep entertained, parking was on site, closets were huge, and the best part was the staff. Everyone was super friendly and helpful. I would definitely recommend it.",
            "title": "Loved it!!!",
            "user": "Lauradeestrada"
        },
        {
            "date": "December 22, 2012",
            "detail_rating": {
                "business": null,
                "cleanliness": 5.0,
                "desk": null,
                "location": 4.0,
                "pool": null,
                "restaurant": null,
                "rooms": 5.0,
                "service": null,
                "sleep": 4.0,
                "value": 4.0
            },
            "helpfulness": 2,
            "id": 147895156,
            "likes": {
                "disliked": null,
                "liked": null
            },
            "rating": 5.0,
            "stay_parameters": "Stayed December 2012, traveled with family",
            "text": "If you like the extra amenties offered by upscale hotels such as doorman, concierage, front desk clerk, bellhops, daily housekeeping and room service then the Andersonville Guesthouse is not for you.",
            "title": "Excellent alternative to a chain hotel",
            "user": "fillcall"
        }
    ],
    "slim_ranking": 0.104166666667,
    "stars": null,
    "tripadvisor": {
        "VISITED": false,
        "country_name": null,
        "locality": null,
        "pic_link": null,
        "street_address": null
    },
    "user_rating": 5.0,
    "variance": {
        "average": 1,
        "excellent": 19,
        "poor": 0,
        "terrible": 0,
        "very good": 1
    }
}