{
    "aka": "b Hotel",
    "description": "B-Hotel is the one of the best places to stay while visiting Barcelona. Less than ten minutes from the Ramblas, Plaza Catalunya, the beach, and the museums atop Montju\u00efc, its location within the most exciting area of the city and its proximity to the major conference centers have made B-Hotel a favorite destination for travelers on business or pleasure, as well as a key gathering spot or meeting place.",
    "detail_rating": {
        "cleanliness": 4.5,
        "location": 4.5,
        "rooms": 4.5,
        "service": 4.0,
        "sleep": 4.0,
        "value": 4.0
    },
    "location": {
        "city": null,
        "continent": "Europe",
        "country": "Spain",
        "proposed_city": "Barcelona",
        "province": null,
        "region": "Catalonia"
    },
    "name": "B-Hotel",
    "places": {
        "aka": [],
        "hotel_description": [
            "Barcelona"
        ],
        "hotel_name": []
    },
    "review_count": 1134,
    "review_count_current": 64,
    "reviews": [
        {
            "date": "April 28, 2006",
            "detail_rating": {
                "business": null,
                "cleanliness": 5.0,
                "desk": null,
                "location": null,
                "pool": null,
                "restaurant": null,
                "rooms": 5.0,
                "service": 5.0,
                "sleep": null,
                "value": 5.0
            },
            "helpfulness": 6,
            "id": 5015676,
            "likes": {
                "disliked": null,
                "liked": null
            },
            "rating": 5.0,
            "stay_parameters": "Stayed April 2006",
            "text": "Stayed in this hotel for 6 nights and we were very happy. The room was good size, the pool area is lovely. The location is excellant and the bus from the airpost drops you right by hotel. The only negative is that the hotel describtion says 'well-equipped gym' but thay was no gym at the hotel. We had a fab time in Barcelona and would love to go back to this hotel.",
            "title": "Great Hotel!",
            "user": "gemybell"
        },
        {
            "date": "April 27, 2006",
            "detail_rating": {
                "business": null,
                "cleanliness": 5.0,
                "desk": null,
                "location": null,
                "pool": null,
                "restaurant": null,
                "rooms": 5.0,
                "service": 5.0,
                "sleep": null,
                "value": 5.0
            },
            "helpfulness": 10,
            "id": 5013167,
            "likes": {
                "disliked": null,
                "liked": null
            },
            "rating": 5.0,
            "stay_parameters": "Stayed April 2006",
            "text": "stayed here for 6 days and 6 nights with my girlfriend. perfect location for town, its only 5 minutes by metro to the main shopping area and you can use the green or red metro lines from Espanya, 200 metres from the hotel (turn right out of hotel). couldn't comment on breakfast but used the local supermarket down the road, about 2 minutes walk (turn left out of the hotel) and there you can get fresh bread, croissants, etc. looks like a bookshop/newsagent but sells allsorts inside.",
            "title": "great hotel, great location",
            "user": "you_beauties"
        },
        {
            "date": "April 25, 2006",
            "detail_rating": {
                "business": null,
                "cleanliness": 5.0,
                "desk": null,
                "location": null,
                "pool": null,
                "restaurant": null,
                "rooms": 5.0,
                "service": 5.0,
                "sleep": null,
                "value": 5.0
            },
            "helpfulness": 4,
            "id": 5007953,
            "likes": {
                "disliked": null,
                "liked": null
            },
            "rating": 5.0,
            "stay_parameters": "Stayed April 2006",
            "text": "lights...don't know quite what the fuss is about, they are pretty straight forward. the main problem we had was locating the button for the blind between the bathroom and the bedroom (switch is part of shaver socket over the sink).",
            "title": "Great value Top Notch Hotel",
            "user": "AlecCampbell"
        },
        {
            "date": "April 25, 2006",
            "detail_rating": {
                "business": null,
                "cleanliness": 4.0,
                "desk": null,
                "location": null,
                "pool": null,
                "restaurant": null,
                "rooms": 4.0,
                "service": 3.0,
                "sleep": null,
                "value": 5.0
            },
            "helpfulness": 6,
            "id": 5007415,
            "likes": {
                "disliked": null,
                "liked": null
            },
            "rating": 4.0,
            "stay_parameters": "Stayed April 2006",
            "text": "great view, friendly staff. great rooftop. internet access via computer in main foyer for those of us without laptops (who takes a laptop on holiday? we're not all business men!).",
            "title": "Very nice Hotel and good value for money",
            "user": "Rosaleno"
        },
        {
            "date": "April 19, 2006",
            "detail_rating": {
                "business": null,
                "cleanliness": 4.0,
                "desk": null,
                "location": null,
                "pool": null,
                "restaurant": null,
                "rooms": 5.0,
                "service": 4.0,
                "sleep": null,
                "value": 4.0
            },
            "helpfulness": 5,
            "id": 4987456,
            "likes": {
                "disliked": null,
                "liked": null
            },
            "rating": 4.0,
            "stay_parameters": "Stayed April 2006",
            "text": "watch the funky ceiling lights in the lift as they change colour and as you move up the corridors to your room the lights brighten and dim.",
            "title": "A god choice",
            "user": "nightcrowler"
        },
        {
            "date": "August 28, 2007",
            "detail_rating": {
                "business": 5.0,
                "cleanliness": 5.0,
                "desk": null,
                "front_desk": 5.0,
                "location": 4.0,
                "pool": null,
                "restaurant": null,
                "rooms": 5.0,
                "service": 4.0,
                "sleep": null,
                "value": 4.0
            },
            "helpfulness": 2,
            "id": 8520440,
            "likes": {
                "disliked": "\u2014 Can't think of something...",
                "liked": "\u2014 The pool and hotel style."
            },
            "rating": 5.0,
            "stay_parameters": "Stayed June 2007",
            "text": "We stayed here a couple of nights in June and as we wanted something different (and a pool was important for us) we choose B-hotel at a very reasonable rate (90\u20ac per room per night), knowing that hotels in Barcelona are often over-priced in the high season and that you can only get a shabby pension for 60-70\u20ac per night it's worth it paying the extra for far better quality.",
            "title": "A nice 'different' hotel in Barcelona !",
            "user": "Delectatio"
        },
        {
            "date": "August 21, 2007",
            "detail_rating": {
                "business": 4.0,
                "cleanliness": 4.0,
                "desk": null,
                "front_desk": 3.0,
                "location": 5.0,
                "pool": null,
                "restaurant": null,
                "rooms": 4.0,
                "service": 4.0,
                "sleep": null,
                "value": 5.0
            },
            "helpfulness": 1,
            "id": 8465284,
            "likes": {
                "disliked": "\u2014 Bar",
                "liked": "\u2014 Pool"
            },
            "rating": 5.0,
            "stay_parameters": "Stayed June 2007, traveled as a couple",
            "text": "The rooms were nice, spacious, very contemporary with lcd tv, 'open' bathroom and domotica. Very well cleaned and with a nice atmosphere to them. Friendly reception staff.",
            "title": "Great Hotel To go with the girlfriend",
            "user": "Tunes7"
        },
        {
            "date": "August 19, 2007",
            "detail_rating": {
                "business": 5.0,
                "cleanliness": 5.0,
                "desk": null,
                "front_desk": 4.0,
                "location": 3.0,
                "pool": null,
                "restaurant": null,
                "rooms": 4.0,
                "service": 4.0,
                "sleep": null,
                "value": 4.0
            },
            "helpfulness": 3,
            "id": 8453946,
            "likes": {
                "disliked": "\u2014 sterile, clinical environment",
                "liked": "\u2014 cleanliness, efficiency"
            },
            "rating": 4.0,
            "stay_parameters": "Stayed August 2007, traveled with friends",
            "text": "The pool (with panoramic views) was a big bonus to cool down after hours of sightseeing.",
            "title": "excellent but we moved on !",
            "user": "JessieDublin"
        },
        {
            "date": "August 5, 2007",
            "detail_rating": {
                "business": 5.0,
                "cleanliness": 5.0,
                "desk": null,
                "front_desk": 5.0,
                "location": 5.0,
                "pool": null,
                "restaurant": null,
                "rooms": 5.0,
                "service": 5.0,
                "sleep": null,
                "value": 5.0
            },
            "helpfulness": 3,
            "id": 8357006,
            "likes": {
                "disliked": null,
                "liked": "\u2014 The roof terrace"
            },
            "rating": 5.0,
            "stay_parameters": "Stayed August 2007, traveled as a couple",
            "text": "I can recommend this hotel to anyone!",
            "title": "Brilliant stay at B-hotel",
            "user": "sarah-j-knight"
        },
        {
            "date": "August 3, 2007",
            "detail_rating": {
                "business": null,
                "cleanliness": null,
                "desk": null,
                "location": null,
                "pool": null,
                "restaurant": null,
                "rooms": null,
                "service": null,
                "sleep": null,
                "value": null
            },
            "helpfulness": 4,
            "id": 8284229,
            "likes": {
                "disliked": null,
                "liked": null
            },
            "rating": 5.0,
            "stay_parameters": null,
            "text": "I loved the hotel for several aspects. The first one and without a doubt the pool in the roof, with a view toward the Madrid square, a good place to make love. then second the room a simple but fine room, with a bathroom very fashion with a bathtub view to the bed....the personnel is simple and nice.",
            "title": "Stay Here!",
            "user": "JLLondon"
        },
        {
            "date": "April 15, 2006",
            "detail_rating": {
                "business": null,
                "cleanliness": 5.0,
                "desk": null,
                "location": null,
                "pool": null,
                "restaurant": null,
                "rooms": 5.0,
                "service": 5.0,
                "sleep": null,
                "value": 5.0
            },
            "helpfulness": 6,
            "id": 4975730,
            "likes": {
                "disliked": null,
                "liked": null
            },
            "rating": 5.0,
            "stay_parameters": "Stayed April 2006",
            "text": "B-Hotel is a great place on many levels. Firstly the design is very funky and stylish. I loved the bar area, rooms and the front door (once we'd found it!). The pool on the roof is a great plus and fab for just chilling out.",
            "title": "Cool hotel in an amazing city",
            "user": "Chris M"
        },
        {
            "date": "April 14, 2006",
            "detail_rating": {
                "business": null,
                "cleanliness": 4.0,
                "desk": null,
                "location": null,
                "pool": null,
                "restaurant": null,
                "rooms": 4.0,
                "service": 3.0,
                "sleep": null,
                "value": 4.0
            },
            "helpfulness": 13,
            "id": 4972702,
            "likes": {
                "disliked": null,
                "liked": null
            },
            "rating": 4.0,
            "stay_parameters": "Stayed April 2006",
            "text": "The location of the hotel is great, being on Placa Espanya which has a rail and tube station. A walk over the road and you have easy access to the parks of Montjuic.",
            "title": "nice hotel & not too pricey",
            "user": "iandel"
        },
        {
            "date": "April 11, 2006",
            "detail_rating": {
                "business": null,
                "cleanliness": null,
                "desk": null,
                "location": null,
                "pool": null,
                "restaurant": null,
                "rooms": null,
                "service": null,
                "sleep": null,
                "value": null
            },
            "helpfulness": 10,
            "id": 4965635,
            "likes": {
                "disliked": null,
                "liked": null
            },
            "rating": 4.0,
            "stay_parameters": null,
            "text": "There is no restaurant in the hotel and not much close by so we suggest getting into the Old Town in the centre which is 10 mins by tube.",
            "title": "Very Nice Hotel",
            "user": "A TripAdvisor user"
        },
        {
            "date": "April 5, 2006",
            "detail_rating": {
                "business": null,
                "cleanliness": 4.0,
                "desk": null,
                "location": null,
                "pool": null,
                "restaurant": null,
                "rooms": 5.0,
                "service": 3.0,
                "sleep": null,
                "value": 5.0
            },
            "helpfulness": 10,
            "id": 4937487,
            "likes": {
                "disliked": null,
                "liked": null
            },
            "rating": 5.0,
            "stay_parameters": "Stayed March 2006",
            "text": "The rooms themselves are funky with the light switch situation creating much amusement. I felt that it did seem a little rough in places as the wooden floor scratches easily but over all it is well built.",
            "title": "Loved the Design",
            "user": "lola1616"
        },
        {
            "date": "April 4, 2006",
            "detail_rating": {
                "business": null,
                "cleanliness": 5.0,
                "desk": null,
                "location": null,
                "pool": null,
                "restaurant": null,
                "rooms": 4.0,
                "service": 4.0,
                "sleep": null,
                "value": 5.0
            },
            "helpfulness": 10,
            "id": 4932296,
            "likes": {
                "disliked": null,
                "liked": null
            },
            "rating": 5.0,
            "stay_parameters": "Stayed April 2006",
            "text": "Breakfast in the hotel is 25 Euros and a small continental selection. Suggest not bothering or stocking up with a late start (it's served until 11am).",
            "title": "Chic Hotel in good location",
            "user": "bridgemagoo2"
        },
        {
            "date": "October 14, 2008",
            "detail_rating": {
                "business": 5.0,
                "cleanliness": 5.0,
                "desk": null,
                "location": 5.0,
                "pool": null,
                "restaurant": null,
                "rooms": 5.0,
                "service": 5.0,
                "sleep": null,
                "value": 5.0
            },
            "helpfulness": null,
            "id": 20872224,
            "likes": {
                "disliked": "\u2014 Would have liked a larger balcony but hey.",
                "liked": "\u2014 The decor of the rooms, very stylish and a nice chilled ambience throughout the hotel."
            },
            "rating": 5.0,
            "stay_parameters": "Stayed September 2008, traveled as a couple",
            "text": "Stayed in this hotel with my girlfriend for five nights in September and really enjoyed it.",
            "title": "Fantastic hotel",
            "user": "Karagiozis"
        },
        {
            "date": "October 6, 2008",
            "detail_rating": {
                "business": null,
                "cleanliness": 5.0,
                "desk": null,
                "front_desk": 5.0,
                "location": 5.0,
                "pool": null,
                "restaurant": null,
                "rooms": 5.0,
                "service": 5.0,
                "sleep": null,
                "value": 5.0
            },
            "helpfulness": 1,
            "id": 20676284,
            "likes": {
                "disliked": "\u2014 N/A",
                "liked": "\u2014 The design of the rooms"
            },
            "rating": 5.0,
            "stay_parameters": "Stayed October 2008, traveled with family",
            "text": "The room was excellent and the decor/style was very original. Very clean and the bathroom adds a very nice touch.",
            "title": "Will definitely stay here again!",
            "user": "lbcf"
        },
        {
            "date": "September 15, 2008",
            "detail_rating": {
                "business": 5.0,
                "cleanliness": 4.0,
                "desk": null,
                "front_desk": 4.0,
                "location": 5.0,
                "pool": null,
                "restaurant": null,
                "rooms": 4.0,
                "service": 4.0,
                "sleep": null,
                "value": 4.0
            },
            "helpfulness": null,
            "id": 20096087,
            "likes": {
                "disliked": "\u2014 Price increases",
                "liked": "\u2014 Location and Style"
            },
            "rating": 4.0,
            "stay_parameters": "Stayed June 2005, traveled as a couple",
            "text": "The staff throughout the hotel were fantastic in particular the reception desk always helpful and accommodating.",
            "title": "Great location - Gorgeous Hotel.",
            "user": "TeeGee101"
        },
        {
            "date": "August 27, 2008",
            "detail_rating": {
                "business": 4.0,
                "cleanliness": 5.0,
                "desk": null,
                "front_desk": 5.0,
                "location": 1.0,
                "pool": null,
                "restaurant": null,
                "rooms": 4.0,
                "service": 5.0,
                "sleep": null,
                "value": 2.0
            },
            "helpfulness": 1,
            "id": 19411477,
            "likes": {
                "disliked": "\u2014 Location plus \"trying hard but not quiet getting it feeling\"",
                "liked": "\u2014 Staff and Rooms"
            },
            "rating": 3.0,
            "stay_parameters": "Stayed July 2008, traveled with friends",
            "text": "The location is slightly out of town (15-20 mins walk to the center depending on pace) but it is right next to a metro station (3-4 stops) and you dont really notice. Weather permitting the rooftop pool is an ideal place to relax with some nice views.",
            "title": "Alright if you are not fussy",
            "user": "ChampagneTasteEurope"
        },
        {
            "date": "August 26, 2008",
            "detail_rating": {
                "business": 5.0,
                "cleanliness": 5.0,
                "desk": null,
                "front_desk": 2.0,
                "location": 4.0,
                "pool": null,
                "restaurant": null,
                "rooms": 5.0,
                "service": 2.0,
                "sleep": null,
                "value": 3.0
            },
            "helpfulness": null,
            "id": 19366845,
            "likes": {
                "disliked": "\u2014 service",
                "liked": "\u2014 location"
            },
            "rating": 5.0,
            "stay_parameters": "Stayed April 2008, traveled with friends",
            "text": "Would definitely stay here again if I came back to barcelona.",
            "title": "Nice Hotel - Staff Issues",
            "user": "zouki_08"
        },
        {
            "date": "January 25, 2006",
            "detail_rating": {
                "business": null,
                "cleanliness": 5.0,
                "desk": null,
                "location": null,
                "pool": null,
                "restaurant": null,
                "rooms": 5.0,
                "service": 5.0,
                "sleep": null,
                "value": 4.0
            },
            "helpfulness": 13,
            "id": 4387173,
            "likes": {
                "disliked": null,
                "liked": null
            },
            "rating": 5.0,
            "stay_parameters": "Stayed January 2006, traveled on business",
            "text": "Stayed 23rd January. Room on 7th Floor - very stylish, lots of nice touches, quality fittings. Hotel is fabulous - staff were polite, friendly and helpfull. Breakfast was good, lots of choice and typical of Barcelona hotels. Despite being very close to Place D'Espanya the room was very quiet. I travel to Barcelona frequently and like to be away from the Ramblas area because it is so noisy. B is about 20 minute walk from Place Catalunya but is yards from Metro. For \u20ac1.20 you can travel to Catalunya in 10 minutes. Also taxis are very cheap although most taxi drivers speak no English. Hotel were having problems with hot water supply but this was out of their control ~ problem locally with water supply on that day. I can't recommend this hotel enough.",
            "title": "Excellent",
            "user": "gabsterUK"
        },
        {
            "date": "January 24, 2006",
            "detail_rating": {
                "business": null,
                "cleanliness": null,
                "desk": null,
                "location": null,
                "pool": null,
                "restaurant": null,
                "rooms": null,
                "service": null,
                "sleep": null,
                "value": null
            },
            "helpfulness": 9,
            "id": 4373706,
            "likes": {
                "disliked": null,
                "liked": null
            },
            "rating": 4.0,
            "stay_parameters": null,
            "text": "Great hotel, cool rooms and great service. Staff was relaxed and very nice to deal with.",
            "title": "Great hotel, but noisy and location a bit off",
            "user": "A TripAdvisor user"
        },
        {
            "date": "January 1, 2006",
            "detail_rating": {
                "business": null,
                "cleanliness": null,
                "desk": null,
                "location": null,
                "pool": null,
                "restaurant": null,
                "rooms": null,
                "service": null,
                "sleep": null,
                "value": null
            },
            "helpfulness": 21,
            "id": 4315266,
            "likes": {
                "disliked": null,
                "liked": null
            },
            "rating": 5.0,
            "stay_parameters": null,
            "text": "Ask for a corner room as they are slightly larger. Rooms facing the street slightly noisy in the morning rush. Breakfast buffe not that good, and location a bit off perhaps. Taxis are cheap and easy to come by though so did not matter much.",
            "title": "Funky hotel in a funky city",
            "user": "dollmint"
        },
        {
            "date": "March 26, 2006",
            "detail_rating": {
                "business": null,
                "cleanliness": null,
                "desk": null,
                "location": null,
                "pool": null,
                "restaurant": null,
                "rooms": null,
                "service": null,
                "sleep": null,
                "value": null
            },
            "helpfulness": 11,
            "id": 4735149,
            "likes": {
                "disliked": null,
                "liked": null
            },
            "rating": 5.0,
            "stay_parameters": null,
            "text": "Alright, this was the 2nd stay of our honeymoon (the 1st was Rome), and we were very pleased with everything about this hotel. The hotel staff was excellent. They spoke good English and pointed us out in every direction- The nightlife, tourist attractions, romantic spots and everything. The location of the hotel is excellent. The metro is about a 5 min walk. The metro is very convenient to get to anywhere in the city. I would advise on your 1st day in Spain to take the guided bus tour and figure out which sites you like and then visit them accordingly the following days.",
            "title": "Honeymooned Here",
            "user": "A TripAdvisor user"
        },
        {
            "date": "March 21, 2006",
            "detail_rating": {
                "business": null,
                "cleanliness": 3.0,
                "desk": null,
                "location": null,
                "pool": null,
                "restaurant": null,
                "rooms": 2.0,
                "service": 1.0,
                "sleep": null,
                "value": 3.0
            },
            "helpfulness": 18,
            "id": 4721016,
            "likes": {
                "disliked": null,
                "liked": null
            },
            "rating": 2.0,
            "stay_parameters": "Stayed March 2006",
            "text": "The Hotel Room was very nice and elegant. The lighting of the room was awesome (a little hard to figure out). You could dim the lights and could make for a very eventful night. There is FREE internet service in the hotel, so no need for a laptop.",
            "title": "Second rate hotel with rude staff",
            "user": "MadamLucyLuLu"
        },
        {
            "date": "March 20, 2006",
            "detail_rating": {
                "business": null,
                "cleanliness": 5.0,
                "desk": null,
                "location": null,
                "pool": null,
                "restaurant": null,
                "rooms": 5.0,
                "service": 5.0,
                "sleep": null,
                "value": 5.0
            },
            "helpfulness": 9,
            "id": 4703397,
            "likes": {
                "disliked": null,
                "liked": null
            },
            "rating": 5.0,
            "stay_parameters": "Stayed March 2006",
            "text": "Overall, me and my wife have NO complaints about this hotel (and we are very particular about room standards). We would definitely stay there again.",
            "title": "loved the hotel b",
            "user": "chefola"
        },
        {
            "date": "March 20, 2006",
            "detail_rating": {
                "business": null,
                "cleanliness": 5.0,
                "desk": null,
                "location": null,
                "pool": null,
                "restaurant": null,
                "rooms": 5.0,
                "service": 5.0,
                "sleep": null,
                "value": 5.0
            },
            "helpfulness": 7,
            "id": 4694829,
            "likes": {
                "disliked": null,
                "liked": null
            },
            "rating": 5.0,
            "stay_parameters": "Stayed December 2005",
            "text": "Having read some of the excellent reviews that the B Hotel has on Tripadvisor my boyfriend and I decided to book seven nights with them.",
            "title": "loved it !!!!",
            "user": "mdnadri"
        },
        {
            "date": "February 20, 2006",
            "detail_rating": {
                "business": null,
                "cleanliness": 5.0,
                "desk": null,
                "location": null,
                "pool": null,
                "restaurant": null,
                "rooms": 5.0,
                "service": 4.0,
                "sleep": null,
                "value": 5.0
            },
            "helpfulness": 19,
            "id": 4472515,
            "likes": {
                "disliked": null,
                "liked": null
            },
            "rating": 4.0,
            "stay_parameters": "Stayed May 2005",
            "text": "When we arrived they couldn't find our booking but after ten minutes or so of looking they did. When we went to our room we found they had given us a twin room and we had booked a double. We went back to reception to explain that we had booked a double not a twin and we were told that in Spain there is no word for twin and that a \"double\" just means it sleeps two whether it's two single beds or one double bed. The staff member who told us this was very abrupt. We were told that getting a double room was \"NOT POSSIBLE\" until the next day. We were disappointed but we agreed.",
            "title": "A must for a girlie weekend!",
            "user": "louloulh"
        },
        {
            "date": "February 6, 2006",
            "detail_rating": {
                "business": null,
                "cleanliness": null,
                "desk": null,
                "location": null,
                "pool": null,
                "restaurant": null,
                "rooms": null,
                "service": null,
                "sleep": null,
                "value": null
            },
            "helpfulness": 17,
            "id": 4416970,
            "likes": {
                "disliked": null,
                "liked": null
            },
            "rating": 5.0,
            "stay_parameters": null,
            "text": "Service was absolutely fabulous. Sergio at the front desk was so friendly, helpful, and professional. Nothing was a problem for them.",
            "title": "Spot On",
            "user": "A TripAdvisor user"
        },
        {
            "date": "February 2, 2006",
            "detail_rating": {
                "business": null,
                "cleanliness": null,
                "desk": null,
                "location": null,
                "pool": null,
                "restaurant": null,
                "rooms": null,
                "service": null,
                "sleep": null,
                "value": null
            },
            "helpfulness": 14,
            "id": 4408386,
            "likes": {
                "disliked": null,
                "liked": null
            },
            "rating": 5.0,
            "stay_parameters": null,
            "text": "We have nothing bad to say about this hotel and would stay here over and over again!!!",
            "title": "A Grade for the B Hotel",
            "user": "A TripAdvisor user"
        },
        {
            "date": "October 24, 2005",
            "detail_rating": {
                "business": null,
                "cleanliness": null,
                "desk": null,
                "location": null,
                "pool": null,
                "restaurant": null,
                "rooms": null,
                "service": null,
                "sleep": null,
                "value": null
            },
            "helpfulness": 9,
            "id": 4047668,
            "likes": {
                "disliked": null,
                "liked": null
            },
            "rating": 5.0,
            "stay_parameters": null,
            "text": "I'd definately recommend this hotel to people wanting a bit of luxury at affordable prices. As soon as I walked into the room, the modern style reminded me of the Lowry Hotel in Manchester. The room had all modern and stylish amenities, including a digital safe, which was free to use. The plasma screen tv was a good bonus too. The rooms are quiet, and if you prefer to have the balcony doors shut at night, no traffic noise can be heard. The location is ideal, I got the aerobus from El Prat which drops you off on Placa Espanya and its only a short walk to the hotel. Montjuic, MNAC, the Olympic Stadiums and Poble Espanyol are about a 20-25 minute walk away (Depending on how fast you walk!) and the views of the city from the steps of MNAC and from the Olympic Stadium are amazing, especially on a clear day. There is easy access to Placa Catalunya from the bus stop accross the road from the hotel, which has buses running very often. The supermarket down the street is also very convenient with cheap food, especially if you're on a budget ;) I'd definately go back to Barcelona again (for the 4th time!), and to this hotel especially ;)",
            "title": "Amazing hotel!!!",
            "user": "A TripAdvisor user"
        },
        {
            "date": "October 18, 2005",
            "detail_rating": {
                "business": null,
                "cleanliness": null,
                "desk": null,
                "location": null,
                "pool": null,
                "restaurant": null,
                "rooms": null,
                "service": null,
                "sleep": null,
                "value": null
            },
            "helpfulness": 14,
            "id": 4033814,
            "likes": {
                "disliked": null,
                "liked": null
            },
            "rating": 5.0,
            "stay_parameters": null,
            "text": "Where to start. This hotel is of a VERY high standard for the money. The thing that stops it getting higher star rating is the absence of a restaurant. This is how the Star-rating system works. No restaurant means it can't get any higher. We stayed for 5 nights, in October - after the end of the main tourist season really. The room was great. Clean, crisp and modern. The double bed was two single's wedged together, but it was HUGE and hardly noticeable. The bath was lovely, although it took us 10 minutes to find the tap! (Modern fixtures!) The only slight 'quirk' was that the wall between the bed and the bath/shower was glass. No curtain or anything. So whether you wanted to or not, you got to watch your roommate soaping themselves! Fine if you're a couple, but if you're away sharing and on business or just friends, you might not be so keen! I'm guessing twin rooms must have a different arrangement.",
            "title": "Brilliant value hotel in a central location.",
            "user": "A TripAdvisor user"
        },
        {
            "date": "January 4, 2008",
            "detail_rating": {
                "business": null,
                "cleanliness": 4.0,
                "desk": null,
                "front_desk": 4.0,
                "location": 3.0,
                "pool": null,
                "restaurant": null,
                "rooms": 5.0,
                "service": 4.0,
                "sleep": null,
                "value": 4.0
            },
            "helpfulness": 1,
            "id": 12320671,
            "likes": {
                "disliked": "\u2014 Noise from metro trains and passing ambulances.",
                "liked": "\u2014 Good size rooms, modern and clean."
            },
            "rating": 3.0,
            "stay_parameters": "Stayed December 2007, traveled as a couple",
            "text": "Before you book this hotel, you need to ask yourself what you want. If you want a hotel that has lots of bars, restauraunts and shops within easy walking distance, then this is not the hotel for you. If however you want a hotel that is close to the metro and therefore easy to get anywhere is barcelona quickly then this could be for you. But way up the pros and cons.",
            "title": "Way up the pros and cons",
            "user": "bellmeister"
        },
        {
            "date": "January 1, 2008",
            "detail_rating": {
                "business": 5.0,
                "cleanliness": 4.0,
                "desk": null,
                "front_desk": 2.0,
                "location": 1.0,
                "pool": null,
                "restaurant": null,
                "rooms": 1.0,
                "service": 1.0,
                "sleep": null,
                "value": 2.0
            },
            "helpfulness": null,
            "id": 12167579,
            "likes": {
                "disliked": "\u2014 Price, Room, Location",
                "liked": "\u2014 Nothing"
            },
            "rating": 2.0,
            "stay_parameters": "Stayed December 2007, traveled with friends",
            "text": "Pros:",
            "title": "Over rated hotel",
            "user": "worldcitizn"
        },
        {
            "date": "December 23, 2007",
            "detail_rating": {
                "business": 3.0,
                "cleanliness": 3.0,
                "desk": null,
                "front_desk": 3.0,
                "location": 3.0,
                "pool": null,
                "restaurant": null,
                "rooms": 4.0,
                "service": 3.0,
                "sleep": null,
                "value": 4.0
            },
            "helpfulness": 1,
            "id": 11914197,
            "likes": {
                "disliked": "\u2014 Nothing",
                "liked": "\u2014 Nothing"
            },
            "rating": 4.0,
            "stay_parameters": "Stayed December 2007, traveled as a couple",
            "text": "very close to espanya metro station (L1 and L3)",
            "title": "Great place for the weekend in Barcelona",
            "user": "Arturas"
        },
        {
            "date": "December 9, 2007",
            "detail_rating": {
                "business": 5.0,
                "cleanliness": 5.0,
                "desk": null,
                "front_desk": 5.0,
                "location": 3.0,
                "pool": null,
                "restaurant": null,
                "rooms": 5.0,
                "service": 4.0,
                "sleep": null,
                "value": 4.0
            },
            "helpfulness": null,
            "id": 11403948,
            "likes": {
                "disliked": "\u2014 location",
                "liked": "\u2014 the room"
            },
            "rating": 4.0,
            "stay_parameters": "Stayed March 2007, traveled with family",
            "text": "modern and spacious rooms with great fitout",
            "title": "Good hotel",
            "user": "memoria-TRIP"
        },
        {
            "date": "November 21, 2007",
            "detail_rating": {
                "business": null,
                "cleanliness": 3.0,
                "desk": null,
                "front_desk": 4.0,
                "location": 4.0,
                "pool": null,
                "restaurant": null,
                "rooms": 5.0,
                "service": 5.0,
                "sleep": null,
                "value": 5.0
            },
            "helpfulness": 4,
            "id": 10955373,
            "likes": {
                "disliked": "\u2014 Cleaner failed to clean vertical surfaces in bathroom area!",
                "liked": "\u2014 Quiet room in a supposedly noisy city."
            },
            "rating": 5.0,
            "stay_parameters": "Stayed November 2007, traveled as a couple",
            "text": "in room safe",
            "title": "Excellent value for money",
            "user": "aber-fan"
        },
        {
            "date": "September 18, 2007",
            "detail_rating": {
                "business": 3.0,
                "cleanliness": 4.0,
                "desk": null,
                "front_desk": 3.0,
                "location": 4.0,
                "pool": null,
                "restaurant": null,
                "rooms": 5.0,
                "service": 3.0,
                "sleep": null,
                "value": 4.0
            },
            "helpfulness": 9,
            "id": 8749731,
            "likes": {
                "disliked": null,
                "liked": null
            },
            "rating": 5.0,
            "stay_parameters": "Stayed March 2007, traveled as a couple",
            "text": "I arrived at the B-Hotel with my girlfriend for a few romantic days away with each other. When we arrived at the hotel, we were not dissapointed. It is however important to note that this is not a full services hotel, for example, it has a bar by the rooftop pool but no barman behind it, there is a bar in the main lobby but it shuts at 10:00 in the evening & there is a room to take breakfast in should you so desire...but no restaurant to talk of that will serve dinner etc...",
            "title": "Its all about the roof-top pool...;)",
            "user": "TheOracle"
        },
        {
            "date": "September 15, 2007",
            "detail_rating": {
                "business": 5.0,
                "cleanliness": 5.0,
                "desk": null,
                "front_desk": 4.0,
                "location": 4.0,
                "pool": null,
                "restaurant": null,
                "rooms": 4.0,
                "service": 4.0,
                "sleep": null,
                "value": 5.0
            },
            "helpfulness": 3,
            "id": 8718298,
            "likes": {
                "disliked": "\u2014 No balcony to sit onb",
                "liked": "\u2014 big room and the pool"
            },
            "rating": 4.0,
            "stay_parameters": "Stayed September 2007, traveled as a couple",
            "text": "For us, that was not a problem becuase if you in Barcelona, quite frankly, you are there to explore the streets anf find bars and restaurants either recommended to you or that you have researched already.",
            "title": "As good as it sounds",
            "user": "ksamwell"
        },
        {
            "date": "September 7, 2007",
            "detail_rating": {
                "business": null,
                "cleanliness": null,
                "desk": null,
                "location": null,
                "pool": null,
                "restaurant": null,
                "rooms": null,
                "service": null,
                "sleep": null,
                "value": null
            },
            "helpfulness": 3,
            "id": 8669777,
            "likes": {
                "disliked": null,
                "liked": null
            },
            "rating": 5.0,
            "stay_parameters": null,
            "text": "This hotel is a design hotel first and foremost so what you will see everywhere are touches of minimalism and bespoke design pieces matched with your trademark design hotel mood lighting.",
            "title": "A place really worth staying!",
            "user": "ereme"
        },
        {
            "date": "September 5, 2007",
            "detail_rating": {
                "business": 5.0,
                "cleanliness": 5.0,
                "desk": null,
                "front_desk": 5.0,
                "location": 5.0,
                "pool": null,
                "restaurant": null,
                "rooms": 5.0,
                "service": 5.0,
                "sleep": null,
                "value": 5.0
            },
            "helpfulness": 2,
            "id": 8661837,
            "likes": {
                "disliked": "\u2014 nothing",
                "liked": "\u2014 the room and pool"
            },
            "rating": 5.0,
            "stay_parameters": "Stayed September 2007",
            "text": "Check-in was efficient and we were racing up to our room in no time at all. At this juncture I feel it necessary to point out that there are two categories of room.",
            "title": "Just wonderfull...just B-Hotel...",
            "user": "MariaCoimbra"
        },
        {
            "date": "September 2, 2007",
            "detail_rating": {
                "business": null,
                "cleanliness": null,
                "desk": null,
                "location": null,
                "pool": null,
                "restaurant": null,
                "rooms": null,
                "service": null,
                "sleep": null,
                "value": null
            },
            "helpfulness": 3,
            "id": 8606016,
            "likes": {
                "disliked": null,
                "liked": null
            },
            "rating": 4.0,
            "stay_parameters": null,
            "text": "The first is your standard room which encompasses a king, queen or two twins together bed (important to specify upon booking) with a modern bath/shower, fun/complicated mood lighting, 20\" LCD television with limited channels and floor to ceiling windows spanning the width of the room with a half metre deep balcony in front. When booking, specify that you would like a room facing the Plaza Espana as the room are very well sound insulated with aircon so worrying about leaving the balcony door open is not an issue and you can wake up to a marvellous yet buzzing view.",
            "title": "Cool Barcelona hotel",
            "user": "ljrslp"
        },
        {
            "date": "November 16, 2005",
            "detail_rating": {
                "business": null,
                "cleanliness": null,
                "desk": null,
                "location": null,
                "pool": null,
                "restaurant": null,
                "rooms": null,
                "service": null,
                "sleep": null,
                "value": null
            },
            "helpfulness": 11,
            "id": 4121034,
            "likes": {
                "disliked": null,
                "liked": null
            },
            "rating": 5.0,
            "stay_parameters": null,
            "text": "What can I say about this hotel that hasn't already been said?! I booked it on the recommendation of a friend of a friend and wasn't dissapointed with it.",
            "title": "Excellent Value for money",
            "user": "A TripAdvisor user"
        },
        {
            "date": "November 8, 2005",
            "detail_rating": {
                "business": null,
                "cleanliness": null,
                "desk": null,
                "location": null,
                "pool": null,
                "restaurant": null,
                "rooms": null,
                "service": null,
                "sleep": null,
                "value": null
            },
            "helpfulness": 9,
            "id": 4093252,
            "likes": {
                "disliked": null,
                "liked": null
            },
            "rating": 4.0,
            "stay_parameters": null,
            "text": "As soon as we'd pulled up in the taxi outside the hotel my girlfriend and I were lost for words, even more so when we got to our room. We stayed on the executive (7th) floor and had a nice little balcony, amazing lighting and furniture and a great view of Gran Via.",
            "title": "A Special Recommendation!!!",
            "user": "A TripAdvisor user"
        },
        {
            "date": "August 21, 2008",
            "detail_rating": {
                "business": 4.0,
                "cleanliness": 4.0,
                "desk": null,
                "front_desk": 4.0,
                "location": 3.0,
                "pool": null,
                "restaurant": null,
                "rooms": 4.0,
                "service": 3.0,
                "sleep": null,
                "value": 3.0
            },
            "helpfulness": 1,
            "id": 19213431,
            "likes": {
                "disliked": "\u2014 Breakfast",
                "liked": "\u2014 Roof top pool and deck area"
            },
            "rating": 5.0,
            "stay_parameters": "Stayed August 2008, traveled as a couple",
            "text": "I recently went to Barcelona for the first time with my girlftriend and we stayed at the B-Hotel and had an absolutely amazing time. This hotel is extremely chic and in a great location for those who prefer not to stay too close to the madness of the Ramblas. It is very close to the Magic Fountain which has an amazing light and music show in the evenings. Getting to the Ramblas, the beach and the marina is extremely easy as there is a Metro station and a bus stop incredibly nearby and Spanish public transport is fast, clean, very cheap and air conditioned.",
            "title": "Great discovery.",
            "user": "stanley9"
        },
        {
            "date": "August 12, 2008",
            "detail_rating": {
                "business": null,
                "cleanliness": 5.0,
                "desk": null,
                "front_desk": 4.0,
                "location": 4.0,
                "pool": null,
                "restaurant": null,
                "rooms": 4.0,
                "service": 5.0,
                "sleep": null,
                "value": 4.0
            },
            "helpfulness": 1,
            "id": 18873354,
            "likes": {
                "disliked": "\u2014 Small balconies",
                "liked": "\u2014 Value for money"
            },
            "rating": 5.0,
            "stay_parameters": "Stayed August 2008, traveled with friends",
            "text": "The hotel itself is beautifully designed and has an amazing roof top deck with sun loungers, complete with an infinity pool, which is a great place to chill out after a day's sightseeing or before heading off at night. The rooms themselves are great too and have excellent bathrooms although the lighting takes some getting used to! Our only criticism would be the awful overpriced breakfasts. Guests would do better to walk around the corner to Paul's the upmarket bakers and buy some top notch pastries instead.",
            "title": "Superb hotel, great location",
            "user": "Calby71"
        },
        {
            "date": "July 30, 2008",
            "detail_rating": {
                "business": 5.0,
                "cleanliness": 5.0,
                "desk": null,
                "front_desk": 4.0,
                "location": 5.0,
                "pool": null,
                "restaurant": null,
                "rooms": 5.0,
                "service": 5.0,
                "sleep": null,
                "value": 5.0
            },
            "helpfulness": null,
            "id": 18413276,
            "likes": {
                "disliked": null,
                "liked": "\u2014 Terrace, rooms, breakfast, location"
            },
            "rating": 5.0,
            "stay_parameters": "Stayed July 2008, traveled on business",
            "text": "Incidentally, we'd heard that Barcelona could be dangerous with lot's of muggings but we felt quite safe strolling through the town at midnight.",
            "title": "Great, modern hotel with perfect location",
            "user": "VolleyNOR"
        },
        {
            "date": "July 15, 2008",
            "detail_rating": {
                "business": 3.0,
                "cleanliness": 5.0,
                "desk": null,
                "front_desk": 4.0,
                "location": 4.0,
                "pool": null,
                "restaurant": null,
                "rooms": 4.0,
                "service": 4.0,
                "sleep": null,
                "value": 4.0
            },
            "helpfulness": null,
            "id": 17907270,
            "likes": {
                "disliked": "\u2014 Bathrooms",
                "liked": "\u2014 Modern design"
            },
            "rating": 4.0,
            "stay_parameters": "Stayed June 2008, traveled on business",
            "text": "Finally, this hotel appeals to couples of all sexual persuasions but is not suitable for families, as it lacks child friendly facilities.",
            "title": "Modern hotel, good price",
            "user": "molly_malone_81"
        },
        {
            "date": "June 28, 2008",
            "detail_rating": {
                "business": 5.0,
                "cleanliness": 5.0,
                "desk": null,
                "front_desk": 5.0,
                "location": 5.0,
                "pool": null,
                "restaurant": null,
                "rooms": 5.0,
                "service": 5.0,
                "sleep": null,
                "value": 5.0
            },
            "helpfulness": null,
            "id": 17316979,
            "likes": {
                "disliked": "\u2014 nothing",
                "liked": "\u2014 rooms"
            },
            "rating": 5.0,
            "stay_parameters": "Stayed May 2008, traveled as a couple",
            "text": "I was with a party of 6 girls, celebrating a big birthday. The hotel was perfect for this. Lovely terrace with pool, and the friendly staff on hand with beers for us! I booked directly with the hotel and got a very good price. I would recommend staying here as you are minutes away from the Metro and the stop for the tour bus, which I would thoroughly recommend. I didn't have breakfast in the hotel as it was 13 euros, but there were plenty of restaurants on the main street. I would stay here again.",
            "title": "Great Adult Location",
            "user": "Andrew N"
        },
        {
            "date": "November 8, 2007",
            "detail_rating": {
                "business": null,
                "cleanliness": 5.0,
                "desk": null,
                "front_desk": 5.0,
                "location": 4.0,
                "pool": null,
                "restaurant": null,
                "rooms": 5.0,
                "service": 5.0,
                "sleep": null,
                "value": 4.0
            },
            "helpfulness": null,
            "id": 10699437,
            "likes": {
                "disliked": "\u2014 Distance from centre",
                "liked": "\u2014 Modern design"
            },
            "rating": 5.0,
            "stay_parameters": "Stayed August 2007, traveled as a couple",
            "text": "Spent a long weekend at the B Hotel. Very impressed with the modern design. Staff were excellent when asked about local facilities ie shopping, bars and restaurants. Breakfast was the best continental buffet I have had anywhere. A good walk to main centre, but enjoyable. The best feature was the rooftop pool and terrace area. The second best was the design of the bathroom. Thoroughly recommended!",
            "title": "Stylish B Hotel",
            "user": "Juli3G"
        },
        {
            "date": "October 27, 2007",
            "detail_rating": {
                "business": null,
                "cleanliness": null,
                "desk": null,
                "location": null,
                "pool": null,
                "restaurant": null,
                "rooms": null,
                "service": null,
                "sleep": null,
                "value": null
            },
            "helpfulness": 1,
            "id": 10379099,
            "likes": {
                "disliked": null,
                "liked": null
            },
            "rating": 4.0,
            "stay_parameters": null,
            "text": "I just returned from a four night weekend break at the B Hotel in Barcelona and was delighted with the hotel. The rooms are typical boutique style with everything you could want - fantastic mood lighting, block-out curtains and ample storage - with superb bathroom - the shower was one of the best I have had, and the range of products provided extensive, including decent hairdryer! In contrast to other reviewers I did not find the window wall to the bathroom a problem as there was a ceiling to floor blind maintaining some privacy. Although the rooms are sound proofed, the main road outside is noisy and you can hear traffic at night. The pool is breathtaking - an infinity pool on the roof with lots of loungers and cushioned chairs. There is also internet access in the lobby which seems to be very popular, and wifi in the rooms if you have your own laptop. Reception very helpful for restaurant bookings in the city. Would highly recommend this hotel for singles, couples and families - great value for the price you pay.",
            "title": "Fantastic Boutique Hotel",
            "user": "AppyOlidee"
        },
        {
            "date": "October 19, 2007",
            "detail_rating": {
                "business": 2.0,
                "cleanliness": 5.0,
                "desk": null,
                "front_desk": 3.0,
                "location": 5.0,
                "pool": null,
                "restaurant": null,
                "rooms": 5.0,
                "service": 3.0,
                "sleep": null,
                "value": 4.0
            },
            "helpfulness": null,
            "id": 10134199,
            "likes": {
                "disliked": null,
                "liked": "\u2014 Rooms"
            },
            "rating": 3.0,
            "stay_parameters": "Stayed September 2007, traveled solo",
            "text": "Stayed here 3 nights on my first barcelona visit. It is one of the best designed hotel i have ever seen. Rooms,bathroom,terrace,bathroom amenities, everything was unique.Rooftop view was spectacular at night, however the swimming pool was way too small for a hotel with 80 rooms.",
            "title": "Great design, poor staff",
            "user": "chloeshiny"
        },
        {
            "date": "October 18, 2007",
            "detail_rating": {
                "business": 4.0,
                "cleanliness": 4.0,
                "desk": null,
                "front_desk": 5.0,
                "location": 4.0,
                "pool": null,
                "restaurant": null,
                "rooms": 5.0,
                "service": 3.0,
                "sleep": null,
                "value": 5.0
            },
            "helpfulness": null,
            "id": 10120824,
            "likes": {
                "disliked": null,
                "liked": null
            },
            "rating": 4.0,
            "stay_parameters": "Stayed October 2007, traveled solo",
            "text": "Breakfast had a lot of choices, there were tapas, light food, cookies,pastries, all kinds of fruit juices and drinks. Plus, it was served till 11 oclock, which was good for late sleepers.",
            "title": "Great Hotel. I would definitely stay here again.",
            "user": "snowcrash"
        },
        {
            "date": "October 18, 2007",
            "detail_rating": {
                "business": 4.0,
                "cleanliness": 5.0,
                "desk": null,
                "front_desk": 4.0,
                "location": 4.0,
                "pool": null,
                "restaurant": null,
                "rooms": 4.0,
                "service": 4.0,
                "sleep": null,
                "value": 5.0
            },
            "helpfulness": 2,
            "id": 10109959,
            "likes": {
                "disliked": "\u2014 Would have preferred some more choice at breakfast.",
                "liked": "\u2014 The design and the cleanliness."
            },
            "rating": 5.0,
            "stay_parameters": "Stayed June 2006, traveled with friends",
            "text": "Other than all the good things, hotel staff didnt really speak english, and the ones who spoke answered me back in Spanish. It is such a shame cos there were many american tourists at the hotel.Last day, i needed to use the so-called `business center` and it was a total dissapointment.First, the printer wasnt installed on the hotel computer so i had to bring my own laptop, and connect the printer.And then there were only a few sheets of paper in the printer and one side of them were already used,but they were turned back to the clean side,so when i tried to print a document, it was successfully printed on the used side of the papers. I am sure it is not so difficult for a hotel that charges the customers minimum 150Euros for a night to supply clean and unused papers and properly working computers for business center.",
            "title": "Great hotel, good location",
            "user": "bhhandel"
        },
        {
            "date": "June 23, 2008",
            "detail_rating": {
                "business": null,
                "cleanliness": null,
                "desk": null,
                "location": null,
                "pool": null,
                "restaurant": null,
                "rooms": null,
                "service": null,
                "sleep": null,
                "value": null
            },
            "helpfulness": null,
            "id": 17158168,
            "likes": {
                "disliked": null,
                "liked": null
            },
            "rating": 5.0,
            "stay_parameters": null,
            "text": "I was more than pleased with our stay at the B Hotel. It was very modern, clean & very convieniently located to the train station, airport & tourist buses. I would definately stay there again. I always check several web sites. 1st prices(very reasonable), then for reviews, and we (there were 6 of us) were not disappointed with anything at the \"B\".",
            "title": "Loved the \"B\" Hotel!",
            "user": "A TripAdvisor user"
        },
        {
            "date": "June 12, 2008",
            "detail_rating": {
                "business": null,
                "cleanliness": 5.0,
                "desk": null,
                "front_desk": 5.0,
                "location": 4.0,
                "pool": null,
                "restaurant": null,
                "rooms": 5.0,
                "service": 5.0,
                "sleep": null,
                "value": 4.0
            },
            "helpfulness": 1,
            "id": 16871170,
            "likes": {
                "disliked": null,
                "liked": null
            },
            "rating": 5.0,
            "stay_parameters": "Stayed June 2008, traveled as a couple",
            "text": "Peggy S",
            "title": "Great stay.",
            "user": "timbo56"
        },
        {
            "date": "May 31, 2008",
            "detail_rating": {
                "business": 4.0,
                "cleanliness": 5.0,
                "desk": null,
                "front_desk": 1.0,
                "location": 4.0,
                "pool": null,
                "restaurant": null,
                "rooms": 4.0,
                "service": 2.0,
                "sleep": null,
                "value": 3.0
            },
            "helpfulness": 1,
            "id": 16534093,
            "likes": {
                "disliked": "\u2014 Receptionist",
                "liked": "\u2014 Comfort"
            },
            "rating": 2.0,
            "stay_parameters": "Stayed August 2007, traveled as a couple",
            "text": "California",
            "title": "Great Hotel, Unpolite receptionist",
            "user": "MACY13a"
        },
        {
            "date": "May 31, 2008",
            "detail_rating": {
                "business": 4.0,
                "cleanliness": 5.0,
                "desk": null,
                "front_desk": 2.0,
                "location": 4.0,
                "pool": null,
                "restaurant": null,
                "rooms": 5.0,
                "service": null,
                "sleep": null,
                "value": 2.0
            },
            "helpfulness": 3,
            "id": 16531504,
            "likes": {
                "disliked": "\u2014 noise",
                "liked": "\u2014 room"
            },
            "rating": 2.0,
            "stay_parameters": "Stayed May 2008, traveled on business",
            "text": "My wife and I stayed there for 4 nights on a romantic/sightseeing break.",
            "title": "Pro and con",
            "user": "ceedaworld"
        },
        {
            "date": "May 28, 2008",
            "detail_rating": {
                "business": null,
                "cleanliness": 5.0,
                "desk": null,
                "front_desk": 5.0,
                "location": 5.0,
                "pool": null,
                "restaurant": null,
                "rooms": 5.0,
                "service": null,
                "sleep": null,
                "value": 5.0
            },
            "helpfulness": 2,
            "id": 16458655,
            "likes": {
                "disliked": "\u2014 Nothing",
                "liked": "\u2014 The ultra modern clean lines and lighting/ loved breakfast too !!"
            },
            "rating": 5.0,
            "stay_parameters": "Stayed May 2008, traveled as a couple",
            "text": "Although it is slightly out of the city centre we found it a great location. It is easily accessible from the airport by the airport bus right outside the terminal. They will drop you at Plac Espanya and the hotel is right there. When you want to head into the city centre there is a metro station just across the road from the hotel. We found this the easiest way to get around and were in the city centre within 10 minutes of leaving the hotel. Within 10 minutes walk of the hotel is the hill of Montjuc and the Font Magic which are worth a look on weekend evenings when the fountains are set to music. Also next to this is Mies Van Der Rohe's Barcelona Pavillion, a mecca for architecture buffs. We carried on walking up the hill, helped by a series of very welcome outdoor escalators and after a half hours stroll with some beautifull views of the city, we were at the Joan Miro Museum. Carry on from here and you can get the Fununcular railway back to the metro system.",
            "title": "B for Brilliant",
            "user": "BigGUk"
        },
        {
            "date": "November 22, 2008",
            "detail_rating": {
                "business": 4.0,
                "cleanliness": 3.0,
                "desk": null,
                "front_desk": 5.0,
                "location": 4.0,
                "pool": null,
                "restaurant": null,
                "rooms": 4.0,
                "service": 4.0,
                "sleep": null,
                "value": 5.0
            },
            "helpfulness": null,
            "id": 22091761,
            "likes": {
                "disliked": "\u2014 The light switch was very difficult to use",
                "liked": "\u2014 Location"
            },
            "rating": 4.0,
            "stay_parameters": "Stayed November 2008, traveled as a couple",
            "text": "I booked this hotel 2 days prior to my visit via hotels.com for only \u00a355/night. Upon our very late arrival, we were upgraded to an executive room. The room was generously sized and faced the back so was nice and quiet. Referring to the comment two doors down about the missing bathroom door, this is a design feature of the room. There is no door between the bath and the bedroom, there is a black glass wall. There is a door for the toilet.",
            "title": "Pefect Location",
            "user": "ymous"
        },
        {
            "date": "November 6, 2008",
            "detail_rating": {
                "business": null,
                "cleanliness": 5.0,
                "desk": null,
                "front_desk": 5.0,
                "location": 4.0,
                "pool": null,
                "restaurant": null,
                "rooms": 5.0,
                "service": 5.0,
                "sleep": null,
                "value": 5.0
            },
            "helpfulness": 1,
            "id": 21608688,
            "likes": {
                "disliked": "\u2014 Bathroom lighting, Safe not big enough for laptop",
                "liked": "\u2014 Value, Design, Staff"
            },
            "rating": 5.0,
            "stay_parameters": "Stayed October 2008, traveled on business",
            "text": "Whilst not in the centre of Barcelona (a 30 minute walk from Las Ramblas), we found ourselves perfectly positioned for our visit to the monestry, which was on direct train route from the local station, and the castle and the sea were both walking distance.",
            "title": "Simply superb",
            "user": "Martin68"
        },
        {
            "date": "October 20, 2008",
            "detail_rating": {
                "business": null,
                "cleanliness": 1.0,
                "desk": null,
                "front_desk": 1.0,
                "location": 4.0,
                "pool": null,
                "restaurant": null,
                "rooms": 1.0,
                "service": 1.0,
                "sleep": null,
                "value": 2.0
            },
            "helpfulness": 2,
            "id": 21037347,
            "likes": {
                "disliked": null,
                "liked": null
            },
            "rating": 1.0,
            "stay_parameters": "Stayed April 2008",
            "text": "I did not try the breakfast here. There are lots of cafes and bakeries nearby where we got a coffee and pastry for 4 Euros. There were many small bars where you can get very good quality and reasonably priced tapas, especially along the adjacent street Avenue du Paralel.",
            "title": "Rundown property.Unprofessional staff",
            "user": "FCMUsa"
        },
        {
            "date": "October 19, 2008",
            "detail_rating": {
                "business": 3.0,
                "cleanliness": 5.0,
                "desk": null,
                "front_desk": 5.0,
                "location": 4.0,
                "pool": null,
                "restaurant": null,
                "rooms": 5.0,
                "service": 5.0,
                "sleep": null,
                "value": 5.0
            },
            "helpfulness": 3,
            "id": 21002801,
            "likes": {
                "disliked": "\u2014 Nothing",
                "liked": "\u2014 The design of the hotel room and the rooftop pool"
            },
            "rating": 5.0,
            "stay_parameters": "Stayed October 2008, traveled as a couple",
            "text": "Location is a little out of the centre but I didn't find it a problem. The hotel is five minutes walk from the Placa Espanya metro stop and you can get into the centre very quickly or it's a 20 min walk to Placa Catlunya.",
            "title": "Fantastic value",
            "user": "PremierGirl"
        },
        {
            "date": "October 15, 2008",
            "detail_rating": {
                "business": null,
                "cleanliness": 5.0,
                "desk": null,
                "front_desk": 5.0,
                "location": 5.0,
                "pool": null,
                "restaurant": null,
                "rooms": 5.0,
                "service": 5.0,
                "sleep": null,
                "value": 5.0
            },
            "helpfulness": null,
            "id": 20894889,
            "likes": {
                "disliked": "\u2014 nothing - it was excellent!",
                "liked": "\u2014 Swimming Pool on the roof"
            },
            "rating": 5.0,
            "stay_parameters": "Stayed October 2008, traveled as a couple",
            "text": "Had a 6th floor room facing Grand Via. It is a very busy road and there was traffic noise but this is a city hotel so it's fair to expect it and it didn't bother me. If you're a light sleeper, there are some rooms on the inside of the hotel that you might want to ask for. The room is a good size with large desk, comfortable chair and sofa. There is a full length door and tiny balcony that you can step out on for a bit of fresh air. Bathroom is good with a decent sized bath and seriously powerful shower which amazingly doesn't go all over the floor like most do.",
            "title": "Excellent hotel",
            "user": "frankiemagic"
        }
    ],
    "slim_ranking": 0.147227533461,
    "stars": 3,
    "tripadvisor": {
        "VISITED": false,
        "country_name": null,
        "locality": null,
        "pic_link": null,
        "street_address": null
    },
    "user_rating": 4.5,
    "variance": {
        "average": 110,
        "excellent": 528,
        "poor": 33,
        "terrible": 14,
        "very good": 449
    }
}