{
    "aka": "Milton Park Country House Hotel And Destination Spa",
    "description": "Milton Park Country House Hotel & Spa, the Southern Highlands leading luxury hotel, crowns its own private 300 acre estate. Considered by many to be the finest regional hotel in Australia, Milton Park offers luxurious accommodation, fine cuisine and impeccable service in an atmosphere of relaxed sophistication. The hotels facilities rival some of the greatest Country House Hotels of the World. Both American Express Travel & Gourmet Traveller Magazine have recently voted Milton Park amongst their top ten luxury escapes for 2009.",
    "detail_rating": {
        "cleanliness": null,
        "location": null,
        "rooms": null,
        "service": null,
        "sleep": null,
        "value": null
    },
    "location": {
        "city": "Bowral",
        "continent": "South Pacific",
        "country": "Australia",
        "proposed_city": "Milton",
        "province": null,
        "region": null
    },
    "name": "Milton Park Country House Hotel & Destination Spa",
    "places": {
        "aka": [
            "Milton"
        ],
        "hotel_description": [
            "Milton"
        ],
        "hotel_name": [
            "Milton"
        ]
    },
    "review_count": 147,
    "review_count_current": 10,
    "reviews": [
        {
            "date": "April 10, 2008",
            "detail_rating": {
                "business": null,
                "cleanliness": 1.0,
                "desk": null,
                "front_desk": 2.0,
                "location": 4.0,
                "pool": null,
                "restaurant": null,
                "rooms": 1.0,
                "service": 1.0,
                "sleep": null,
                "value": 1.0
            },
            "helpfulness": 8,
            "id": 14927901,
            "likes": {
                "disliked": "\u2014 every single thing was horrible, except the beautiful gardens",
                "liked": "\u2014 The landscaped grounds"
            },
            "rating": 1.0,
            "stay_parameters": "Stayed April 2008, traveled as a couple",
            "text": "My Wife and I stayed at Milton Park for 2 nights, following our wedding at another venue in the southern highlands. We were under the impression we were staying at a 5 star venue, that was the reason we decided to go there, however once we arrived we found the place to be nothing like any 5 star hotel we have ever stayed at.",
            "title": "Self Appointed 5 Stars",
            "user": "SydneyWaspman"
        },
        {
            "date": "March 25, 2008",
            "detail_rating": {
                "business": null,
                "cleanliness": 2.0,
                "desk": null,
                "front_desk": 2.0,
                "location": 5.0,
                "pool": null,
                "restaurant": null,
                "rooms": 2.0,
                "service": 2.0,
                "sleep": null,
                "value": 2.0
            },
            "helpfulness": 2,
            "id": 14508217,
            "likes": {
                "disliked": "\u2014 Poorly maintained rooms and mixed service from staff.",
                "liked": "\u2014 Extensive mature gardens and sitting rooms which were part of the original house."
            },
            "rating": 2.0,
            "stay_parameters": "Stayed March 2008, traveled with family",
            "text": "After parking our car several hundred metres from the entrance in the car park (no valet), I carried our bags to reception to check in. We were handed the keys to the room and told where to go (a 5 star hotel would show you to your room).",
            "title": "Attention to detail lacking",
            "user": "wandering59"
        },
        {
            "date": "February 29, 2008",
            "detail_rating": {
                "business": 5.0,
                "cleanliness": 5.0,
                "desk": null,
                "front_desk": 5.0,
                "location": 5.0,
                "pool": null,
                "restaurant": null,
                "rooms": 5.0,
                "service": 5.0,
                "sleep": null,
                "value": 5.0
            },
            "helpfulness": 2,
            "id": 13922837,
            "likes": {
                "disliked": "\u2014 nothing really.",
                "liked": "\u2014 ambience and country feel."
            },
            "rating": 5.0,
            "stay_parameters": "Stayed February 2008, traveled as a couple",
            "text": "I then carried our bags on another lengthy walk down the cold hallways to our room. (Room 206)",
            "title": "One of a kind!",
            "user": "RB2008"
        },
        {
            "date": "December 31, 2007",
            "detail_rating": {
                "business": null,
                "cleanliness": 1.0,
                "desk": null,
                "front_desk": 1.0,
                "location": 4.0,
                "pool": null,
                "restaurant": null,
                "rooms": 2.0,
                "service": 1.0,
                "sleep": null,
                "value": 1.0
            },
            "helpfulness": 3,
            "id": 12174510,
            "likes": {
                "disliked": "\u2014 Everything else!",
                "liked": "\u2014 The gardens"
            },
            "rating": 2.0,
            "stay_parameters": "Stayed December 2007, traveled as a couple",
            "text": "Upon entering, there was a bottle of Australian Sparkling Wine waiting for us in the room. However my wife had ordered Champagne and paid for champagne when the room was booked ($70).",
            "title": "Has the potential to be great....but falls short",
            "user": "Jepetto"
        },
        {
            "date": "June 18, 2007",
            "detail_rating": {
                "business": null,
                "cleanliness": 5.0,
                "desk": null,
                "front_desk": 4.0,
                "location": 5.0,
                "pool": null,
                "restaurant": null,
                "rooms": 5.0,
                "service": 5.0,
                "sleep": null,
                "value": 4.0
            },
            "helpfulness": 1,
            "id": 7871648,
            "likes": {
                "disliked": "\u2014 Reception - is a little odd and too far from the carpark",
                "liked": "\u2014 The quality - perfect"
            },
            "rating": 5.0,
            "stay_parameters": "Stayed June 2007, traveled as a couple",
            "text": "My wife and I were absolutely disgusted by the bathroom. There were broken tiles, tiles missing and horrific mould and mildew had over run the squalid, dank room. We proceeded to the reception again to complain, and to say that this place is not the 5 star hotel we had thought we had booked into. This was when we were told that Milton Park is in fact, \"self appointed 5 stars\", whatever that means.",
            "title": "Totally Relaxing",
            "user": "DOOSHNA"
        },
        {
            "date": "August 11, 2008",
            "detail_rating": {
                "business": 2.0,
                "cleanliness": 4.0,
                "desk": null,
                "front_desk": 3.0,
                "location": 4.0,
                "pool": null,
                "restaurant": null,
                "rooms": 4.0,
                "service": 2.0,
                "sleep": null,
                "value": 4.0
            },
            "helpfulness": 1,
            "id": 18831462,
            "likes": {
                "disliked": null,
                "liked": null
            },
            "rating": 4.0,
            "stay_parameters": "Stayed April 2008, traveled as a couple",
            "text": "We stayed at the hotel for a night in early April 2008. The purpose of our visit was to check out the hotel and their full range of services in the lead up to our wedding which we were going to hold there in 2009.",
            "title": "Ok... but not fantastic",
            "user": "T-A-UK"
        },
        {
            "date": "July 29, 2008",
            "detail_rating": {
                "business": 3.0,
                "cleanliness": null,
                "desk": null,
                "front_desk": 3.0,
                "location": 4.0,
                "pool": null,
                "restaurant": null,
                "rooms": 5.0,
                "service": 3.0,
                "sleep": null,
                "value": 4.0
            },
            "helpfulness": 3,
            "id": 18376796,
            "likes": {
                "disliked": "\u2014 Rather cold in the hotel",
                "liked": "\u2014 Restaurant and amazing massages (and I am a massage snob!)"
            },
            "rating": 4.0,
            "stay_parameters": "Stayed July 2008, traveled as a couple",
            "text": "The hotel and the grounds are fantastic, the food in the restaurant was superb and the rooms were lovely. It is a long way from town and there isn't the standard high level of service you would expect from a 5 star place. Parking is a challenge, there is no one to show you to your room and the service at lunch was very slack. We didn't receive the \"full treatment\" that the other diners received, I'm not sure if it was because they were told we would be tasting for a wedding but you'd think they would offer a standard service to everyone.",
            "title": "Great Winter getaway from Sydney but lacking a few touches",
            "user": "DuchessSydney"
        },
        {
            "date": "July 18, 2008",
            "detail_rating": {
                "business": null,
                "cleanliness": 5.0,
                "desk": null,
                "front_desk": 3.0,
                "location": 5.0,
                "pool": null,
                "restaurant": null,
                "rooms": 4.0,
                "service": 2.0,
                "sleep": null,
                "value": 2.0
            },
            "helpfulness": 3,
            "id": 17997018,
            "likes": {
                "disliked": "\u2014 Poor attention to detail",
                "liked": "\u2014 Relaxing getaway"
            },
            "rating": 4.0,
            "stay_parameters": "Stayed July 2008, traveled on business",
            "text": "Overall the service really lets down the place, when we were planning our wedding we were that they could do one thing on one day and then the next they couldn't. The coordinator while very nice is over worked and in the time it took for her to issue the quotation we orgainised the entire wedding in another location. So in summary if you can get a deal stay here, the grounds are amazing and the food great (we didn't try out the spa) but expect little from the service and you won't be disappointed.",
            "title": "A nice alternative...",
            "user": "mkc91"
        },
        {
            "date": "June 11, 2008",
            "detail_rating": {
                "business": null,
                "cleanliness": 3.0,
                "desk": null,
                "front_desk": 1.0,
                "location": 4.0,
                "pool": null,
                "restaurant": null,
                "rooms": 4.0,
                "service": 1.0,
                "sleep": null,
                "value": 3.0
            },
            "helpfulness": 4,
            "id": 16866626,
            "likes": {
                "disliked": "\u2014 The Staff",
                "liked": "\u2014 The Grounds"
            },
            "rating": 2.0,
            "stay_parameters": "Stayed February 2008, traveled as a couple",
            "text": "My boyfriend took me to Milton park for our two year anniversary. We often escape the rat race of Sydney at weekends and our favourites are Tower Lodge (Hunter valley) and Lillianfels (Blue Mountains) but as we were impressed by the Milton Park website and wanted to try somewhere new so we went to spend a weekend there.",
            "title": "No Recommendations Here - Dramas Dramas Dramas",
            "user": "Krissishi"
        },
        {
            "date": "May 5, 2008",
            "detail_rating": {
                "business": 5.0,
                "cleanliness": 5.0,
                "desk": null,
                "front_desk": 5.0,
                "location": 5.0,
                "pool": null,
                "restaurant": null,
                "rooms": 5.0,
                "service": 5.0,
                "sleep": null,
                "value": 5.0
            },
            "helpfulness": 2,
            "id": 15679280,
            "likes": {
                "disliked": null,
                "liked": "\u2014 Spa, Food, Accomodation, Gardens, Staff"
            },
            "rating": 5.0,
            "stay_parameters": "Stayed April 2008, traveled as a couple",
            "text": "It was a very cold weekend in july so we were glad we had requested a room with a fire, the rest of the hotel was pretty cold and I imagine the rooms without fires would have been too. They didn't light the fires in the lounge area or bar until after 5-6pm (so there was nowhere warm to sit and have a cup of tea or read the paper- if we hadn't of had a fire in our room) the hotel felt very quiet and apart from a conference of about 20 people there only seemed a few other people staying there.",
            "title": "Simply the Best",
            "user": "stevesSydney"
        }
    ],
    "slim_ranking": 0.777777777778,
    "stars": null,
    "tripadvisor": {
        "VISITED": false,
        "country_name": null,
        "locality": null,
        "pic_link": null,
        "street_address": null
    },
    "user_rating": 3.5,
    "variance": {
        "average": 28,
        "excellent": 48,
        "poor": 17,
        "terrible": 25,
        "very good": 29
    }
}