{
    "aka": "Fairmont Hotel",
    "description": "Featuring 210 rooms, the Fairmont Resort is the perfect place for a romantic escape, a get together with a group of friends or family or a business retreat or conference. The Fairmont Resort is currently undergoing a transformation as part of its entry into Accor's MGallery collection of Unique Upscale hotels. the Fairmont Resort, Blue Mountains has awe inspiring views over the beautiful Jamison Valley & adjoining Leura Golf Course and an extensive array of leisure facilities including two restaurants, a bar lounge, indoor heated pool and outdoor pool, tennis and squash courts, table tennis, gymnasium and spa treatment facilities (by appointment).",
    "detail_rating": {
        "cleanliness": 4.0,
        "location": 4.5,
        "rooms": 4.0,
        "service": 4.0,
        "sleep": 4.0,
        "value": 4.0
    },
    "location": {
        "city": null,
        "continent": "South Pacific",
        "country": "Australia",
        "proposed_city": "Fairmont",
        "province": null,
        "region": null
    },
    "name": "Fairmont Resort - MGallery Collection",
    "places": {
        "aka": [
            "Fairmont"
        ],
        "hotel_description": [
            "Fairmont"
        ],
        "hotel_name": [
            "Fairmont"
        ]
    },
    "review_count": 1188,
    "review_count_current": 17,
    "reviews": [
        {
            "date": "February 24, 2013",
            "detail_rating": {
                "business": null,
                "cleanliness": 5.0,
                "desk": null,
                "location": 4.0,
                "pool": null,
                "restaurant": null,
                "rooms": 5.0,
                "service": 5.0,
                "sleep": 4.0,
                "value": 5.0
            },
            "helpfulness": 3,
            "id": 152927301,
            "likes": {
                "disliked": null,
                "liked": null
            },
            "rating": 5.0,
            "stay_parameters": "Stayed February 2013, traveled with family",
            "text": "My son and I came here for a Monday to Friday stay and didn't manage to utilise all the facilities on offer at the Fairmont because there are simply so many.",
            "title": "This place has got everything",
            "user": "TravelBug_Mike"
        },
        {
            "date": "February 23, 2013",
            "detail_rating": {
                "business": null,
                "cleanliness": null,
                "desk": null,
                "location": null,
                "pool": null,
                "restaurant": null,
                "rooms": null,
                "service": null,
                "sleep": null,
                "value": null
            },
            "helpfulness": null,
            "id": 152909664,
            "likes": {
                "disliked": null,
                "liked": null
            },
            "rating": 3.0,
            "stay_parameters": null,
            "text": "I know it isn't supposed to be a challenge to see if you can put a tick against trying everything this resort has available but as far as value for money goes even using half the facilities leaves you way in front.",
            "title": "Grand Hotel. Many flaws.",
            "user": "Gazz44"
        },
        {
            "date": "February 22, 2013",
            "detail_rating": {
                "business": null,
                "cleanliness": 2.0,
                "desk": null,
                "location": 4.0,
                "pool": null,
                "restaurant": null,
                "rooms": 2.0,
                "service": 3.0,
                "sleep": 3.0,
                "value": 1.0
            },
            "helpfulness": null,
            "id": 152766762,
            "likes": {
                "disliked": null,
                "liked": null
            },
            "rating": 2.0,
            "stay_parameters": "Stayed February 2013, traveled as a couple",
            "text": "We did manage to enjoy table tennis, a hit of squash on one of the two courts, multiple swims in both the massive indoor pool as well as the outdoor pool, (both heated although maybe not the outdoor one when we had a dip), hopped into both the indoor and outdoor spas as well as enjoying the mens sauna which you access via the men's change rooms, (same deal for the ladies).",
            "title": "Disappointing.",
            "user": "Australia2London"
        },
        {
            "date": "February 22, 2013",
            "detail_rating": {
                "business": null,
                "cleanliness": null,
                "desk": null,
                "location": null,
                "pool": null,
                "restaurant": null,
                "rooms": null,
                "service": null,
                "sleep": null,
                "value": null
            },
            "helpfulness": null,
            "id": 152758035,
            "likes": {
                "disliked": null,
                "liked": null
            },
            "rating": 2.0,
            "stay_parameters": null,
            "text": "We didn't quite get to sweat it out in the very well equipped gym or run around on one of the tennis courts, my son isn't a fan of snooker or pool so we skipped the two full sized tables in the billards room but saw others having a go.",
            "title": "Disappointing for the price",
            "user": "Deborah B"
        },
        {
            "date": "February 21, 2013",
            "detail_rating": {
                "business": null,
                "cleanliness": 4.0,
                "desk": null,
                "location": 5.0,
                "pool": null,
                "restaurant": null,
                "rooms": 3.0,
                "service": 3.0,
                "sleep": 4.0,
                "value": 3.0
            },
            "helpfulness": null,
            "id": 152730881,
            "likes": {
                "disliked": null,
                "liked": null
            },
            "rating": 3.0,
            "stay_parameters": "Stayed September 2012, traveled with family",
            "text": "This is an older, once grand resort complex.",
            "title": "Nice Facility, but has its issues",
            "user": "Brodeur"
        },
        {
            "date": "February 18, 2013",
            "detail_rating": {
                "business": null,
                "cleanliness": 5.0,
                "desk": null,
                "location": 4.0,
                "pool": null,
                "restaurant": null,
                "rooms": 4.0,
                "service": 4.0,
                "sleep": 5.0,
                "value": 4.0
            },
            "helpfulness": 1,
            "id": 152429621,
            "likes": {
                "disliked": null,
                "liked": null
            },
            "rating": 5.0,
            "stay_parameters": "Stayed March 2012, traveled with friends",
            "text": "It is in need of a complete renovation, but has good bones. It is in a great location, and you can see that at one time the services and physical plant was top notch, but now it is showing its age and it more than tired in major categories. Spa and pool were immense, but they didn't have much in the way of equipment or resources remaining. Maintenance seems to be an issue.",
            "title": "Friendly Haven",
            "user": "Luxury_lover4"
        },
        {
            "date": "February 18, 2013",
            "detail_rating": {
                "business": null,
                "cleanliness": 5.0,
                "desk": null,
                "location": 5.0,
                "pool": null,
                "restaurant": null,
                "rooms": 5.0,
                "service": 5.0,
                "sleep": null,
                "value": 5.0
            },
            "helpfulness": 1,
            "id": 152409335,
            "likes": {
                "disliked": null,
                "liked": null
            },
            "rating": 5.0,
            "stay_parameters": "Stayed February 2013",
            "text": "Most of the facilities were good. Some of the rooms were recently updated and were of a good size with good amenities, with bathrooms that were adequate. Lobby area is a little tired.",
            "title": "Fantastic venue with amazing views and excellent food.",
            "user": "austj"
        },
        {
            "date": "February 17, 2013",
            "detail_rating": {
                "business": null,
                "cleanliness": 5.0,
                "desk": null,
                "location": 5.0,
                "pool": null,
                "restaurant": null,
                "rooms": 5.0,
                "service": 5.0,
                "sleep": 5.0,
                "value": 5.0
            },
            "helpfulness": 2,
            "id": 152310375,
            "likes": {
                "disliked": null,
                "liked": null
            },
            "rating": 5.0,
            "stay_parameters": "Stayed February 2013, traveled as a couple",
            "text": "Parking for guests is totally inadequate. You must park far down a hill from the entrance, and the number of cars far exceed the spaces available. Some of the access gates to the parking area that would make this process a little easier, are perpetually locked. Also, this hotel is EXTREMELY hard to find if you are driving in by car, and the signage is almost non-existent, and what is present is contradictory.",
            "title": "Wow.",
            "user": "holtipsfrombagz"
        },
        {
            "date": "March 9, 2013",
            "detail_rating": {
                "business": null,
                "cleanliness": 5.0,
                "desk": null,
                "location": 5.0,
                "pool": null,
                "restaurant": null,
                "rooms": 5.0,
                "service": 5.0,
                "sleep": 5.0,
                "value": 5.0
            },
            "helpfulness": null,
            "id": 154067890,
            "likes": {
                "disliked": null,
                "liked": null
            },
            "rating": 5.0,
            "stay_parameters": "Stayed February 2013, traveled with family",
            "text": "We stayed at the Fairmont resort for two nights in February and had a fantastic time. The hotel reception area looks great and the staff were friendly. We were able to get a good deal as we were staying midweek and the hotel was quiet. We were really pleased with our room which had been recently refurbished and looked really smart. Breakfast was fantastic with so much choice and good quality ingredients. Would definitely recommend staying here, location was great too. I would agree with previous review about parking as this was the one downside. We did always manage to get a parking spot but it was often the last one.",
            "title": "Lovely hotel, great value",
            "user": "JosieH"
        },
        {
            "date": "March 6, 2013",
            "detail_rating": {
                "business": null,
                "cleanliness": 4.0,
                "desk": null,
                "location": 4.0,
                "pool": null,
                "restaurant": null,
                "rooms": 4.0,
                "service": 2.0,
                "sleep": 4.0,
                "value": 3.0
            },
            "helpfulness": 1,
            "id": 153905918,
            "likes": {
                "disliked": null,
                "liked": null
            },
            "rating": 3.0,
            "stay_parameters": "Stayed March 2013, traveled as a couple",
            "text": "Great place with great position. The room was of a good standard.",
            "title": "Great Place Poor Dinning",
            "user": "KRM52"
        },
        {
            "date": "March 5, 2013",
            "detail_rating": {
                "business": null,
                "cleanliness": 5.0,
                "desk": null,
                "location": 4.0,
                "pool": null,
                "restaurant": null,
                "rooms": 5.0,
                "service": 5.0,
                "sleep": 5.0,
                "value": 4.0
            },
            "helpfulness": 3,
            "id": 153754131,
            "likes": {
                "disliked": null,
                "liked": null
            },
            "rating": 5.0,
            "stay_parameters": "Stayed March 2013, traveled as a couple",
            "text": "But the resort was let down by the dinning experience.",
            "title": "Fantastic stay in a wonderful mountain getaway",
            "user": "Dekoven"
        },
        {
            "date": "March 2, 2013",
            "detail_rating": {
                "business": null,
                "cleanliness": 5.0,
                "desk": null,
                "location": 5.0,
                "pool": null,
                "restaurant": null,
                "rooms": 5.0,
                "service": 5.0,
                "sleep": 5.0,
                "value": 5.0
            },
            "helpfulness": null,
            "id": 153495235,
            "likes": {
                "disliked": null,
                "liked": null
            },
            "rating": 5.0,
            "stay_parameters": "Stayed February 2013, traveled as a couple",
            "text": "On the Friday night due to the weather we would have preferred to dine in but the fine restaurant was booked out, The buffet was not open and the Embers area was packed out. This is unacceptable for a 250 plus room hotel.",
            "title": "Fantastic",
            "user": "Tobie_08"
        },
        {
            "date": "March 2, 2013",
            "detail_rating": {
                "business": null,
                "cleanliness": 4.0,
                "desk": null,
                "location": 4.0,
                "pool": null,
                "restaurant": null,
                "rooms": 5.0,
                "service": 4.0,
                "sleep": 4.0,
                "value": 4.0
            },
            "helpfulness": 1,
            "id": 153492032,
            "likes": {
                "disliked": null,
                "liked": null
            },
            "rating": 5.0,
            "stay_parameters": "Stayed February 2013, traveled with family",
            "text": "The Saturday night there was a seafood buffet which we attended. We were disappointed with the variety of seafood supplied as it was at a level that you would get from a standard Buffet.",
            "title": "Wonderful mountains getaway",
            "user": "Rebecca C"
        },
        {
            "date": "February 28, 2013",
            "detail_rating": {
                "business": null,
                "cleanliness": 4.0,
                "desk": null,
                "location": 5.0,
                "pool": null,
                "restaurant": null,
                "rooms": 3.0,
                "service": 5.0,
                "sleep": 3.0,
                "value": 4.0
            },
            "helpfulness": null,
            "id": 153353374,
            "likes": {
                "disliked": null,
                "liked": null
            },
            "rating": 4.0,
            "stay_parameters": "Stayed February 2013, traveled on business",
            "text": "Being a Blue Mountains Resident, and hearing about the recent history of the Fairmont, I was keen to see what the new owners had done. I stayed 4 nights for our company annual meeting. I had a Courtyard Room and it was a really decent size. The furnishing were not new, but in good shape and contemporary and stylish. The AC was a little disappointing as it didn't really seem to do anything. This was OK as the outside temp was about 24 degrees most days, but it could be a problem on really hot days or in the middle of winter. On the whole, the rooms were good. The shower in my room however was the main let down. It could be best described as a dribble. As such it took forever to shower. I wasn't happy about this at all. I did report it but I have no idea if it was looked at or not.",
            "title": "Conference Stay",
            "user": "SW_Sydney"
        },
        {
            "date": "February 26, 2013",
            "detail_rating": {
                "business": null,
                "cleanliness": 5.0,
                "desk": null,
                "location": 5.0,
                "pool": null,
                "restaurant": null,
                "rooms": 2.0,
                "service": 4.0,
                "sleep": 2.0,
                "value": 4.0
            },
            "helpfulness": 1,
            "id": 153255460,
            "likes": {
                "disliked": null,
                "liked": null
            },
            "rating": 3.0,
            "stay_parameters": "Stayed February 2013, traveled as a couple",
            "text": "The dinning was good. Catering for conferences at these types of venues are notoriously bad....however, the Fairmont did a great job in the is area. It was a little hard to get a drink in the public areas after about 10 pm. There are some great facilities (library, billiards room, tennis & squash courts, outdoor pool, etc) and they all seem to be kept in great shape.",
            "title": "telling all as it happened",
            "user": "ian_mcjannett"
        },
        {
            "date": "February 25, 2013",
            "detail_rating": {
                "business": null,
                "cleanliness": 5.0,
                "desk": null,
                "location": 4.0,
                "pool": null,
                "restaurant": null,
                "rooms": 4.0,
                "service": 5.0,
                "sleep": 4.0,
                "value": 4.0
            },
            "helpfulness": null,
            "id": 153145510,
            "likes": {
                "disliked": null,
                "liked": null
            },
            "rating": 5.0,
            "stay_parameters": "Stayed February 2013, traveled as a couple",
            "text": "The conference venue and support was great also.",
            "title": "LEURA OVERNIGHT",
            "user": "bardelma"
        },
        {
            "date": "February 24, 2013",
            "detail_rating": {
                "business": null,
                "cleanliness": 4.0,
                "desk": null,
                "location": 5.0,
                "pool": null,
                "restaurant": null,
                "rooms": 4.0,
                "service": 3.0,
                "sleep": 4.0,
                "value": 3.0
            },
            "helpfulness": 1,
            "id": 152973736,
            "likes": {
                "disliked": null,
                "liked": null
            },
            "rating": 4.0,
            "stay_parameters": "Stayed January 2013, traveled solo",
            "text": "I'm glad to see this great hotel get back on its feet again and I would be happy to stay again....even though I do live down the road :-)",
            "title": "Good but not Great",
            "user": "Gstr70"
        }
    ],
    "slim_ranking": 1.0,
    "stars": 4.5,
    "tripadvisor": {
        "VISITED": false,
        "country_name": null,
        "locality": null,
        "pic_link": null,
        "street_address": null
    },
    "user_rating": 4.0,
    "variance": {
        "average": 175,
        "excellent": 412,
        "poor": 58,
        "terrible": 67,
        "very good": 476
    }
}