{
    "aka": "Hilton Garden Inn Birmingham Brindleyplace Hotel Birmingham",
    "description": "Winner of the 2011 TripAdvisor Certificate of Excellence The Hilton Garden Inn is a four star standard hotel located in Birmingham City Centre within the prestigous Brindleyplace development. The hotel is centrally located and ideal when attending events and concerts at the International Convention Centre, National Indoor Arena and Symphony Hall or enjoying the shopping and nightlife in and around the city centre. The hotel features 238 queen evolution rooms, the Brindley Lounge, City Cafe, Business Centre and Fitness Centre. All of the rooms are equipped with Apple Imacs which provide a full IT solution for all of your business needs and double up as a comprehensive entertainment system as well featuring a wide range of channels including sky sports. Complimentary wifi is avilable throughout the hotel as well. Sleep Deep, Eat Well, Work Smart, Stay Fit and Treat Yourself are amongst the brand pillars which the team work hard to deliver and ensure that you have a comfortable and successful stay.",
    "detail_rating": {
        "cleanliness": 4.5,
        "location": 4.5,
        "rooms": 4.0,
        "service": 4.0,
        "sleep": 4.0,
        "value": 4.0
    },
    "location": {
        "city": null,
        "continent": "Europe",
        "country": "United Kingdom (UK)",
        "proposed_city": "Birmingham",
        "province": null,
        "region": null
    },
    "name": "Hilton Garden Inn Birmingham Brindleyplace",
    "places": {
        "aka": [
            "Birmingham"
        ],
        "hotel_description": [
            "Birmingham"
        ],
        "hotel_name": [
            "Birmingham"
        ]
    },
    "review_count": 1201,
    "review_count_current": 40,
    "reviews": [
        {
            "date": "October 13, 2006",
            "detail_rating": {
                "business": 5.0,
                "cleanliness": 5.0,
                "desk": null,
                "front_desk": 5.0,
                "location": 5.0,
                "pool": null,
                "restaurant": null,
                "rooms": 5.0,
                "service": 5.0,
                "sleep": null,
                "value": 5.0
            },
            "helpfulness": null,
            "id": 5948228,
            "likes": {
                "disliked": "\u2014 The restaurant is excellent; with some unique menu choices.",
                "liked": "\u2014 Clean, reasonably priced rooms"
            },
            "rating": 5.0,
            "stay_parameters": "Stayed September 2006, traveled on business",
            "text": "Excellent hotel.",
            "title": "Loved the City Inn",
            "user": "Brown1922"
        },
        {
            "date": "October 12, 2006",
            "detail_rating": {
                "business": null,
                "cleanliness": 4.0,
                "desk": null,
                "front_desk": 4.0,
                "location": 4.0,
                "pool": null,
                "restaurant": null,
                "rooms": 4.0,
                "service": 2.0,
                "sleep": null,
                "value": 4.0
            },
            "helpfulness": 2,
            "id": 5944561,
            "likes": {
                "disliked": null,
                "liked": null
            },
            "rating": 3.0,
            "stay_parameters": "Stayed October 2006",
            "text": "Also, the restaurant is a real gem. Great service, great food. Our group had some questions and the chef came out to meet with us.",
            "title": "Minor improvements required",
            "user": "Junoesque"
        },
        {
            "date": "October 10, 2006",
            "detail_rating": {
                "business": 5.0,
                "cleanliness": 5.0,
                "desk": null,
                "front_desk": 5.0,
                "location": 5.0,
                "pool": null,
                "restaurant": null,
                "rooms": 5.0,
                "service": 5.0,
                "sleep": null,
                "value": 4.0
            },
            "helpfulness": null,
            "id": 5934509,
            "likes": {
                "disliked": "\u2014 NOthing",
                "liked": "\u2014 The Staff"
            },
            "rating": 5.0,
            "stay_parameters": "Stayed October 2006, traveled as a couple",
            "text": "Very clean and in an excellent location.",
            "title": "Classy Hotel with really nice staff to go with it!",
            "user": "jazman01"
        },
        {
            "date": "October 9, 2006",
            "detail_rating": {
                "business": null,
                "cleanliness": 2.0,
                "desk": null,
                "front_desk": 2.0,
                "location": 4.0,
                "pool": null,
                "restaurant": null,
                "rooms": 3.0,
                "service": 1.0,
                "sleep": null,
                "value": null
            },
            "helpfulness": 2,
            "id": 5931856,
            "likes": {
                "disliked": "\u2014 Queuing for everything!",
                "liked": "\u2014 Location and soundproofing. Comfortable bed."
            },
            "rating": 2.0,
            "stay_parameters": "Stayed October 2006, traveled as a couple",
            "text": "Stayed here on a Saturday night because of good location next to the NIA. Staff friendly and trying to do their best but long queues at check in, breakfast and checkout.",
            "title": "Location excellent but hotel could do better.",
            "user": "UKResidents"
        },
        {
            "date": "October 3, 2006",
            "detail_rating": {
                "business": 4.0,
                "cleanliness": 5.0,
                "desk": null,
                "front_desk": 4.0,
                "location": 3.0,
                "pool": null,
                "restaurant": null,
                "rooms": 4.0,
                "service": 3.0,
                "sleep": null,
                "value": 3.0
            },
            "helpfulness": null,
            "id": 5905068,
            "likes": {
                "disliked": null,
                "liked": "\u2014 Location"
            },
            "rating": 4.0,
            "stay_parameters": "Stayed September 2006, traveled on business",
            "text": "Ate in the City Cafe - food good but service far too slow. They should open earlier for those wanting to eat before concerts etc. It was clear to me that they cannot cope with the numbers when the hotel is full.",
            "title": "Decent enough for quick business trip!",
            "user": "MrBen1"
        },
        {
            "date": "September 29, 2009",
            "detail_rating": {
                "business": null,
                "cleanliness": 5.0,
                "desk": null,
                "location": 4.0,
                "pool": null,
                "restaurant": null,
                "rooms": 5.0,
                "service": 5.0,
                "sleep": null,
                "value": 5.0
            },
            "helpfulness": null,
            "id": 45424247,
            "likes": {
                "disliked": null,
                "liked": null
            },
            "rating": 5.0,
            "stay_parameters": "Stayed September 2009, traveled as a couple",
            "text": "Rooms: really nice, very comfy bed, excellent shower and towels, great TV;",
            "title": "Very very comfortable, good service, bit out of centre",
            "user": "AllanBLondon"
        },
        {
            "date": "September 28, 2009",
            "detail_rating": {
                "business": null,
                "cleanliness": 5.0,
                "desk": null,
                "location": 5.0,
                "pool": null,
                "restaurant": null,
                "rooms": 5.0,
                "service": 5.0,
                "sleep": null,
                "value": 5.0
            },
            "helpfulness": null,
            "id": 45273572,
            "likes": {
                "disliked": null,
                "liked": null
            },
            "rating": 5.0,
            "stay_parameters": "Stayed September 2009, traveled on business",
            "text": "Service: excellent",
            "title": "Great value, clean elegant hotel",
            "user": "Laurapants1"
        },
        {
            "date": "September 26, 2009",
            "detail_rating": {
                "business": null,
                "cleanliness": 5.0,
                "desk": null,
                "location": 5.0,
                "pool": null,
                "restaurant": null,
                "rooms": 5.0,
                "service": 5.0,
                "sleep": null,
                "value": 5.0
            },
            "helpfulness": null,
            "id": 44750774,
            "likes": {
                "disliked": null,
                "liked": null
            },
            "rating": 5.0,
            "stay_parameters": "Stayed September 2009, traveled with friends",
            "text": "Location: its slightly out of the centre, but in a very nice 'new area' by the canal. Its 2 seconds off Broad Street which seems to be the major bars and clubs street.",
            "title": "Can't fault it.",
            "user": "Chistery"
        },
        {
            "date": "September 23, 2009",
            "detail_rating": {
                "business": null,
                "cleanliness": 5.0,
                "desk": null,
                "location": 5.0,
                "pool": null,
                "restaurant": null,
                "rooms": 4.0,
                "service": 5.0,
                "sleep": null,
                "value": 5.0
            },
            "helpfulness": null,
            "id": 43819688,
            "likes": {
                "disliked": null,
                "liked": null
            },
            "rating": 5.0,
            "stay_parameters": "Stayed September 2009, traveled as a couple",
            "text": "I stayed at the City inn, Birmingham for 3 nights while I was at a conference at the ICC in Birmingham. The hotel was ideally placed in relation to both the ICC and Brindley place (where most of the nightlife/ restaurants are). One point to be noted ladies- the route to the ICC from the hotel is cobbled- Very charming but don't wear your best heels! The hotel itself is elegant, minimally decorated and clean. The bathroom in my room was bright, airy and spotless, with anti fog mirrors which is a nice touch. The room I was staying in had an I mac in it (nice piece of kit!) which had all freeview channels radio etc. I was also supplied with white company toiletries and a bathrobe. I must say I was quite surprised by the facilities in the room considering I was in a standard room that averaged \u00a3110 a night. I have stayed in far more expensive hotels that have come nowhere near this hotel.",
            "title": "Great hotel",
            "user": "bristolstu"
        },
        {
            "date": "September 20, 2009",
            "detail_rating": {
                "business": null,
                "cleanliness": 5.0,
                "desk": null,
                "location": 5.0,
                "pool": null,
                "restaurant": null,
                "rooms": 5.0,
                "service": 5.0,
                "sleep": null,
                "value": 5.0
            },
            "helpfulness": null,
            "id": 43131394,
            "likes": {
                "disliked": null,
                "liked": null
            },
            "rating": 5.0,
            "stay_parameters": "Stayed September 2009, traveled with friends",
            "text": "I ordered room service which was ok. The Thai sweet potato and chickpea curry was a bit of a disappointment. It tasted nice but only had about 5 chickpeas in it and was more like rice with sauce. For \u00a38.95 it was expensive but I guess room service is anyway! The breakfast however was really great. Full range of continental style breakfast and cooked breakfast to order. Much better than hot buffet breakfast as it was fresh, warm and delicious. You can even get Stornaway black pudding!",
            "title": "fab for a night out",
            "user": "ghostie5"
        },
        {
            "date": "September 4, 2009",
            "detail_rating": {
                "business": null,
                "cleanliness": 5.0,
                "desk": null,
                "location": 4.0,
                "pool": null,
                "restaurant": null,
                "rooms": 5.0,
                "service": 4.0,
                "sleep": null,
                "value": 4.0
            },
            "helpfulness": null,
            "id": 39772770,
            "likes": {
                "disliked": null,
                "liked": null
            },
            "rating": 4.0,
            "stay_parameters": "Stayed September 2009, traveled on business",
            "text": "I booked this at \u00a359 including breakfast.You do have to pay an extra \u00a312 for parking underneath the hotel however .The rooms are new,spotlessly clean and are all very well presented and equipped.I found the original room i stayed in was too noisy due to a noisy air vent.I was moved to a quieter room with no fuss, immediately upon phoning reception.The breakfast was also excellent ,the service speedy and efficient and given the size of the hotel and the number of guests everyhing was run very well.I stay at hotels with work for the major part of the last nine years and can honestly say that it is rare for my expectations to be met.This time they were met fully",
            "title": "Excellent Standard at a Reasonable Price",
            "user": "PAULBWarrington"
        },
        {
            "date": "September 1, 2009",
            "detail_rating": {
                "business": null,
                "cleanliness": 5.0,
                "desk": null,
                "location": 5.0,
                "pool": null,
                "restaurant": null,
                "rooms": 5.0,
                "service": 5.0,
                "sleep": null,
                "value": 5.0
            },
            "helpfulness": null,
            "id": 39483483,
            "likes": {
                "disliked": null,
                "liked": null
            },
            "rating": 5.0,
            "stay_parameters": "Stayed August 2009, traveled as a couple",
            "text": "This hotel was fantastic in every way. Very good price. Excellant service. Lovely modern comfortable room and the mac was a very good touch. I would look no further. Ideal location with bars, restaurants and shopping close by - just perfect.",
            "title": "My 1st choice in Birmingham",
            "user": "PoppetsCoDurham"
        },
        {
            "date": "August 29, 2009",
            "detail_rating": {
                "business": null,
                "cleanliness": 5.0,
                "desk": null,
                "location": 5.0,
                "pool": null,
                "restaurant": null,
                "rooms": 4.0,
                "service": 5.0,
                "sleep": null,
                "value": 5.0
            },
            "helpfulness": null,
            "id": 39173605,
            "likes": {
                "disliked": null,
                "liked": null
            },
            "rating": 5.0,
            "stay_parameters": "Stayed August 2009, traveled solo",
            "text": "Deserves everyone of its 4 stars. I had an amazing deal at \u00a359, the hotel is worth at least \u00a3100. Great location, but very quiet inside, really excellent staff, nice airy restaurant and bar, great breakfast, good rooms. Very hard to beat at this level.",
            "title": "Outstanding value, great hotel",
            "user": "1492trip"
        },
        {
            "date": "August 23, 2009",
            "detail_rating": {
                "business": null,
                "cleanliness": 5.0,
                "desk": null,
                "location": 5.0,
                "pool": null,
                "restaurant": null,
                "rooms": 5.0,
                "service": 5.0,
                "sleep": null,
                "value": null
            },
            "helpfulness": 3,
            "id": 38555806,
            "likes": {
                "disliked": null,
                "liked": null
            },
            "rating": 5.0,
            "stay_parameters": "Stayed August 2009, traveled as a couple",
            "text": "We returned today from a 2 night stay booked through Superbreaks, upgraded room and rail travel included.",
            "title": "Don't bother with anywhere else!",
            "user": "glamourpuss1000"
        },
        {
            "date": "August 22, 2009",
            "detail_rating": {
                "business": null,
                "cleanliness": 5.0,
                "desk": null,
                "location": 5.0,
                "pool": null,
                "restaurant": null,
                "rooms": 5.0,
                "service": 5.0,
                "sleep": null,
                "value": 5.0
            },
            "helpfulness": 1,
            "id": 38445291,
            "likes": {
                "disliked": null,
                "liked": null
            },
            "rating": 5.0,
            "stay_parameters": "Stayed July 2009, traveled on business",
            "text": "The location is excellent- you are in the middle of everything but not disturbed by anything even though Broad Street is a very short distance away.",
            "title": "Fantastic hotel in the heart of the City. ..",
            "user": "SewerKitty"
        },
        {
            "date": "February 28, 2007",
            "detail_rating": {
                "business": null,
                "cleanliness": null,
                "desk": null,
                "location": null,
                "pool": null,
                "restaurant": null,
                "rooms": null,
                "service": null,
                "sleep": null,
                "value": null
            },
            "helpfulness": 1,
            "id": 6856225,
            "likes": {
                "disliked": null,
                "liked": null
            },
            "rating": 4.0,
            "stay_parameters": null,
            "text": "We stayed at the City Inn weekend of the 25th Feb '07 and were very impressed with the place. The rooms were perfectly adequate with DVD player, stereo and nice toiletries (White Company). The day to day staff were a little hit or miss but the management seemed switched on. We had a great rate from the net which included 20% off drinks etc.. Very secure car park under hotel and hotel itself is perfectly located for Birminghams bars and conference centre / REP etc.....Breckie wasn't included but was worth the money to be honest with very nice fry up and good selection of other bits to fill you up for the day. I would reccomend this place to everyone but would ask the management to give their staff a little incentive to be a little more helpful and friendly.",
            "title": "Great location, great prices, great hotel - service could be better",
            "user": "busastep"
        },
        {
            "date": "February 18, 2007",
            "detail_rating": {
                "business": null,
                "cleanliness": null,
                "desk": null,
                "location": null,
                "pool": null,
                "restaurant": null,
                "rooms": null,
                "service": null,
                "sleep": null,
                "value": null
            },
            "helpfulness": 2,
            "id": 6809412,
            "likes": {
                "disliked": null,
                "liked": null
            },
            "rating": 4.0,
            "stay_parameters": null,
            "text": "Very modern clean hotel in a good location for nightlife and all that Birmingham has to offer. Rooms high standrd with dvd player, flatscreen TV and Mini Hi-Fi Unit.",
            "title": "Modern Hotel",
            "user": "Mike05"
        },
        {
            "date": "February 18, 2007",
            "detail_rating": {
                "business": 3.0,
                "cleanliness": 4.0,
                "desk": null,
                "front_desk": 2.0,
                "location": 3.0,
                "pool": null,
                "restaurant": null,
                "rooms": 2.0,
                "service": 1.0,
                "sleep": null,
                "value": 2.0
            },
            "helpfulness": 2,
            "id": 6809125,
            "likes": {
                "disliked": "\u2014 poor bathrooms",
                "liked": "\u2014 area"
            },
            "rating": 2.0,
            "stay_parameters": "Stayed February 2007, traveled on business",
            "text": "Slightly on the expensive side compared to rivals in the immediate locality (Jurys, Novotel)",
            "title": "A bit dissapointing",
            "user": "lannacombe"
        },
        {
            "date": "February 13, 2007",
            "detail_rating": {
                "business": null,
                "cleanliness": 4.0,
                "desk": null,
                "front_desk": 3.0,
                "location": 5.0,
                "pool": null,
                "restaurant": null,
                "rooms": 4.0,
                "service": 4.0,
                "sleep": null,
                "value": 4.0
            },
            "helpfulness": 1,
            "id": 6786626,
            "likes": {
                "disliked": "\u2014 Nothing really",
                "liked": "\u2014 The location"
            },
            "rating": 4.0,
            "stay_parameters": "Stayed January 2007, traveled as a couple",
            "text": "Breakfast good.",
            "title": "Good hotel, fab location",
            "user": "Goldcat"
        },
        {
            "date": "January 20, 2007",
            "detail_rating": {
                "business": 5.0,
                "cleanliness": 4.0,
                "desk": null,
                "front_desk": 4.0,
                "location": 5.0,
                "pool": null,
                "restaurant": null,
                "rooms": 5.0,
                "service": 4.0,
                "sleep": null,
                "value": 4.0
            },
            "helpfulness": 2,
            "id": 6627709,
            "likes": {
                "disliked": null,
                "liked": "\u2014 Style and location"
            },
            "rating": 4.0,
            "stay_parameters": "Stayed January 2007, traveled on business",
            "text": "No real negatives",
            "title": "Would definitely recommend the City Inn Birmingham",
            "user": "jojomillar"
        },
        {
            "date": "October 2, 2006",
            "detail_rating": {
                "business": 3.0,
                "cleanliness": 1.0,
                "desk": null,
                "front_desk": 2.0,
                "location": 3.0,
                "pool": null,
                "restaurant": null,
                "rooms": 2.0,
                "service": 2.0,
                "sleep": null,
                "value": 3.0
            },
            "helpfulness": 1,
            "id": 5898702,
            "likes": {
                "disliked": null,
                "liked": null
            },
            "rating": 2.0,
            "stay_parameters": "Stayed September 2006, traveled as a couple",
            "text": "Hotel looked nice enough online, but we would not stay there again. We were given a smoking room, despite asking well in advance for a non-smoking room. Then we found some suspect brown liquid spilt down the walls in the bedroom and bathroom. On our way out to dinner, we asked the Guest Services representitive to pelase see the room was cleaned while we were out. He apologised and insisted it would be done.",
            "title": "Dirty room and expensive parking",
            "user": "mikedux"
        },
        {
            "date": "September 4, 2006",
            "detail_rating": {
                "business": null,
                "cleanliness": null,
                "desk": null,
                "location": null,
                "pool": null,
                "restaurant": null,
                "rooms": null,
                "service": null,
                "sleep": null,
                "value": null
            },
            "helpfulness": 2,
            "id": 5766748,
            "likes": {
                "disliked": null,
                "liked": null
            },
            "rating": 3.0,
            "stay_parameters": null,
            "text": "On our return later that evening, we found the room untouched. I called Guest Services again, they apologised again and sent someone up. This gentleman insisted he would clean the bathroom wall but not the bedroom wall. When I challenged him on that, he said it is not what he does and he would call his manager.",
            "title": "Not as good as last time",
            "user": "DEE-DI"
        },
        {
            "date": "August 21, 2006",
            "detail_rating": {
                "business": 4.0,
                "cleanliness": 4.0,
                "desk": null,
                "front_desk": 2.0,
                "location": 4.0,
                "pool": null,
                "restaurant": null,
                "rooms": 4.0,
                "service": 1.0,
                "sleep": null,
                "value": 3.0
            },
            "helpfulness": 2,
            "id": 5631813,
            "likes": {
                "disliked": "\u2014 Staff morale",
                "liked": "\u2014 Cleanliness"
            },
            "rating": 3.0,
            "stay_parameters": "Stayed July 2006, traveled as a couple",
            "text": "Eventually, manager arrived and finally had the offending areas cleaned.",
            "title": "Room for improvement",
            "user": "MrBrady"
        },
        {
            "date": "August 9, 2006",
            "detail_rating": {
                "business": 3.0,
                "cleanliness": 4.0,
                "desk": null,
                "front_desk": 4.0,
                "location": 5.0,
                "pool": null,
                "restaurant": null,
                "rooms": 4.0,
                "service": 2.0,
                "sleep": null,
                "value": 3.0
            },
            "helpfulness": 6,
            "id": 5589425,
            "likes": {
                "disliked": "\u2014 Size of bathroom, poor functionality of furnishings, poor service",
                "liked": "\u2014 Clean, good location, well sound-proofed"
            },
            "rating": 3.0,
            "stay_parameters": "Stayed July 2006, traveled on business",
            "text": "Breakfast was very good the next morning. However when we left, we discovered that the promised discount on parking at the neighbouring multi-storey amounted to a mere 10% - overnight parking adding a further \u00a311.50 to our bill - something that was not made clear on their website or when the booking was made.",
            "title": "Disappointing considering the hype",
            "user": "minkoir"
        },
        {
            "date": "July 15, 2006",
            "detail_rating": {
                "business": null,
                "cleanliness": 2.0,
                "desk": null,
                "location": null,
                "pool": null,
                "restaurant": null,
                "rooms": 2.0,
                "service": 3.0,
                "sleep": null,
                "value": 3.0
            },
            "helpfulness": 4,
            "id": 5469215,
            "likes": {
                "disliked": null,
                "liked": null
            },
            "rating": 3.0,
            "stay_parameters": "Stayed July 2006",
            "text": "I would not recommend this hotel.",
            "title": "4 Stars Is A Little Overstretching It...",
            "user": "billyshirt"
        },
        {
            "date": "January 13, 2007",
            "detail_rating": {
                "business": null,
                "cleanliness": 5.0,
                "desk": null,
                "front_desk": 2.0,
                "location": 4.0,
                "pool": null,
                "restaurant": null,
                "rooms": 4.0,
                "service": 4.0,
                "sleep": null,
                "value": 4.0
            },
            "helpfulness": null,
            "id": 6588710,
            "likes": {
                "disliked": "\u2014 Price of parking",
                "liked": "\u2014 Great hotel location"
            },
            "rating": 4.0,
            "stay_parameters": "Stayed July 2006, traveled as a couple",
            "text": "Decided to stay in the Birmingham City inn after an enjoyable visit to the Bristol hotel, the Birmingham hotel offers the same great value and fantastic features that the Bristol hotel presented. Very nice modern rooms, well equipped with home entertainment systems (DVD player and decent Hifi). Spacious bathroom, fantastic shower plenty of room for two.",
            "title": "Modern, clean & enjoyable",
            "user": "The_Craven"
        },
        {
            "date": "January 13, 2007",
            "detail_rating": {
                "business": null,
                "cleanliness": null,
                "desk": null,
                "location": null,
                "pool": null,
                "restaurant": null,
                "rooms": null,
                "service": null,
                "sleep": null,
                "value": null
            },
            "helpfulness": 3,
            "id": 6588492,
            "likes": {
                "disliked": null,
                "liked": null
            },
            "rating": 2.0,
            "stay_parameters": null,
            "text": "The major concern was the total lack of free car parking, the hotel had a subsidised offer in the local NCP, which almost backed on to the hotel, but the price over a long weekend still broke the \u00a320 mark. Other niggles that made the stay slightly less enjoyable was the checking out process, poor staffing levels on the front desk contributed to a lengthy queue but the swiftness of the staff once being dealt with was very efficient.",
            "title": "Review update",
            "user": "fleckerpilgrim"
        },
        {
            "date": "December 27, 2006",
            "detail_rating": {
                "business": 5.0,
                "cleanliness": 5.0,
                "desk": null,
                "front_desk": 5.0,
                "location": 5.0,
                "pool": null,
                "restaurant": null,
                "rooms": 4.0,
                "service": 5.0,
                "sleep": null,
                "value": 4.0
            },
            "helpfulness": 1,
            "id": 6503992,
            "likes": {
                "disliked": null,
                "liked": "\u2014 location"
            },
            "rating": 4.0,
            "stay_parameters": "Stayed December 2006, traveled as a couple",
            "text": "Please refer to my previous review when reading this update.",
            "title": "highly recommended",
            "user": "jrmatthews"
        },
        {
            "date": "November 27, 2006",
            "detail_rating": {
                "business": 3.0,
                "cleanliness": 3.0,
                "desk": null,
                "front_desk": 2.0,
                "location": 4.0,
                "pool": null,
                "restaurant": null,
                "rooms": 2.0,
                "service": 2.0,
                "sleep": null,
                "value": 2.0
            },
            "helpfulness": 3,
            "id": 6180961,
            "likes": {
                "disliked": "\u2014 Staff",
                "liked": "\u2014 Cafe, but it wasnt spotless."
            },
            "rating": 1.0,
            "stay_parameters": "Stayed November 2006, traveled on business",
            "text": "I thought it only fair to post an update so that City Inn get a fair overall review from me.",
            "title": "Not my idea of a effortless stay.......",
            "user": "AnnaDuchess"
        },
        {
            "date": "October 30, 2006",
            "detail_rating": {
                "business": 4.0,
                "cleanliness": 4.0,
                "desk": null,
                "front_desk": 3.0,
                "location": 4.0,
                "pool": null,
                "restaurant": null,
                "rooms": 2.0,
                "service": 4.0,
                "sleep": null,
                "value": 2.0
            },
            "helpfulness": null,
            "id": 6028396,
            "likes": {
                "disliked": "\u2014 Small bathroom with no bath",
                "liked": "\u2014 Modern and clean"
            },
            "rating": 3.0,
            "stay_parameters": "Stayed September 2006, traveled as a couple",
            "text": "I sent an email to David Orr, CEO of the City Inn group at around 2000 hours on the first night of my stay. You can read that mail in my initial review.",
            "title": "Clean, comfortable and great location",
            "user": "Jojobailey73"
        },
        {
            "date": "September 13, 2009",
            "detail_rating": {
                "business": null,
                "cleanliness": 4.0,
                "desk": null,
                "location": 4.0,
                "pool": null,
                "restaurant": null,
                "rooms": 4.0,
                "service": 4.0,
                "sleep": null,
                "value": 4.0
            },
            "helpfulness": null,
            "id": 41254167,
            "likes": {
                "disliked": null,
                "liked": null
            },
            "rating": 4.0,
            "stay_parameters": "Stayed August 2009, traveled as a couple",
            "text": "stayed overnight at city inn as had an early fight in the morning.5 pound in taxi to the station with direct link to airport,cooked breakfast as well as continental buffet was included and also i mac entertainment system in room with free internet.rooms were clean and modern and staff very helpful and would highly recommend if staying in birmingham.",
            "title": "comfortable stay",
            "user": "jimiUnanderra"
        },
        {
            "date": "September 11, 2009",
            "detail_rating": {
                "business": null,
                "cleanliness": 5.0,
                "desk": null,
                "location": 3.0,
                "pool": null,
                "restaurant": null,
                "rooms": 4.0,
                "service": 4.0,
                "sleep": null,
                "value": 5.0
            },
            "helpfulness": null,
            "id": 40815066,
            "likes": {
                "disliked": null,
                "liked": null
            },
            "rating": 4.0,
            "stay_parameters": "Stayed December 2008, traveled on business",
            "text": "This hotel has put a bit of effort into being slightly different. The rooms are not huge but they are light and clean. The apple mac's that double as your tv in the room are pretty cool. Location is a bit of a walk from town, but there is a new development near it that looks like it could become a main area for bars & restaurants on way into the centre. It is a nice quiet hotel and is a lot better than the ones in the main centre which now look tired and gruby in comparison. Staff were nice. I booked via www.getroomscheaper.com and found a room here for under \u00a370!",
            "title": "Different, clean, quiet",
            "user": "JumboMcNutt"
        },
        {
            "date": "September 7, 2009",
            "detail_rating": {
                "business": null,
                "cleanliness": 5.0,
                "desk": null,
                "location": 4.0,
                "pool": null,
                "restaurant": null,
                "rooms": 5.0,
                "service": 5.0,
                "sleep": null,
                "value": 4.0
            },
            "helpfulness": null,
            "id": 40051365,
            "likes": {
                "disliked": null,
                "liked": null
            },
            "rating": 5.0,
            "stay_parameters": "Stayed October 2008, traveled as a couple",
            "text": "Went here for UFC 89. When we arrived it was a quick easy check in. Into the room and was very impressed. Clean, modern, great view and an amazing i-mac tv internet thing which was really usefull when I needed any info. The breakfast was first class, the staff were fine and overall good value for money.",
            "title": "One of the best.",
            "user": "supraman9999"
        },
        {
            "date": "September 6, 2009",
            "detail_rating": {
                "business": null,
                "cleanliness": 5.0,
                "desk": null,
                "location": 5.0,
                "pool": null,
                "restaurant": null,
                "rooms": 4.0,
                "service": 4.0,
                "sleep": null,
                "value": 4.0
            },
            "helpfulness": null,
            "id": 39897316,
            "likes": {
                "disliked": null,
                "liked": null
            },
            "rating": 5.0,
            "stay_parameters": "Stayed June 2009, traveled on business",
            "text": "Would recommend here without hesitation.",
            "title": "Clean and modern",
            "user": "TruerReviewer"
        },
        {
            "date": "September 4, 2009",
            "detail_rating": {
                "business": null,
                "cleanliness": 5.0,
                "desk": null,
                "location": 4.0,
                "pool": null,
                "restaurant": null,
                "rooms": 3.0,
                "service": 3.0,
                "sleep": null,
                "value": 4.0
            },
            "helpfulness": null,
            "id": 39788336,
            "likes": {
                "disliked": null,
                "liked": null
            },
            "rating": 3.0,
            "stay_parameters": "Stayed September 2009, traveled on business",
            "text": "Stayed overnight on a business trip. The room was modern and clean, bathroom a bit small but the shower was large. Having an imac in each room was a good idea but the internet seemed particularly slow? We ate in the restaurant in the evening and the food was good but some of the portions were a bit small and the service was also a bit slow, even though it was very quiet. Breakfast was excellent.",
            "title": "Don't believe the hype!",
            "user": "LondonRabbity"
        },
        {
            "date": "August 21, 2009",
            "detail_rating": {
                "business": null,
                "cleanliness": 5.0,
                "desk": null,
                "location": 5.0,
                "pool": null,
                "restaurant": null,
                "rooms": 5.0,
                "service": 5.0,
                "sleep": null,
                "value": 5.0
            },
            "helpfulness": null,
            "id": 38349754,
            "likes": {
                "disliked": null,
                "liked": null
            },
            "rating": 5.0,
            "stay_parameters": "Stayed July 2009, traveled as a couple",
            "text": "This hotel is fantastic and gets top marks on all counts.",
            "title": "Gorgeous, stylish, comfortable and in a great location. Very hard to beat.",
            "user": "the_shopping_addict"
        },
        {
            "date": "August 20, 2009",
            "detail_rating": {
                "business": null,
                "cleanliness": 4.0,
                "desk": null,
                "location": 5.0,
                "pool": null,
                "restaurant": null,
                "rooms": 5.0,
                "service": 4.0,
                "sleep": null,
                "value": 5.0
            },
            "helpfulness": null,
            "id": 38240769,
            "likes": {
                "disliked": null,
                "liked": null
            },
            "rating": 5.0,
            "stay_parameters": "Stayed August 2009, traveled solo",
            "text": "Firstly the hotel is located in a fab location - Brindleyplace - home to several lovely restaurants. Also Broad Street, with lots of bars and clubs. Getting to the hotel is walkable (about ten/fifteen minutes), but better to get a taxi if you are coming from Birmingham New Street station if you are not familiar with the area, and/or have luggage. It's only a short ride and costs about a fiver.",
            "title": "Great hotel, great location!",
            "user": "wanderingsar"
        },
        {
            "date": "August 19, 2009",
            "detail_rating": {
                "business": null,
                "cleanliness": 5.0,
                "desk": null,
                "location": 4.0,
                "pool": null,
                "restaurant": null,
                "rooms": 4.0,
                "service": 4.0,
                "sleep": null,
                "value": 3.0
            },
            "helpfulness": null,
            "id": 38129117,
            "likes": {
                "disliked": null,
                "liked": null
            },
            "rating": 4.0,
            "stay_parameters": "Stayed March 2009, traveled as a couple",
            "text": "Onto the hotel itself. It's just perfect. Looks nice from the outside, and even better inside. The large lobby is beautifully designed, with very attractive lounge. The overall style is my favourite type - stylish and modern.",
            "title": "It was a very nice, whole and relaxing experience",
            "user": "Kelene"
        },
        {
            "date": "August 17, 2009",
            "detail_rating": {
                "business": null,
                "cleanliness": 5.0,
                "desk": null,
                "location": 5.0,
                "pool": null,
                "restaurant": null,
                "rooms": 5.0,
                "service": 5.0,
                "sleep": null,
                "value": 5.0
            },
            "helpfulness": null,
            "id": 37931434,
            "likes": {
                "disliked": null,
                "liked": null
            },
            "rating": 5.0,
            "stay_parameters": "Stayed August 2009, traveled as a couple",
            "text": "I found the reception staff to be very friendly, professional, helpful and pleasant to deal with. Check in was a very simple, quick process.",
            "title": "A great place to stay",
            "user": "CardiffRobin"
        },
        {
            "date": "August 17, 2009",
            "detail_rating": {
                "business": null,
                "cleanliness": null,
                "desk": null,
                "location": null,
                "pool": null,
                "restaurant": null,
                "rooms": null,
                "service": null,
                "sleep": null,
                "value": null
            },
            "helpfulness": null,
            "id": 37910169,
            "likes": {
                "disliked": null,
                "liked": null
            },
            "rating": 3.0,
            "stay_parameters": null,
            "text": "My room was nicely sized, with a very comfortable bed, dressed with high quality bed linen. The decor is modern with neutral colours. The bathroom was really nice, with a good, powerful shower. All bedrooms in City Inn hotels have Apple Mac computers installed, which double up as tv's with several freeview/Sky channels. Use of the internet on these computers is totally complimentary. What a fabulous touch! It saved me having to take my laptop with me, and even better still, saved me having to fork out an extra \u00a315-\u00a320 for a day's internet connection, which is what many other hotel brands still do.",
            "title": "Downhill since we last stayed but hopefully a one off",
            "user": "nowsayplease"
        }
    ],
    "slim_ranking": 0.130434782609,
    "stars": 4,
    "tripadvisor": {
        "VISITED": false,
        "country_name": null,
        "locality": null,
        "pic_link": null,
        "street_address": null
    },
    "user_rating": 4.0,
    "variance": {
        "average": 140,
        "excellent": 506,
        "poor": 40,
        "terrible": 17,
        "very good": 498
    }
}