{
    "aka": "Skycity Hotel Auckland",
    "description": "Centrally located, SKYCITY Hotel facilities are top-class, rooms are spacious and the iconic Sky Tower is right on your doorstep. Choose to dine in style at one of 20 plus restaurants, caf\u00e9 and bars and experience the thrill of the world-class Casino. Wi-Fi is complimentary.",
    "detail_rating": {
        "cleanliness": 4.5,
        "location": 4.5,
        "rooms": 4.5,
        "service": 4.0,
        "sleep": 4.5,
        "value": 4.0
    },
    "location": {
        "city": null,
        "continent": "South Pacific",
        "country": "New Zealand",
        "proposed_city": "Auckland",
        "province": null,
        "region": "North Island"
    },
    "name": "SKYCITY Hotel",
    "places": {
        "aka": [
            "Auckland"
        ],
        "hotel_description": [],
        "hotel_name": []
    },
    "review_count": 735,
    "review_count_current": 18,
    "reviews": [
        {
            "date": "January 13, 2007",
            "detail_rating": {
                "business": 3.0,
                "cleanliness": 3.0,
                "desk": null,
                "front_desk": 3.0,
                "location": 4.0,
                "pool": null,
                "restaurant": null,
                "rooms": 3.0,
                "service": null,
                "sleep": null,
                "value": 3.0
            },
            "helpfulness": 2,
            "id": 6590197,
            "likes": {
                "disliked": null,
                "liked": null
            },
            "rating": 3.0,
            "stay_parameters": "Stayed January 2007, traveled on business",
            "text": "We stayed one night in the Skycity Hotel on JAN 4th. The location is excellent: right in the middle of Auckland. The hotel room was ok but the bathroom was dirty so that we had to ask for the maid. There is really nothing special about this hotel but the location. It is definitely suitable for a short business or leisure trip.",
            "title": "Acceptable rooms / Great Location = just average",
            "user": "GAP15"
        },
        {
            "date": "January 12, 2007",
            "detail_rating": {
                "business": null,
                "cleanliness": 5.0,
                "desk": null,
                "front_desk": 2.0,
                "location": 4.0,
                "pool": null,
                "restaurant": null,
                "rooms": 5.0,
                "service": 1.0,
                "sleep": null,
                "value": 1.0
            },
            "helpfulness": 1,
            "id": 6583971,
            "likes": {
                "disliked": "\u2014 Everything else",
                "liked": "\u2014 The bed was comfortable"
            },
            "rating": 1.0,
            "stay_parameters": "Stayed January 2007, traveled as a couple",
            "text": "The Skycity is an annoying tourist trap with TERRIBLE, and I mean TERRIBLE food. Room service and Fortuna were absolutely disgusting. Is bad when you can't even get chips right.",
            "title": "Not for us",
            "user": "Beans and Cornbread"
        },
        {
            "date": "August 10, 2006",
            "detail_rating": {
                "business": 4.0,
                "cleanliness": 4.0,
                "desk": null,
                "front_desk": 3.0,
                "location": 4.0,
                "pool": null,
                "restaurant": null,
                "rooms": 4.0,
                "service": 3.0,
                "sleep": null,
                "value": 3.0
            },
            "helpfulness": 7,
            "id": 5594781,
            "likes": {
                "disliked": null,
                "liked": null
            },
            "rating": 4.0,
            "stay_parameters": "Stayed August 2006, traveled with family",
            "text": "arrived to think we were staying in a massive shopping complex but after 24 hours we got our bearings and found we had made a good choice by staying at skycity. plenty of dining options but chose to eat out. can recommend the harbourside grill just down from the hotel. this hotel is modern but manic. if you dont like hustle and bustle this is not for you otherwise its a good quality hotel with nice rooms and well located.",
            "title": "very busy but good choice",
            "user": "travelagent10"
        },
        {
            "date": "November 29, 2007",
            "detail_rating": {
                "business": null,
                "cleanliness": null,
                "desk": null,
                "location": null,
                "pool": null,
                "restaurant": null,
                "rooms": null,
                "service": null,
                "sleep": null,
                "value": null
            },
            "helpfulness": null,
            "id": 11153480,
            "likes": {
                "disliked": null,
                "liked": null
            },
            "rating": 2.0,
            "stay_parameters": null,
            "text": "After travelling both the North and South Island and staying in various B&Bs, Hostels and Lodges, we were looking forward to our last night in Auckland at the Sky City for some somewhat more \"civilized\" accommodations and the conveniences of the restaurants and casino, etc. This one room for one night cost more than two rooms at some of the other places we had stayed (all of which were above satisfactory). We got there a bit late about 7:30 p.m., was checked in by a girl who seemed like she was having a bad day and then assisted by a bell boy who said absolutely nothing on the way up to the room. Once we got there I opened the door and he let me stand there holding it open for him while he got the luggage. i had to ask him if he could place a peice of luggage to hold the door open (which is of course the first thing any experienced bell man would do) which he did with no eye contact and no acknowledgement. After he got the luggage in, he simply walked out, I'm not kidding you. I had to laugh. He certainly wasn't looking for a tip!",
            "title": "Humorous",
            "user": "Minoaka"
        },
        {
            "date": "August 26, 2007",
            "detail_rating": {
                "business": null,
                "cleanliness": null,
                "desk": null,
                "location": null,
                "pool": null,
                "restaurant": null,
                "rooms": null,
                "service": null,
                "sleep": null,
                "value": null
            },
            "helpfulness": null,
            "id": 8511671,
            "likes": {
                "disliked": null,
                "liked": null
            },
            "rating": 4.0,
            "stay_parameters": null,
            "text": "The room itself is nothing to write home about, pretty basic hotel room standard for $315.00 NZ. My husband, who joined me a few minutes later, and I then got ready for dinner but didn't get out of the room until a little after 9 pm. We first tried to see about dinner in one of the tower restaurants, which were either closed or booked so we went to visit the concierge for a recommendation. Who do we find minding the concierge desk, None other than our favorite bell boy. I had to laugh again.",
            "title": "Good Stay",
            "user": "JNW"
        },
        {
            "date": "August 14, 2007",
            "detail_rating": {
                "business": null,
                "cleanliness": 3.0,
                "desk": null,
                "front_desk": 1.0,
                "location": 5.0,
                "pool": null,
                "restaurant": null,
                "rooms": 4.0,
                "service": 3.0,
                "sleep": null,
                "value": 4.0
            },
            "helpfulness": 2,
            "id": 8422939,
            "likes": {
                "disliked": "\u2014 check-in",
                "liked": "\u2014 Location - you can always find it because of the tower"
            },
            "rating": 4.0,
            "stay_parameters": "Stayed July 2007",
            "text": "We finally ended up having dinner in the lobby cafe. The food was expensive but edible. We did visit the casino which is at least as advertised. The next morning we checked out asking to store some bags for an hour or two while we tried to get some shopping in. This was met with a mute nod by the new bell boy.",
            "title": "Skycity Hotel Auckland is always easy to find",
            "user": "lithlith"
        },
        {
            "date": "May 18, 2007",
            "detail_rating": {
                "business": 5.0,
                "cleanliness": 4.0,
                "desk": null,
                "front_desk": 5.0,
                "location": 5.0,
                "pool": null,
                "restaurant": null,
                "rooms": 4.0,
                "service": 4.0,
                "sleep": null,
                "value": 5.0
            },
            "helpfulness": null,
            "id": 7640093,
            "likes": {
                "disliked": null,
                "liked": "\u2014 R"
            },
            "rating": 4.0,
            "stay_parameters": "Stayed May 2007, traveled as a couple",
            "text": "The only good thing I can say about the service here is that the doorman helped us put our bags in the cab when we left with a smile.",
            "title": "Good hotel, Good location",
            "user": "SJB100"
        },
        {
            "date": "May 11, 2007",
            "detail_rating": {
                "business": null,
                "cleanliness": null,
                "desk": null,
                "location": null,
                "pool": null,
                "restaurant": null,
                "rooms": null,
                "service": null,
                "sleep": null,
                "value": null
            },
            "helpfulness": null,
            "id": 7589687,
            "likes": {
                "disliked": null,
                "liked": null
            },
            "rating": 3.0,
            "stay_parameters": null,
            "text": "If you want the convenience of the skycity, save yourself some money and find something close by, this hotel is not worth the rate.",
            "title": "Big place",
            "user": "NorwestIlliniWineGuy"
        },
        {
            "date": "May 24, 2008",
            "detail_rating": {
                "business": null,
                "cleanliness": 4.0,
                "desk": null,
                "front_desk": 4.0,
                "location": 5.0,
                "pool": null,
                "restaurant": null,
                "rooms": 4.0,
                "service": 4.0,
                "sleep": null,
                "value": 4.0
            },
            "helpfulness": 1,
            "id": 16363990,
            "likes": {
                "disliked": "\u2014 n/a",
                "liked": "\u2014 Location"
            },
            "rating": 4.0,
            "stay_parameters": "Stayed April 2008, traveled as a couple",
            "text": "We spent 2 nights here at the start of our honeymoon after a very long flight from the UK - so we were really pleased to find a very comfortable room waiting for us on our arrival. We have no complaints at all about the hotel - it was modern, conveniently located, bright and had great parking facilities. There's plenty going on in the hotel as it's part of a leisure complex including various bars, restaurants, casino and the famous Skytower - but this is away from the hotel area so there's no noise or disturbance at all. The location is great as it's only a few minutes walk to the busy waterfront restaurants and the main shopping area. Overall, a decent hotel for a few nights stopover/sightseeing.",
            "title": "Really good base to explore the city",
            "user": "Anon0"
        },
        {
            "date": "April 22, 2008",
            "detail_rating": {
                "business": null,
                "cleanliness": null,
                "desk": null,
                "location": null,
                "pool": null,
                "restaurant": null,
                "rooms": null,
                "service": null,
                "sleep": null,
                "value": null
            },
            "helpfulness": null,
            "id": 15234003,
            "likes": {
                "disliked": null,
                "liked": null
            },
            "rating": 4.0,
            "stay_parameters": null,
            "text": "We stayed (Mar 2004) in an executive suite for US$96/nite and we felt that was a great price for what we received. The room was decorated in bright blues with some other colorful highlights that made the room enjoyable. The bathroom was blue tile and a big solid glass shower door. I thought the 2 buttons on the toilet were kind of neat. (1/2 flush and a full flush). The maid kept the shampoo, soap and bath gel replenished everyday. The only drawback was there was some heavy soap scum or buildup on the shower floor.",
            "title": "Bright inviting colors!",
            "user": "travel23"
        },
        {
            "date": "March 11, 2008",
            "detail_rating": {
                "business": null,
                "cleanliness": 4.0,
                "desk": null,
                "front_desk": 4.0,
                "location": 4.0,
                "pool": null,
                "restaurant": null,
                "rooms": 4.0,
                "service": 4.0,
                "sleep": null,
                "value": 5.0
            },
            "helpfulness": null,
            "id": 14212153,
            "likes": {
                "disliked": "\u2014 No problems",
                "liked": "\u2014 Central location"
            },
            "rating": 5.0,
            "stay_parameters": "Stayed February 2008, traveled with family",
            "text": "They also offer a business center with 2 internet ready PC's, phones and a laser printer (free of charge)",
            "title": "Excellent base from which to see the city",
            "user": "Old_Nottinghamian"
        },
        {
            "date": "January 24, 2008",
            "detail_rating": {
                "business": null,
                "cleanliness": null,
                "desk": null,
                "location": null,
                "pool": null,
                "restaurant": null,
                "rooms": null,
                "service": null,
                "sleep": null,
                "value": null
            },
            "helpfulness": null,
            "id": 12953732,
            "likes": {
                "disliked": null,
                "liked": null
            },
            "rating": 4.0,
            "stay_parameters": null,
            "text": "Other than that I would have no problem staying there again in an executive suite.",
            "title": "Buzzy Hotel with great Pool Deck",
            "user": "alderneyLondon"
        },
        {
            "date": "December 13, 2007",
            "detail_rating": {
                "business": 3.0,
                "cleanliness": 3.0,
                "desk": null,
                "front_desk": 3.0,
                "location": 4.0,
                "pool": null,
                "restaurant": null,
                "rooms": 2.0,
                "service": 3.0,
                "sleep": null,
                "value": 4.0
            },
            "helpfulness": null,
            "id": 11525770,
            "likes": {
                "disliked": "\u2014 management",
                "liked": "\u2014 location, price"
            },
            "rating": 3.0,
            "stay_parameters": "Stayed December 2007, traveled with family",
            "text": "**Note: I had this posted under the wrong Skycity in NZ. I stayed there back in march of 2004.",
            "title": "mega hotel centrally located looking a little tired around the edges",
            "user": "Derrico"
        },
        {
            "date": "April 26, 2007",
            "detail_rating": {
                "business": 5.0,
                "cleanliness": 5.0,
                "desk": null,
                "front_desk": 5.0,
                "location": 5.0,
                "pool": null,
                "restaurant": null,
                "rooms": 5.0,
                "service": 5.0,
                "sleep": null,
                "value": 4.0
            },
            "helpfulness": null,
            "id": 7444948,
            "likes": {
                "disliked": "\u2014 liked it all",
                "liked": "\u2014 location"
            },
            "rating": 5.0,
            "stay_parameters": "Stayed January 2007, traveled with family",
            "text": "Stay at the Sky city Hotel if you want to have a great location, great facilities and excellent food, staff and accommodation.",
            "title": "Excellent location",
            "user": "CaronSheffield"
        },
        {
            "date": "April 23, 2007",
            "detail_rating": {
                "business": null,
                "cleanliness": 4.0,
                "desk": null,
                "front_desk": 4.0,
                "location": 4.0,
                "pool": null,
                "restaurant": null,
                "rooms": 5.0,
                "service": 5.0,
                "sleep": null,
                "value": 4.0
            },
            "helpfulness": null,
            "id": 7420444,
            "likes": {
                "disliked": "\u2014 that noise at 5.20am",
                "liked": "\u2014 large room"
            },
            "rating": 5.0,
            "stay_parameters": "Stayed April 2007, traveled on business",
            "text": "We (2 adults and 2 children) stayed our last two nights in New Zealand at the end of an amazing four week trip; we had stayed in some very nice places but were not disappointed in this one,",
            "title": "Lovely big room",
            "user": "Lottie1"
        },
        {
            "date": "March 17, 2007",
            "detail_rating": {
                "business": null,
                "cleanliness": 3.0,
                "desk": null,
                "front_desk": 4.0,
                "location": 4.0,
                "pool": null,
                "restaurant": null,
                "rooms": 3.0,
                "service": null,
                "sleep": null,
                "value": null
            },
            "helpfulness": 1,
            "id": 7178341,
            "likes": {
                "disliked": "\u2014 nothing really",
                "liked": "\u2014 location"
            },
            "rating": 3.0,
            "stay_parameters": "Stayed February 2007, traveled as a couple",
            "text": "We stayed one night at the hotel as my husband was attending a conference there.",
            "title": "An OK hotel",
            "user": "Kaypee00"
        },
        {
            "date": "March 16, 2007",
            "detail_rating": {
                "business": null,
                "cleanliness": 3.0,
                "desk": null,
                "front_desk": 5.0,
                "location": 5.0,
                "pool": null,
                "restaurant": null,
                "rooms": 3.0,
                "service": 4.0,
                "sleep": null,
                "value": 5.0
            },
            "helpfulness": null,
            "id": 7171951,
            "likes": {
                "disliked": "\u2014 Nothing",
                "liked": "\u2014 The pool area"
            },
            "rating": 4.0,
            "stay_parameters": "Stayed February 2007, traveled solo",
            "text": "Check-in was done by my husband but he didn't complain about anything so I assume everything went fine. If you are a tourist staying here please be aware that it is also the home of the casino in Auckland so there are loads of people milling around. The hotel check-in is at the far right end of the lobby area.",
            "title": "Was perfect!!!!!!!!!",
            "user": "travelforfunReading"
        },
        {
            "date": "March 4, 2007",
            "detail_rating": {
                "business": 1.0,
                "cleanliness": 1.0,
                "desk": null,
                "front_desk": 3.0,
                "location": 3.0,
                "pool": null,
                "restaurant": null,
                "rooms": 1.0,
                "service": 3.0,
                "sleep": null,
                "value": 1.0
            },
            "helpfulness": 3,
            "id": 6911269,
            "likes": {
                "disliked": "\u2014 Blood and other stains of bed linen",
                "liked": "\u2014 Checking out"
            },
            "rating": 1.0,
            "stay_parameters": "Stayed March 2007, traveled on business",
            "text": "Our room was on the 4th floor and was one of the biggest rooms I've stayed in for a long while.",
            "title": "Awful, Dirty smelly place",
            "user": "DowJones"
        }
    ],
    "slim_ranking": 0.103896103896,
    "stars": 4.5,
    "tripadvisor": {
        "VISITED": false,
        "country_name": null,
        "locality": null,
        "pic_link": null,
        "street_address": null
    },
    "user_rating": 4.0,
    "variance": {
        "average": 98,
        "excellent": 326,
        "poor": 25,
        "terrible": 14,
        "very good": 272
    }
}