{
    "aka": "Hilton Suites Chicago/Magnificent Mile Hotel",
    "description": "Hilton Suites Chicago/Magnificent Mile hotel in downtown Chicago is an upscale all-suite property in a prime downtown Chicago location. Our modern, all suite-hotel provides comfortable, well-appointed two-room guest suites and executive accommodations.... more.",
    "detail_rating": {
        "cleanliness": 4.0,
        "location": 4.5,
        "rooms": 4.0,
        "service": 4.0,
        "sleep": 4.0,
        "value": 4.0
    },
    "location": {
        "city": "Chicago",
        "continent": null,
        "country": "United States",
        "proposed_city": "Chicago",
        "province": null,
        "region": null
    },
    "name": "Hilton Suites Chicago/Magnificent Mile",
    "places": {
        "aka": [
            "Chicago"
        ],
        "hotel_description": [
            "Chicago"
        ],
        "hotel_name": [
            "Chicago"
        ]
    },
    "review_count": 625,
    "review_count_current": 20,
    "reviews": [
        {
            "date": "August 30, 2008",
            "detail_rating": {
                "business": null,
                "cleanliness": null,
                "desk": null,
                "front_desk": 4.0,
                "location": 4.0,
                "pool": null,
                "restaurant": null,
                "rooms": 5.0,
                "service": 3.0,
                "sleep": null,
                "value": 5.0
            },
            "helpfulness": null,
            "id": 19540267,
            "likes": {
                "disliked": "\u2014 housekeeping wake up",
                "liked": "\u2014 Location and comfort"
            },
            "rating": 5.0,
            "stay_parameters": "Stayed August 2008, traveled with family",
            "text": "Stayed here for 2 weeks and had a great time. Rooms are spacious, air-con kept rooms nice n'cool and beds were excellent. Great location and we found all the staff very helpful. Only minor gripe was housekeeping waking us up for something we didn't request. Note only rooms with single king are on lake side, we have 2 doubles which meant city side. We didn't have breakfast there and instead went to Tempo (UK tourist note food good but doesn't take cards so dollars go quickly), Corner bakery (Cedar and State) excellent food/value or LAppetitto (Hancock building). Given length of stay we found hotel to be excellent and would definitely stay again.",
            "title": "Great place to stay",
            "user": "Tony E"
        },
        {
            "date": "August 27, 2008",
            "detail_rating": {
                "business": null,
                "cleanliness": 4.0,
                "desk": null,
                "front_desk": 1.0,
                "location": 5.0,
                "pool": null,
                "restaurant": null,
                "rooms": 4.0,
                "service": 1.0,
                "sleep": null,
                "value": 2.0
            },
            "helpfulness": null,
            "id": 19417552,
            "likes": {
                "disliked": "\u2014 Service",
                "liked": "\u2014 Location near shops and suite accomodations"
            },
            "rating": 2.0,
            "stay_parameters": "Stayed July 2008, traveled with friends",
            "text": "This hotel has nicely renovated suites but that's where the good news ends. We are Hilton Honor members but that means nothing to the management here. If you think you can check in at the stated check-in time at 3:00, don't get your hopes up. We couldn't check in until 4:30, but had to check out on- time the next day. I asked if they would compensate us for that somehow (maybe a free drink or breakfast), I was answered with an indifferent \"No, we don't do that!\"",
            "title": "Not The Best If You Expect Service",
            "user": "TravelLuvr45"
        },
        {
            "date": "July 31, 2008",
            "detail_rating": {
                "business": 2.0,
                "cleanliness": 2.0,
                "desk": null,
                "front_desk": 2.0,
                "location": 4.0,
                "pool": null,
                "restaurant": null,
                "rooms": 4.0,
                "service": 2.0,
                "sleep": null,
                "value": 3.0
            },
            "helpfulness": null,
            "id": 18445855,
            "likes": {
                "disliked": "\u2014 No service",
                "liked": "\u2014 comfortable room"
            },
            "rating": 2.0,
            "stay_parameters": "Stayed July 2008, traveled on business",
            "text": "I requested extra towels but never got them. There wasn't any extra toilet paper in the room. We asked the concierge where was a good place to eat and she snapped, \"Everything is booked until 10:00.\" She eventually got us a reservation but it was grudging. Odd job for someone with this temperament. We travel frequently and this is the first time I have been motivated to write this kind of review. Luckily, most of our travel experiences have been positive.",
            "title": "All show and no substance",
            "user": "ant9801"
        },
        {
            "date": "July 16, 2008",
            "detail_rating": {
                "business": null,
                "cleanliness": 4.0,
                "desk": null,
                "front_desk": 1.0,
                "location": 5.0,
                "pool": null,
                "restaurant": null,
                "rooms": 4.0,
                "service": 1.0,
                "sleep": null,
                "value": 3.0
            },
            "helpfulness": 1,
            "id": 17938634,
            "likes": {
                "disliked": null,
                "liked": null
            },
            "rating": 1.0,
            "stay_parameters": "Stayed July 2008",
            "text": "The room is decent and reasonably comfortable. That is about all the complementary statements I can make. Expect no service, because you will get what you expect. When they say check in is at 3 pm, don't expect it a minute early. Don't store your bags with the bellman because you never know when you will see them again.",
            "title": "Great location, horrible service",
            "user": "sarahtraveler"
        },
        {
            "date": "July 7, 2008",
            "detail_rating": {
                "business": null,
                "cleanliness": null,
                "desk": null,
                "location": null,
                "pool": null,
                "restaurant": null,
                "rooms": null,
                "service": null,
                "sleep": null,
                "value": null
            },
            "helpfulness": 3,
            "id": 17630198,
            "likes": {
                "disliked": null,
                "liked": null
            },
            "rating": 3.0,
            "stay_parameters": null,
            "text": "Don't ask for turn down service because that won't happen and don't ask for any special compensation because that won't happen.",
            "title": "Beware The Alcove",
            "user": "Accountant5"
        },
        {
            "date": "June 21, 2008",
            "detail_rating": {
                "business": null,
                "cleanliness": 5.0,
                "desk": null,
                "front_desk": 5.0,
                "location": 5.0,
                "pool": null,
                "restaurant": null,
                "rooms": 5.0,
                "service": 5.0,
                "sleep": null,
                "value": 5.0
            },
            "helpfulness": null,
            "id": 17108176,
            "likes": {
                "disliked": "\u2014 The only negative is the price to have your car valet parked. We paid $49 before tip.",
                "liked": "\u2014 The room was absolutely beautiful over looking the lake, and the bedding was quite comfortable."
            },
            "rating": 5.0,
            "stay_parameters": "Stayed June 2008, traveled as a couple",
            "text": "From top to bottom, we thoroughly enjoyed our stay. The staff was attentive, efficient and friendly. Our room was absolutely lovely ... better than expected. We only had a short stay, and would have loved to have extended it, but unfortunately we did not pack accordingly.",
            "title": "Simply Delightful. Enough Said.",
            "user": "LemontTravelers"
        },
        {
            "date": "June 8, 2008",
            "detail_rating": {
                "business": 3.0,
                "cleanliness": 5.0,
                "desk": null,
                "front_desk": 4.0,
                "location": 5.0,
                "pool": null,
                "restaurant": null,
                "rooms": 5.0,
                "service": 4.0,
                "sleep": null,
                "value": 4.0
            },
            "helpfulness": 1,
            "id": 16766794,
            "likes": {
                "disliked": "\u2014 No Free Wi-Fi (had to pay daily fee for internet access)",
                "liked": "\u2014 Great location, comfortable rooms, nice staff"
            },
            "rating": 5.0,
            "stay_parameters": "Stayed May 2008, traveled with family",
            "text": "The room had a comfortable sitting area with a desk facing Oak Street Beach, a flat screen TV, and a convenient wet bar, microwave and mini refrigerator (all nicely concealed in beautiful cabinets.)",
            "title": "A New Favorite Place to Stay",
            "user": "MXB"
        },
        {
            "date": "May 28, 2008",
            "detail_rating": {
                "business": 5.0,
                "cleanliness": 5.0,
                "desk": null,
                "front_desk": 5.0,
                "location": 5.0,
                "pool": null,
                "restaurant": null,
                "rooms": 3.0,
                "service": 4.0,
                "sleep": null,
                "value": 4.0
            },
            "helpfulness": 1,
            "id": 16476629,
            "likes": {
                "disliked": "\u2014 HVAC and the heat",
                "liked": "\u2014 location"
            },
            "rating": 4.0,
            "stay_parameters": "Stayed February 2008, traveled as a couple",
            "text": "The bathroom was quite spacious and tastefully decorated. It was accessible from both the sitting area and the master bedroom. Between the master bedroom and bathroom was a nice vanity area.",
            "title": "Good but...",
            "user": "JulesfromIowa"
        },
        {
            "date": "April 4, 2008",
            "detail_rating": {
                "business": null,
                "cleanliness": 4.0,
                "desk": null,
                "front_desk": 4.0,
                "location": 5.0,
                "pool": null,
                "restaurant": null,
                "rooms": 4.0,
                "service": 4.0,
                "sleep": null,
                "value": 4.0
            },
            "helpfulness": null,
            "id": 14794558,
            "likes": {
                "disliked": null,
                "liked": "\u2014 location"
            },
            "rating": 4.0,
            "stay_parameters": "Stayed March 2008, traveled as a couple",
            "text": "The master bedroom was also tastefully decorated with a very comfortable bed and a view of the lake. The bedding was top notch and what you would expect of nicer hotels. The hotel was very quiet, so you could really get a good nights sleep.",
            "title": "Very nice",
            "user": "Bamaroy"
        },
        {
            "date": "March 7, 2008",
            "detail_rating": {
                "business": null,
                "cleanliness": null,
                "desk": null,
                "location": null,
                "pool": null,
                "restaurant": null,
                "rooms": null,
                "service": null,
                "sleep": null,
                "value": null
            },
            "helpfulness": null,
            "id": 14115321,
            "likes": {
                "disliked": null,
                "liked": null
            },
            "rating": 4.0,
            "stay_parameters": null,
            "text": "We took advantage of the complimentary breakfest and was pleasantly surprised at the wide offerings, the helpful staff, and the views of city life bustling outside the window. They also had an outdoor cafe.",
            "title": "A Wicked time in Chicago",
            "user": "magazineprincess"
        },
        {
            "date": "February 24, 2009",
            "detail_rating": {
                "business": null,
                "cleanliness": null,
                "desk": null,
                "location": null,
                "pool": null,
                "restaurant": null,
                "rooms": null,
                "service": null,
                "sleep": null,
                "value": null
            },
            "helpfulness": null,
            "id": 25110506,
            "likes": {
                "disliked": null,
                "liked": null
            },
            "rating": 5.0,
            "stay_parameters": null,
            "text": "We stayed here for one night at the end of a week-long business trip to Central Illinois. The room rate was cheaper than near the airport, so we thought we'd have some fun our last night. And the Hilton Suites didn't disappoint!",
            "title": "Great location, beautiful views - highly recommend!",
            "user": "Calif0rnia_traveller"
        },
        {
            "date": "January 23, 2009",
            "detail_rating": {
                "business": 4.0,
                "cleanliness": 5.0,
                "desk": null,
                "front_desk": 5.0,
                "location": 5.0,
                "pool": null,
                "restaurant": null,
                "rooms": 5.0,
                "service": 5.0,
                "sleep": null,
                "value": 5.0
            },
            "helpfulness": 2,
            "id": 23822403,
            "likes": {
                "disliked": "\u2014 nothing",
                "liked": "\u2014 Location, spacious, friendly staff"
            },
            "rating": 5.0,
            "stay_parameters": "Stayed January 2009, traveled with family",
            "text": "The staff was wonderful - starting with the valet attendants. (Yes, parking is $50, but it's that much everywhere in Chicago or most major cities.) The front desk staff was most helpful and freindly. The suite was on the 26th floor and had a nice view of Lake Michigan. There was an LCD TV in the living room area and an older TV in the bedroom. The rooms have been recently updated, as everything was nice and new.",
            "title": "Absolutely loved it",
            "user": "firsedge"
        },
        {
            "date": "January 19, 2009",
            "detail_rating": {
                "business": 3.0,
                "cleanliness": 4.0,
                "desk": null,
                "front_desk": 3.0,
                "location": 4.0,
                "pool": null,
                "restaurant": null,
                "rooms": 5.0,
                "service": 4.0,
                "sleep": null,
                "value": 4.0
            },
            "helpfulness": 1,
            "id": 23709893,
            "likes": {
                "disliked": "\u2014 It was -13 when I stayed there but that's not the hotel's fault.",
                "liked": "\u2014 Nice new two room suites with nice ammenities."
            },
            "rating": 5.0,
            "stay_parameters": "Stayed January 2009, traveled on business",
            "text": "The pool and exercise room are on the top floor (30th) with a gorgeous view.",
            "title": "Great surprise",
            "user": "MrAJZ"
        },
        {
            "date": "November 6, 2008",
            "detail_rating": {
                "business": 3.0,
                "cleanliness": 5.0,
                "desk": null,
                "front_desk": 5.0,
                "location": 4.0,
                "pool": null,
                "restaurant": null,
                "rooms": 4.0,
                "service": 5.0,
                "sleep": null,
                "value": 4.0
            },
            "helpfulness": 2,
            "id": 21595871,
            "likes": {
                "disliked": null,
                "liked": null
            },
            "rating": 4.0,
            "stay_parameters": "Stayed October 2008, traveled on business",
            "text": "The restaurant was great for breakfast. The continental breakfast for Diamond members was rather sparse, but we could apply the voucher towards a full breakfast, which was delicious.",
            "title": "Good location and service",
            "user": "Suhaib F"
        },
        {
            "date": "September 18, 2008",
            "detail_rating": {
                "business": 4.0,
                "cleanliness": 4.0,
                "desk": null,
                "front_desk": 5.0,
                "location": 5.0,
                "pool": null,
                "restaurant": null,
                "rooms": 4.0,
                "service": 5.0,
                "sleep": null,
                "value": 4.0
            },
            "helpfulness": null,
            "id": 20184818,
            "likes": {
                "disliked": null,
                "liked": "\u2014 The employees"
            },
            "rating": 5.0,
            "stay_parameters": "Stayed August 2008, traveled with friends",
            "text": "The location is great. We parked the car and didn't need it again. It's a one block walk to Michigan Avenue with lots of shops and restaurants right there.",
            "title": "Fantastic Hotel! Amazing Experience!",
            "user": "happytraveler1987"
        },
        {
            "date": "February 13, 2008",
            "detail_rating": {
                "business": 5.0,
                "cleanliness": 5.0,
                "desk": null,
                "front_desk": 5.0,
                "location": 5.0,
                "pool": null,
                "restaurant": null,
                "rooms": 5.0,
                "service": 5.0,
                "sleep": null,
                "value": 5.0
            },
            "helpfulness": 1,
            "id": 13538578,
            "likes": {
                "disliked": "\u2014 The front door staff was not very friendly but the rest of the staff made up for it.",
                "liked": "\u2014 Location and the overall warm and inviting feel of the hotel"
            },
            "rating": 5.0,
            "stay_parameters": "Stayed February 2008, traveled as a couple",
            "text": "First of all, you cant beat the location. It's in the perfect spot on the Magnificent Mile and very close the lake. John Hancock tower is across the street and worth a visit. The hotel is on a quiet street away from the hustle and bustle which made it feel more like a local boutique hotel rather than a busy and noisy mega-hotel. The front desk staff was overly helpful and when I told the clerk I was craving clam chowder he proceeded to call all the local restaurants until he found one serving clam chowder! I was impressed.",
            "title": "Great Hotel. Great Location. Great staff.",
            "user": "wolfpacknc22"
        },
        {
            "date": "January 26, 2008",
            "detail_rating": {
                "business": 3.0,
                "cleanliness": 5.0,
                "desk": null,
                "front_desk": 5.0,
                "location": 5.0,
                "pool": null,
                "restaurant": null,
                "rooms": 5.0,
                "service": 3.0,
                "sleep": null,
                "value": 4.0
            },
            "helpfulness": 1,
            "id": 13021374,
            "likes": {
                "disliked": "\u2014 cold draft everywhere; fitness rooms needs more weight equipment.",
                "liked": "\u2014 quietness of rooms; views."
            },
            "rating": 5.0,
            "stay_parameters": "Stayed January 2008, traveled on business",
            "text": "The rooms are top notch and super clean. Maid service was superb and the common areas were all very clean and nicely appointed. I loved the top floor pool with the breathtaking view of the lake.",
            "title": "Good place to stay",
            "user": "colesloough"
        },
        {
            "date": "January 19, 2008",
            "detail_rating": {
                "business": null,
                "cleanliness": null,
                "desk": null,
                "location": null,
                "pool": null,
                "restaurant": null,
                "rooms": null,
                "service": null,
                "sleep": null,
                "value": null
            },
            "helpfulness": 2,
            "id": 12784082,
            "likes": {
                "disliked": null,
                "liked": null
            },
            "rating": 5.0,
            "stay_parameters": null,
            "text": "One person complained about the trash can being in the wrong place and said they wouldn't recommend the hotel...well I think that says it all when all you can find wrong with this hotel is a mis located trash can. It's a great place to stay....period.",
            "title": "I always love to come back!",
            "user": "pearldream"
        },
        {
            "date": "January 15, 2008",
            "detail_rating": {
                "business": null,
                "cleanliness": 5.0,
                "desk": null,
                "front_desk": 3.0,
                "location": 5.0,
                "pool": null,
                "restaurant": null,
                "rooms": 1.0,
                "service": 4.0,
                "sleep": null,
                "value": 2.0
            },
            "helpfulness": 2,
            "id": 12630697,
            "likes": {
                "disliked": null,
                "liked": null
            },
            "rating": 3.0,
            "stay_parameters": "Stayed December 2007, traveled with family",
            "text": "Nice hotel. Used to be doubletree suites. Just south of Drake hotel.",
            "title": "Was better as a Doubletree",
            "user": "yankinoz"
        },
        {
            "date": "January 11, 2008",
            "detail_rating": {
                "business": null,
                "cleanliness": 5.0,
                "desk": null,
                "front_desk": 3.0,
                "location": 5.0,
                "pool": null,
                "restaurant": null,
                "rooms": 5.0,
                "service": 4.0,
                "sleep": null,
                "value": 5.0
            },
            "helpfulness": 1,
            "id": 12520942,
            "likes": {
                "disliked": null,
                "liked": null
            },
            "rating": 5.0,
            "stay_parameters": "Stayed January 2008, traveled on business",
            "text": "Remodeled property... much better place than as a doubletree.",
            "title": "Excellent Option in the Magnificent Mile area",
            "user": "bubbafb"
        }
    ],
    "slim_ranking": 0.5,
    "stars": 3.5,
    "tripadvisor": {
        "VISITED": false,
        "country_name": null,
        "locality": null,
        "pic_link": null,
        "street_address": null
    },
    "user_rating": 4.0,
    "variance": {
        "average": 92,
        "excellent": 214,
        "poor": 39,
        "terrible": 14,
        "very good": 266
    }
}