{
    "aka": null,
    "description": null,
    "detail_rating": {
        "cleanliness": null,
        "location": null,
        "rooms": null,
        "service": null,
        "sleep": null,
        "value": null
    },
    "location": {
        "city": null,
        "continent": "Europe",
        "country": "Ireland",
        "proposed_city": null,
        "province": null,
        "region": null
    },
    "name": "Knockeven House",
    "places": {
        "aka": [],
        "hotel_description": [],
        "hotel_name": []
    },
    "review_count": 121,
    "review_count_current": 20,
    "reviews": [
        {
            "date": "July 16, 2012",
            "detail_rating": {
                "business": null,
                "cleanliness": 5.0,
                "desk": null,
                "location": 5.0,
                "pool": null,
                "restaurant": null,
                "rooms": 5.0,
                "service": 5.0,
                "sleep": 5.0,
                "value": 5.0
            },
            "helpfulness": null,
            "id": 134542047,
            "likes": {
                "disliked": null,
                "liked": null
            },
            "rating": 5.0,
            "stay_parameters": "Stayed June 2012, traveled with family",
            "text": "We had eleven people ages 9-70 in our family's party and Miss Pam took great care of us all! Our reservations were all promptly taken care of via several emails. Pam is a delightful woman and easy to work with. Her beautiful home in Cobh is just a few minutes from town and is absolutely lovely. It is clean, well-kept, nicely appointed and Pam is a fantastic cook. The en-suites are very large and personalized. Pam welcomed us into the formal living room upon our arrival and offered us tea, coffee, scones. She also took the time to find out what types of attractions we wanted to visit and offered suggestions for sight seeing and dinner. We had delicious made-to-order hot breakfasts the following morning before departing. Great experience for our entire family.",
            "title": "Great B&B - reasonably priced, delicious food, most welcoming host and hostess!",
            "user": "purdue93"
        },
        {
            "date": "July 9, 2012",
            "detail_rating": {
                "business": null,
                "cleanliness": 5.0,
                "desk": null,
                "location": 4.0,
                "pool": null,
                "restaurant": null,
                "rooms": null,
                "service": 5.0,
                "sleep": 4.0,
                "value": 5.0
            },
            "helpfulness": null,
            "id": 133931987,
            "likes": {
                "disliked": null,
                "liked": null
            },
            "rating": 5.0,
            "stay_parameters": "Stayed July 2012, traveled with family",
            "text": "We had 6 people travelling together, representing three generations of my family. When we arrived, we were offered tea after we had settled in, and it was lovely. This was something I missed at the various B&Bs during this trip to Ireland, but it may have been partly because we were arriving late so often. Pam could not have been more hospitable, and friendly! She gave us recommendations for dinner and St. Coleman's for Mass, but we didn't make it to Mass on time. It is a beautiful cathedral, though!",
            "title": "A short stay made to seem longer and more relaxed due to great hospitality!",
            "user": "Maureen D"
        },
        {
            "date": "July 9, 2012",
            "detail_rating": {
                "business": null,
                "cleanliness": 5.0,
                "desk": null,
                "location": 5.0,
                "pool": null,
                "restaurant": null,
                "rooms": 5.0,
                "service": 5.0,
                "sleep": 5.0,
                "value": 5.0
            },
            "helpfulness": null,
            "id": 133871571,
            "likes": {
                "disliked": null,
                "liked": null
            },
            "rating": 5.0,
            "stay_parameters": "Stayed April 2012, traveled with family",
            "text": "My husband and I shared our room with our son, and Pam said she could just move another bed in for him while we were at dinner, When we returned, there was a beautiful bed all made up, nicer than his bed at home, and I couldn't imagine how she just \"moved\" that in!",
            "title": "Great Location and a Great B & B",
            "user": "mizunoman"
        },
        {
            "date": "July 2, 2012",
            "detail_rating": {
                "business": null,
                "cleanliness": 5.0,
                "desk": null,
                "location": 4.0,
                "pool": null,
                "restaurant": null,
                "rooms": 5.0,
                "service": 5.0,
                "sleep": 5.0,
                "value": 5.0
            },
            "helpfulness": 1,
            "id": 133320830,
            "likes": {
                "disliked": null,
                "liked": null
            },
            "rating": 5.0,
            "stay_parameters": "Stayed June 2012, traveled as a couple",
            "text": "Pam was very friendly and made us all feel like old friends staying over. As others have mentioned, the breakfast was delicious, and her scones were brilliant as well. We really enjoyed Knockeven House!",
            "title": "Haven on a rainy day",
            "user": "TableCape"
        },
        {
            "date": "June 28, 2012",
            "detail_rating": {
                "business": null,
                "cleanliness": 5.0,
                "desk": null,
                "location": 4.0,
                "pool": null,
                "restaurant": null,
                "rooms": 4.0,
                "service": 5.0,
                "sleep": null,
                "value": 5.0
            },
            "helpfulness": null,
            "id": 132993005,
            "likes": {
                "disliked": null,
                "liked": null
            },
            "rating": 5.0,
            "stay_parameters": "Stayed June 2012, traveled with family",
            "text": "Knockeven house is beautiful and Pamela is a warm, wonderful hostess! On our arrival we were escorted into the living room area where we were greeted with tea and scones and a warm fire on a chilly wet day in Ireland. Our rooms were spacious, the beds were very comfortable and the view (our room was in the front of the house) of Cobh was great! Our breakfast was delicious and Pam offered many choices fruit/yogurt/breads/cheeses/meats and hot breakfast too! The Knockeven house is well located for day trips to Kinsale, Blarney Castle and Cork. Pam is very helpful with suggestions of places to go and what to see. We really enjoyed our stay at the Knockeven House!",
            "title": "Afternoon Tea",
            "user": "fiona1969"
        },
        {
            "date": "September 9, 2012",
            "detail_rating": {
                "business": null,
                "cleanliness": 5.0,
                "desk": null,
                "location": 5.0,
                "pool": null,
                "restaurant": null,
                "rooms": 5.0,
                "service": 5.0,
                "sleep": null,
                "value": 5.0
            },
            "helpfulness": null,
            "id": 139837797,
            "likes": {
                "disliked": null,
                "liked": null
            },
            "rating": 5.0,
            "stay_parameters": "Stayed August 2012",
            "text": "We have been in a lot of beautiful hotels around the world over the years, but this place is up with the very best of them.",
            "title": "Unbelievable, best B&B yet!!",
            "user": "RoryMc"
        },
        {
            "date": "September 2, 2012",
            "detail_rating": {
                "business": null,
                "cleanliness": 5.0,
                "desk": null,
                "location": 5.0,
                "pool": null,
                "restaurant": null,
                "rooms": 5.0,
                "service": 5.0,
                "sleep": null,
                "value": 5.0
            },
            "helpfulness": null,
            "id": 139172498,
            "likes": {
                "disliked": null,
                "liked": null
            },
            "rating": 5.0,
            "stay_parameters": "Stayed September 2012",
            "text": "Pamela and John were just the best hosts, tea and scones to start our stay and even a large glass of wine and lovely chat to end the night...",
            "title": "Just lovely",
            "user": "Lisa M"
        },
        {
            "date": "August 17, 2012",
            "detail_rating": {
                "business": null,
                "cleanliness": 5.0,
                "desk": null,
                "location": 4.0,
                "pool": null,
                "restaurant": null,
                "rooms": 5.0,
                "service": 5.0,
                "sleep": 5.0,
                "value": 4.0
            },
            "helpfulness": null,
            "id": 137490097,
            "likes": {
                "disliked": null,
                "liked": null
            },
            "rating": 5.0,
            "stay_parameters": "Stayed August 2012, traveled as a couple",
            "text": "It's an old 1800's house restored to perfection..old but so warm and inviting.",
            "title": "What a magnificent house",
            "user": "MaMa_C52"
        },
        {
            "date": "August 3, 2012",
            "detail_rating": {
                "business": null,
                "cleanliness": null,
                "desk": null,
                "location": null,
                "pool": null,
                "restaurant": null,
                "rooms": null,
                "service": null,
                "sleep": null,
                "value": null
            },
            "helpfulness": null,
            "id": 136149095,
            "likes": {
                "disliked": null,
                "liked": null
            },
            "rating": 5.0,
            "stay_parameters": null,
            "text": "The five guest rooms were just unreal, old style, warm and luxurious to the last.",
            "title": "Lovely accommodations and gracious host",
            "user": "IntotheWoods22"
        },
        {
            "date": "July 25, 2012",
            "detail_rating": {
                "business": null,
                "cleanliness": 5.0,
                "desk": null,
                "location": 5.0,
                "pool": null,
                "restaurant": null,
                "rooms": 5.0,
                "service": 5.0,
                "sleep": 5.0,
                "value": 5.0
            },
            "helpfulness": null,
            "id": 135353481,
            "likes": {
                "disliked": null,
                "liked": null
            },
            "rating": 5.0,
            "stay_parameters": "Stayed June 2012, traveled as a couple",
            "text": "Breakfast was equally as perfect, full Irish and everything else besides!",
            "title": "Superb!",
            "user": "Tupelo010835"
        },
        {
            "date": "June 21, 2012",
            "detail_rating": {
                "business": null,
                "cleanliness": 5.0,
                "desk": null,
                "location": 5.0,
                "pool": null,
                "restaurant": null,
                "rooms": 5.0,
                "service": 5.0,
                "sleep": 5.0,
                "value": 5.0
            },
            "helpfulness": null,
            "id": 132465596,
            "likes": {
                "disliked": null,
                "liked": null
            },
            "rating": 5.0,
            "stay_parameters": "Stayed June 2012, traveled with family",
            "text": "This was a great B&B at a great house and a great price. Pam welcomed us with tea and homemade scones even though we arrived at 9:30. This was a welcome treat after a long day of travel. The house was beautiful and the room we were in was BIG!!! We had the whole house to ourselves since no other guest was staying there that night. What a surprise! I wish we could have stayed for a few additional day but unfortunately we had to leave early. Despite this, Pam made us a wonderful breakfast and recommended things to see on our way to our next city.",
            "title": "All to ourselves!",
            "user": "localdecoy"
        },
        {
            "date": "June 20, 2012",
            "detail_rating": {
                "business": null,
                "cleanliness": 5.0,
                "desk": null,
                "location": 5.0,
                "pool": null,
                "restaurant": null,
                "rooms": 5.0,
                "service": 5.0,
                "sleep": 5.0,
                "value": 5.0
            },
            "helpfulness": null,
            "id": 132405811,
            "likes": {
                "disliked": null,
                "liked": null
            },
            "rating": 5.0,
            "stay_parameters": "Stayed May 2012, traveled with family",
            "text": "This is one of the loveliest B & B's by far. Pam was very accomodating to our needs and always willing to make everyone feel at home. Beautiful rooms and her selection in food was wonderful. We thoroughly enjoyed our stay and this little seaport town.",
            "title": "Lovely surroundings, lovely service",
            "user": "John P"
        },
        {
            "date": "June 10, 2012",
            "detail_rating": {
                "business": null,
                "cleanliness": 5.0,
                "desk": null,
                "location": 5.0,
                "pool": null,
                "restaurant": null,
                "rooms": 5.0,
                "service": 5.0,
                "sleep": 5.0,
                "value": 5.0
            },
            "helpfulness": null,
            "id": 131701177,
            "likes": {
                "disliked": null,
                "liked": null
            },
            "rating": 5.0,
            "stay_parameters": "Stayed June 2012, traveled with friends",
            "text": "This is a lovely B&B on the coastal town of Ireland. Compared to other B&Bs, this one is outstanding. The rooms are well appointed and nicely decorated. The hostess and owner is very gracious and prepares a deluxe breakfast. Its location is close to town which offers serveral nice restaurants. I definitely recommend it and hope to return again,",
            "title": "Excellent B&B",
            "user": "LIZ250"
        },
        {
            "date": "June 3, 2012",
            "detail_rating": {
                "business": null,
                "cleanliness": 5.0,
                "desk": null,
                "location": 5.0,
                "pool": null,
                "restaurant": null,
                "rooms": 5.0,
                "service": 5.0,
                "sleep": 5.0,
                "value": 5.0
            },
            "helpfulness": null,
            "id": 131212572,
            "likes": {
                "disliked": null,
                "liked": null
            },
            "rating": 5.0,
            "stay_parameters": "Stayed May 2012, traveled with friends",
            "text": "Pam could not have been any more gracious. The evening meal she served was second to none. It was the first day we arrived and it was so relaxing. This B&B was one of the best places we stayed at on our trip. A must if you are in the area.",
            "title": "Brilliant, spectacular, awesome",
            "user": "Karen M"
        },
        {
            "date": "May 22, 2012",
            "detail_rating": {
                "business": null,
                "cleanliness": null,
                "desk": null,
                "location": null,
                "pool": null,
                "restaurant": null,
                "rooms": null,
                "service": null,
                "sleep": null,
                "value": null
            },
            "helpfulness": null,
            "id": 130433445,
            "likes": {
                "disliked": null,
                "liked": null
            },
            "rating": 5.0,
            "stay_parameters": null,
            "text": "This gorgeous period home was one of our two favorite B&Bs on our trip. The house has large rooms and the true feel of a period estate. Pam was a great hostess with terrific recommendations on restaurants and other things in the area. Do NOT miss the scones and cheese selecting at breakfast. I could not stop myself!! The breakfast was served in a beautiful dining room around one large table where the different guests can enjoy each other's company. The price is very reasonable for such a lavish period home!",
            "title": "Outstanding luxury B&B at a value!",
            "user": "MJMacM"
        },
        {
            "date": "May 22, 2012",
            "detail_rating": {
                "business": null,
                "cleanliness": 5.0,
                "desk": null,
                "location": 5.0,
                "pool": null,
                "restaurant": null,
                "rooms": 5.0,
                "service": 5.0,
                "sleep": 5.0,
                "value": 5.0
            },
            "helpfulness": null,
            "id": 130395887,
            "likes": {
                "disliked": null,
                "liked": null
            },
            "rating": 5.0,
            "stay_parameters": "Stayed May 2012, traveled with friends",
            "text": "Pam greets you into her home with a warm fire, tea and the BEST scones in Ireland. Her rooms are big and warm. Knockeven house is just grand!",
            "title": "First stay and the best",
            "user": "JaneH27"
        },
        {
            "date": "May 16, 2012",
            "detail_rating": {
                "business": null,
                "cleanliness": 5.0,
                "desk": null,
                "location": 5.0,
                "pool": null,
                "restaurant": null,
                "rooms": 5.0,
                "service": 5.0,
                "sleep": 4.0,
                "value": 5.0
            },
            "helpfulness": null,
            "id": 130060867,
            "likes": {
                "disliked": null,
                "liked": null
            },
            "rating": 5.0,
            "stay_parameters": "Stayed May 2012, traveled with family",
            "text": "We spent one night in Knockeven house May 10th. We were warmly greeted by Pam and she offered refreshments when we arrived. She also went out of her way to drop us in town ( a few min down the road). The Irish breakfast accompanied by freshly baked scones was excellent.",
            "title": "Excellent Stay",
            "user": "Taistealgobrach"
        },
        {
            "date": "May 12, 2012",
            "detail_rating": {
                "business": null,
                "cleanliness": 5.0,
                "desk": null,
                "location": 4.0,
                "pool": null,
                "restaurant": null,
                "rooms": 5.0,
                "service": 5.0,
                "sleep": 5.0,
                "value": 5.0
            },
            "helpfulness": null,
            "id": 129825347,
            "likes": {
                "disliked": null,
                "liked": null
            },
            "rating": 5.0,
            "stay_parameters": "Stayed May 2012, traveled as a couple",
            "text": "Rooms were very grand and spacious. Thoroughly enjoyed.",
            "title": "Excellent B & B",
            "user": "Ironwain"
        },
        {
            "date": "May 8, 2012",
            "detail_rating": {
                "business": null,
                "cleanliness": 2.0,
                "desk": null,
                "location": 4.0,
                "pool": null,
                "restaurant": null,
                "rooms": 3.0,
                "service": 4.0,
                "sleep": 3.0,
                "value": 4.0
            },
            "helpfulness": 1,
            "id": 129612464,
            "likes": {
                "disliked": null,
                "liked": null
            },
            "rating": 3.0,
            "stay_parameters": "Stayed April 2012, traveled as a couple",
            "text": "Knockeven was one of our best B & B experience in Ireland. Tastefully furnished manor house with big rooms and a great shower! Pam and John are gracious hosts and Pam is a font of information about anything in the area; her suggestion for a visit to Ardmore on our way to Kilknenny was a very good suggestion. Excellent breakfast and the scones are the best!",
            "title": "Best scones of the whole trip",
            "user": "Mary T"
        },
        {
            "date": "May 2, 2012",
            "detail_rating": {
                "business": null,
                "cleanliness": 5.0,
                "desk": null,
                "location": 5.0,
                "pool": null,
                "restaurant": null,
                "rooms": 5.0,
                "service": 5.0,
                "sleep": 5.0,
                "value": 3.0
            },
            "helpfulness": null,
            "id": 129230380,
            "likes": {
                "disliked": null,
                "liked": null
            },
            "rating": 5.0,
            "stay_parameters": "Stayed April 2012, traveled as a couple",
            "text": "We stayed two nights at the end of April. Pam could not have been nicer. Bar none the best scones of the 12 day trip. The house and furnishings could use some freshening up. A little worn.",
            "title": "Lovely house, lovely hospitality",
            "user": "Betsy H"
        }
    ],
    "slim_ranking": 0.0769230769231,
    "stars": null,
    "tripadvisor": {
        "VISITED": false,
        "country_name": null,
        "locality": null,
        "pic_link": null,
        "street_address": null
    },
    "user_rating": 5.0,
    "variance": {
        "average": 3,
        "excellent": 110,
        "poor": 0,
        "terrible": 0,
        "very good": 8
    }
}