{
    "aka": "1st Tracks Lodge",
    "description": "Located ski-in, ski-out at the base of Whistler Mountain in Whistler Creekside, First Tracks Lodge is an upscale, condo style hotel. This all suite hotel features suites ranging in size from one to four bedrooms. Each suite offers a full kitchen with upscale appliances and granite counter tops, a living area with a gas fireplace, private balconies and one full bathroom per bedroom. This property truly offers all of the comforts of home in a most convenient location. In addition, the Creekside Village is just steps away providing convenient access to a grocery store, liquor store, ski and board rentals, Whistler kids programs as well as a few coffee shops and eateries.",
    "detail_rating": {
        "cleanliness": null,
        "location": null,
        "rooms": null,
        "service": null,
        "sleep": null,
        "value": null
    },
    "location": {
        "city": "Whistler",
        "continent": null,
        "country": "Canada",
        "proposed_city": null,
        "province": null,
        "region": null
    },
    "name": "First Tracks Lodge",
    "places": {
        "aka": [],
        "hotel_description": [],
        "hotel_name": []
    },
    "review_count": 233,
    "review_count_current": 16,
    "reviews": [
        {
            "date": "March 11, 2007",
            "detail_rating": {
                "business": null,
                "cleanliness": null,
                "desk": null,
                "front_desk": 4.0,
                "location": 5.0,
                "pool": null,
                "restaurant": null,
                "rooms": 5.0,
                "service": 5.0,
                "sleep": null,
                "value": 5.0
            },
            "helpfulness": 1,
            "id": 7012289,
            "likes": {
                "disliked": "\u2014 nothing!!! and I'm a very difficult person to please in terms of hol accommodation",
                "liked": "\u2014 the luxury of the apartment and proximity to slopes"
            },
            "rating": 5.0,
            "stay_parameters": "Stayed March 2007, traveled as a couple",
            "text": "My husband and I have just returned from a week long break in First tracks and in line with all the other reviews it was amazing.",
            "title": "Amazing",
            "user": "UkSle"
        },
        {
            "date": "March 10, 2007",
            "detail_rating": {
                "business": null,
                "cleanliness": null,
                "desk": null,
                "location": null,
                "pool": null,
                "restaurant": null,
                "rooms": null,
                "service": null,
                "sleep": null,
                "value": null
            },
            "helpfulness": 6,
            "id": 7009124,
            "likes": {
                "disliked": null,
                "liked": null
            },
            "rating": 5.0,
            "stay_parameters": null,
            "text": "I booked first tracks on the basis of the trip advisor reviews and wasn't disapointed. We ended up with a 1.5 bedroom apt(+ den and shower room) due to some confusion with our booking (we originally booked for a 1 bedroom). The apartments are funished to a very high standard (granite work sufaces, underfloor heating, spa baths,silver kitchen appliances). They are very homely,comfortable and clean",
            "title": "Ignore the last reviews criticims. This place is the Bomb",
            "user": "DonnieDarker"
        },
        {
            "date": "March 6, 2007",
            "detail_rating": {
                "business": null,
                "cleanliness": null,
                "desk": null,
                "location": null,
                "pool": null,
                "restaurant": null,
                "rooms": null,
                "service": null,
                "sleep": null,
                "value": null
            },
            "helpfulness": 1,
            "id": 6925952,
            "likes": {
                "disliked": null,
                "liked": null
            },
            "rating": 5.0,
            "stay_parameters": null,
            "text": "The location beside the gondola is perfect for the keen skiier, my husband was out by 8.15 every morning whilst I stayed in bed!",
            "title": "The Good and the Bad",
            "user": "JonnyRotten90"
        },
        {
            "date": "February 1, 2007",
            "detail_rating": {
                "business": 4.0,
                "cleanliness": 5.0,
                "desk": null,
                "front_desk": 4.0,
                "location": 5.0,
                "pool": null,
                "restaurant": null,
                "rooms": 5.0,
                "service": 5.0,
                "sleep": null,
                "value": 5.0
            },
            "helpfulness": 2,
            "id": 6724453,
            "likes": {
                "disliked": "\u2014 no bad points",
                "liked": "\u2014 Quality, space, location"
            },
            "rating": 5.0,
            "stay_parameters": "Stayed January 2007, traveled with family",
            "text": "Almost the only tiny negative comment I have is that the locks on the ski lockers are quite complicated to work and in terms of the location the runs back down to Creekside are intermediate and hard going on tired legs.",
            "title": "Doesn't get any better!",
            "user": "johnsomi"
        },
        {
            "date": "January 31, 2007",
            "detail_rating": {
                "business": null,
                "cleanliness": 5.0,
                "desk": null,
                "front_desk": 5.0,
                "location": 5.0,
                "pool": null,
                "restaurant": null,
                "rooms": 5.0,
                "service": 5.0,
                "sleep": null,
                "value": 5.0
            },
            "helpfulness": 1,
            "id": 6719409,
            "likes": {
                "disliked": "\u2014 the pillows",
                "liked": "\u2014 The fact that it was very modern and right next to the gondola"
            },
            "rating": 5.0,
            "stay_parameters": "Stayed January 2007, traveled with friends",
            "text": "Coming from the UK my only experience of skiing and ski accomodation is in the French Alps.",
            "title": "Great Place",
            "user": "jimalbe"
        },
        {
            "date": "March 28, 2008",
            "detail_rating": {
                "business": 4.0,
                "cleanliness": 5.0,
                "desk": null,
                "front_desk": 4.0,
                "location": 5.0,
                "pool": null,
                "restaurant": null,
                "rooms": 5.0,
                "service": 5.0,
                "sleep": null,
                "value": 4.0
            },
            "helpfulness": 1,
            "id": 14605431,
            "likes": {
                "disliked": "\u2014 All that skiing wore me out -- sore legs!",
                "liked": "\u2014 Location, spaciousness, comfort."
            },
            "rating": 5.0,
            "stay_parameters": "Stayed January 2008",
            "text": "When I go skiing, I like to find a place right at the slopes, ski-in, ski-out, no time and effort wasted hauling all the ski gear around. First Tracks' location is perfect -- you are right at the base of the Creekside Gondola, with a ski storage room that is perhaps 30 seconds from the lift. Access to skiing was fabulous. In fact our 5th floor suite looked out over the Gondola, with a nice view up the slope and up the mountain.",
            "title": "Fabulous Place to Stay in Whistler",
            "user": "Paul99501"
        },
        {
            "date": "February 19, 2008",
            "detail_rating": {
                "business": 4.0,
                "cleanliness": 4.0,
                "desk": null,
                "front_desk": 3.0,
                "location": 4.0,
                "pool": null,
                "restaurant": null,
                "rooms": 5.0,
                "service": 4.0,
                "sleep": null,
                "value": 5.0
            },
            "helpfulness": 3,
            "id": 13681205,
            "likes": {
                "disliked": "\u2014 Lack of view ... but it was completely silent.",
                "liked": "\u2014 Quality - from the ice-dispensing fridge to spa-bath, washer/dryer to 3 TVs and Hi-Fi within a HUGE apartment."
            },
            "rating": 5.0,
            "stay_parameters": "Stayed February 2008, traveled as a couple",
            "text": "Spent 10 nights here in a group that had 2 large suites -- one was 4 bedrooms, one was 3 bedrooms. The suites were large, upscale, very comfortable. The building overall is tasteful and has that whole natural wood and rock lodge vibe. Good kitchens, lots of room, big bathrooms, very cushy and comfortable. Very clean and quiet -- I never heard any noises coming through the walls. In room laundry, which is nice when you ski. Large ski storage rooms with 2 levels of security to protect your gear.",
            "title": "Everything you'll expect but remember it's Creekside",
            "user": "CJBROWN"
        },
        {
            "date": "January 27, 2008",
            "detail_rating": {
                "business": 3.0,
                "cleanliness": 5.0,
                "desk": null,
                "front_desk": 3.0,
                "location": 5.0,
                "pool": null,
                "restaurant": null,
                "rooms": 5.0,
                "service": 4.0,
                "sleep": null,
                "value": 5.0
            },
            "helpfulness": 2,
            "id": 13036792,
            "likes": {
                "disliked": null,
                "liked": null
            },
            "rating": 5.0,
            "stay_parameters": "Stayed January 2008, traveled with friends",
            "text": "Other Lodge amenities were also excellent. Two huge outdoor hot tubs, one for adults, one for kids. A really nice outdoor heated pool. Big, well-equipped workout facilities. Large and very comfortable lobby.",
            "title": "No egg cups!",
            "user": "ChezandJon"
        },
        {
            "date": "January 6, 2008",
            "detail_rating": {
                "business": 2.0,
                "cleanliness": 5.0,
                "desk": null,
                "front_desk": 3.0,
                "location": 4.0,
                "pool": null,
                "restaurant": null,
                "rooms": 5.0,
                "service": 3.0,
                "sleep": null,
                "value": 5.0
            },
            "helpfulness": 1,
            "id": 12393205,
            "likes": {
                "disliked": "\u2014 nothing",
                "liked": "\u2014 everything"
            },
            "rating": 5.0,
            "stay_parameters": "Stayed September 2007, traveled as a couple",
            "text": "Service was good, the staff was friendly and responsive.",
            "title": "Fantastic place, amazing value",
            "user": "diggaa"
        },
        {
            "date": "August 27, 2007",
            "detail_rating": {
                "business": 3.0,
                "cleanliness": 5.0,
                "desk": null,
                "front_desk": 4.0,
                "location": 5.0,
                "pool": null,
                "restaurant": null,
                "rooms": 5.0,
                "service": 5.0,
                "sleep": null,
                "value": 4.0
            },
            "helpfulness": 2,
            "id": 8514947,
            "likes": {
                "disliked": "\u2014 not told about parking fee",
                "liked": "\u2014 great condo high quality"
            },
            "rating": 5.0,
            "stay_parameters": "Stayed August 2007, traveled with friends",
            "text": "I also liked the Creekside location. Short walk (3 minutes or less) to everything you need -- grocery store, restaurants and bars, ski shop and ski rental, video store, internet cafe, Starbucks, etc.",
            "title": "Great Accommodations",
            "user": "Tripwilmington"
        },
        {
            "date": "August 12, 2007",
            "detail_rating": {
                "business": 5.0,
                "cleanliness": 5.0,
                "desk": null,
                "front_desk": 5.0,
                "location": 4.0,
                "pool": null,
                "restaurant": null,
                "rooms": 5.0,
                "service": 4.0,
                "sleep": null,
                "value": 5.0
            },
            "helpfulness": 3,
            "id": 8396982,
            "likes": {
                "disliked": null,
                "liked": "\u2014 Big and clean"
            },
            "rating": 4.0,
            "stay_parameters": "Stayed August 2007",
            "text": "I will stay here again in the winter for ski season without a doubt. I like the fact that it is a little ways from the noise of whistler village as my kids are young and still need the get to bed relatively early (9pm). We stayed in a 3 bedroom unit and having the den made nights fun playing games and watching movies. The unit was extremely clean and had \"extras\" like heated floors. You do have to check in at the Legends like others have pointed out which isn't a big deal. Parking is below the building which in the winter will be very useful.",
            "title": "Oustanding Place to Stay",
            "user": "JohnsonSeattle"
        },
        {
            "date": "July 9, 2007",
            "detail_rating": {
                "business": null,
                "cleanliness": 5.0,
                "desk": null,
                "front_desk": 4.0,
                "location": 4.0,
                "pool": null,
                "restaurant": null,
                "rooms": 5.0,
                "service": null,
                "sleep": null,
                "value": 4.0
            },
            "helpfulness": 1,
            "id": 8087135,
            "likes": {
                "disliked": null,
                "liked": "\u2014 Decor of the rooms"
            },
            "rating": 5.0,
            "stay_parameters": "Stayed July 2007, traveled with family",
            "text": "We stayed at First Tracks on July 5 and we were impressed with the space, style and quality of our 2 bedroom unit. One bedroom had a king bed, the other a queen, and there was a sofa bed in the open kitchen/dining/living room area in the middle. Each bedroom had its own TV and bathroom. There was also a TV in the living room. A laundry room with storage racks is right by the entry. The bathrooms and kitchen are attractively decorated in granite and wood.",
            "title": "Great Stay in Creekside section",
            "user": "jlbob"
        },
        {
            "date": "June 8, 2007",
            "detail_rating": {
                "business": null,
                "cleanliness": 5.0,
                "desk": null,
                "front_desk": 4.0,
                "location": 5.0,
                "pool": null,
                "restaurant": null,
                "rooms": 5.0,
                "service": 4.0,
                "sleep": null,
                "value": 5.0
            },
            "helpfulness": 1,
            "id": 7805549,
            "likes": {
                "disliked": "\u2014 Front Desk at Legends",
                "liked": "\u2014 Well appointed"
            },
            "rating": 5.0,
            "stay_parameters": "Stayed June 2007, traveled as a couple",
            "text": "There is a heated main pool and 2 hot tubs, one for adults only, and a workout room. Some guests used the Lodge's BBQ grill to cook their dinner by the pool. A Japanese restaurant is located in the Lodge, which is right next to the chairlift. (The chairlift was not running at this time.)",
            "title": "Wonderful",
            "user": "Mimi4583"
        },
        {
            "date": "April 16, 2007",
            "detail_rating": {
                "business": null,
                "cleanliness": null,
                "desk": null,
                "location": null,
                "pool": null,
                "restaurant": null,
                "rooms": null,
                "service": null,
                "sleep": null,
                "value": null
            },
            "helpfulness": 6,
            "id": 7377769,
            "likes": {
                "disliked": null,
                "liked": null
            },
            "rating": 4.0,
            "stay_parameters": null,
            "text": "The Creekside section was quiet compared to the main Whistler Village, which was a few miles further north. There are several restaurant choices in this area, but most of the restaurants are in the main village. You would need to drive back to the village or take the local bus.",
            "title": "Not too bad for a \"south of town\" condo",
            "user": "A TripAdvisor user"
        },
        {
            "date": "April 2, 2007",
            "detail_rating": {
                "business": null,
                "cleanliness": 5.0,
                "desk": null,
                "front_desk": 2.0,
                "location": 4.0,
                "pool": null,
                "restaurant": null,
                "rooms": 5.0,
                "service": 5.0,
                "sleep": null,
                "value": 4.0
            },
            "helpfulness": 4,
            "id": 7269817,
            "likes": {
                "disliked": "\u2014 Front desk staff",
                "liked": "\u2014 Size, facilities, location"
            },
            "rating": 4.0,
            "stay_parameters": "Stayed March 2007, traveled as a couple",
            "text": "We enjoyed a pleasant meal at Una Mas, the Mexican grill restaurant. We really liked the international, specialty and gourmet food choices at the Creekside Market grocery store.",
            "title": "First Tracks - Second Impressions",
            "user": "AussieinUKLondon"
        },
        {
            "date": "January 17, 2007",
            "detail_rating": {
                "business": 4.0,
                "cleanliness": 5.0,
                "desk": null,
                "front_desk": 4.0,
                "location": 5.0,
                "pool": null,
                "restaurant": null,
                "rooms": 5.0,
                "service": 5.0,
                "sleep": null,
                "value": 5.0
            },
            "helpfulness": 1,
            "id": 6612577,
            "likes": {
                "disliked": "\u2014 Parking underground is a bit tight with a big SUV!",
                "liked": "\u2014 The quality of the furnishings in the room were top notch!"
            },
            "rating": 5.0,
            "stay_parameters": "Stayed January 2007, traveled with family",
            "text": "Thanks to all those who wrote a nice review of this place! It was just as described and, I think, one of the nicest lodgey (is that really a word?) properties that I have ever stayed at. Everything about the condo-type lodge room was 1st class - great kitchen with all the items you need to prepare most meals.",
            "title": "Can't think of a better place!",
            "user": "ChicagoPablo"
        }
    ],
    "slim_ranking": 0.0769230769231,
    "stars": 3.5,
    "tripadvisor": {
        "VISITED": false,
        "country_name": null,
        "locality": null,
        "pic_link": null,
        "street_address": null
    },
    "user_rating": 5.0,
    "variance": {
        "average": 5,
        "excellent": 187,
        "poor": 2,
        "terrible": 1,
        "very good": 38
    }
}