{
    "aka": "Diva Hotel San Francisco",
    "description": "The avant-garde Hotel Diva with its ultra-modern rooms is in the center of all that San Francisco has to offer. Surrounded by theaters, shopping, nightlife, casual and fine dining, and steps away from Cable Car line, Hotel Diva is an excellent choice for couples, families, and business travelers. Amenities include complimentary high-speed wireless Internet, 24 hour business center, fitness room, and complimentary coffee and tea service in the morning.",
    "detail_rating": {
        "cleanliness": 4.5,
        "location": 4.5,
        "rooms": 4.0,
        "service": 4.0,
        "sleep": 4.0,
        "value": 4.0
    },
    "location": {
        "city": "San Francisco",
        "continent": null,
        "country": "United States",
        "proposed_city": "San",
        "province": null,
        "region": null
    },
    "name": "Hotel Diva",
    "places": {
        "aka": [
            "San"
        ],
        "hotel_description": [
            "San"
        ],
        "hotel_name": []
    },
    "review_count": 840,
    "review_count_current": 80,
    "reviews": [
        {
            "date": "April 23, 2008",
            "detail_rating": {
                "business": 4.0,
                "cleanliness": 5.0,
                "desk": null,
                "front_desk": 5.0,
                "location": 4.0,
                "pool": null,
                "restaurant": null,
                "rooms": 5.0,
                "service": 5.0,
                "sleep": null,
                "value": 5.0
            },
            "helpfulness": 2,
            "id": 15288459,
            "likes": {
                "disliked": null,
                "liked": "\u2014 great value"
            },
            "rating": 5.0,
            "stay_parameters": "Stayed April 2008, traveled with family",
            "text": "My family and I (wife and 2 daughters, ages 7 and 9) stayed at the hotel Diva for a week on a vacation. We highly, highly recommend the Diva, and we had a great time.",
            "title": "Great Great Hotel + great value",
            "user": "Dcman91"
        },
        {
            "date": "April 20, 2008",
            "detail_rating": {
                "business": 5.0,
                "cleanliness": 4.0,
                "desk": null,
                "front_desk": 4.0,
                "location": 5.0,
                "pool": null,
                "restaurant": null,
                "rooms": 4.0,
                "service": 4.0,
                "sleep": null,
                "value": 4.0
            },
            "helpfulness": 1,
            "id": 15172044,
            "likes": {
                "disliked": "\u2014 Noisy at night on the weekends",
                "liked": "\u2014 Location"
            },
            "rating": 4.0,
            "stay_parameters": "Stayed April 2008, traveled on business",
            "text": "We stayed in a studio suite queen, which provided us 2 separate bedrooms that shared a bathroom, this was perfect for us. Complaints about noise on Geary street are valid, ask for a room in the back. The individual that checked us in gave us a choice and we did this, and the room was quiet.",
            "title": "Pluses and minuses",
            "user": "honhi96825"
        },
        {
            "date": "April 9, 2008",
            "detail_rating": {
                "business": null,
                "cleanliness": 3.0,
                "desk": null,
                "front_desk": 2.0,
                "location": 2.0,
                "pool": null,
                "restaurant": null,
                "rooms": 2.0,
                "service": 2.0,
                "sleep": null,
                "value": 2.0
            },
            "helpfulness": 1,
            "id": 14912531,
            "likes": {
                "disliked": "\u2014 noisy and cold",
                "liked": "\u2014 clean bathroom"
            },
            "rating": 2.0,
            "stay_parameters": "Stayed January 2008",
            "text": "Our beds were comfortable. Our rooms weren't big, but weren't tiny either. We did fine with a week's worth of clothes as long as we were organized. Our bedrooms and bathroom were very clean and stayed that way throughout the week. Note to visitors, tip cleaning staff at any hotel a few dollars a day, this always goes a long way.",
            "title": "Staff acting like divas - noisy - and dark rooms",
            "user": "Oceanne"
        },
        {
            "date": "April 6, 2008",
            "detail_rating": {
                "business": 4.0,
                "cleanliness": 4.0,
                "desk": null,
                "front_desk": 4.0,
                "location": 4.0,
                "pool": null,
                "restaurant": null,
                "rooms": 3.0,
                "service": 3.0,
                "sleep": null,
                "value": 4.0
            },
            "helpfulness": 2,
            "id": 14836531,
            "likes": {
                "disliked": null,
                "liked": "\u2014 Decor, location, price"
            },
            "rating": 4.0,
            "stay_parameters": "Stayed April 2008, traveled with family",
            "text": "The staff were sociable and helpful 100% of the time, including cleaning staff, and several staff members made it a point to be engaging to my children. My kids weren't ignored and were treated well. I greatly appreciated this. The hotel does appear to be marketed to adults, but my kids fit in fine and we did not feel out of place. I noticed they have many specials, several geared towards kids The lounges were great, I liked the style and appreciated having computers and morning coffee available.",
            "title": "Great Location",
            "user": "ardengood"
        },
        {
            "date": "March 31, 2008",
            "detail_rating": {
                "business": 5.0,
                "cleanliness": 5.0,
                "desk": null,
                "front_desk": 5.0,
                "location": 4.0,
                "pool": null,
                "restaurant": null,
                "rooms": 4.0,
                "service": 5.0,
                "sleep": null,
                "value": 3.0
            },
            "helpfulness": 1,
            "id": 14697074,
            "likes": {
                "disliked": null,
                "liked": null
            },
            "rating": 3.0,
            "stay_parameters": "Stayed March 2008",
            "text": "Are there homeless outside, yes, and they are all over San Francisco as well. While I don't care for being hit up for money every 5 minutes, neither was I harassed, and one homeless gentleman even directed my daughter towards the inner sidewalk when she was unsafely heading towards the street. Polite homeless folk? Only in San Francisco!",
            "title": "Noisy but nice",
            "user": "ChinaGirl_7"
        },
        {
            "date": "October 21, 2007",
            "detail_rating": {
                "business": 5.0,
                "cleanliness": 5.0,
                "desk": null,
                "front_desk": 5.0,
                "location": 5.0,
                "pool": null,
                "restaurant": null,
                "rooms": 5.0,
                "service": 5.0,
                "sleep": null,
                "value": 5.0
            },
            "helpfulness": null,
            "id": 10180721,
            "likes": {
                "disliked": null,
                "liked": null
            },
            "rating": 5.0,
            "stay_parameters": "Stayed November 2006, traveled as a couple",
            "text": "This hotel is at a great location. YOu dont spend a lot of time in it but its perfect for exploring san fran. it reminds me of ikea. i really liked it. clean, quiet and great location, very hip!",
            "title": "perfect for san fran trip!",
            "user": "dagmaras"
        },
        {
            "date": "October 17, 2007",
            "detail_rating": {
                "business": 3.0,
                "cleanliness": 4.0,
                "desk": null,
                "front_desk": 5.0,
                "location": 5.0,
                "pool": null,
                "restaurant": null,
                "rooms": 4.0,
                "service": 5.0,
                "sleep": null,
                "value": 4.0
            },
            "helpfulness": 1,
            "id": 10097845,
            "likes": {
                "disliked": "\u2014 decor",
                "liked": "\u2014 staff"
            },
            "rating": 4.0,
            "stay_parameters": "Stayed October 2007, traveled on business",
            "text": "Hotel Diva is really good at what it sets out to do, and that is to appeal to a young, hip, contemporary crowd.",
            "title": "Diva Taste Specific...GREAT, Attentive Staff",
            "user": "jcdato"
        },
        {
            "date": "October 16, 2007",
            "detail_rating": {
                "business": 4.0,
                "cleanliness": 4.0,
                "desk": null,
                "front_desk": 3.0,
                "location": 4.0,
                "pool": null,
                "restaurant": null,
                "rooms": 4.0,
                "service": 3.0,
                "sleep": null,
                "value": 4.0
            },
            "helpfulness": null,
            "id": 10086523,
            "likes": {
                "disliked": "\u2014 The fact that we didn't get the queen size bed we had reserved",
                "liked": "\u2014 The location"
            },
            "rating": 4.0,
            "stay_parameters": "Stayed August 2007, traveled as a couple",
            "text": "The staff is tremendously courteous and accomodating. The decor is very modern and industrial with lots of cool colors, steel and geometric patterns. The multiple internet lounges are each uniquely designed as is this hotel.",
            "title": "Very handy central location",
            "user": "ChezSerreChevalier"
        },
        {
            "date": "October 16, 2007",
            "detail_rating": {
                "business": 4.0,
                "cleanliness": 3.0,
                "desk": null,
                "front_desk": 4.0,
                "location": 4.0,
                "pool": null,
                "restaurant": null,
                "rooms": 3.0,
                "service": 4.0,
                "sleep": null,
                "value": 2.0
            },
            "helpfulness": 1,
            "id": 10086499,
            "likes": {
                "disliked": "\u2014 rooms, price",
                "liked": "\u2014 staff"
            },
            "rating": 2.0,
            "stay_parameters": "Stayed October 2007, traveled on business",
            "text": "Having the Starbucks and upscale Mexican Bistro open to the lobby was fantastic! Furthermore, the overall hotel location cannot be beat for shopping, theater, and Union Square.",
            "title": "MIxed feelings about the Diva",
            "user": "rafaelcherino"
        },
        {
            "date": "October 14, 2007",
            "detail_rating": {
                "business": null,
                "cleanliness": null,
                "desk": null,
                "location": null,
                "pool": null,
                "restaurant": null,
                "rooms": null,
                "service": null,
                "sleep": null,
                "value": null
            },
            "helpfulness": null,
            "id": 10075501,
            "likes": {
                "disliked": null,
                "liked": null
            },
            "rating": 4.0,
            "stay_parameters": null,
            "text": "I prefer more traditional and luxurious decor, but Hotel Diva excelled in its niche.",
            "title": "Nice for the Price",
            "user": "BBLA"
        },
        {
            "date": "August 2, 2007",
            "detail_rating": {
                "business": 5.0,
                "cleanliness": 5.0,
                "desk": null,
                "front_desk": 5.0,
                "location": 5.0,
                "pool": null,
                "restaurant": null,
                "rooms": 5.0,
                "service": 5.0,
                "sleep": null,
                "value": 5.0
            },
            "helpfulness": 3,
            "id": 8277706,
            "likes": {
                "disliked": "\u2014 Nothing. We loved it!",
                "liked": "\u2014 It was surprisingly quiet considering how busy Geary St. is, and was kept immaculate."
            },
            "rating": 5.0,
            "stay_parameters": "Stayed July 2007, traveled as a couple",
            "text": "Got a pretty good price at the Diva at the last minute after discovering our previously-planned hotel was smack-dab in the middle of the Tenderloin (think \"guys beggins for change, peeing on the streetcorner, etc\" kind of visuals). Staff are fantastic, and take care of anything you need. The rooms are tremendous - great decorating style (you'll probably either love it or hate it. Check out their website for pics), and the suite we had could easily sleep four - it had a queen-sized Murphy bed in the sitting room. Outstanding cleanliness and friendliness by the staff at all times, and the ability to use the various internet lounges was really handy. The location is just over a block away from the Powell cable car line and Union Square, and is a reasonable walk from Chinatown. We'd definitely stay there again!",
            "title": "A wondeful place to stay!",
            "user": "CooperSOntario"
        },
        {
            "date": "July 23, 2007",
            "detail_rating": {
                "business": 3.0,
                "cleanliness": 3.0,
                "desk": null,
                "front_desk": 3.0,
                "location": 4.0,
                "pool": null,
                "restaurant": null,
                "rooms": 3.0,
                "service": 4.0,
                "sleep": null,
                "value": null
            },
            "helpfulness": 2,
            "id": 8220376,
            "likes": {
                "disliked": null,
                "liked": null
            },
            "rating": 3.0,
            "stay_parameters": "Stayed May 2007, traveled as a couple",
            "text": "Stayed 6 nights in a Junior Suite on the top floor of the hotel facing the back.",
            "title": "Giant Bedroom, Tiny Bathroom",
            "user": "sobakasu"
        },
        {
            "date": "July 22, 2007",
            "detail_rating": {
                "business": 5.0,
                "cleanliness": 5.0,
                "desk": null,
                "front_desk": 5.0,
                "location": 5.0,
                "pool": null,
                "restaurant": null,
                "rooms": 5.0,
                "service": 5.0,
                "sleep": null,
                "value": 5.0
            },
            "helpfulness": 4,
            "id": 8217558,
            "likes": {
                "disliked": "\u2014 The homeless all around the area is a bit daunting but area very busy so quite safe.",
                "liked": "\u2014 The Service is absolutely fantastic!"
            },
            "rating": 5.0,
            "stay_parameters": "Stayed July 2007, traveled solo",
            "text": "The welcome at the hotel was congenial and David the concierge was always helpful or had some drole remark to make.",
            "title": "Love the Diva!",
            "user": "NYCAlarmGal"
        },
        {
            "date": "July 22, 2007",
            "detail_rating": {
                "business": null,
                "cleanliness": 3.0,
                "desk": null,
                "front_desk": 4.0,
                "location": 4.0,
                "pool": null,
                "restaurant": null,
                "rooms": 3.0,
                "service": null,
                "sleep": null,
                "value": 5.0
            },
            "helpfulness": 2,
            "id": 8215702,
            "likes": {
                "disliked": null,
                "liked": "\u2014 Location and price"
            },
            "rating": 4.0,
            "stay_parameters": "Stayed June 2007, traveled as a couple",
            "text": "A room at the back of the hotel afforded a view of nothing interesting but we enjoyed not hearing the hum of Geary St.",
            "title": "Darling Diva",
            "user": "Burntwood"
        },
        {
            "date": "July 17, 2007",
            "detail_rating": {
                "business": null,
                "cleanliness": 5.0,
                "desk": null,
                "front_desk": 4.0,
                "location": 4.0,
                "pool": null,
                "restaurant": null,
                "rooms": 4.0,
                "service": 4.0,
                "sleep": null,
                "value": 4.0
            },
            "helpfulness": 1,
            "id": 8131527,
            "likes": {
                "disliked": "\u2014 Nothing",
                "liked": "\u2014 The clean room"
            },
            "rating": 4.0,
            "stay_parameters": "Stayed July 2007, traveled as a couple",
            "text": "In terms of decoration, the most striking thing was the size difference between the bedroom (huge) and the bathroom (miniscule). This is something I can never quite get a handle on. Additionally, I would qualify the bathroom as badly designed.",
            "title": "Great place! Nice Service.",
            "user": "LouLou93644"
        },
        {
            "date": "May 2, 2007",
            "detail_rating": {
                "business": 5.0,
                "cleanliness": 5.0,
                "desk": null,
                "front_desk": 4.0,
                "location": 5.0,
                "pool": null,
                "restaurant": null,
                "rooms": 4.0,
                "service": 4.0,
                "sleep": null,
                "value": 4.0
            },
            "helpfulness": 1,
            "id": 7495190,
            "likes": {
                "disliked": "\u2014 the bed and the decoration.",
                "liked": "\u2014 location and accomodations"
            },
            "rating": 4.0,
            "stay_parameters": "Stayed April 2007, traveled on business",
            "text": "I got a deal through Travelzoo to stay at Diva over the weekend for just $85 a night. We had a huge double room, with HD TV , wireless, and several other perks. Most precious to me was the \"business center\" where I could prepare for a conference I was attenting. I had constant internet access and access to a printer.",
            "title": "Good value (if the prices stay low)",
            "user": "xa_chicago"
        },
        {
            "date": "April 12, 2007",
            "detail_rating": {
                "business": 5.0,
                "cleanliness": 5.0,
                "desk": null,
                "front_desk": 5.0,
                "location": 5.0,
                "pool": null,
                "restaurant": null,
                "rooms": 5.0,
                "service": 5.0,
                "sleep": null,
                "value": 5.0
            },
            "helpfulness": 4,
            "id": 7341731,
            "likes": {
                "disliked": "\u2014 Nothing!!!",
                "liked": "\u2014 The Wonderful Staff,The Great Rooms,The Great Location,Everything!!!!"
            },
            "rating": 5.0,
            "stay_parameters": "Stayed April 2007, traveled as a couple",
            "text": "The staff was amazingly kind and the location hard to beat.",
            "title": "The Hotel Diva is the Finest Hotel in San Francisco!",
            "user": "BryRob"
        },
        {
            "date": "April 4, 2007",
            "detail_rating": {
                "business": 3.0,
                "cleanliness": 4.0,
                "desk": null,
                "front_desk": 5.0,
                "location": 5.0,
                "pool": null,
                "restaurant": null,
                "rooms": 3.0,
                "service": 5.0,
                "sleep": null,
                "value": 4.0
            },
            "helpfulness": 3,
            "id": 7280786,
            "likes": {
                "disliked": "\u2014 common areas",
                "liked": "\u2014 staff, location"
            },
            "rating": 3.0,
            "stay_parameters": "Stayed March 2007, traveled solo",
            "text": "However, the bed was uncomfortable and the sheets very cheap. I do not mind these things, and think the price reflected the quality of the bedding. I only warn potential visitors in the very likely case that the hotel's prices go up.",
            "title": "Nice staff",
            "user": "Joanie881"
        },
        {
            "date": "April 2, 2007",
            "detail_rating": {
                "business": 5.0,
                "cleanliness": 5.0,
                "desk": null,
                "front_desk": 4.0,
                "location": 5.0,
                "pool": null,
                "restaurant": null,
                "rooms": 4.0,
                "service": 5.0,
                "sleep": null,
                "value": 4.0
            },
            "helpfulness": 2,
            "id": 7270584,
            "likes": {
                "disliked": "\u2014 N/A",
                "liked": "\u2014 The modern furnishings and the location."
            },
            "rating": 5.0,
            "stay_parameters": "Stayed April 2007, traveled as a couple",
            "text": "As an aside, the hotel is way over designed. Too may orange details and silly artsy add-ons. It will surely look dated within 3 years.",
            "title": "Hotel Diva was fantastic!",
            "user": "Lil_Lola"
        },
        {
            "date": "March 17, 2007",
            "detail_rating": {
                "business": null,
                "cleanliness": null,
                "desk": null,
                "location": null,
                "pool": null,
                "restaurant": null,
                "rooms": null,
                "service": null,
                "sleep": null,
                "value": null
            },
            "helpfulness": 5,
            "id": 7178879,
            "likes": {
                "disliked": null,
                "liked": null
            },
            "rating": 5.0,
            "stay_parameters": null,
            "text": "Hotel Diva is San Francisco's finest hotel, in our opinion! The staff was the nicest, and most helpful of ANY hotel we have ever stayed in. Ruth the Front Desk Diva, will make sure your stay is most enjoyable, as well as David, the VERY knowledgeable Concierge...he will go the extra mile for you. We truly felt that we were part of their family while we were staying at The Diva, and I can honestly say, that you would be hard pressed to find a better staffed Hotel. And THE ROOMS!! Wonderful,Modern,Warm,Comfortable! The Housekeeping staff is also one of the best around, they also wanted to make sure all was well. We got asked routinely if everything in the rooms were clean and to our liking, and these were some of the CLEANEST rooms we have experienced in our many Hotel stays. The Hotel was also very accomodating in booking us \"Quiet\" rooms on the back of the Hotel off the street ( the rooms facing the street have to deal with more noise, and I am a light sleeper ) and also made sure both rooms we booked were next door to each other. PLEASE, do yourself a favor, the next time you are in San Francisco, book a room at The Hotel Diva, you will be SO GLAD you did!! Bryan Nolte/Rob Weber-CIncinnati,Ohio",
            "title": "Great Staff, Great Service, Great Location - GREAT hotel!!",
            "user": "McFleurry"
        },
        {
            "date": "March 29, 2008",
            "detail_rating": {
                "business": 1.0,
                "cleanliness": 4.0,
                "desk": null,
                "front_desk": 5.0,
                "location": 5.0,
                "pool": null,
                "restaurant": null,
                "rooms": 3.0,
                "service": 4.0,
                "sleep": null,
                "value": 2.0
            },
            "helpfulness": 1,
            "id": 14642487,
            "likes": {
                "disliked": "\u2014 poor computers, noise, drink machines, very little amenities",
                "liked": "\u2014 excellent location, friendly and helpful staff, comfy beds"
            },
            "rating": 3.0,
            "stay_parameters": "Stayed March 2008, traveled as a couple",
            "text": "We stayed at the Diva from March 24-28, 2008. Upon arrival, I can see how this hotel would be easy for cab drivers or anyone to miss, as there is not a big sign at all. Check in went great, David, the front desk clerk was very nice and even offered us a hopon/hopoff tour of the city. We passed b/c I had already made arrangements for a city tour the next day. Our room was very small and had a strange almost metallic odor so we switched to a slightly bigger room that had a desk. We could still smell the odor a little but not as strong. I will say the bed was extremely comfy with nice down pillows and soft sheets.",
            "title": "Okay hotel with Great location, will choose different hotel next time",
            "user": "Heather875"
        },
        {
            "date": "February 28, 2008",
            "detail_rating": {
                "business": 5.0,
                "cleanliness": 5.0,
                "desk": null,
                "front_desk": 5.0,
                "location": 5.0,
                "pool": null,
                "restaurant": null,
                "rooms": 5.0,
                "service": 5.0,
                "sleep": null,
                "value": 5.0
            },
            "helpfulness": 2,
            "id": 13912722,
            "likes": {
                "disliked": "\u2014 nothing",
                "liked": "\u2014 the overall experience was fantastic"
            },
            "rating": 5.0,
            "stay_parameters": "Stayed February 2008, traveled as a couple",
            "text": "The pictures on the website definitely make the place look better. We also found that the computers in the business center and on the floors were extremely slow if they were working at all, which did not please my husband at all. The drink machine also took our money on 2 seperate occasions. The coffee in the morning on the 6th floor was delicious, but it would have been great to have a continental breakfast like the folks in the larger rooms on the diva 7th floor. The rooms are very, very minimalistic.",
            "title": "the Diva was divine!",
            "user": "gigi655"
        },
        {
            "date": "February 26, 2008",
            "detail_rating": {
                "business": 4.0,
                "cleanliness": 3.0,
                "desk": null,
                "front_desk": 3.0,
                "location": 4.0,
                "pool": null,
                "restaurant": null,
                "rooms": 3.0,
                "service": 3.0,
                "sleep": null,
                "value": 2.0
            },
            "helpfulness": null,
            "id": 13870472,
            "likes": {
                "disliked": "\u2014 The view and the small rooms",
                "liked": "\u2014 The clean room"
            },
            "rating": 2.0,
            "stay_parameters": "Stayed February 2008, traveled as a couple",
            "text": "Our room was facing Geary street, which made for a lot of noise every night, including the garbage trucks that came through at 5:30 or so.",
            "title": "Expected More",
            "user": "Queenbee4sure"
        },
        {
            "date": "January 29, 2008",
            "detail_rating": {
                "business": null,
                "cleanliness": null,
                "desk": null,
                "location": null,
                "pool": null,
                "restaurant": null,
                "rooms": null,
                "service": null,
                "sleep": null,
                "value": null
            },
            "helpfulness": 2,
            "id": 13109195,
            "likes": {
                "disliked": null,
                "liked": null
            },
            "rating": 1.0,
            "stay_parameters": null,
            "text": "The location right near the trolley car and Union Square was hard to beat. It was an easy walk to the financial district, China town, and even the Ferry building.",
            "title": "Very disappointed",
            "user": "coco060"
        },
        {
            "date": "January 24, 2008",
            "detail_rating": {
                "business": 5.0,
                "cleanliness": 5.0,
                "desk": null,
                "front_desk": 5.0,
                "location": 5.0,
                "pool": null,
                "restaurant": null,
                "rooms": 3.0,
                "service": 5.0,
                "sleep": null,
                "value": 5.0
            },
            "helpfulness": null,
            "id": 12968646,
            "likes": {
                "disliked": "\u2014 Small bathrooms that need to be updated.",
                "liked": "\u2014 Location, location, location!"
            },
            "rating": 5.0,
            "stay_parameters": "Stayed January 2008, traveled on business",
            "text": "All in all, the hotel was just ok, the service was really good, but I will probably choose a different one next time I go to the City that has a little more ambiance and amenities.",
            "title": "Very sexy little boutique hotel - perfect location!",
            "user": "acali2dc"
        },
        {
            "date": "June 24, 2007",
            "detail_rating": {
                "business": 3.0,
                "cleanliness": 4.0,
                "desk": null,
                "front_desk": 4.0,
                "location": 5.0,
                "pool": null,
                "restaurant": null,
                "rooms": 5.0,
                "service": 3.0,
                "sleep": null,
                "value": 5.0
            },
            "helpfulness": 1,
            "id": 7976303,
            "likes": {
                "disliked": "\u2014 miscomunication about checking in",
                "liked": "\u2014 Decor of room"
            },
            "rating": 5.0,
            "stay_parameters": "Stayed April 2007, traveled on business",
            "text": "I have stayed at this hotel three times and enjoyed each stay. The decor is hip and modern. My rooms had huge flat screen TVs. And the price was great. Who knew you could get a $140 hotel room in SF's Union Square? Would expect to pay a lot more.",
            "title": "Great deal, hip interior",
            "user": "Johosephat"
        },
        {
            "date": "June 22, 2007",
            "detail_rating": {
                "business": null,
                "cleanliness": 4.0,
                "desk": null,
                "front_desk": 3.0,
                "location": 3.0,
                "pool": null,
                "restaurant": null,
                "rooms": 4.0,
                "service": 4.0,
                "sleep": null,
                "value": 4.0
            },
            "helpfulness": 2,
            "id": 7959083,
            "likes": {
                "disliked": "\u2014 The view.",
                "liked": "\u2014 The room decor and cozinest of the room."
            },
            "rating": 4.0,
            "stay_parameters": "Stayed June 2007, traveled as a couple",
            "text": "Service was good. I did have problems checking in during two of my visits. I booked through a third party site (don't recall the name, but not one of the well known brands). There was bad communication between the third party site and the Diva, so the hotel did not have my name when I checked in. The front desk gave me a room anyway, then called the booking agency to get the details. It worked out, but I recommend buying direct or through a well known online travel agency.",
            "title": "The perfect cozy spot",
            "user": "mstemeca"
        },
        {
            "date": "June 18, 2007",
            "detail_rating": {
                "business": 4.0,
                "cleanliness": 4.0,
                "desk": null,
                "front_desk": 4.0,
                "location": 4.0,
                "pool": null,
                "restaurant": null,
                "rooms": 2.0,
                "service": 2.0,
                "sleep": null,
                "value": 4.0
            },
            "helpfulness": 2,
            "id": 7927351,
            "likes": {
                "disliked": "\u2014 service",
                "liked": "\u2014 location"
            },
            "rating": 1.0,
            "stay_parameters": "Stayed June 2007, traveled as a couple",
            "text": "Great location. Very clean rooms.",
            "title": "Bad Experience at Hotel Diva",
            "user": "imtrendywendy"
        },
        {
            "date": "June 17, 2007",
            "detail_rating": {
                "business": null,
                "cleanliness": null,
                "desk": null,
                "location": null,
                "pool": null,
                "restaurant": null,
                "rooms": null,
                "service": null,
                "sleep": null,
                "value": null
            },
            "helpfulness": 1,
            "id": 7868837,
            "likes": {
                "disliked": null,
                "liked": null
            },
            "rating": 5.0,
            "stay_parameters": null,
            "text": "We stayed at Hotel Dive 4 nights for a mid-week rendevous. Be sure to get there early to obtain the best room(s) which are NOT facing Geary Street. Finding the hotel is a little challenging but it's in the heart of downtown San Francisco in the art district. The room was decorated in contemporary decor and the primary colors in our room was stainless steel, taupe and tangerine. We enjoyed TV on a 42 inch flat screen. The room is SMALL. I would recommend it only for couples needing a place to nestle up together or a girls' nite out retreat. The bathrooms are based on European style where things are compact. The carpet was clean. At night we could hear \"some\" street noise but it's easily overcome by the AC or TV. The hotel staff was friendly as well as the valet. That's the other thing, it's total valet parking unless you can find a 24 garage. However, you can come and go for the same daily rate of at least $35 per day. Starbucks is attached to the hotel and there are plenty of eateries to choose from. Chosing this location, you really don't need a vehicle. Take a shuttle from the Airport and walk, use the BART or bus system to get around. If you are considering the beach, the bridges or the wharf, you will need a vehicle. We noticed several national car rental facitilties around the corner. In short, we have designated this our downtown spot and will defintely stay here again.",
            "title": "Stunning decor, great staff",
            "user": "zoomer-7"
        },
        {
            "date": "June 3, 2007",
            "detail_rating": {
                "business": 5.0,
                "cleanliness": 5.0,
                "desk": null,
                "front_desk": 5.0,
                "location": 5.0,
                "pool": null,
                "restaurant": null,
                "rooms": 5.0,
                "service": 5.0,
                "sleep": null,
                "value": 5.0
            },
            "helpfulness": 3,
            "id": 7753078,
            "likes": {
                "disliked": "\u2014 Views",
                "liked": "\u2014 Spacious"
            },
            "rating": 5.0,
            "stay_parameters": "Stayed June 2007, traveled with friends",
            "text": "I booked at Hotel Diva due to the good reviews at tripadvisor but I can not give this hotel a good review.",
            "title": "Great Place for a Weekend Getaway",
            "user": "delovelyladya"
        },
        {
            "date": "November 13, 2005",
            "detail_rating": {
                "business": null,
                "cleanliness": 2.0,
                "desk": null,
                "location": null,
                "pool": null,
                "restaurant": null,
                "rooms": 2.0,
                "service": 2.0,
                "sleep": null,
                "value": 2.0
            },
            "helpfulness": 4,
            "id": 4108933,
            "likes": {
                "disliked": null,
                "liked": null
            },
            "rating": 2.0,
            "stay_parameters": "Stayed October 2005",
            "text": "My friend and I have tried several hotels in SF and were excited to try the Diva because of its alluring website and some of the good reviews on this site. As compared to other hotels in this price range I would say the Diva falls short. When we arrived at the hotel we were told that we had been upgraded. We had reserved a double but instead got one king bed. This was corrected by a discount from $219 to $149 and a cot. Honestly, I think that the room we got and the overall ambiance of the hotel would warrant prices in the $90-$129 range. Our room was smallish with a tiny, tiny bathroom. It smelled of cigarette smoke although we were on a non-smoking floor. We found the front desk personnel stiff and slow. It seemed to take forever to make our adjustment. The beds were comfortable. Our room faced Geary and was very noisy all night. Heard lots of ambulances/traffic until about 2 a.m. One nice touch was the Colobri Mexican restaurant next door. We enjoyed margaritas and guacamole and chatting with the bartender. All in all, if the hotel price had been cheaper and we had gotten what we reserved we would have been satisfied. We've decided not to return.",
            "title": "Disappointed!",
            "user": "sandyweb33"
        },
        {
            "date": "September 29, 2005",
            "detail_rating": {
                "business": null,
                "cleanliness": 5.0,
                "desk": null,
                "location": null,
                "pool": null,
                "restaurant": null,
                "rooms": 4.0,
                "service": 5.0,
                "sleep": null,
                "value": 5.0
            },
            "helpfulness": 6,
            "id": 3975299,
            "likes": {
                "disliked": null,
                "liked": null
            },
            "rating": 5.0,
            "stay_parameters": "Stayed September 2005, traveled on business",
            "text": "This is the stuff of travel fiction - a great value mid-priced 3* centrally located hip hotel 2 blocks from Union Square.",
            "title": "Devine Diva",
            "user": "SpaceAgent"
        },
        {
            "date": "September 29, 2005",
            "detail_rating": {
                "business": null,
                "cleanliness": 5.0,
                "desk": null,
                "location": null,
                "pool": null,
                "restaurant": null,
                "rooms": 4.0,
                "service": 4.0,
                "sleep": null,
                "value": 4.0
            },
            "helpfulness": 2,
            "id": 3948277,
            "likes": {
                "disliked": null,
                "liked": null
            },
            "rating": 4.0,
            "stay_parameters": "Stayed September 2005, traveled on business",
            "text": "Neat but not lavish - attentive, friendly staff. Terrific rooms with every attendent facility and a great business centre too.",
            "title": "Great little hotel",
            "user": "typhoonsurf"
        },
        {
            "date": "September 26, 2005",
            "detail_rating": {
                "business": null,
                "cleanliness": null,
                "desk": null,
                "location": null,
                "pool": null,
                "restaurant": null,
                "rooms": null,
                "service": null,
                "sleep": null,
                "value": null
            },
            "helpfulness": 4,
            "id": 3939106,
            "likes": {
                "disliked": null,
                "liked": null
            },
            "rating": 4.0,
            "stay_parameters": null,
            "text": "Second visit, so why fix it if it ain't broke.",
            "title": "Cute Place!",
            "user": "A TripAdvisor user"
        },
        {
            "date": "September 20, 2005",
            "detail_rating": {
                "business": null,
                "cleanliness": null,
                "desk": null,
                "location": null,
                "pool": null,
                "restaurant": null,
                "rooms": null,
                "service": null,
                "sleep": null,
                "value": null
            },
            "helpfulness": 1,
            "id": 3924314,
            "likes": {
                "disliked": null,
                "liked": null
            },
            "rating": 4.0,
            "stay_parameters": null,
            "text": "Go Diva - can't wait to get back to my favourite City by the Bay.",
            "title": "Small but beautiful",
            "user": "A TripAdvisor user"
        },
        {
            "date": "August 14, 2006",
            "detail_rating": {
                "business": 4.0,
                "cleanliness": 5.0,
                "desk": null,
                "front_desk": 5.0,
                "location": 5.0,
                "pool": null,
                "restaurant": null,
                "rooms": 5.0,
                "service": 5.0,
                "sleep": null,
                "value": 5.0
            },
            "helpfulness": 16,
            "id": 5607498,
            "likes": {
                "disliked": "\u2014 lighting (too dim!)",
                "liked": "\u2014 location, cost, amenitites, decor"
            },
            "rating": 5.0,
            "stay_parameters": "Stayed August 2006, traveled as a couple",
            "text": "My fiance and I stayed here for two nights on the last leg of our trip to San Francisco in the standard queen room. The price through their \"Cheap is Chic\" special on their website was $109, which can't be beat for the central location.",
            "title": "Great Hip Bargain at Hotel Diva!",
            "user": "starhawk"
        },
        {
            "date": "August 6, 2006",
            "detail_rating": {
                "business": null,
                "cleanliness": null,
                "desk": null,
                "location": null,
                "pool": null,
                "restaurant": null,
                "rooms": null,
                "service": null,
                "sleep": null,
                "value": null
            },
            "helpfulness": 2,
            "id": 5564420,
            "likes": {
                "disliked": null,
                "liked": null
            },
            "rating": 3.0,
            "stay_parameters": null,
            "text": "THE GOOD: Cheap!! Great Location!! It's within walking distance to everything around Union Square- The square itself, the shopping, the theatres (it's right across the street from one), restaurants, the Market-Powell Cable Car line (takes you to Fisherman's Wharf for $5/one way), Chinatown, Civic Center, Nob Hill, etc. There's a drugstore (it was either a Walgreens or Eckerds) about a block or less away which is convenient and there's a Starbucks right next door. There's also a Borders bookstore several blocks away, about a 6 minute walk. The decor was great (although I did overhear an older couple complaining about how it was \"too modern\"). It's decorated in greys, blues, with punches of orange and a lot of metal (the furniture and \"headboard\") (you can check it out on the website). The room and bathroom were both super clean and well equipped. There are a selection of magazines (NYLON, a local fashion magazine, etc.), the toiletries smell amazing, and there's a cute little welcome bag with freebies and goodies in there like emergen-C, toothpaste, an energy drink sample, Nivea face body cream, etc. There's also a distinct \"DIVA!\" theme or \"personality\" (as they call it) throughout your stay, which may strike some as being over the top and definitely oriented to a young, hip, female crowd. (I thought it was fun and a welcome change from stuffier hotels but my fiance definitely rolled his eyes a couple times). There's a small desk and chair, a comfy bed (super smooth sheets), a dresser (it looks like a lateral file cabinet) and the tv is wall-mounted (like in a hospital). There's an iron and ironing board, safe, and full-length mirror in the closet. The bathroom also had really nice modern fixtures. There are \"offices\" on several floors with a computer and internet access (but no printer). There is also AIR CONDITIONING!! A lot of places in San Francisco don't have air conditioning since it's usually pretty cool but it's nice for the rare \"heat wave\" like the one they had recently. The service is incredible! The concierge was helpful for arranging our transportation to the airport, as well as fielding our questions about the area.",
            "title": "Hotel Diva - Near Union Square",
            "user": "Out_of_valley"
        },
        {
            "date": "August 6, 2006",
            "detail_rating": {
                "business": null,
                "cleanliness": null,
                "desk": null,
                "location": null,
                "pool": null,
                "restaurant": null,
                "rooms": null,
                "service": null,
                "sleep": null,
                "value": null
            },
            "helpfulness": 2,
            "id": 5564358,
            "likes": {
                "disliked": null,
                "liked": null
            },
            "rating": 5.0,
            "stay_parameters": null,
            "text": "THE \"BAD\": Note, most of these observations aren't unique to The Diva since they pretty much apply to any of the boutique hotels in the area. The rooms are small, but any decent hotel in the Union Square area at this price will be small- Even then, it's only really small if there are two people staying in the room. And the decor more than makes up for it. I would rather stay at a nice, clean, modern place than get a larger room in a depressing motel-ish place. Try to get a room away from the street- Our room faced Geary Street and it gets pretty loud at night. Turning on the air conditioning / fan helped mask the noise and it didn't bother my fiance but I slept with earplugs. (It didn't bother me enough to ask for a different room). There's no minifridge and the cable TV options were pretty poor (although, again, you're probably not in Union Square to sit around, eating from your minifridge, and watching a lot of TV! The one thing that was kind of annoying was how dark it was since the lamps weren't that strong.",
            "title": "A real gem",
            "user": "J1XOX"
        },
        {
            "date": "July 28, 2006",
            "detail_rating": {
                "business": 2.0,
                "cleanliness": 2.0,
                "desk": null,
                "front_desk": 4.0,
                "location": 5.0,
                "pool": null,
                "restaurant": null,
                "rooms": 2.0,
                "service": 3.0,
                "sleep": null,
                "value": 2.0
            },
            "helpfulness": 6,
            "id": 5520986,
            "likes": {
                "disliked": "\u2014 The actually accommodation",
                "liked": "\u2014 Location"
            },
            "rating": 2.0,
            "stay_parameters": "Stayed July 2006, traveled as a couple",
            "text": "The location is perfectly safe- There are a lot of affluent shops around Union Square so people forget that San Francisco has a huge, HUGE homeless population and a huge, HUGE drug problem. And that it's a pretty dirty city (like NYC dirty but better since there aren't as many people). You may smell the distinct odor of pee on one street and then you'll be standing in front of a swanky shop. You're going to be aware of people asking you for change, food, etc. It's not like you're on the streets of Calcutta, but you'll pretty much see a homeless person or junky on every street. Occasionally, someone might start going crazy and yelling at someone or no one in particular on the street (this happened to me). But there are tons of people out and about (due to the theatre-goers and restaurants and bars) so we felt comfortable, even relatively late at night. Most of the hotels lining Geary street have 24-hour doormen or people at the front desk, which gives you the comforting sense that there are at least several eyes and ears open at all times to the street.",
            "title": "disappointing",
            "user": "ADouble"
        },
        {
            "date": "July 26, 2006",
            "detail_rating": {
                "business": null,
                "cleanliness": 5.0,
                "desk": null,
                "front_desk": 5.0,
                "location": 5.0,
                "pool": null,
                "restaurant": null,
                "rooms": 5.0,
                "service": 5.0,
                "sleep": null,
                "value": 5.0
            },
            "helpfulness": 3,
            "id": 5513710,
            "likes": {
                "disliked": "\u2014 nowhere to put makeup bags in bathroom ...no shelves for stuff",
                "liked": "\u2014 everthing"
            },
            "rating": 5.0,
            "stay_parameters": "Stayed July 2006, traveled with family",
            "text": "Who Will Not Enjoy Union Square / The Diva Hotel: If you are looking for quaint, warm, or traditional, you probably won't like The Diva since you may feel the decor at the hotel is too industrial or \"cold\" and modern. And on a delicate note...If you're part of an \"older crowd\" used to staying at large established chain hotels, you may not like The Diva since it definitely has an almost aggressively youthful \"tone\" which can be interpreted as fun, or annoying, depending on your point of view. Also, like my fiance's parents, if you're going to be uncomfortable staying in an area that is vibrant and centrally located but definitely urban and somewhat seedy looking on some streets and with a population of homeless people and drug addicts, then stay at the hermetically sealed (and very nice but expensive) Westin in the area, or at one of the nice hotels on bucolic Nob Hill (trust me, no panhandlers will be trekking up those ridiculously steep hills).",
            "title": "hottest little hotel in san francisco",
            "user": "rinaldired"
        },
        {
            "date": "July 26, 2006",
            "detail_rating": {
                "business": 4.0,
                "cleanliness": 5.0,
                "desk": null,
                "front_desk": 5.0,
                "location": 5.0,
                "pool": null,
                "restaurant": null,
                "rooms": 5.0,
                "service": 5.0,
                "sleep": null,
                "value": 5.0
            },
            "helpfulness": 2,
            "id": 5513129,
            "likes": {
                "disliked": "\u2014 Waiting for the elevator",
                "liked": "\u2014 Location"
            },
            "rating": 5.0,
            "stay_parameters": "Stayed June 2006, traveled on business",
            "text": "I'm from L.A. and every year I teach here in S.F.and I'm put up in another place (can't remember the name) - This year I was put up at the Diva and I loved it. A very old building with a very new flair.",
            "title": "I Liked This Place!",
            "user": "Dancing_Boy"
        },
        {
            "date": "July 18, 2006",
            "detail_rating": {
                "business": null,
                "cleanliness": 5.0,
                "desk": null,
                "location": null,
                "pool": null,
                "restaurant": null,
                "rooms": 5.0,
                "service": 5.0,
                "sleep": null,
                "value": 4.0
            },
            "helpfulness": 6,
            "id": 5480566,
            "likes": {
                "disliked": null,
                "liked": null
            },
            "rating": 5.0,
            "stay_parameters": "Stayed July 2006",
            "text": "Very Mercer-New York like. Modern. Everything was new, comfortable, worked. Granted there's no view, but why do you need a view when you're in San Francisco? Go walk!",
            "title": "First choice in SF",
            "user": "gruvtek"
        },
        {
            "date": "July 13, 2006",
            "detail_rating": {
                "business": null,
                "cleanliness": null,
                "desk": null,
                "location": null,
                "pool": null,
                "restaurant": null,
                "rooms": null,
                "service": null,
                "sleep": null,
                "value": null
            },
            "helpfulness": 2,
            "id": 5464298,
            "likes": {
                "disliked": null,
                "liked": null
            },
            "rating": 5.0,
            "stay_parameters": null,
            "text": "Convenient to everything. Especially the lively Union Square. Great restaurants, the nightlife. Are you kidding? For these prices??? You have to be nuts to stay anywhere else. I'm shocked that this is ranked (as of this writing) #47.",
            "title": "Honest, graceful and courteous staff- they returned my wallet safely.",
            "user": "A TripAdvisor user"
        },
        {
            "date": "July 5, 2006",
            "detail_rating": {
                "business": null,
                "cleanliness": 5.0,
                "desk": null,
                "location": null,
                "pool": null,
                "restaurant": null,
                "rooms": 5.0,
                "service": 5.0,
                "sleep": null,
                "value": 5.0
            },
            "helpfulness": 1,
            "id": 5429591,
            "likes": {
                "disliked": null,
                "liked": null
            },
            "rating": 4.0,
            "stay_parameters": "Stayed July 2006",
            "text": "The hotel front desk was very friendly and I even bought a DIVA T-Shirt (okay, okay, so it says SEXY on the back)",
            "title": "Excellent, affordable, unique",
            "user": "traveler2377"
        },
        {
            "date": "July 4, 2006",
            "detail_rating": {
                "business": null,
                "cleanliness": 4.0,
                "desk": null,
                "location": null,
                "pool": null,
                "restaurant": null,
                "rooms": 4.0,
                "service": 5.0,
                "sleep": null,
                "value": 5.0
            },
            "helpfulness": 2,
            "id": 5425916,
            "likes": {
                "disliked": null,
                "liked": null
            },
            "rating": 4.0,
            "stay_parameters": "Stayed June 2006",
            "text": "Try it out. It's a hundred plus bucks in San Francisco!",
            "title": "Modern hotel in a great location",
            "user": "BrownBalto"
        },
        {
            "date": "January 7, 2008",
            "detail_rating": {
                "business": 5.0,
                "cleanliness": 4.0,
                "desk": null,
                "front_desk": 4.0,
                "location": 5.0,
                "pool": null,
                "restaurant": null,
                "rooms": 4.0,
                "service": 4.0,
                "sleep": null,
                "value": 4.0
            },
            "helpfulness": 2,
            "id": 12423924,
            "likes": {
                "disliked": "\u2014 small bathroom, dirty tiles/grout",
                "liked": "\u2014 Perfect Location in heart of Union Square"
            },
            "rating": 4.0,
            "stay_parameters": "Stayed December 2007, traveled as a couple",
            "text": "We stayed 2 nights: New Year's Eve and New year's day, and the location was ideal in the heart of Union Square. Saks 5th Ave is a few blocks away, Japantown is a brisk 15 minute walk...",
            "title": "Stylish update to an older building in the heart of Union Square",
            "user": "VertigoSeoul"
        },
        {
            "date": "January 4, 2008",
            "detail_rating": {
                "business": 5.0,
                "cleanliness": 5.0,
                "desk": null,
                "front_desk": 5.0,
                "location": 5.0,
                "pool": null,
                "restaurant": null,
                "rooms": 4.0,
                "service": 4.0,
                "sleep": null,
                "value": 5.0
            },
            "helpfulness": 2,
            "id": 12330555,
            "likes": {
                "disliked": null,
                "liked": null
            },
            "rating": 4.0,
            "stay_parameters": "Stayed December 2007, traveled as a couple",
            "text": "Friendly hotel staff, valet parking ($35/night) The hotel is a quirky older building (not a bad thing), with dead-end corridors ending at full-height windows looking out onto the street, glass walls looking down into restaurant/common areas. \"Personality\" Hotel Group has added a modern sleek look to the whole place. Blue elevator buttons, stainless headboard that peels away to reveal the wall, Artemide night table swing arm lamps, simple modern shower fixtures all add to the industrial chic.",
            "title": "Union Square adjacent",
            "user": "HollywoodTravelAgent"
        },
        {
            "date": "December 27, 2007",
            "detail_rating": {
                "business": 5.0,
                "cleanliness": 5.0,
                "desk": null,
                "front_desk": 5.0,
                "location": 5.0,
                "pool": null,
                "restaurant": null,
                "rooms": 5.0,
                "service": 5.0,
                "sleep": null,
                "value": 5.0
            },
            "helpfulness": null,
            "id": 11986082,
            "likes": {
                "disliked": null,
                "liked": null
            },
            "rating": 5.0,
            "stay_parameters": "Stayed December 2007, traveled as a couple",
            "text": "The shower was strong, room had complimentary wireless, filing drawer \"dresser\", writing desk, Swing-arm flat screen TV, bertoia diamond chairs, room safe, separate washsink area. Bathroom was a little small and tiles looked like they could use some cleaning and some grout. The bed was comfortable and room was clean, other than the bathroom tiles.",
            "title": "Trendy Hotel with Great Union Square Location",
            "user": "laurengucsb"
        },
        {
            "date": "December 2, 2007",
            "detail_rating": {
                "business": 3.0,
                "cleanliness": 2.0,
                "desk": null,
                "front_desk": 1.0,
                "location": 3.0,
                "pool": null,
                "restaurant": null,
                "rooms": 2.0,
                "service": 2.0,
                "sleep": null,
                "value": 2.0
            },
            "helpfulness": 2,
            "id": 11211301,
            "likes": {
                "disliked": null,
                "liked": null
            },
            "rating": 2.0,
            "stay_parameters": "Stayed December 2007, traveled on business",
            "text": "Gym was small and a little depressing-blinds were pulled closed to hide the roof fans, gym door probably could have used glass so it didn't seem like you were working out in a prison gym.",
            "title": "Cramped and Unprofessional",
            "user": "morningstar27"
        },
        {
            "date": "November 28, 2007",
            "detail_rating": {
                "business": 3.0,
                "cleanliness": 4.0,
                "desk": null,
                "front_desk": 4.0,
                "location": 4.0,
                "pool": null,
                "restaurant": null,
                "rooms": 3.0,
                "service": 4.0,
                "sleep": null,
                "value": 3.0
            },
            "helpfulness": null,
            "id": 11125183,
            "likes": {
                "disliked": "\u2014 Didn't live up to photos on website",
                "liked": "\u2014 Location wasn't bad"
            },
            "rating": 3.0,
            "stay_parameters": "Stayed December 2006, traveled as a couple",
            "text": "Business center was nice-I printed out directions to our Sonoma hotel.",
            "title": "Not Bad",
            "user": "michaelmelton1"
        },
        {
            "date": "October 10, 2007",
            "detail_rating": {
                "business": 4.0,
                "cleanliness": 4.0,
                "desk": null,
                "location": 5.0,
                "pool": null,
                "restaurant": null,
                "rooms": 3.0,
                "service": 3.0,
                "sleep": null,
                "value": 3.0
            },
            "helpfulness": null,
            "id": 10061857,
            "likes": {
                "disliked": null,
                "liked": null
            },
            "rating": 3.0,
            "stay_parameters": "Stayed September 2007, traveled on business",
            "text": "The room was nice but a bit small. I thought I booked a king size bed but got a queen. The hotel room does not look as nice as the pictures on the website but it is clean. Cheap looking furniture. We were happy though that it was clean and very convenient to the Moscone Center and Union Square.",
            "title": "Nice but did not look anything like website picture",
            "user": "traveladdict014"
        },
        {
            "date": "October 4, 2007",
            "detail_rating": {
                "business": 4.0,
                "cleanliness": 5.0,
                "desk": null,
                "front_desk": 5.0,
                "location": 5.0,
                "pool": null,
                "restaurant": null,
                "rooms": 4.0,
                "service": 5.0,
                "sleep": null,
                "value": 4.0
            },
            "helpfulness": null,
            "id": 10039035,
            "likes": {
                "disliked": "\u2014 The elevator",
                "liked": "\u2014 Its creative quirkyness"
            },
            "rating": 4.0,
            "stay_parameters": "Stayed September 2007, traveled on business",
            "text": "What a quirky, fun place to stay! The room was cool and comfortable on a quiet hallway. The in-room amenities are hilarious and appropriate. Sleek modern fixtures and a comfy bed were great. The hotel staff were informed and helpful, dealing with all of our needs with a smile. The hotel is conveniently located - close to lots of things but on a relatively quiet street. I would definitely stay here again.",
            "title": "Quirky fun",
            "user": "andrawatkins"
        },
        {
            "date": "October 1, 2007",
            "detail_rating": {
                "business": 2.0,
                "cleanliness": 2.0,
                "desk": null,
                "front_desk": 3.0,
                "location": 2.0,
                "pool": null,
                "restaurant": null,
                "rooms": 2.0,
                "service": 2.0,
                "sleep": null,
                "value": 3.0
            },
            "helpfulness": 2,
            "id": 10023987,
            "likes": {
                "disliked": "\u2014 Half remodelled rooms",
                "liked": "\u2014 Location to Clift Hotel Bar opposite the hotel"
            },
            "rating": 3.0,
            "stay_parameters": "Stayed September 2007, traveled on business",
            "text": "The location of the hotel was pretty good. The beggars waiting outside the front door were something else though. A city notorious for beggars - the location of the hotel was right in the thick of them all. Quite unnerving for a 20-something woman walking alone during the day or night. The hotel appears to have had some sort of remodeling done - however parts of the room laughed at the others. Ie The main bedroom was very modern, slick plasma etc but then the bathroom was old and a bit tired-looking & cramped. No space to place any of your toiletries and barely space to swing a cat. Quite pricey for the value - we paid $166 + tax USD/nt for a king room and then about $130/nt for a Queen. Moved down to the Marina District half way through our stay and found it to be EXCELLENT. Gorgeous location in the midst of Union St & Chestnut St. Both streets are lined with little boutiques, great coffee shops, wine bars, cute little restaurants and there wasnt one beggar in sight! A short bus ride to the city if you wanted some of the city nightlife.",
            "title": "Contemporary semi refurbished hotel",
            "user": "Camnicsydney"
        },
        {
            "date": "September 25, 2007",
            "detail_rating": {
                "business": 5.0,
                "cleanliness": 5.0,
                "desk": null,
                "front_desk": 5.0,
                "location": 5.0,
                "pool": null,
                "restaurant": null,
                "rooms": 4.0,
                "service": 5.0,
                "sleep": null,
                "value": 4.0
            },
            "helpfulness": 2,
            "id": 10002559,
            "likes": {
                "disliked": "\u2014 Noise from neighbors, not Hotel's fault",
                "liked": "\u2014 Friendly Front Desk Staff, Uniqueness of the Hotel"
            },
            "rating": 5.0,
            "stay_parameters": "Stayed September 2007, traveled as a couple",
            "text": "Hotel Diva in San Francisco, what can I say about this boutique. It's a great hotel inside and out. From the friendly personel at the front desk to the room decor and amenities. I expected the room to be quite small compared to the bigger hotel chains, but you can not beat experiencing a unique hotel boutique such as Diva's. The only complaints about the hotel is the noise levels at night from our neighbors in the suite room, sounded like a party was going on in there. But who cares, its a fun hotel.",
            "title": "Super Hot Boutique - DIVA",
            "user": "CADiesel310"
        },
        {
            "date": "September 9, 2007",
            "detail_rating": {
                "business": 4.0,
                "cleanliness": 4.0,
                "desk": null,
                "front_desk": 3.0,
                "location": 5.0,
                "pool": null,
                "restaurant": null,
                "rooms": 4.0,
                "service": 4.0,
                "sleep": null,
                "value": 4.0
            },
            "helpfulness": 3,
            "id": 8680976,
            "likes": {
                "disliked": null,
                "liked": null
            },
            "rating": 4.0,
            "stay_parameters": "Stayed September 2007, traveled with friends",
            "text": "I'd DEFINITELY STAY HERE AGAIN. Thanks DIVA!",
            "title": "Super Cute hotel- perfect for travelers, great location",
            "user": "AP_Phoenix"
        },
        {
            "date": "July 11, 2008",
            "detail_rating": {
                "business": 3.0,
                "cleanliness": 1.0,
                "desk": null,
                "front_desk": 3.0,
                "location": 2.0,
                "pool": null,
                "restaurant": null,
                "rooms": 1.0,
                "service": 3.0,
                "sleep": null,
                "value": 1.0
            },
            "helpfulness": null,
            "id": 17783517,
            "likes": {
                "disliked": "\u2014 The hotel, the rooms were not good",
                "liked": "\u2014 The price, I got it for $100 on price... but I think it's only woth about $75"
            },
            "rating": 1.0,
            "stay_parameters": "Stayed June 2008, traveled as a couple",
            "text": "I hated this hotel. It's located on the shadier part of Geary Street. The room was very worn and smelled. I was on the 4th floor and about 5 feet from my window was a parking lot and outside my door was the business center. The walls are terribly thin! I couldn't sleep there... either I heard people outside my room and it sounded like they were in my room or the cars in the parking lot were moving around. I don't know, I'm usually an easy going person, sleeps everywhere and never has an issue... but I was truly unhappy at the hotel Diva.",
            "title": "Last time I slept so badly, I was in a Hostel in Barcelona",
            "user": "Nik31"
        },
        {
            "date": "July 10, 2008",
            "detail_rating": {
                "business": null,
                "cleanliness": null,
                "desk": null,
                "location": null,
                "pool": null,
                "restaurant": null,
                "rooms": null,
                "service": null,
                "sleep": null,
                "value": null
            },
            "helpfulness": null,
            "id": 17738486,
            "likes": {
                "disliked": null,
                "liked": null
            },
            "rating": 4.0,
            "stay_parameters": null,
            "text": "This motel is set basically like an apartment that was turned into a motel. It was excellent in serving our purpose. We stayed in the Queen suite, it was great having seperate rooms, me(Mom), my daughter (teen) and her girlfriend had a seperate room from my guy friend who vacationed with us. The rooms were very clean, and the staff was very friendly and helpful. The continental breakfast was \"just OK\"(not offered with all rooms). We were in the back of the motel, so I guess thats why we had absolutely no problems with the noise issues some of the other reviews reported having, we even talked on day about how quiet the rooms were and how we couldnt hear outside noise nor people in the other rooms or halls at all. Every floor had a lounge, which my girls loved in the evening. I felt completely safe with them going, being that you had to have a room key to enter the lounge at all. Do have to watch homeless people, but that is in all the bigger cities, not any worse than any other larger city I have visited. Everything is pretty close, or the trolley is close enough to commute to other areas if needed. If you are going to stay a week, it is worth getting a week pass for the trolley, it is $5 a pop everytime you get on or off ($24/wk). The pass will also be good for the other public transportation like the buses and such also.",
            "title": "Nice, clean, friendly staff",
            "user": "lovintravlin66"
        },
        {
            "date": "July 2, 2008",
            "detail_rating": {
                "business": 5.0,
                "cleanliness": 5.0,
                "desk": null,
                "front_desk": 5.0,
                "location": 5.0,
                "pool": null,
                "restaurant": null,
                "rooms": 4.0,
                "service": 4.0,
                "sleep": null,
                "value": 4.0
            },
            "helpfulness": 1,
            "id": 17461019,
            "likes": {
                "disliked": "\u2014 No complaints",
                "liked": "\u2014 P{irce and location"
            },
            "rating": 4.0,
            "stay_parameters": "Stayed June 2008, traveled with friends",
            "text": "This boutique property has an excellent location off Union Square, easily accesible to theaters, public transportation and restaurants, for those who prefer its ultra-modern decor. Rates are moderate and the staff is professional.",
            "title": "Great Location. Decent Price.",
            "user": "Nicky33609"
        },
        {
            "date": "June 26, 2008",
            "detail_rating": {
                "business": null,
                "cleanliness": 5.0,
                "desk": null,
                "front_desk": 5.0,
                "location": 5.0,
                "pool": null,
                "restaurant": null,
                "rooms": 5.0,
                "service": 5.0,
                "sleep": null,
                "value": 5.0
            },
            "helpfulness": 1,
            "id": 17265108,
            "likes": {
                "disliked": "\u2014 Nothing",
                "liked": "\u2014 Everything"
            },
            "rating": 5.0,
            "stay_parameters": "Stayed June 2008, traveled as a couple",
            "text": "My boyfriend and I just stayed at the Hotel Diva and loved it. The staff was great and personable. It is connected to a nice Mexican restaurant that I plan on eating at next time. They have convenient valet parking and the manager, Rudy, is the greatest.",
            "title": "I love Hotel Diva!",
            "user": "BonitaLanita"
        },
        {
            "date": "June 17, 2008",
            "detail_rating": {
                "business": 5.0,
                "cleanliness": 5.0,
                "desk": null,
                "front_desk": 5.0,
                "location": 5.0,
                "pool": null,
                "restaurant": null,
                "rooms": 5.0,
                "service": 5.0,
                "sleep": null,
                "value": 5.0
            },
            "helpfulness": 1,
            "id": 16992105,
            "likes": {
                "disliked": "\u2014 That I could not stay another few days to enjoy it more!",
                "liked": "\u2014 I loved everything about it...But the Starbucks in the lobby was a great added bonus!"
            },
            "rating": 5.0,
            "stay_parameters": "Stayed May 2008, traveled with friends",
            "text": "We stayed in a very spacious room with a HUGE AMAZING bed. It was great and in very close proximity to shopping, restaurants, BART, everything!",
            "title": "Absolutely fantastic!!!",
            "user": "marnimann"
        },
        {
            "date": "March 16, 2007",
            "detail_rating": {
                "business": 3.0,
                "cleanliness": 4.0,
                "desk": null,
                "front_desk": 4.0,
                "location": 4.0,
                "pool": null,
                "restaurant": null,
                "rooms": 4.0,
                "service": 4.0,
                "sleep": null,
                "value": 4.0
            },
            "helpfulness": 3,
            "id": 7172015,
            "likes": {
                "disliked": null,
                "liked": null
            },
            "rating": 4.0,
            "stay_parameters": "Stayed March 2007, traveled on business",
            "text": "For the price and the location, the Diva is a good bet. I stayed for 10 nights and found it to be everything I needed. I was in one of their larger rooms (complete with couch and mini fridge) and did feel somewhat pampered. The front desk staff and concierge were always friendly and greeted me. When we asked for restaurant recommendations or directions, they were always helpful. However, my colleague did have an unpleasant experience with one of the front desk people when she checked in.",
            "title": "Stayed 10 nights",
            "user": "annchgo"
        },
        {
            "date": "February 17, 2007",
            "detail_rating": {
                "business": null,
                "cleanliness": null,
                "desk": null,
                "location": null,
                "pool": null,
                "restaurant": null,
                "rooms": null,
                "service": null,
                "sleep": null,
                "value": null
            },
            "helpfulness": 4,
            "id": 6806059,
            "likes": {
                "disliked": null,
                "liked": null
            },
            "rating": 4.0,
            "stay_parameters": null,
            "text": "The hotel should rethink its wall color - the chalky white shows every single smudge and nick, so the walls appear a bit dingy. I usually don't use drawers at hotels, so the file-cabinets-turned-dressers didn't bother me, but I thought they were odd. Always had plenty of hot water, shower pressure, clean towels and I thought the bed was very comfy for a hotel bed, so I was happy. Oh, and the large flat panel TV was nice, too.",
            "title": "We adored it",
            "user": "cathyhub"
        },
        {
            "date": "February 15, 2007",
            "detail_rating": {
                "business": null,
                "cleanliness": null,
                "desk": null,
                "location": null,
                "pool": null,
                "restaurant": null,
                "rooms": null,
                "service": null,
                "sleep": null,
                "value": null
            },
            "helpfulness": 4,
            "id": 6799212,
            "likes": {
                "disliked": null,
                "liked": null
            },
            "rating": 5.0,
            "stay_parameters": null,
            "text": "The location is very close to all of the Union Square shopping and general toursity atmosphere. About a 5-10 minute walk to the BART/MUNI. There IS a Starbucks right off the lobby, which was convenient, but I thought the service there was subpar. I was not as impressed with restaurants right on Union Square as I was with others around town, but you can find something to eat pretty easily around the hotel. A few blocks away there is a great Thai place called Arroi and a sushi place called Sanraku. Also liked the diner across the street and down a block for French Toast and walk a few blocks to get to a great French place called Plouf (mussels and clams galore). Oh, and for great Mexican food and a cheap bottle of Dos Equis, visit the taqueria that is across the street and down about two blocks in the opposite direction of Union Square.",
            "title": "Amazing Valentines Trip",
            "user": "potterphreak"
        },
        {
            "date": "January 30, 2007",
            "detail_rating": {
                "business": 5.0,
                "cleanliness": 3.0,
                "desk": null,
                "front_desk": 5.0,
                "location": 4.0,
                "pool": null,
                "restaurant": null,
                "rooms": 2.0,
                "service": 5.0,
                "sleep": null,
                "value": 3.0
            },
            "helpfulness": 5,
            "id": 6717648,
            "likes": {
                "disliked": null,
                "liked": null
            },
            "rating": 2.0,
            "stay_parameters": "Stayed January 2007",
            "text": "As far as the complaints go about panhandlers in the area... Whether you're paying $500 for a luxery hotel or $100 for the Diva, you're going to run into panhandlers in SF. Most just stand in one place and call out for change - they do not chase you down or get in your face. If panhandlers make you uncomfortable, perhaps SF is not the right place for you to visit. I felt very safe in the area around the Diva.",
            "title": "Can't understand why this hotel gets such good reviews",
            "user": "lairdwd"
        },
        {
            "date": "January 23, 2007",
            "detail_rating": {
                "business": null,
                "cleanliness": null,
                "desk": null,
                "location": null,
                "pool": null,
                "restaurant": null,
                "rooms": null,
                "service": null,
                "sleep": null,
                "value": null
            },
            "helpfulness": 3,
            "id": 6643102,
            "likes": {
                "disliked": null,
                "liked": null
            },
            "rating": 1.0,
            "stay_parameters": null,
            "text": "By the way, due to a flight cancellation, I ended up for a night in the Hilton on O'Farrell Street just a few minutes from the Diva. The price was twice as much as the Diva, but I wouldn't say that it was necessarily worth it, since the Diva was fine by my standards. But, if you are very picky and have the money to spend, the Hilton was very clean, new and comfortable. I stayed in tower 2 in one of the handicap accessible rooms, so it was very roomy as well. The buffalo wings in the lounge were very good. :)",
            "title": "Hotel Horrid!",
            "user": "slojorge"
        },
        {
            "date": "June 12, 2006",
            "detail_rating": {
                "business": null,
                "cleanliness": null,
                "desk": null,
                "location": null,
                "pool": null,
                "restaurant": null,
                "rooms": null,
                "service": null,
                "sleep": null,
                "value": null
            },
            "helpfulness": 7,
            "id": 5336499,
            "likes": {
                "disliked": null,
                "liked": null
            },
            "rating": 5.0,
            "stay_parameters": null,
            "text": "Very inexpensive and utilitarian hotel, extremely clean and comfortable. The staff was polite and helpful. If you are looking for romantic luxury, this isn't your hotel, but for convenience, cleanliness and economy, you really can't do better.",
            "title": "Very good deal",
            "user": "A TripAdvisor user"
        },
        {
            "date": "April 21, 2006",
            "detail_rating": {
                "business": null,
                "cleanliness": 4.0,
                "desk": null,
                "location": null,
                "pool": null,
                "restaurant": null,
                "rooms": 4.0,
                "service": 4.0,
                "sleep": null,
                "value": 4.0
            },
            "helpfulness": 6,
            "id": 4993963,
            "likes": {
                "disliked": null,
                "liked": null
            },
            "rating": 4.0,
            "stay_parameters": "Stayed March 2006, traveled on business",
            "text": "worth the money and the search. hard to find hotel at night. but once found, it was a dream.",
            "title": "clean dream",
            "user": "SFSiciliano"
        },
        {
            "date": "March 23, 2006",
            "detail_rating": {
                "business": null,
                "cleanliness": null,
                "desk": null,
                "location": null,
                "pool": null,
                "restaurant": null,
                "rooms": null,
                "service": null,
                "sleep": null,
                "value": null
            },
            "helpfulness": 4,
            "id": 4727960,
            "likes": {
                "disliked": null,
                "liked": null
            },
            "rating": 5.0,
            "stay_parameters": null,
            "text": "a totally different design and decor. refreshing from the run of the mill big hotels. my room was clean and tidy. i received an amenity in my room from the sales department. i had excellent service from the front desk. very helpful.",
            "title": "Cool, hip design at the Diva",
            "user": "A TripAdvisor user"
        },
        {
            "date": "March 6, 2006",
            "detail_rating": {
                "business": null,
                "cleanliness": 4.0,
                "desk": null,
                "location": null,
                "pool": null,
                "restaurant": null,
                "rooms": 4.0,
                "service": 5.0,
                "sleep": null,
                "value": 5.0
            },
            "helpfulness": 2,
            "id": 4587358,
            "likes": {
                "disliked": null,
                "liked": null
            },
            "rating": 4.0,
            "stay_parameters": "Stayed February 2006",
            "text": "i felt like a dad though with most checking in being in there 20's and 30's. definetely for a young corporate type, but i felt young being there.",
            "title": "Very cute, great location!",
            "user": "simplyso"
        },
        {
            "date": "January 26, 2006",
            "detail_rating": {
                "business": null,
                "cleanliness": 2.0,
                "desk": null,
                "location": null,
                "pool": null,
                "restaurant": null,
                "rooms": 2.0,
                "service": 4.0,
                "sleep": null,
                "value": 3.0
            },
            "helpfulness": 3,
            "id": 4388808,
            "likes": {
                "disliked": null,
                "liked": null
            },
            "rating": 3.0,
            "stay_parameters": "Stayed January 2006, traveled on business",
            "text": "my son had the room next to me. he liked the dvd vending maching and the gym. he said the gym was better than any other hotel i've takin him with me too.",
            "title": "With character but without class",
            "user": "martinsa"
        },
        {
            "date": "June 16, 2008",
            "detail_rating": {
                "business": null,
                "cleanliness": null,
                "desk": null,
                "location": null,
                "pool": null,
                "restaurant": null,
                "rooms": null,
                "service": null,
                "sleep": null,
                "value": null
            },
            "helpfulness": 1,
            "id": 16953976,
            "likes": {
                "disliked": null,
                "liked": null
            },
            "rating": 4.0,
            "stay_parameters": null,
            "text": "Location so close to Union Square was magic. The rooms are small, very functional with cutting edge decor, which we enjoyed. The down side was that they tended to be a bit noisey. Staff were helpful and the rooms very clean the beds were also very comfortable. We would stay here again for the location, and as we were tourists and did not want the facilites of a 5 star hotel (i.e. gyms and resturants) we were happy with the cost saving. The ability to be able to walk anywhere was such a bonus, we would be happy to stay here again. The high speed internet really worked in our room.",
            "title": "Great to stay with the Stars",
            "user": "Killcare"
        },
        {
            "date": "May 15, 2008",
            "detail_rating": {
                "business": 5.0,
                "cleanliness": 5.0,
                "desk": null,
                "front_desk": 5.0,
                "location": 5.0,
                "pool": null,
                "restaurant": null,
                "rooms": 5.0,
                "service": 5.0,
                "sleep": null,
                "value": 5.0
            },
            "helpfulness": 2,
            "id": 16063933,
            "likes": {
                "disliked": "\u2014 The proximity to a noisey alley of some of the rooms",
                "liked": "\u2014 The beds"
            },
            "rating": 5.0,
            "stay_parameters": "Stayed April 2008",
            "text": "My mother & I stayed at hotel Diva on a short break to San Francisco recently & would certainly recommend it to tourists & business travellers alike.",
            "title": "Great Little Hotel Great Location Fabulous Beds",
            "user": "lilgreenmomo"
        },
        {
            "date": "May 14, 2008",
            "detail_rating": {
                "business": null,
                "cleanliness": 5.0,
                "desk": null,
                "front_desk": 5.0,
                "location": 5.0,
                "pool": null,
                "restaurant": null,
                "rooms": 5.0,
                "service": 5.0,
                "sleep": null,
                "value": 5.0
            },
            "helpfulness": 1,
            "id": 16024462,
            "likes": {
                "disliked": "\u2014 Nothing!",
                "liked": "\u2014 The Staff"
            },
            "rating": 5.0,
            "stay_parameters": "Stayed May 2008, traveled as a couple",
            "text": "The staff were friendly & helpful, the public areas of the hotel were spotless & well maintained. The rooms were excellent especially for the star rating. But the one thing that recommends this hotel above all others are the beds. They are wonderful, firm but not bouncy with the added bonus of what seemed to be a mattress topper, high quality linens & huge squishy pillows that didn't loose their shape the moment you put your head onto them. Completely wonderful. I am sure that a good bed that encourages a good nights sleep must be at least number two on the list of essentials for any traveller.",
            "title": "VIVA the DIVA!!",
            "user": "DebbaJoy"
        },
        {
            "date": "May 6, 2008",
            "detail_rating": {
                "business": null,
                "cleanliness": null,
                "desk": null,
                "location": null,
                "pool": null,
                "restaurant": null,
                "rooms": null,
                "service": null,
                "sleep": null,
                "value": null
            },
            "helpfulness": 1,
            "id": 15728813,
            "likes": {
                "disliked": null,
                "liked": null
            },
            "rating": 5.0,
            "stay_parameters": null,
            "text": "The only downsides I can think of are:",
            "title": "Hotel Diva, A Great Boutique Hotel in Union Square",
            "user": "00crusader"
        },
        {
            "date": "May 2, 2008",
            "detail_rating": {
                "business": 3.0,
                "cleanliness": 5.0,
                "desk": null,
                "front_desk": 5.0,
                "location": 5.0,
                "pool": null,
                "restaurant": null,
                "rooms": 4.0,
                "service": 5.0,
                "sleep": null,
                "value": 5.0
            },
            "helpfulness": 1,
            "id": 15590631,
            "likes": {
                "disliked": "\u2014 Street noise, slow to no internet connection",
                "liked": "\u2014 Nice staff, clean rooms"
            },
            "rating": 4.0,
            "stay_parameters": "Stayed April 2008, traveled with family",
            "text": "- The fact that board is on a room only basis but there are options for breakfast locally.",
            "title": "Just Right",
            "user": "GoWhoopers"
        },
        {
            "date": "January 11, 2007",
            "detail_rating": {
                "business": 4.0,
                "cleanliness": 4.0,
                "desk": null,
                "front_desk": 5.0,
                "location": 5.0,
                "pool": null,
                "restaurant": null,
                "rooms": 5.0,
                "service": 5.0,
                "sleep": null,
                "value": 5.0
            },
            "helpfulness": 1,
            "id": 6577087,
            "likes": {
                "disliked": "\u2014 Get a room NOT overlooking Geary",
                "liked": "\u2014 Great attitude and safefacility"
            },
            "rating": 4.0,
            "stay_parameters": "Stayed January 2007, traveled solo",
            "text": "My first trip to beautiful San Francisco and I was happy to have selected Diva. The hotel was recommended in the Travel section of our local newspaper . All of the staff were more than accommodating , in fact, there was a problem on the 2nd day with the shower and when I reported it, was promptly moved to a room on the same floor (it was even a bit larger than my original spacious accommodation. I did not get her name but she was a beautiful young lady with glasses.",
            "title": "A great introduction to San Francisco",
            "user": "Cavendish Beach"
        },
        {
            "date": "January 11, 2007",
            "detail_rating": {
                "business": 3.0,
                "cleanliness": 5.0,
                "desk": null,
                "front_desk": 5.0,
                "location": 4.0,
                "pool": null,
                "restaurant": null,
                "rooms": 5.0,
                "service": 5.0,
                "sleep": null,
                "value": null
            },
            "helpfulness": 1,
            "id": 6574284,
            "likes": {
                "disliked": null,
                "liked": null
            },
            "rating": 4.0,
            "stay_parameters": "Stayed January 2007, traveled with friends",
            "text": "The location is superb...close to Union Square...shopping..shopping ...and of course many other sightseeing venues.",
            "title": "Lovely hotel",
            "user": "LondonFuzzyface"
        },
        {
            "date": "December 7, 2006",
            "detail_rating": {
                "business": 5.0,
                "cleanliness": 5.0,
                "desk": null,
                "front_desk": 5.0,
                "location": 5.0,
                "pool": null,
                "restaurant": null,
                "rooms": 3.0,
                "service": 5.0,
                "sleep": null,
                "value": 4.0
            },
            "helpfulness": 5,
            "id": 6344476,
            "likes": {
                "disliked": "\u2014 Very \"correctional facility chic\"",
                "liked": "\u2014 The water pressure from the futuristic shower head"
            },
            "rating": 4.0,
            "stay_parameters": "Stayed December 2006, traveled solo",
            "text": "I would definitely return.",
            "title": "Super water pressure and friendly staff",
            "user": "Garuda70"
        },
        {
            "date": "November 16, 2006",
            "detail_rating": {
                "business": 5.0,
                "cleanliness": 4.0,
                "desk": null,
                "front_desk": 1.0,
                "location": 5.0,
                "pool": null,
                "restaurant": null,
                "rooms": 1.0,
                "service": 1.0,
                "sleep": null,
                "value": 1.0
            },
            "helpfulness": 5,
            "id": 6138365,
            "likes": {
                "disliked": null,
                "liked": null
            },
            "rating": 1.0,
            "stay_parameters": "Stayed November 2006, traveled as a couple",
            "text": "We had a great stay at Hotel Diva. The staff were really friendly, the rooms clean and modern. The only problem we had was that the room was sooo noisy because of what sounded like a generator outside the window (we were at the back of the hotel). I know it's quite noisy at the front as well as they told us they were putting us in the quiet part of the hotel, but it definately did effect our sleep and I would ask to stay in a different part of the hotel next time.",
            "title": "Good Location...Unresponsive staff",
            "user": "80'sbaby"
        },
        {
            "date": "November 15, 2006",
            "detail_rating": {
                "business": null,
                "cleanliness": null,
                "desk": null,
                "location": null,
                "pool": null,
                "restaurant": null,
                "rooms": null,
                "service": null,
                "sleep": null,
                "value": null
            },
            "helpfulness": 2,
            "id": 6133983,
            "likes": {
                "disliked": null,
                "liked": null
            },
            "rating": 5.0,
            "stay_parameters": null,
            "text": "Apart from that however the hotel was fabulous!",
            "title": "I liked it a lot!",
            "user": "a.p.1017"
        }
    ],
    "slim_ranking": 0.268085106383,
    "stars": 3.5,
    "tripadvisor": {
        "VISITED": false,
        "country_name": null,
        "locality": null,
        "pic_link": null,
        "street_address": null
    },
    "user_rating": 4.0,
    "variance": {
        "average": 113,
        "excellent": 292,
        "poor": 52,
        "terrible": 31,
        "very good": 352
    }
}