{
    "aka": "Peppers Craigieburn Hotel Bowral",
    "description": "Reflecting the style and elegance of the original homestead, Peppers Craigieburn was originally built in 1887 and welcomed its first guests in 1909. Offering stylish and elegant accommodation, Peppers Craigieburn has a delightful onsite restaurant, tennis court and is the perfect place for a romantic weekend away or a relaxing escape.Within easy reach of Sydney, Canberra and the coast, Peppers Craigieburn is set in an area renowned for its national parks, antique shopping and cool climate wines.",
    "detail_rating": {
        "cleanliness": null,
        "location": null,
        "rooms": null,
        "service": null,
        "sleep": null,
        "value": null
    },
    "location": {
        "city": "Bowral",
        "continent": "South Pacific",
        "country": "Australia",
        "proposed_city": "Craigieburn",
        "province": null,
        "region": null
    },
    "name": "Peppers Craigieburn",
    "places": {
        "aka": [
            "Craigieburn"
        ],
        "hotel_description": [
            "Craigieburn",
            "Sydney",
            "Canberra"
        ],
        "hotel_name": [
            "Craigieburn"
        ]
    },
    "review_count": 222,
    "review_count_current": 9,
    "reviews": [
        {
            "date": "August 11, 2008",
            "detail_rating": {
                "business": 2.0,
                "cleanliness": 3.0,
                "desk": null,
                "front_desk": 3.0,
                "location": 2.0,
                "pool": null,
                "restaurant": null,
                "rooms": 3.0,
                "service": 3.0,
                "sleep": null,
                "value": 3.0
            },
            "helpfulness": 1,
            "id": 18830307,
            "likes": {
                "disliked": "\u2014 Staff",
                "liked": "\u2014 Location in relation to wineries"
            },
            "rating": 3.0,
            "stay_parameters": "Stayed August 2008, traveled with friends",
            "text": "We stayed at this resort fully aware of the other travellers have experienced. It wasn't as bad as it was made out to be but also not fantastic.",
            "title": "Its a bit meh",
            "user": "T-A-UK"
        },
        {
            "date": "July 20, 2008",
            "detail_rating": {
                "business": null,
                "cleanliness": 3.0,
                "desk": null,
                "front_desk": 1.0,
                "location": 3.0,
                "pool": null,
                "restaurant": null,
                "rooms": 1.0,
                "service": 2.0,
                "sleep": null,
                "value": 2.0
            },
            "helpfulness": 1,
            "id": 18078422,
            "likes": {
                "disliked": "\u2014 the rooms - too small",
                "liked": "\u2014 great location"
            },
            "rating": 2.0,
            "stay_parameters": "Stayed July 2008, traveled as a couple",
            "text": "Room sizes were on the small side, not tiny but definately not spacious. The quality of the services in the rooms definately aren't of the 4 star quality (no in room movies etc) but we were told snootily by the staff in the hotel that these basic services will be rolled out to the whole hotel shortly.",
            "title": "Not worth the money",
            "user": "fussytravelerSydney"
        },
        {
            "date": "July 5, 2008",
            "detail_rating": {
                "business": 5.0,
                "cleanliness": 5.0,
                "desk": null,
                "front_desk": 4.0,
                "location": 4.0,
                "pool": null,
                "restaurant": null,
                "rooms": 4.0,
                "service": 5.0,
                "sleep": null,
                "value": 3.0
            },
            "helpfulness": null,
            "id": 17546381,
            "likes": {
                "disliked": "\u2014 too many conferences at the same time",
                "liked": "\u2014 wayne and his hot chocolate skills"
            },
            "rating": 4.0,
            "stay_parameters": "Stayed June 2008, traveled on business",
            "text": "We all found the staff to be rude and seemed to be looking down on us. In particular was a rather short attitude to us at breakfast which made us feel like petulant children when all we wanted to do was sit down and have breakfast. The food was on the sparse side, pretty poor quality (cordial was being passed off as OJ, eggs were powdered) and took a long time to come out from the kitchen.",
            "title": "Great space for business conferences",
            "user": "DownunderSugarglider"
        },
        {
            "date": "June 8, 2008",
            "detail_rating": {
                "business": null,
                "cleanliness": 3.0,
                "desk": null,
                "front_desk": 3.0,
                "location": 1.0,
                "pool": null,
                "restaurant": null,
                "rooms": 1.0,
                "service": 2.0,
                "sleep": null,
                "value": 1.0
            },
            "helpfulness": null,
            "id": 16764663,
            "likes": {
                "disliked": "\u2014 The rooms..fit for a midget",
                "liked": "\u2014 It was only 1 hour away from home and only 5 minutes away from the Centennial Winery"
            },
            "rating": 1.0,
            "stay_parameters": "Stayed June 2008, traveled with family",
            "text": "Grounds, the setting is nice over the golf course and parking is a lot easier than it is at Milton Park.",
            "title": "So bad... we left the next day",
            "user": "SydneyExpat2008"
        },
        {
            "date": "May 11, 2008",
            "detail_rating": {
                "business": null,
                "cleanliness": 2.0,
                "desk": null,
                "front_desk": 5.0,
                "location": 5.0,
                "pool": null,
                "restaurant": null,
                "rooms": 1.0,
                "service": 5.0,
                "sleep": null,
                "value": 2.0
            },
            "helpfulness": 1,
            "id": 15940936,
            "likes": {
                "disliked": "\u2014 filthy cheap rooms",
                "liked": "\u2014 The grounds"
            },
            "rating": 2.0,
            "stay_parameters": "Stayed April 2008, traveled as a couple",
            "text": "Would I stay there again? Probably not, we got a deal on wotif $189 including breakfast which made it expensive but not over the top for Bowral. I would feel pretty ripped off if I paid the rack rate. The facilities at the hotel are very limited in the evenings so you would need to take something to keep you occupied. Its ok, not great but if you can get a deal and your going for a night then I would probably stay there. If not I'm sure there are better places in Bowral to stay.",
            "title": "Very dissapointing",
            "user": "Sa5096b"
        },
        {
            "date": "March 24, 2008",
            "detail_rating": {
                "business": null,
                "cleanliness": 5.0,
                "desk": null,
                "front_desk": 5.0,
                "location": 5.0,
                "pool": null,
                "restaurant": null,
                "rooms": 1.0,
                "service": 5.0,
                "sleep": null,
                "value": 1.0
            },
            "helpfulness": 1,
            "id": 14504879,
            "likes": {
                "disliked": "\u2014 Room and bathroom",
                "liked": "\u2014 Surroundings and staff"
            },
            "rating": 1.0,
            "stay_parameters": "Stayed March 2008, traveled as a couple",
            "text": "Stayed in Cragieburn over the Easter weekend for 2 nights. Service was fantastic and the hotel was nice and new. The staff was really friendly and nice. The room looked excellent at first, and everything was very new. The surroundings were simply beautiful too. But we soon realised that the room was really tiny for the two of us and the bathroom was really tiny too, I think it measured something like 1m x 4 m all in all? The fan was really loud and there was absolutely no space to put toiletries... The worst thing we realised was that the water pressure in the showerhead was really terrible. It was a miserable task getting a shower.",
            "title": "Disappointing...",
            "user": "BingSydney"
        },
        {
            "date": "March 9, 2008",
            "detail_rating": {
                "business": null,
                "cleanliness": 5.0,
                "desk": null,
                "front_desk": 5.0,
                "location": 5.0,
                "pool": null,
                "restaurant": null,
                "rooms": 3.0,
                "service": 5.0,
                "sleep": null,
                "value": 3.0
            },
            "helpfulness": 1,
            "id": 14151006,
            "likes": {
                "disliked": "\u2014 The dam hospital wing!",
                "liked": "\u2014 Great Location, Views from the main house, Food, Service"
            },
            "rating": 4.0,
            "stay_parameters": "Stayed March 2008, traveled on business",
            "text": "The king sized bed took up a lot of space in the room. There was also a couch at the opposite wall to the bed. The couch was good to sit on for a read, except that there wasn't any reading lights. It was also awkwardly positioned. It was a sort of reclining couch... I would have prefered if I could recline in the direction facing the television set and read at the same time. Instead, the couch reclined in a position where my back was towards the TV and facing a huge mirror.",
            "title": "Nice outside but some surprises",
            "user": "Dovem32"
        },
        {
            "date": "November 4, 2007",
            "detail_rating": {
                "business": 1.0,
                "cleanliness": 2.0,
                "desk": null,
                "front_desk": 3.0,
                "location": 3.0,
                "pool": null,
                "restaurant": null,
                "rooms": 1.0,
                "service": 2.0,
                "sleep": null,
                "value": 2.0
            },
            "helpfulness": 2,
            "id": 10578223,
            "likes": {
                "disliked": "\u2014 The Accommodation",
                "liked": "\u2014 The gardens and locale"
            },
            "rating": 2.0,
            "stay_parameters": "Stayed October 2007, traveled on business",
            "text": "Breakfast was included in the hotel fee that we paid, nearly A$300 per night. Breakfast was also quite crap with a limited variety and a lot of which had ran out by the time we went down for breakfast. Even utensils, plates and bowls were not replenished. The breakfast was really disappointing. On the 2nd day, we gave the breakfast a miss.",
            "title": "Not that great",
            "user": "Garthy_2"
        },
        {
            "date": "October 1, 2007",
            "detail_rating": {
                "business": null,
                "cleanliness": null,
                "desk": null,
                "location": null,
                "pool": null,
                "restaurant": null,
                "rooms": null,
                "service": null,
                "sleep": null,
                "value": null
            },
            "helpfulness": null,
            "id": 10024849,
            "likes": {
                "disliked": null,
                "liked": null
            },
            "rating": 2.0,
            "stay_parameters": null,
            "text": "We have just arrived back from Cragieburn and have some mixed feelings. The property has been recently renovated and looks very modern and sleek inside. Our room ( A Terrace Room??? with no Terrace) was not huge but well furnished, with what seemed like completely new curtains, bed, linen etc.",
            "title": "A real disappointment",
            "user": "Haggers_Syd"
        }
    ],
    "slim_ranking": 0.666666666667,
    "stars": 4.5,
    "tripadvisor": {
        "VISITED": false,
        "country_name": null,
        "locality": null,
        "pic_link": null,
        "street_address": null
    },
    "user_rating": 3.5,
    "variance": {
        "average": 56,
        "excellent": 49,
        "poor": 37,
        "terrible": 25,
        "very good": 55
    }
}