{
    "aka": "Casale Santa Brigida: Art Monastery Guesthouse Umbria, Italy",
    "description": "Become a temporary part of our international arts community! The Art Monastery Project applies inspiring aspects of traditional monastic life (ecological sustainability, communal living, contemplative practice) to artmaking instead of religion. Whether or not you participate in group meditations, yoga on the pool deck, group meals, or tons of ongoing workshops, your stay at the Santa Brigida will be truly unique. \u20ac35/person/night for a double occupancy studio.",
    "detail_rating": {
        "cleanliness": null,
        "location": null,
        "rooms": null,
        "service": null,
        "sleep": null,
        "value": null
    },
    "location": {
        "city": null,
        "continent": "Europe",
        "country": "Italy",
        "proposed_city": null,
        "province": null,
        "region": "Umbria"
    },
    "name": "Casale Santa Brigida: Art Monastery Guesthouse",
    "places": {
        "aka": [],
        "hotel_description": [],
        "hotel_name": []
    },
    "review_count": 17,
    "review_count_current": 1,
    "reviews": [
        {
            "date": "August 16, 2008",
            "detail_rating": {
                "business": 5.0,
                "cleanliness": 5.0,
                "desk": null,
                "front_desk": 4.0,
                "location": 4.0,
                "pool": null,
                "restaurant": null,
                "rooms": 4.0,
                "service": 4.0,
                "sleep": null,
                "value": 5.0
            },
            "helpfulness": null,
            "id": 19002893,
            "likes": {
                "disliked": null,
                "liked": null
            },
            "rating": 5.0,
            "stay_parameters": "Stayed June 2008, traveled solo",
            "text": "I came down to Calvi, the Santa Brigida, and Art Monastery in early June, and really had a wonderful stay. The area is very peaceful and relaxing, and since it was very hot that week, the pool was wonderful! There are huge jasmine bushes and the air smells amazing, and a fig tree was full of delicious fruit. The hosts and landlord were very friendly and helpful in meeting my needs.",
            "title": "Amazing views of the Umbrian hills!",
            "user": "Finnatic"
        }
    ],
    "slim_ranking": 0.5,
    "stars": null,
    "tripadvisor": {
        "VISITED": false,
        "country_name": null,
        "locality": null,
        "pic_link": null,
        "street_address": null
    },
    "user_rating": 5.0,
    "variance": {
        "average": 0,
        "excellent": 16,
        "poor": 0,
        "terrible": 0,
        "very good": 1
    }
}