{
    "aka": "Miramar Hotel Singapore",
    "description": "Tower Hotel located in city center, within walking distance of Orchard Road & Chinatown.",
    "detail_rating": {
        "cleanliness": 4.0,
        "location": 4.0,
        "rooms": 4.0,
        "service": 4.0,
        "sleep": 4.0,
        "value": 4.0
    },
    "location": {
        "city": null,
        "continent": "Asia",
        "country": "Singapore",
        "proposed_city": "Miramar",
        "province": null,
        "region": null
    },
    "name": "Hotel Miramar",
    "places": {
        "aka": [
            "Miramar"
        ],
        "hotel_description": [],
        "hotel_name": [
            "Miramar"
        ]
    },
    "review_count": 452,
    "review_count_current": 64,
    "reviews": [
        {
            "date": "February 5, 2013",
            "detail_rating": {
                "business": null,
                "cleanliness": 5.0,
                "desk": null,
                "location": 4.0,
                "pool": null,
                "restaurant": null,
                "rooms": 4.0,
                "service": 5.0,
                "sleep": 4.0,
                "value": 4.0
            },
            "helpfulness": 1,
            "id": 151470472,
            "likes": {
                "disliked": null,
                "liked": null
            },
            "rating": 4.0,
            "stay_parameters": "Stayed January 2013, traveled with family",
            "text": "Found the hotel to be excellent, very well organised, helpful and accommodating staff. Large room with big double bed and camp bed. Close to all main activities. 10 minute walk to China Town. Would stay there again.",
            "title": "Stopover.",
            "user": "Rhonda T"
        },
        {
            "date": "February 4, 2013",
            "detail_rating": {
                "business": null,
                "cleanliness": 5.0,
                "desk": null,
                "location": 4.0,
                "pool": null,
                "restaurant": null,
                "rooms": 4.0,
                "service": 5.0,
                "sleep": 5.0,
                "value": 5.0
            },
            "helpfulness": 8,
            "id": 151358667,
            "likes": {
                "disliked": null,
                "liked": null
            },
            "rating": 4.0,
            "stay_parameters": "Stayed January 2013, traveled as a couple",
            "text": "We have stayed at a number of 4 star hotels in Singapore which we were very happy with .",
            "title": "Jan 2013",
            "user": "hebphoto"
        },
        {
            "date": "February 3, 2013",
            "detail_rating": {
                "business": null,
                "cleanliness": 5.0,
                "desk": null,
                "location": 5.0,
                "pool": null,
                "restaurant": null,
                "rooms": 5.0,
                "service": 5.0,
                "sleep": 5.0,
                "value": 5.0
            },
            "helpfulness": 9,
            "id": 151316035,
            "likes": {
                "disliked": null,
                "liked": null
            },
            "rating": 4.0,
            "stay_parameters": "Stayed January 2013, traveled as a couple",
            "text": "In Jan 2013 we wanted to stay at a 3 Star to save money etc .",
            "title": "Good hotel and location",
            "user": "Twojays_10"
        },
        {
            "date": "January 30, 2013",
            "detail_rating": {
                "business": null,
                "cleanliness": 5.0,
                "desk": null,
                "location": 5.0,
                "pool": null,
                "restaurant": null,
                "rooms": 5.0,
                "service": 5.0,
                "sleep": 5.0,
                "value": 5.0
            },
            "helpfulness": 1,
            "id": 151006005,
            "likes": {
                "disliked": null,
                "liked": null
            },
            "rating": 5.0,
            "stay_parameters": "Stayed January 2013, traveled as a couple",
            "text": "We came across the Hotel Mira Mara which we can honestly say great value for money ,Clean comfortable and the staff very helpful & Shuttle bus very handy .",
            "title": "great place to stay",
            "user": "carpBristol"
        },
        {
            "date": "January 30, 2013",
            "detail_rating": {
                "business": null,
                "cleanliness": 5.0,
                "desk": null,
                "location": 4.0,
                "pool": null,
                "restaurant": null,
                "rooms": 4.0,
                "service": 5.0,
                "sleep": 5.0,
                "value": 5.0
            },
            "helpfulness": 1,
            "id": 150995329,
            "likes": {
                "disliked": null,
                "liked": null
            },
            "rating": 4.0,
            "stay_parameters": "Stayed September 2012, traveled as a couple",
            "text": "Go over the bridge just outside down steps to the right the second bar restaurant the Boomerang great food 1 serve is enough for two .",
            "title": "My first stay in Singapore",
            "user": "StephanieSeychelles"
        },
        {
            "date": "June 2, 2006",
            "detail_rating": {
                "business": null,
                "cleanliness": null,
                "desk": null,
                "location": null,
                "pool": null,
                "restaurant": null,
                "rooms": null,
                "service": null,
                "sleep": null,
                "value": null
            },
            "helpfulness": 3,
            "id": 5292122,
            "likes": {
                "disliked": null,
                "liked": null
            },
            "rating": 2.0,
            "stay_parameters": null,
            "text": "My family of four, one 16 year old, 12 year old and husband and I stayed at the Miriamar from May 8 through the 12. When we arrived we were tired and hot from the trip. We registered in and were told we had a room on the third floor. But guess what we had to walk up to our room and carry our luggage. Now if any one knows a women and a pre teen girl can bring a lot of luggage. So up we all went with all this stuff. Went into our room and to our supprise it was a room with a king. I did tell them we needed a room with double beds. Found the maid in the hall way and tried to explain to her we needed a bigger room, she spoke no english and my spanish is not the best. make a long story short we did get a room with two beds. We did notice the room did have a musty smell and the AC did not work well. The house cleaning was not at all good. The tub backed up and the maid never cleaned the bath room good. The tub had a ring around it and the beds were not made.",
            "title": "Mixed feelings",
            "user": "A TripAdvisor user"
        },
        {
            "date": "May 18, 2006",
            "detail_rating": {
                "business": null,
                "cleanliness": 4.0,
                "desk": null,
                "location": null,
                "pool": null,
                "restaurant": null,
                "rooms": 3.0,
                "service": 5.0,
                "sleep": null,
                "value": 3.0
            },
            "helpfulness": 1,
            "id": 5180253,
            "likes": {
                "disliked": null,
                "liked": null
            },
            "rating": 3.0,
            "stay_parameters": "Stayed May 2006",
            "text": "The view from the top floor was great, you saw the water and the kids loved it. The breakfast was ok. The front desk staff were helpful and nice.",
            "title": "Budget hotel, clean, friendly and free continental breakfast",
            "user": "mrchicago"
        },
        {
            "date": "May 11, 2007",
            "detail_rating": {
                "business": null,
                "cleanliness": null,
                "desk": null,
                "location": null,
                "pool": null,
                "restaurant": null,
                "rooms": null,
                "service": null,
                "sleep": null,
                "value": null
            },
            "helpfulness": 19,
            "id": 7588189,
            "likes": {
                "disliked": null,
                "liked": null
            },
            "rating": 1.0,
            "stay_parameters": null,
            "text": "I am writing this review about the Hotel Miramar, 606 Ponce de Leon Avenue, San Juan. Please DO NOT confuse this with the Marriot Miramar. I made a reservation through Priceline and received confirmation for the Hotel Miramar for one night prior to our cruise leaving. We arrived at the hotel at 1:30 am. Upon arrival a woman comes out to the street (this hotel is located on a dark side street in San Juan) and asks us if we have reservations. I thought it most peculiar, but said yes, we have reservations and confirmation (room already paid for) through Priceline. I then give her the paper with confirmation # and payment record, and she says, \"We don't have a reservation for you\" I said, \" Here it is, it's already paid for\". She says \"no, I have no room for you.\" I said, \"OK, just give us a room and we will pay for it.\" (thinking that I will sort all this out when we get home)",
            "title": "Horrible experience Do Not Go, Find another hotel",
            "user": "westerngypsy"
        },
        {
            "date": "May 3, 2007",
            "detail_rating": {
                "business": 4.0,
                "cleanliness": 5.0,
                "desk": null,
                "front_desk": 5.0,
                "location": 5.0,
                "pool": null,
                "restaurant": null,
                "rooms": 5.0,
                "service": 5.0,
                "sleep": null,
                "value": 4.0
            },
            "helpfulness": 9,
            "id": 7542650,
            "likes": {
                "disliked": "\u2014 Maybe Where To Put Our Clothes",
                "liked": "\u2014 The Bed Was BIG And Our TV Too :-)"
            },
            "rating": 5.0,
            "stay_parameters": "Stayed May 2007, traveled with family",
            "text": "She then says, \"there are no rooms available here, they are all taken.\" So we get back into the taxi, and our driver feels so sorry for us that he starts to call other hotels to see if he can get us a room. Meantime, we are sitting in front of the Miramar when another taxi pulls up. Two people get out and go in with their travel packet and yep.....sure enough they get a room! Meantime the taxi driver is having a difficult time since all hotel rooms are booked up in San Juan. Finally he calls the Best Western who just had an airline crew cancellation! We go there and I am telling the from desk clerk about our experirence with the Miramar Hotel and he said there were two other people who checked in earlier that the same thing had happened to. The Hotel Miramar was unsympathetic, and totally unresponsive. I would tell everyone out there, don't go.....it was an awful experience for 2 very experienced travelers. I have contacted Priceline for them to resolve this... Stay clear of this place, you don't want to end up like we did.",
            "title": "WE LOVED IT!!!",
            "user": "Dario_Rossy"
        },
        {
            "date": "April 23, 2007",
            "detail_rating": {
                "business": null,
                "cleanliness": null,
                "desk": null,
                "location": null,
                "pool": null,
                "restaurant": null,
                "rooms": null,
                "service": null,
                "sleep": null,
                "value": null
            },
            "helpfulness": 10,
            "id": 7420063,
            "likes": {
                "disliked": null,
                "liked": null
            },
            "rating": 1.0,
            "stay_parameters": null,
            "text": "This hotel is very good we stayed there from 26 April till 01 May 2007. We had a blast the hotel staff is excellent, clean room and towels everyday. The hotel is near a supermarket on the right and right on the corner you can find taxi, and if you want to go by bus it's only 0,75$. Naxt to Pueblo Supermarket you can find, subway, a chinese restaurant, a restaurant about taco's and there's a pharmacy across the street and a beauty saloon. So we found the hotel very good. In the lobby there's free internet for 30 minutes. And a cute yellow bird. And I forgot to take a picture of the bathroom next time :-)",
            "title": "Horrible Experience at the Hotel Miramar",
            "user": "MissKareBear"
        },
        {
            "date": "March 30, 2007",
            "detail_rating": {
                "business": 3.0,
                "cleanliness": 4.0,
                "desk": null,
                "front_desk": 4.0,
                "location": 3.0,
                "pool": null,
                "restaurant": null,
                "rooms": 3.0,
                "service": 4.0,
                "sleep": null,
                "value": 3.0
            },
            "helpfulness": 6,
            "id": 7252017,
            "likes": {
                "disliked": "\u2014 outdated bathroom",
                "liked": "\u2014 Location and affordability"
            },
            "rating": 3.0,
            "stay_parameters": "Stayed March 2007, traveled as a couple",
            "text": "I stayed at the Hotel Miramar with my family prior to our Caribbean cruise. Thankfully, we were there for only 1 night. It is by far the worst experience at a hotel that I have ever encountered. We requested one room for a family of 4 and were given \u201cthe biggest room\u201d. Granted, the room is relatively spacious, but none of us felt comfortable at all to really get good sleep.",
            "title": "Terrific staff...good value",
            "user": "mjamesr55"
        },
        {
            "date": "March 9, 2013",
            "detail_rating": {
                "business": null,
                "cleanliness": 4.0,
                "desk": null,
                "location": 4.0,
                "pool": null,
                "restaurant": null,
                "rooms": 4.0,
                "service": 5.0,
                "sleep": 4.0,
                "value": 4.0
            },
            "helpfulness": 1,
            "id": 154068456,
            "likes": {
                "disliked": null,
                "liked": null
            },
            "rating": 4.0,
            "stay_parameters": "Stayed March 2013, traveled with family",
            "text": "We spent one night here as part of a Singapore Stopover. The outside appearance of the hotel is not great but once inside it's a decent hotel. OUr room was small but well equipped (even included robes) and clean. We had a view of the swimming pool and were on the 7th floor which was quiet. Breakfast was good with lots of choice and was very good value for money. Agree with comments about the staff - all very friendly and helpful and made a big fuss of our 2 young children. We weren't flying until later that night but were allowed use of a courtesy room for a shower etc before we left which was really great.",
            "title": "Good stopover hotel",
            "user": "JosieH"
        },
        {
            "date": "March 2, 2013",
            "detail_rating": {
                "business": null,
                "cleanliness": 5.0,
                "desk": null,
                "location": 5.0,
                "pool": null,
                "restaurant": null,
                "rooms": 5.0,
                "service": 5.0,
                "sleep": 5.0,
                "value": 4.0
            },
            "helpfulness": 1,
            "id": 153521906,
            "likes": {
                "disliked": null,
                "liked": null
            },
            "rating": 4.0,
            "stay_parameters": "Stayed February 2013, traveled as a couple",
            "text": "We had a very nice exsperiance with Miramar in Singapore.Very clean room, every day was cleaned, towels changed, they even provided bath caps, tooth brushes.....",
            "title": "Good hotel for a stopver holiday",
            "user": "AntoanetaPlamen"
        },
        {
            "date": "February 26, 2013",
            "detail_rating": {
                "business": null,
                "cleanliness": 3.0,
                "desk": null,
                "location": 3.0,
                "pool": null,
                "restaurant": null,
                "rooms": 4.0,
                "service": 5.0,
                "sleep": 4.0,
                "value": 3.0
            },
            "helpfulness": 6,
            "id": 153177443,
            "likes": {
                "disliked": null,
                "liked": null
            },
            "rating": 4.0,
            "stay_parameters": "Stayed January 2013, traveled as a couple",
            "text": "very friendly and helpful staff! WE had an unforgettable singapore stopover holiday, and the location of the Miramar is also very good , near the clark quey and walking long \u0175alking :) to the attrActons as singapore flyer, singing fonnatiane......",
            "title": "Stopover, value hotel",
            "user": "ARW0647"
        },
        {
            "date": "February 25, 2013",
            "detail_rating": {
                "business": null,
                "cleanliness": 3.0,
                "desk": null,
                "location": 3.0,
                "pool": null,
                "restaurant": null,
                "rooms": 3.0,
                "service": 3.0,
                "sleep": 3.0,
                "value": 3.0
            },
            "helpfulness": null,
            "id": 153005821,
            "likes": {
                "disliked": null,
                "liked": null
            },
            "rating": 3.0,
            "stay_parameters": "Stayed November 2012, traveled on business",
            "text": "It looks a little austere from the outside but inside reception is nicely finished in marble and our room was adequately kitted out. There is a busy road outside but from our 9th floor room it could not be heard. The ground floor restaurant is adequate for both breakfast and dinner although they do have a habit of bring the breakfast closing time forward and hurrying you out. Not helpful after a long flight/ late arrival. Can't comment on the price as inclusive agents price.",
            "title": "Average hotel",
            "user": "gaganini"
        },
        {
            "date": "February 24, 2013",
            "detail_rating": {
                "business": null,
                "cleanliness": 5.0,
                "desk": null,
                "location": 5.0,
                "pool": null,
                "restaurant": null,
                "rooms": 5.0,
                "service": 5.0,
                "sleep": 4.0,
                "value": 4.0
            },
            "helpfulness": 1,
            "id": 152967698,
            "likes": {
                "disliked": null,
                "liked": null
            },
            "rating": 4.0,
            "stay_parameters": "Stayed January 2013, traveled as a couple",
            "text": "Ideal for a stopover if you are looking for a good hotel rather than a luxury hotel. The staff are helpful at reception but the best are the 'bell boys' unfailingly helpful and welcoming.",
            "title": "Great for a stopover",
            "user": "Jeanette D"
        },
        {
            "date": "April 12, 2007",
            "detail_rating": {
                "business": null,
                "cleanliness": null,
                "desk": null,
                "location": null,
                "pool": null,
                "restaurant": null,
                "rooms": null,
                "service": null,
                "sleep": null,
                "value": null
            },
            "helpfulness": 2,
            "id": 7338082,
            "likes": {
                "disliked": null,
                "liked": null
            },
            "rating": 3.0,
            "stay_parameters": null,
            "text": "Location of Hotel Miramar is very good ,very near to all shopping centres ,staff were freindly. Overall was not satisfyied with the conditions of the rooms. The rooms needed a good clean up,and needs new beddings. I would not rate it as a 3.5 or 4 star Hotel as it says on the net.",
            "title": "was okay",
            "user": "snaidu"
        },
        {
            "date": "January 21, 2006",
            "detail_rating": {
                "business": null,
                "cleanliness": 3.0,
                "desk": null,
                "location": null,
                "pool": null,
                "restaurant": null,
                "rooms": 3.0,
                "service": 3.0,
                "sleep": null,
                "value": 4.0
            },
            "helpfulness": 6,
            "id": 4368009,
            "likes": {
                "disliked": null,
                "liked": null
            },
            "rating": 3.0,
            "stay_parameters": "Stayed January 2006, traveled on business",
            "text": "A top to bottom renovation is nearly complete at the Excelsior and it will become a Marriott Courtyard as of Feb. 1 2006 or thereabouts. Some of the things I have to say about the hotel may soon be irrelevant. But for now - a nice, moderately priced hotel for business travelers in a good location, away from the tourist hustle bustle but still convenient to the Condado and Old San Juan. I stayed in room 905 which I think is one of the best lines (ie, rooms ending in 05) - they are quite a bit larger than most other rooms, and the other large rooms are close the elevator which is pretty noisy. The room has new, fairly attractive furniture but without any bells and whistles (see pictures). It was comfortable, clean, quiet, and had a nice view of the lagoon and the Condado.",
            "title": "A hotel in progress - will soon be a Marriott Courtyard",
            "user": "Bookistan5"
        },
        {
            "date": "January 23, 2008",
            "detail_rating": {
                "business": null,
                "cleanliness": 5.0,
                "desk": null,
                "front_desk": 5.0,
                "location": 4.0,
                "pool": null,
                "restaurant": null,
                "rooms": 5.0,
                "service": 5.0,
                "sleep": null,
                "value": 5.0
            },
            "helpfulness": 6,
            "id": 12933714,
            "likes": {
                "disliked": null,
                "liked": "\u2014 Friendly staff, amenities and free shuttle"
            },
            "rating": 5.0,
            "stay_parameters": "Stayed January 2008, traveled as a couple",
            "text": "We stayed in this hotel for four nights in early January 2008. This hotel is located about a 20 minute walk from the nearest subway stop, which is a bit further than what we were told by the hotel staff prior to our arrival. Clark\u2019s Quay is about a 20 minute walk along the river and it is not much further to the Colonial district. The hotel provides a free shuttle bus to the shopping district and China town and it is possible to catch the bus for a return trip as long as you meet the bus at the same stop.",
            "title": "Good value for price in Singapore",
            "user": "Canadian079"
        },
        {
            "date": "December 30, 2007",
            "detail_rating": {
                "business": 2.0,
                "cleanliness": 2.0,
                "desk": null,
                "front_desk": 3.0,
                "location": 2.0,
                "pool": null,
                "restaurant": null,
                "rooms": 2.0,
                "service": 2.0,
                "sleep": null,
                "value": 2.0
            },
            "helpfulness": 5,
            "id": 12071242,
            "likes": {
                "disliked": "\u2014 Swiming pool and Gym",
                "liked": "\u2014 Bathroom nice"
            },
            "rating": 2.0,
            "stay_parameters": "Stayed December 2007, traveled as a couple",
            "text": "We enjoyed our time in this hotel. We found the reception staff very helpful. The room was large, with nice amenities, such as an in-room safe, coffee and tea service and hair dryer. The room was very clean with complete bathroom amenities. The hotel was quiet even though it was very busy.",
            "title": "Not up to scratch",
            "user": "Steve2008London"
        },
        {
            "date": "December 29, 2007",
            "detail_rating": {
                "business": 3.0,
                "cleanliness": 4.0,
                "desk": null,
                "front_desk": 4.0,
                "location": 4.0,
                "pool": null,
                "restaurant": null,
                "rooms": 4.0,
                "service": 4.0,
                "sleep": null,
                "value": null
            },
            "helpfulness": 8,
            "id": 12052286,
            "likes": {
                "disliked": "\u2014 nothing",
                "liked": "\u2014 helpful staff and convenient location"
            },
            "rating": 4.0,
            "stay_parameters": "Stayed October 2007, traveled with friends",
            "text": "On our last morning we needed to leave very early. Breakfast was available to us (all except the eggs) at 5 a.m. This was a nice surprise since we thought we would be given a box breakfast. Most of the buffet was available even though it was before usual opening time. This service was greatly appreciated.",
            "title": "had a very comfortable stay here",
            "user": "nanabren"
        },
        {
            "date": "December 24, 2007",
            "detail_rating": {
                "business": null,
                "cleanliness": 5.0,
                "desk": null,
                "front_desk": 5.0,
                "location": 5.0,
                "pool": null,
                "restaurant": null,
                "rooms": 5.0,
                "service": 5.0,
                "sleep": null,
                "value": 5.0
            },
            "helpfulness": 2,
            "id": 11928112,
            "likes": {
                "disliked": "\u2014 all Excellent",
                "liked": "\u2014 Clean Tidy ,Hotel Service Staff Outstanding... food 100%"
            },
            "rating": 5.0,
            "stay_parameters": "Stayed November 2007, traveled as a couple",
            "text": "Even though the location is somewhat far from the public transportation we enjoyed the walks along the riverfront. Restaurants were within walking distance from the hotel. We would recommend this hotel while staying in Singapore.",
            "title": "Hotel in Singapore",
            "user": "photomart"
        },
        {
            "date": "December 3, 2007",
            "detail_rating": {
                "business": null,
                "cleanliness": null,
                "desk": null,
                "location": null,
                "pool": null,
                "restaurant": null,
                "rooms": null,
                "service": null,
                "sleep": null,
                "value": null
            },
            "helpfulness": 4,
            "id": 11217439,
            "likes": {
                "disliked": null,
                "liked": null
            },
            "rating": 3.0,
            "stay_parameters": null,
            "text": "Booked via SingaporeAir re their Singapore stopover deals, price ok, chose hotel from second tier group in SingaporeAir list of hotels based on usual photos and proximity to the MRT train network. However the map on the hotels web site was a bit elastic with the truth re the positioning of the hotel to the nearest station which appeared to be maybe 500 metres away at most, however was around 1500 meters which is a long way in 30degree heat and high humidity. Ordered a double bed but got a twin, nice bathroom, room no better than cheaper 3* hotels. Pool nice but not enough seats and towels always running out, staff not keen to help on that one due to not getting the tips they recieve from bar sales. Pool changing rooms also filthy, hadnt been cleaned in months by the look of it. Did not eat in hotel so cant comment, probably wouldnt stay there again.",
            "title": "good clean hotel",
            "user": "alisoncharvey"
        },
        {
            "date": "February 22, 2013",
            "detail_rating": {
                "business": null,
                "cleanliness": 4.0,
                "desk": null,
                "location": 5.0,
                "pool": null,
                "restaurant": null,
                "rooms": 4.0,
                "service": 5.0,
                "sleep": 4.0,
                "value": 5.0
            },
            "helpfulness": 2,
            "id": 152771017,
            "likes": {
                "disliked": null,
                "liked": null
            },
            "rating": 4.0,
            "stay_parameters": "Stayed February 2013, traveled as a couple",
            "text": "We stayed at the Miramar as part of a stopover package. Although the hotel looked a little tired, the location was excellent, with buses stopping outside and a short walk to the river.The price was very reasonable, and the breakfast was very good value. Just two small niggles. No free WiFi., and no spare sockets to charge up phones and computers.",
            "title": "Good value hotel",
            "user": "John W"
        },
        {
            "date": "February 21, 2013",
            "detail_rating": {
                "business": null,
                "cleanliness": 3.0,
                "desk": null,
                "location": 2.0,
                "pool": null,
                "restaurant": null,
                "rooms": 3.0,
                "service": 3.0,
                "sleep": null,
                "value": 3.0
            },
            "helpfulness": 1,
            "id": 152748744,
            "likes": {
                "disliked": null,
                "liked": null
            },
            "rating": 3.0,
            "stay_parameters": "Stayed February 2013",
            "text": "Arrived and on positive were allowed an early check in. Other positives include a nice pool and friendly staff.",
            "title": "Nice pool but Nothing is for free",
            "user": "Mrpositivenz"
        },
        {
            "date": "February 21, 2013",
            "detail_rating": {
                "business": null,
                "cleanliness": 3.0,
                "desk": null,
                "location": 2.0,
                "pool": null,
                "restaurant": null,
                "rooms": 3.0,
                "service": 4.0,
                "sleep": null,
                "value": 3.0
            },
            "helpfulness": null,
            "id": 152744303,
            "likes": {
                "disliked": null,
                "liked": null
            },
            "rating": 3.0,
            "stay_parameters": "Stayed February 2013",
            "text": "Negatives were that everything added cost, even things I usually expect in a Normal room price such as",
            "title": "Polite staff",
            "user": "alanstacey99"
        },
        {
            "date": "February 12, 2013",
            "detail_rating": {
                "business": null,
                "cleanliness": 5.0,
                "desk": null,
                "location": 5.0,
                "pool": null,
                "restaurant": null,
                "rooms": 5.0,
                "service": 4.0,
                "sleep": 5.0,
                "value": 4.0
            },
            "helpfulness": 3,
            "id": 151988712,
            "likes": {
                "disliked": null,
                "liked": null
            },
            "rating": 5.0,
            "stay_parameters": "Stayed February 2013, traveled with friends",
            "text": "- ability to check emails/ wifi",
            "title": "Great place to stay",
            "user": "Paul S"
        },
        {
            "date": "February 5, 2013",
            "detail_rating": {
                "business": null,
                "cleanliness": null,
                "desk": null,
                "location": null,
                "pool": null,
                "restaurant": null,
                "rooms": null,
                "service": null,
                "sleep": null,
                "value": null
            },
            "helpfulness": 2,
            "id": 151482418,
            "likes": {
                "disliked": null,
                "liked": null
            },
            "rating": 3.0,
            "stay_parameters": null,
            "text": "- tea/ coffee and milk so can at least make a cup of tea. A couple of sachets and being charged $7 for some warm milk seemed a bit on the nose.",
            "title": "Average",
            "user": "Saurabh5813"
        },
        {
            "date": "June 20, 2007",
            "detail_rating": {
                "business": null,
                "cleanliness": null,
                "desk": null,
                "location": null,
                "pool": null,
                "restaurant": null,
                "rooms": null,
                "service": null,
                "sleep": null,
                "value": null
            },
            "helpfulness": 5,
            "id": 7940149,
            "likes": {
                "disliked": null,
                "liked": null
            },
            "rating": 3.0,
            "stay_parameters": null,
            "text": "We booked into this Hotel as there were no rooms (apart from very expensive ones) in the area we normally stay in.",
            "title": "Location not great",
            "user": "flossieChristchurch"
        },
        {
            "date": "June 8, 2007",
            "detail_rating": {
                "business": 4.0,
                "cleanliness": 4.0,
                "desk": null,
                "front_desk": 4.0,
                "location": 4.0,
                "pool": null,
                "restaurant": null,
                "rooms": 4.0,
                "service": 4.0,
                "sleep": null,
                "value": 4.0
            },
            "helpfulness": 9,
            "id": 7808185,
            "likes": {
                "disliked": "\u2014 long walk to to Chinatown and Clarke Quay",
                "liked": "\u2014 the shuttle service, the buffet breakfast, the friendly and accomodating staff"
            },
            "rating": 4.0,
            "stay_parameters": "Stayed May 2007, traveled with friends",
            "text": "The staff at Reception were very good, as were the men who handled the luggage, called taxis etc.",
            "title": "Good hotel in an affordable price",
            "user": "CjT6"
        },
        {
            "date": "June 8, 2007",
            "detail_rating": {
                "business": null,
                "cleanliness": null,
                "desk": null,
                "location": null,
                "pool": null,
                "restaurant": null,
                "rooms": null,
                "service": null,
                "sleep": null,
                "value": null
            },
            "helpfulness": 5,
            "id": 7803954,
            "likes": {
                "disliked": null,
                "liked": null
            },
            "rating": 4.0,
            "stay_parameters": null,
            "text": "The room was of a reasonable size, but could have been cleaner. I noted stains on a hard backed chair, and stains on the blue decoration pillows on the beds. Vacuuming had not done properly as there was a line of dust all along the edge of the carpet in front of the wardrobe.",
            "title": "Good place to stay",
            "user": "ReefCanberra"
        },
        {
            "date": "June 3, 2007",
            "detail_rating": {
                "business": null,
                "cleanliness": 5.0,
                "desk": null,
                "front_desk": 4.0,
                "location": 4.0,
                "pool": null,
                "restaurant": null,
                "rooms": 5.0,
                "service": 5.0,
                "sleep": null,
                "value": 5.0
            },
            "helpfulness": 10,
            "id": 7750487,
            "likes": {
                "disliked": null,
                "liked": "\u2014 Cleanliness"
            },
            "rating": 5.0,
            "stay_parameters": "Stayed April 2007, traveled as a couple",
            "text": "The room and bathroom were a little shabby, but nothing a coat of paint could not fix. There was plenty of shampoo , hand soaps and also toothbrushes , which not many hotels provide. Sheets and towels were changed every day.",
            "title": "Ideal stopover hotel.",
            "user": "SandNDevon"
        },
        {
            "date": "May 2, 2007",
            "detail_rating": {
                "business": 3.0,
                "cleanliness": 2.0,
                "desk": null,
                "front_desk": 4.0,
                "location": 4.0,
                "pool": null,
                "restaurant": null,
                "rooms": 1.0,
                "service": 4.0,
                "sleep": null,
                "value": 2.0
            },
            "helpfulness": null,
            "id": 7540540,
            "likes": {
                "disliked": "\u2014 The price and false advertising",
                "liked": "\u2014 THe helpfull staff"
            },
            "rating": 2.0,
            "stay_parameters": "Stayed May 2007, traveled on business",
            "text": "The location for us was most inconvenient, but with such cheap taxis, it was not a problem to hop into one whenever we wanted to go anywhere.",
            "title": "Some Trick photography in the advertising",
            "user": "fidsboy"
        },
        {
            "date": "April 21, 2008",
            "detail_rating": {
                "business": null,
                "cleanliness": 4.0,
                "desk": null,
                "front_desk": 3.0,
                "location": 3.0,
                "pool": null,
                "restaurant": null,
                "rooms": 4.0,
                "service": 3.0,
                "sleep": null,
                "value": 3.0
            },
            "helpfulness": 1,
            "id": 15180270,
            "likes": {
                "disliked": "\u2014 Long walk to MRT",
                "liked": "\u2014 Quiet"
            },
            "rating": 3.0,
            "stay_parameters": "Stayed May 2007, traveled as a couple",
            "text": "While Singapore is undoubtedly the most plastic and boring place in Asia, this inadequacy is partly made up by its excellent MRT and reasonable bus systems.",
            "title": "Too far from MRT: othewise OK",
            "user": "Victorianlad"
        },
        {
            "date": "April 6, 2008",
            "detail_rating": {
                "business": 3.0,
                "cleanliness": 3.0,
                "desk": null,
                "front_desk": 5.0,
                "location": 3.0,
                "pool": null,
                "restaurant": null,
                "rooms": 3.0,
                "service": 3.0,
                "sleep": null,
                "value": 3.0
            },
            "helpfulness": 4,
            "id": 14824512,
            "likes": {
                "disliked": "\u2014 Waiting for the lifts",
                "liked": "\u2014 Pool area was good for a city hotel"
            },
            "rating": 2.0,
            "stay_parameters": "Stayed April 2008, traveled with family",
            "text": "Unfortunately the Miramar is too far from the MRT: it ia a good 15 minute walk and as I found on a Sunday morning when dragging a suitcase, a Westerner rapidly becomes sweaty.",
            "title": "Singapore!!!!",
            "user": "beamoSuttonColdfield"
        },
        {
            "date": "March 27, 2008",
            "detail_rating": {
                "business": null,
                "cleanliness": 4.0,
                "desk": null,
                "front_desk": 4.0,
                "location": 2.0,
                "pool": null,
                "restaurant": null,
                "rooms": 4.0,
                "service": 4.0,
                "sleep": null,
                "value": 4.0
            },
            "helpfulness": 4,
            "id": 14579406,
            "likes": {
                "disliked": "\u2014 Distance from centre",
                "liked": "\u2014 Bufffet meals in the restaurant"
            },
            "rating": 4.0,
            "stay_parameters": "Stayed January 2008, traveled as a couple",
            "text": "The room was fine with no external noise evident. It was sufficiently dark during the night.",
            "title": "A good Hotel",
            "user": "ChrisF"
        },
        {
            "date": "March 4, 2008",
            "detail_rating": {
                "business": null,
                "cleanliness": 2.0,
                "desk": null,
                "front_desk": 3.0,
                "location": 2.0,
                "pool": null,
                "restaurant": null,
                "rooms": 2.0,
                "service": 2.0,
                "sleep": null,
                "value": 3.0
            },
            "helpfulness": 2,
            "id": 14028817,
            "likes": {
                "disliked": "\u2014 Everything",
                "liked": "\u2014 Nothing"
            },
            "rating": 2.0,
            "stay_parameters": "Stayed February 2008, traveled as a couple",
            "text": "Breakfast was adequate though lacking the sophistication evident in some Filipino hotel breakfasts. Bu then again this is Singapore, and many first time travellers come here so mediocrity tends to rule.",
            "title": "Not Happy",
            "user": "kalmy1961"
        },
        {
            "date": "January 26, 2008",
            "detail_rating": {
                "business": 3.0,
                "cleanliness": 1.0,
                "desk": null,
                "front_desk": 3.0,
                "location": 3.0,
                "pool": null,
                "restaurant": null,
                "rooms": 1.0,
                "service": 3.0,
                "sleep": null,
                "value": 2.0
            },
            "helpfulness": 3,
            "id": 13003957,
            "likes": {
                "disliked": null,
                "liked": null
            },
            "rating": 2.0,
            "stay_parameters": "Stayed January 2008, traveled with family",
            "text": "All in all, fine for a short stopover but for a longer stay, a hotel closer to an MRT station would be preferable.",
            "title": "Acceptable",
            "user": "TripAimer"
        },
        {
            "date": "January 30, 2013",
            "detail_rating": {
                "business": null,
                "cleanliness": 5.0,
                "desk": null,
                "location": 5.0,
                "pool": null,
                "restaurant": null,
                "rooms": 4.0,
                "service": 5.0,
                "sleep": 5.0,
                "value": 5.0
            },
            "helpfulness": 3,
            "id": 150991522,
            "likes": {
                "disliked": null,
                "liked": null
            },
            "rating": 4.0,
            "stay_parameters": "Stayed January 2013, traveled as a couple",
            "text": "Two stays at the Miramar - three nights on arrival in Singapore and one night (different room) prior to leaving. Rooms are comfy and reasonably spacious, tea and coffee facilities are good, excellent beds, helpful and charming staff and very good value food in the restaurant. The pool at the rear of the hotel is great and our first room on 9th floor overlooked this, although the pool itself is somewhat surrounded by other buildings. Nevertheless the sun is on the decks most of the day and it's a peaceful place to read and swim. Access to Chinatown MRT is about a 10 minute walk, and you can get to anywhere in the city on the MRT (underground) which is spotless, and staffed with very helpful people. Taxis are very reasonable too. It's not a luxury hotel but it would be hard to find fault and as a place to rest your head during a busy sightseeing trip to Singapore, you can't do better.",
            "title": "Comfortable hotel in a convenient position for access around Singapore",
            "user": "Payno"
        },
        {
            "date": "January 29, 2013",
            "detail_rating": {
                "business": null,
                "cleanliness": 5.0,
                "desk": null,
                "location": 4.0,
                "pool": null,
                "restaurant": null,
                "rooms": 4.0,
                "service": 4.0,
                "sleep": null,
                "value": 4.0
            },
            "helpfulness": 1,
            "id": 150976300,
            "likes": {
                "disliked": null,
                "liked": null
            },
            "rating": 4.0,
            "stay_parameters": "Stayed February 2012",
            "text": "Decent stay. Clean rooms and good service. Welcoming staff. Great location with walking distance to Clarke Quay and MRT. Definitely recommend. Fitness centre is poor however. Nice pool area but could do with a bit of an upgrade.",
            "title": "Good value",
            "user": "bthomas_11"
        },
        {
            "date": "January 28, 2013",
            "detail_rating": {
                "business": null,
                "cleanliness": null,
                "desk": null,
                "location": null,
                "pool": null,
                "restaurant": null,
                "rooms": null,
                "service": null,
                "sleep": null,
                "value": null
            },
            "helpfulness": 2,
            "id": 150809518,
            "likes": {
                "disliked": null,
                "liked": null
            },
            "rating": 3.0,
            "stay_parameters": null,
            "text": "From Singapore hotels, this does not cost the earth. It is in a great location. It is clean, comfortable and the staff are polite. These are obviously all positive things. However, luxury it is not. That said, you get what you pay for. What does this place lack? Character. Ambience. Modernity. We stayed on NYE becayse we wanted to be close to the Quay and wanted to be able to afford to eat that night. We didnt eat in the restaurant there. We contemplated it, but the ambience was so lacking in the foyer restaurant that we gave it a miss. We had a drink in the lounge and it was like something out of the 80s. Slightly depressing!",
            "title": "You get a bit more than what you pay for",
            "user": "Sarah T"
        },
        {
            "date": "January 27, 2013",
            "detail_rating": {
                "business": null,
                "cleanliness": 3.0,
                "desk": null,
                "location": 2.0,
                "pool": null,
                "restaurant": null,
                "rooms": null,
                "service": 3.0,
                "sleep": 2.0,
                "value": 2.0
            },
            "helpfulness": 2,
            "id": 150715692,
            "likes": {
                "disliked": null,
                "liked": null
            },
            "rating": 3.0,
            "stay_parameters": "Stayed December 2012, traveled as a couple",
            "text": "Would i stay here again? Sure. If i could afford to stay in a better place on NYE in Singapore would I? Yes. For our budget on that particular night, this place was a winner. But if we were staying here for longer than 2 nights we might stretch the budget a bit.",
            "title": "overpriced",
            "user": "petertoonarmy1971"
        },
        {
            "date": "January 27, 2013",
            "detail_rating": {
                "business": null,
                "cleanliness": 5.0,
                "desk": null,
                "location": 5.0,
                "pool": null,
                "restaurant": null,
                "rooms": 4.0,
                "service": 5.0,
                "sleep": 5.0,
                "value": 3.0
            },
            "helpfulness": 3,
            "id": 150713181,
            "likes": {
                "disliked": null,
                "liked": null
            },
            "rating": 4.0,
            "stay_parameters": "Stayed January 2013, traveled with family",
            "text": "the hotel was chosen for us by a travel company otherwise i would have stayed elsewhere.the room was very average & needs updated.the entertainment in the main bar was the same every night.... i wouldnt advise the food from the bar,i had ordered a toasted sandwich & fries & when they finally arrived they were cold & didnt get any condiments or cutlery to eat it with.i would recommend going out across the river for numerous bars restraunts etc etc which is cheaper & a better selection.we didnt use any of the other dining options in the hotel.i wouldnt stay here again for the price we paid you can get a far better class of hotel.....",
            "title": "3 nights before cruise",
            "user": "jennifer o"
        },
        {
            "date": "November 10, 2007",
            "detail_rating": {
                "business": null,
                "cleanliness": null,
                "desk": null,
                "location": null,
                "pool": null,
                "restaurant": null,
                "rooms": null,
                "service": null,
                "sleep": null,
                "value": null
            },
            "helpfulness": 9,
            "id": 10724787,
            "likes": {
                "disliked": null,
                "liked": null
            },
            "rating": 4.0,
            "stay_parameters": null,
            "text": "Stayed here for a stopover for 36 hours. The staff really couldn't have been more helpful and we really felt that we had relaxed and been",
            "title": "really helpful stopover",
            "user": "topgearNewZealand"
        },
        {
            "date": "October 8, 2007",
            "detail_rating": {
                "business": null,
                "cleanliness": 3.0,
                "desk": null,
                "front_desk": 3.0,
                "location": 2.0,
                "pool": null,
                "restaurant": null,
                "rooms": 4.0,
                "service": 3.0,
                "sleep": null,
                "value": null
            },
            "helpfulness": 3,
            "id": 10052282,
            "likes": {
                "disliked": null,
                "liked": null
            },
            "rating": 2.0,
            "stay_parameters": "Stayed March 2006, traveled solo",
            "text": "able to rest between flights. We arrived at 8.30 am and were allowed to use a hospitality room to shower and change in. When we emerged from there intending to store our luggage for the day until our room was available, we were told that our room was all ready for us which was great. The breakfast wasn't up to much and was expensive but we were tired so we ate there anyway. The shuttle bus for Singapore Stopovers stops right outside the hotel which was great. It wasn't so easy to find the stops along Orchard Rd though and we ended up getting a taxi back to the hotel. The taxis were so cheap though that I used them a few times after that. It was better than waiting for a bus in the heat when we were tired. We checked out the following morning, having enjoyed the pool, and left our luggage stored for the day. We were told we could have a late check-out anyway of 2.30 but we wanted to go sight-seeing. When we arrived back at the hotel about 6.30 pm it was possible to prepare for the flight by using the hospitality room again. The hotel was extremely good value, booked with Singapore Airways as part of their stopover service. I really felt we had excellent value for money. I was travelling with my son and could have felt vulnerable in a strange city but I felt quite safe and would go there again.",
            "title": "Very average indeed",
            "user": "Commodore"
        },
        {
            "date": "September 23, 2007",
            "detail_rating": {
                "business": 3.0,
                "cleanliness": 3.0,
                "desk": null,
                "front_desk": 3.0,
                "location": 3.0,
                "pool": null,
                "restaurant": null,
                "rooms": 3.0,
                "service": 3.0,
                "sleep": null,
                "value": 3.0
            },
            "helpfulness": 5,
            "id": 8864436,
            "likes": {
                "disliked": "\u2014 a bit shabby",
                "liked": "\u2014 friendly staff"
            },
            "rating": 3.0,
            "stay_parameters": "Stayed August 2007, traveled as a couple",
            "text": "The room was large and comfortable, but I was not otherwise terribly impressed with this place. Poor location, officious staff and a restaurant that looked more like a military cafeteria than a hotel restaurant all contributed to a distinctly unmemorable hotel experience.",
            "title": "average",
            "user": "nikitaScotland"
        },
        {
            "date": "September 19, 2007",
            "detail_rating": {
                "business": null,
                "cleanliness": 2.0,
                "desk": null,
                "front_desk": 4.0,
                "location": 1.0,
                "pool": null,
                "restaurant": null,
                "rooms": 1.0,
                "service": null,
                "sleep": null,
                "value": 1.0
            },
            "helpfulness": 6,
            "id": 8823894,
            "likes": {
                "disliked": "\u2014 Bad location - Room smells dirt",
                "liked": "\u2014 Nothing"
            },
            "rating": 1.0,
            "stay_parameters": "Stayed September 2007",
            "text": "Suffice it to say, I won't be rushing back here.",
            "title": "Bad Location - Bad room",
            "user": "huow"
        },
        {
            "date": "September 7, 2007",
            "detail_rating": {
                "business": null,
                "cleanliness": null,
                "desk": null,
                "location": null,
                "pool": null,
                "restaurant": null,
                "rooms": null,
                "service": null,
                "sleep": null,
                "value": null
            },
            "helpfulness": 8,
            "id": 8668427,
            "likes": {
                "disliked": null,
                "liked": null
            },
            "rating": 5.0,
            "stay_parameters": null,
            "text": "Recently stayed at The Hotel Miramar Singapore for 3 nights on our way home from Australia. This hotel was ok but would not recommend it ? My travel agent told me it was in the process of being upgraded and there was a new wing finished so obviously I asked for this in my booking. We did not get this wing and the hotel is a little on the shabby side.",
            "title": "Home away from Home",
            "user": "kawerau"
        },
        {
            "date": "July 22, 2005",
            "detail_rating": {
                "business": null,
                "cleanliness": 3.0,
                "desk": null,
                "location": null,
                "pool": null,
                "restaurant": null,
                "rooms": 2.0,
                "service": 4.0,
                "sleep": null,
                "value": 3.0
            },
            "helpfulness": 30,
            "id": 3691711,
            "likes": {
                "disliked": null,
                "liked": null
            },
            "rating": 3.0,
            "stay_parameters": "Stayed July 2005",
            "text": "I stayed in room 404 of the Excelsior on Tuesday, July 12 and Wednesday, July 13, 2005.",
            "title": "What You Pay For",
            "user": "patsyterrell"
        },
        {
            "date": "January 1, 2008",
            "detail_rating": {
                "business": null,
                "cleanliness": null,
                "desk": null,
                "location": null,
                "pool": null,
                "restaurant": null,
                "rooms": null,
                "service": null,
                "sleep": null,
                "value": null
            },
            "helpfulness": null,
            "id": 12202834,
            "likes": {
                "disliked": null,
                "liked": null
            },
            "rating": 2.0,
            "stay_parameters": null,
            "text": "I was very disappointed in this hotel because it was concrete inside and out. I have never stayed in a room with concrete walls, and hope never to again! The staff was nice, but the hotel is on the fringe of a very bad neighborhood and we would not have felt comfortable walking. I had thought the hotel was very close to Old San Juan from their website, but it is about a $12 cab ride away.",
            "title": "Concrete Block",
            "user": "hysterian"
        },
        {
            "date": "November 25, 2007",
            "detail_rating": {
                "business": 1.0,
                "cleanliness": 2.0,
                "desk": null,
                "front_desk": 2.0,
                "location": 1.0,
                "pool": null,
                "restaurant": null,
                "rooms": 1.0,
                "service": 1.0,
                "sleep": null,
                "value": 1.0
            },
            "helpfulness": 2,
            "id": 11056438,
            "likes": {
                "disliked": null,
                "liked": null
            },
            "rating": 1.0,
            "stay_parameters": "Stayed December 2006, traveled solo",
            "text": "Thought that by picking a cheap hotel I could save a lot. Not this one. Except for a couple of staff, I've never seen rudeness so institutionalized in one place from the owner down to the support staff. The rooms are old and worn. Bathrooms are scarily decrepit with tiles chipped off. Thanks god, there is the outside and that's what I did when I was booked in this rodent's nest- stayed outside most of the time expect when it's time to sleep......and you better be really exhausted...",
            "title": "Run now while you can",
            "user": "ebbtide123"
        },
        {
            "date": "October 7, 2007",
            "detail_rating": {
                "business": 5.0,
                "cleanliness": 5.0,
                "desk": null,
                "front_desk": 5.0,
                "location": 5.0,
                "pool": null,
                "restaurant": null,
                "rooms": 5.0,
                "service": 5.0,
                "sleep": null,
                "value": 5.0
            },
            "helpfulness": 3,
            "id": 10048973,
            "likes": {
                "disliked": null,
                "liked": "\u2014 The staff and location"
            },
            "rating": 5.0,
            "stay_parameters": "Stayed September 2007, traveled with family",
            "text": "My mother and I took a mother-daughter vacation and stayed at the Miramar for a week. It was a wonderful place to stay! The hotel was beautiful and the staff, especially Ramon, Sylvia, and Jorge (and others that I can't remember their names) were very accommodating and helpful! They gave us directions, recommendations on places to eat, and wanted to hear of our adventures daily! I loved the area that it was in as I wanted to see more of authentic Puerto Rico than the Americanized version that I felt I would've gotten at the Hilton, etc. There's a pharmacy across the street with some very reasonable souvenirs. Los Pinos Cafe, also across the street, had some wonderful Mofongo. The hotel had a very nice continental breakfast and since parking is so hard to find in San Juan the private parking was a lifesaver! The sundeck has a beautiful view! Overall, I wouldn't have wanted to stay anywhere else!",
            "title": "A Great Place to Stay!!!!!",
            "user": "imagineone"
        },
        {
            "date": "September 12, 2007",
            "detail_rating": {
                "business": 4.0,
                "cleanliness": 4.0,
                "desk": null,
                "front_desk": 5.0,
                "location": 3.0,
                "pool": null,
                "restaurant": null,
                "rooms": 3.0,
                "service": 5.0,
                "sleep": null,
                "value": 5.0
            },
            "helpfulness": 3,
            "id": 8702846,
            "likes": {
                "disliked": "\u2014 no pool",
                "liked": "\u2014 ambiance"
            },
            "rating": 5.0,
            "stay_parameters": "Stayed September 2007, traveled with family",
            "text": "While this is rated a 2 star hotel, don't let this make your decision for you. This is an older, quaint hotel. The staff there are all nice, but Ramone and Sylvia make the hotel what it is.They are some of the best front desk staff I have ever run into. I hated to leave them as much as Puerto Rico!!! They want to know your plans and are always willing to suggest something. They really just bend over backwards to help you. The rooms are large and accommadating. The parking is sparse, but if you give your keys to the front desk staff they will park it for you. (Another plus) The free continental breakfast is standard fare: cereal, sweet rolls, french bread, coffee, juice and jams. They also have free internet for you to use, which is a plus in this technology addicted world: I was able to check my email.",
            "title": "Absolutely wonderful!!!!!",
            "user": "Angel5Devil95"
        },
        {
            "date": "August 1, 2007",
            "detail_rating": {
                "business": 2.0,
                "cleanliness": null,
                "desk": null,
                "front_desk": 2.0,
                "location": 2.0,
                "pool": null,
                "restaurant": null,
                "rooms": 1.0,
                "service": 1.0,
                "sleep": null,
                "value": 1.0
            },
            "helpfulness": 5,
            "id": 8272843,
            "likes": {
                "disliked": null,
                "liked": null
            },
            "rating": 1.0,
            "stay_parameters": "Stayed July 2007, traveled with family",
            "text": "Paid a very low rate, as they say you get what you pay for. The hotel manager, very rude and full of himself. We arrived at 4:00pm was given the room, took the luggage to the room, opened the door, the room was not cleaned from the prior guest, I did state we arrived at 4:00pm!!!! I returned to the front desk, the young lady was apologetic and gave us a new room, she even went up and checked the room before we lugged or luggage back up to the quest rooms. The room was ok, but the ice machine is not inside a stair well or a room on its own, it is in the hallway of the quest floor, all night you can here the ice machine dropping ice into the bottom of the machines' holding area. The first shower I took, I tried to adjust the shower head and it came off in my hand, the next morning I gave the shower head to the manager, as he gave it to his maintenance person the manager rolled his eyes and asked me was their anything else broken in the room . I replied not at this time. Later that day when we return from the beach, I tried to adjust the air conditioners fan speed, but could not because that was broken. The maid service starts at 7:00am sharp, we know because the wheels on the maid service cart squeal load enough to wake you up, if that doesn't wake you the maids talking loudly, and their buckets hitting the wall, cart, ice machine, doors, will. I could continue but you get the point. I haven't had the opportunity to go to Europe yet, but if this is a European style hotel, no thanks, I'll pass.",
            "title": "You could not pay me to stay here.",
            "user": "diver4life"
        },
        {
            "date": "May 30, 2008",
            "detail_rating": {
                "business": null,
                "cleanliness": null,
                "desk": null,
                "location": null,
                "pool": null,
                "restaurant": null,
                "rooms": null,
                "service": null,
                "sleep": null,
                "value": null
            },
            "helpfulness": 4,
            "id": 16513247,
            "likes": {
                "disliked": null,
                "liked": null
            },
            "rating": 4.0,
            "stay_parameters": null,
            "text": "Just returned from Oz with Singapore as a three day stopover at the Miramar Hotel.",
            "title": "Great Hotel for a short visit to Singapore",
            "user": "lecturemusic"
        },
        {
            "date": "May 23, 2008",
            "detail_rating": {
                "business": 3.0,
                "cleanliness": 5.0,
                "desk": null,
                "front_desk": 5.0,
                "location": 5.0,
                "pool": null,
                "restaurant": null,
                "rooms": 5.0,
                "service": 5.0,
                "sleep": null,
                "value": 5.0
            },
            "helpfulness": 5,
            "id": 16331956,
            "likes": {
                "disliked": "\u2014 nothing",
                "liked": "\u2014 comfortable beds"
            },
            "rating": 5.0,
            "stay_parameters": "Stayed March 2008, traveled with family",
            "text": "Hotel very clean and staff most attentive. Nothing too much trouble.",
            "title": "Excellent value",
            "user": "t08"
        },
        {
            "date": "May 16, 2008",
            "detail_rating": {
                "business": null,
                "cleanliness": 4.0,
                "desk": null,
                "front_desk": 4.0,
                "location": 2.0,
                "pool": null,
                "restaurant": null,
                "rooms": 3.0,
                "service": null,
                "sleep": null,
                "value": 3.0
            },
            "helpfulness": 4,
            "id": 16084280,
            "likes": {
                "disliked": "\u2014 The carpet",
                "liked": "\u2014 Cleanliness"
            },
            "rating": 3.0,
            "stay_parameters": "Stayed April 2008, traveled as a couple",
            "text": "The Room was on a high floor with excellent views of the river and every facility.",
            "title": "Ok hotel for a stopover",
            "user": "Typhoon21"
        },
        {
            "date": "May 10, 2008",
            "detail_rating": {
                "business": null,
                "cleanliness": 3.0,
                "desk": null,
                "front_desk": 4.0,
                "location": 2.0,
                "pool": null,
                "restaurant": null,
                "rooms": 3.0,
                "service": null,
                "sleep": null,
                "value": 3.0
            },
            "helpfulness": 4,
            "id": 15879812,
            "likes": {
                "disliked": "\u2014 location not ideal",
                "liked": "\u2014 good taxi service"
            },
            "rating": 3.0,
            "stay_parameters": "Stayed April 2008, traveled with family",
            "text": "The hotel is within walking distance of the main shopping plazas,Chinatown & the River. Use the Metro to visit further afield such as Little India. Great food and sights. Raffles is a bit disappointing now as it is dominated by shopping arcades. Visit Sentosa by Cable car, you could spend a day here, although lots of building going on for the new casino.",
            "title": "Reasonable hotel for stopover visit",
            "user": "Jasmine100"
        },
        {
            "date": "April 29, 2008",
            "detail_rating": {
                "business": 3.0,
                "cleanliness": 4.0,
                "desk": null,
                "front_desk": 4.0,
                "location": 3.0,
                "pool": null,
                "restaurant": null,
                "rooms": 4.0,
                "service": 5.0,
                "sleep": null,
                "value": 5.0
            },
            "helpfulness": 7,
            "id": 15462649,
            "likes": {
                "disliked": "\u2014 not a lot - room was a little small with an extra rollaway bed",
                "liked": "\u2014 helpful and polite staff"
            },
            "rating": 4.0,
            "stay_parameters": "Stayed October 2007, traveled with family",
            "text": "The shopping plazas have some good deals for afternoon tea if you want to get out of the heat.",
            "title": "Excellent All-round",
            "user": "dsl549"
        },
        {
            "date": "April 1, 2008",
            "detail_rating": {
                "business": null,
                "cleanliness": null,
                "desk": null,
                "location": null,
                "pool": null,
                "restaurant": null,
                "rooms": null,
                "service": null,
                "sleep": null,
                "value": null
            },
            "helpfulness": null,
            "id": 14722771,
            "likes": {
                "disliked": null,
                "liked": null
            },
            "rating": 3.0,
            "stay_parameters": null,
            "text": "Considering the prices of five star hotels, we decided to try this hotel for a couple of nights before going to the El San Juan Hotel & Casino. It was clean, the rooms were large, and the staff was helpful. The artwork on the walls in the rooms was actually nice, and the room included a fridge & microwave. Continental breakfast was included which came with fruit, cold cuts, cheese, cereal, coffee, rolls, etc. For two breakfasts, it was nice. They had pretty plants in the tiny lobby and a few birds and a computer in a room behind the lobby. The restaurant next door is where the breakfast was served. We also had dinner there our first night (it included a free drink) - it was pretty good.",
            "title": "Miramar Fine For Short Visit",
            "user": "iam_intrigued"
        },
        {
            "date": "March 27, 2008",
            "detail_rating": {
                "business": null,
                "cleanliness": 3.0,
                "desk": null,
                "front_desk": 1.0,
                "location": 3.0,
                "pool": null,
                "restaurant": null,
                "rooms": 2.0,
                "service": 2.0,
                "sleep": null,
                "value": 1.0
            },
            "helpfulness": null,
            "id": 14590749,
            "likes": {
                "disliked": "\u2014 hidden charges",
                "liked": "\u2014 close to a local bus station that take you to San Juan"
            },
            "rating": 2.0,
            "stay_parameters": "Stayed February 2008, traveled as a couple",
            "text": "For a lower-end priced hotel, this one was fine. The only negative was that the area wasn't close to much. We took the bus to Old San Juan, which was good, and we walked down the block through a few souvenir shops. Other than that, you're in the middle of no where. If you need to hang out in your room, it doesn't have the right feel to want to stay and relax. It just didn't feel that safe. (They locked their front door at night and had someone let you in). For a short stay, it's acceptable. The hotel itself had some charm. If you want to be in the heart of everything, though, this location leaves something to be desired.",
            "title": "Beware of hidden fees",
            "user": "gln126"
        },
        {
            "date": "February 25, 2008",
            "detail_rating": {
                "business": 3.0,
                "cleanliness": 3.0,
                "desk": null,
                "front_desk": 4.0,
                "location": 2.0,
                "pool": null,
                "restaurant": null,
                "rooms": 3.0,
                "service": 3.0,
                "sleep": null,
                "value": 3.0
            },
            "helpfulness": null,
            "id": 13834707,
            "likes": {
                "disliked": null,
                "liked": null
            },
            "rating": 3.0,
            "stay_parameters": "Stayed January 2008, traveled as a couple",
            "text": "My husband and I booked for a night after our cruise. We paid $13 from the Pan American Pier to the hotel. We arrived at 10:30 in the morning. They said that the rooms would not be available until 3 p.m. They allowed us to leave our luggages there while we explored old San Juan. There was a local bus stop located across the street on the left of the hotel. All you have to pay was $0.50/person. It took us to the main station in Old San Juan. We came back at 4:15 thinking that the room should be ready. However, they said that it wouldn't be ready in another half hour. There was not much to do around the hotel so we walked to the supermarket on the right of the hotel. We came back at 5 but the room was still not ready. The receptionist said that we have to pay an extra $3 per person and $5 per night stay. I said that I already paid all the taxes and others charges when I booked for ONE night stay. She then pointed to a sign on the top of the counter and said that the travel agency might not know about these additional charges. I looked at it and it said that the charges commenced on October 1, 2006. And now it is 2008!She insisted that we pay before we she gave us the key. I paid and I asked for a receipt and she printed one for me. The room was big but the fridge didn't work, The chair almost fell apart. The lamp was barely attached to the light fixture. There was mildew smell in the room too unless you blast up the A.C.. When we checked out the next morning, an old man asked us to pay AGAIN because he couldn't find it on the computer nor it was checked off that we paid. It was too much of a hassel to stay in this hotel. Anyway, the taxi fee to the airport was $15.",
            "title": "Our one night stay.",
            "user": "Bollan"
        },
        {
            "date": "January 16, 2008",
            "detail_rating": {
                "business": null,
                "cleanliness": 1.0,
                "desk": null,
                "front_desk": 2.0,
                "location": 1.0,
                "pool": null,
                "restaurant": null,
                "rooms": 1.0,
                "service": 4.0,
                "sleep": null,
                "value": 1.0
            },
            "helpfulness": 1,
            "id": 12682618,
            "likes": {
                "disliked": "\u2014 poor condition of the room. standard of hygeine",
                "liked": "\u2014 staff was pleasant"
            },
            "rating": 1.0,
            "stay_parameters": "Stayed December 2007, traveled solo",
            "text": "We arrived the hotel late on january 19th. An elderly man meet us, checked us in, and pointed out the elevator for us.",
            "title": "Give it a miss",
            "user": "JoeP2"
        },
        {
            "date": "January 8, 2008",
            "detail_rating": {
                "business": 4.0,
                "cleanliness": 3.0,
                "desk": null,
                "front_desk": 4.0,
                "location": 2.0,
                "pool": null,
                "restaurant": null,
                "rooms": 3.0,
                "service": 2.0,
                "sleep": null,
                "value": 3.0
            },
            "helpfulness": null,
            "id": 12430218,
            "likes": {
                "disliked": null,
                "liked": null
            },
            "rating": 3.0,
            "stay_parameters": "Stayed December 2007, traveled as a couple",
            "text": "We stayed on the 4.th floor, to the left out of the elevator, and in the last room on the left side of the hallway. A large room with two large beds, a small fridge, tv, a comfortable chair, and a bathroom. We have nothing to complain about regarding the room, and we slept well in the beds. The aircondition were a little bit noisy, but did not ruin our nights sleep. We went down a couple of floors and found the ice machine. I am glad we did not have a room there. It made a lot of noise. Also fount a soda machine there.",
            "title": "Not a hotel for long vacations",
            "user": "Oslo81"
        }
    ],
    "slim_ranking": 0.284722222222,
    "stars": 3.5,
    "tripadvisor": {
        "VISITED": false,
        "country_name": null,
        "locality": null,
        "pic_link": null,
        "street_address": null
    },
    "user_rating": 4.0,
    "variance": {
        "average": 106,
        "excellent": 82,
        "poor": 21,
        "terrible": 13,
        "very good": 230
    }
}