{
    "aka": null,
    "description": "Aquari Hotel will welcome you to a world of luxury. Downtown Saigon with its myriad of attractions such as Opera House, Notre Dame Cathedral Basilica, Reunification Palace, History Museum, Ben Thanh Market is just 10 minutes walking. Saigon, with its quiet temples and parks, live night-entertainment places, is one of the most dynamic and comfortable cities, like Aquari Hotel, strikes the right balance between business and leisure. You will enjoy the convenient location of Little Japan, which is a quiet and safe area at the centre of Ho Chi Minh City.At our core value, we proudly offer the best, most personalized service for business travellers with comprehensive business facilities available in luxurious settings. We include business essentials in every room and provide meeting rooms up to 100 pax with all audio-visual and technological needs as well as catering services for longer meetings. The 90-room Aquari Hotel is designed to deliver a restful stay for business travellers. Many rooms have views to Saigon River so you can enjoy Saigon by night with a panoramic view. The nocturne of riverbank is very romantic for honeymooners. Imagine seeing the sunrise or sunset with a glass of wine after a hard-working or travelling day. How relaxing it is! Innovative design elements are featured in all aspects of the room as well as flexible workspaces with high-speed internet access...The Spring Restaurant offers International and Asian cuisines, along with some of the finest coffee and a variety of specialty teas, wine collection, fresh juices, house cocktails, sandwiches and snacks... The Coffee Corner will introduce you to famous Vietnamese coffees and diversified Western coffees. Refresh yourself with our soothing foot massage, body massage, sauna, steam room, and manicure/ pedicure... provided by highly trained specialists. Whether you stay at the hotel for business or leisure, it's a delightful way to wind down at the end of the day, or anytime! STAY WITH US, FEEL LIKE HOME!",
    "detail_rating": {
        "cleanliness": null,
        "location": null,
        "rooms": null,
        "service": null,
        "sleep": null,
        "value": null
    },
    "location": {
        "city": null,
        "continent": "Asia",
        "country": "Vietnam",
        "proposed_city": null,
        "province": null,
        "region": null
    },
    "name": "Aquari Hotel",
    "places": {
        "aka": [],
        "hotel_description": [
            "Ho",
            "Spring"
        ],
        "hotel_name": []
    },
    "review_count": 91,
    "review_count_current": 20,
    "reviews": [
        {
            "date": "April 22, 2013",
            "detail_rating": {
                "business": null,
                "cleanliness": 5.0,
                "desk": null,
                "location": 5.0,
                "pool": null,
                "restaurant": null,
                "rooms": 4.0,
                "service": 5.0,
                "sleep": 4.0,
                "value": 4.0
            },
            "helpfulness": 1,
            "id": 158455521,
            "likes": {
                "disliked": null,
                "liked": null
            },
            "rating": 4.0,
            "stay_parameters": "Stayed April 2013, traveled with friends",
            "text": "Stayed here mid April. Stayed on 4th floor in a twin room. The room did not have a view but it was great value. The breakfast was good and the hotel was nice and clean. Free wifi in the rooms worked great.",
            "title": "Great Location",
            "user": "maryado"
        },
        {
            "date": "April 22, 2013",
            "detail_rating": {
                "business": null,
                "cleanliness": 5.0,
                "desk": null,
                "location": 5.0,
                "pool": null,
                "restaurant": null,
                "rooms": 3.0,
                "service": 4.0,
                "sleep": 5.0,
                "value": 4.0
            },
            "helpfulness": null,
            "id": 158430781,
            "likes": {
                "disliked": null,
                "liked": null
            },
            "rating": 4.0,
            "stay_parameters": "Stayed April 2013, traveled as a couple",
            "text": "The location was really good. About a 10 minute walk to Ben Thanh Market.",
            "title": "Great 3* Hotel",
            "user": "am_gill101"
        },
        {
            "date": "April 15, 2013",
            "detail_rating": {
                "business": null,
                "cleanliness": 5.0,
                "desk": null,
                "location": 5.0,
                "pool": null,
                "restaurant": null,
                "rooms": 5.0,
                "service": 5.0,
                "sleep": 5.0,
                "value": 5.0
            },
            "helpfulness": 2,
            "id": 157748605,
            "likes": {
                "disliked": null,
                "liked": null
            },
            "rating": 5.0,
            "stay_parameters": "Stayed April 2013, traveled as a couple",
            "text": "Hotel is located in District 1, within walking distance to most of tourist sites and places to eat. Room was clean, modern and spacious with great views of the river.",
            "title": "ian and wendy",
            "user": "ian h"
        },
        {
            "date": "April 13, 2013",
            "detail_rating": {
                "business": null,
                "cleanliness": null,
                "desk": null,
                "location": null,
                "pool": null,
                "restaurant": null,
                "rooms": null,
                "service": null,
                "sleep": null,
                "value": null
            },
            "helpfulness": 1,
            "id": 157580055,
            "likes": {
                "disliked": null,
                "liked": null
            },
            "rating": 5.0,
            "stay_parameters": null,
            "text": "Breakfast was a little disappointing. While they had a variety of options, they do not seem to re-fill the food (like most other hotels). We usually got down at 9am for breakfast and most of the food and juices would have finished by the time we got there.",
            "title": "Excellent, caring staff",
            "user": "Passionatehawker"
        },
        {
            "date": "April 9, 2013",
            "detail_rating": {
                "business": null,
                "cleanliness": 4.0,
                "desk": null,
                "location": 5.0,
                "pool": null,
                "restaurant": null,
                "rooms": 5.0,
                "service": 4.0,
                "sleep": 5.0,
                "value": 5.0
            },
            "helpfulness": 1,
            "id": 157159860,
            "likes": {
                "disliked": null,
                "liked": null
            },
            "rating": 4.0,
            "stay_parameters": "Stayed October 2012, traveled as a couple",
            "text": "Staff are very friendly, helpful and always smiling. Thoroughly recommended and we will definitely stay here again.",
            "title": "Great location",
            "user": "George K"
        },
        {
            "date": "April 2, 2013",
            "detail_rating": {
                "business": null,
                "cleanliness": 5.0,
                "desk": null,
                "location": 4.0,
                "pool": null,
                "restaurant": null,
                "rooms": 4.0,
                "service": 4.0,
                "sleep": 5.0,
                "value": 5.0
            },
            "helpfulness": null,
            "id": 156354458,
            "likes": {
                "disliked": null,
                "liked": null
            },
            "rating": 4.0,
            "stay_parameters": "Stayed March 2013, traveled as a couple",
            "text": "Quite new hotel with modern amenities. Property is well located and some rooms such as ours had views of the river. Close to good restaurant areas and downtown activities. Area surrounding hotel is destined for rebuilding which will eventually make this a much better location.",
            "title": "Well located",
            "user": "Adrian L"
        },
        {
            "date": "March 31, 2013",
            "detail_rating": {
                "business": null,
                "cleanliness": 5.0,
                "desk": null,
                "location": 5.0,
                "pool": null,
                "restaurant": null,
                "rooms": 5.0,
                "service": 5.0,
                "sleep": 5.0,
                "value": 5.0
            },
            "helpfulness": null,
            "id": 156206163,
            "likes": {
                "disliked": null,
                "liked": null
            },
            "rating": 5.0,
            "stay_parameters": "Stayed March 2013, traveled on business",
            "text": "The restaurant was a disappointment, with it's offerings very limited. We used the facility having arrived in city quite tired on first night, and were possibly the only customers they had for the evening.",
            "title": "Recommended - New and Clean",
            "user": "Ninnadj"
        },
        {
            "date": "March 16, 2013",
            "detail_rating": {
                "business": null,
                "cleanliness": 5.0,
                "desk": null,
                "location": 4.0,
                "pool": null,
                "restaurant": null,
                "rooms": 5.0,
                "service": 5.0,
                "sleep": 4.0,
                "value": 5.0
            },
            "helpfulness": null,
            "id": 154734356,
            "likes": {
                "disliked": null,
                "liked": null
            },
            "rating": 5.0,
            "stay_parameters": "Stayed August 2012, traveled with friends",
            "text": "All facilities were very clean throughout, and the cost represented good value in an area that is becoming more expensive.",
            "title": "TOP HOTEL",
            "user": "Tamquat"
        },
        {
            "date": "March 15, 2013",
            "detail_rating": {
                "business": null,
                "cleanliness": 4.0,
                "desk": null,
                "location": 4.0,
                "pool": null,
                "restaurant": null,
                "rooms": 4.0,
                "service": 4.0,
                "sleep": 5.0,
                "value": 4.0
            },
            "helpfulness": 2,
            "id": 154605140,
            "likes": {
                "disliked": null,
                "liked": null
            },
            "rating": 4.0,
            "stay_parameters": "Stayed December 2012, traveled with family",
            "text": "The only facilities I have experienced in this hotel are the Reception service, Room and the Dining room and was very pleased with all.",
            "title": "Nice hotel in downtown Saigon; choose your taxicab....",
            "user": "fil7_10"
        },
        {
            "date": "March 11, 2013",
            "detail_rating": {
                "business": null,
                "cleanliness": 5.0,
                "desk": null,
                "location": 5.0,
                "pool": null,
                "restaurant": null,
                "rooms": 5.0,
                "service": 4.0,
                "sleep": 5.0,
                "value": 5.0
            },
            "helpfulness": null,
            "id": 154240238,
            "likes": {
                "disliked": null,
                "liked": null
            },
            "rating": 5.0,
            "stay_parameters": "Stayed March 2013, traveled as a couple",
            "text": "The room was clean and cozy on one of the upper floors. Bathroom has a big bath tub and plenty amenities. It felt clean and sanitized.",
            "title": "Great clean and quiet room for a reasonable price close to centre",
            "user": "guapapaloma"
        },
        {
            "date": "May 14, 2013",
            "detail_rating": {
                "business": null,
                "cleanliness": 4.0,
                "desk": null,
                "location": 4.0,
                "pool": null,
                "restaurant": null,
                "rooms": 4.0,
                "service": 5.0,
                "sleep": 4.0,
                "value": 3.0
            },
            "helpfulness": null,
            "id": 160711635,
            "likes": {
                "disliked": null,
                "liked": null
            },
            "rating": 4.0,
            "stay_parameters": "Stayed April 2013, traveled solo",
            "text": "Better than I could wait for, after 10 days travelling from Hanoi.",
            "title": "A bit of surprise ))",
            "user": "TBoris"
        },
        {
            "date": "May 12, 2013",
            "detail_rating": {
                "business": null,
                "cleanliness": 3.0,
                "desk": null,
                "location": 5.0,
                "pool": null,
                "restaurant": null,
                "rooms": 3.0,
                "service": 4.0,
                "sleep": 3.0,
                "value": 4.0
            },
            "helpfulness": null,
            "id": 160446804,
            "likes": {
                "disliked": null,
                "liked": null
            },
            "rating": 4.0,
            "stay_parameters": "Stayed April 2013, traveled as a couple",
            "text": "They speak English quite weill and friendly and beakfast is ok. I don't know why, but there is spare room between bath and walls )) And the shower handle allowes an option like twisting sharp flow of water, - cool!",
            "title": "Decent hotel in a good location",
            "user": "Cat-Fan-17"
        },
        {
            "date": "May 12, 2013",
            "detail_rating": {
                "business": null,
                "cleanliness": 5.0,
                "desk": null,
                "location": 5.0,
                "pool": null,
                "restaurant": null,
                "rooms": 5.0,
                "service": 5.0,
                "sleep": 4.0,
                "value": 5.0
            },
            "helpfulness": null,
            "id": 160434494,
            "likes": {
                "disliked": null,
                "liked": null
            },
            "rating": 5.0,
            "stay_parameters": "Stayed May 2013, traveled as a couple",
            "text": "Good location,but generally speaking, the hotel is not near the market and pagoda's. I wouldn't say that it is cheap either.",
            "title": "Great location, friendly staff",
            "user": "Brian F"
        },
        {
            "date": "May 6, 2013",
            "detail_rating": {
                "business": null,
                "cleanliness": 4.0,
                "desk": null,
                "location": 4.0,
                "pool": null,
                "restaurant": null,
                "rooms": 4.0,
                "service": 3.0,
                "sleep": 2.0,
                "value": 3.0
            },
            "helpfulness": 1,
            "id": 159782658,
            "likes": {
                "disliked": null,
                "liked": null
            },
            "rating": 3.0,
            "stay_parameters": "Stayed April 2013, traveled on business",
            "text": "O, they blocked money on my card in advance! And gave is back after a month (( So be careful and take it into consideration! But I sutisfied with staying in it as a result! Not the worst, really not!",
            "title": "Not as good as before but still good",
            "user": "Davies B"
        },
        {
            "date": "April 30, 2013",
            "detail_rating": {
                "business": null,
                "cleanliness": 3.0,
                "desk": null,
                "location": 3.0,
                "pool": null,
                "restaurant": null,
                "rooms": 3.0,
                "service": 4.0,
                "sleep": 5.0,
                "value": 3.0
            },
            "helpfulness": 1,
            "id": 159222141,
            "likes": {
                "disliked": null,
                "liked": null
            },
            "rating": 3.0,
            "stay_parameters": "Stayed April 2013, traveled as a couple",
            "text": "This is a satisfactory hotel. The room is clean, has a reasonable view and decent facilities. In Australia this would be a 2 star hotel but ticks all the boxes for a Ho Chi Minh stop over. Close to attractions and great restaurants. Breakfast is a bit ordinary compared to other Vietnam breakfasts and don't bother with the coffee.",
            "title": "1 Night stay was ok",
            "user": "SarahJReviews"
        },
        {
            "date": "June 21, 2013",
            "detail_rating": {
                "business": null,
                "cleanliness": 5.0,
                "desk": null,
                "location": 5.0,
                "pool": null,
                "restaurant": null,
                "rooms": 5.0,
                "service": 4.0,
                "sleep": 5.0,
                "value": 3.0
            },
            "helpfulness": 1,
            "id": 164714203,
            "likes": {
                "disliked": null,
                "liked": null
            },
            "rating": 4.0,
            "stay_parameters": "Stayed June 2013, traveled solo",
            "text": "Overall stars - 4 of 5",
            "title": "Very good business hotel close to center yet quiet",
            "user": "LorenzSingapore"
        },
        {
            "date": "May 31, 2013",
            "detail_rating": {
                "business": null,
                "cleanliness": 4.0,
                "desk": null,
                "location": 4.0,
                "pool": null,
                "restaurant": null,
                "rooms": 4.0,
                "service": 4.0,
                "sleep": 5.0,
                "value": 4.0
            },
            "helpfulness": 1,
            "id": 162489906,
            "likes": {
                "disliked": null,
                "liked": null
            },
            "rating": 4.0,
            "stay_parameters": "Stayed May 2013, traveled as a couple",
            "text": "(3 minutes walking distance to Dong Khoi and Hai Ba Trung, Quiet. Presentable business hotel)",
            "title": "Great Hotel",
            "user": "maatte47"
        },
        {
            "date": "May 26, 2013",
            "detail_rating": {
                "business": null,
                "cleanliness": 5.0,
                "desk": null,
                "location": 5.0,
                "pool": null,
                "restaurant": null,
                "rooms": 5.0,
                "service": 5.0,
                "sleep": 5.0,
                "value": 5.0
            },
            "helpfulness": 1,
            "id": 161891540,
            "likes": {
                "disliked": null,
                "liked": null
            },
            "rating": 5.0,
            "stay_parameters": "Stayed May 2013, traveled as a couple",
            "text": "Hotel staff - 4 of 5",
            "title": "Great hotel in ho chi min",
            "user": "Btu7757"
        },
        {
            "date": "May 25, 2013",
            "detail_rating": {
                "business": null,
                "cleanliness": 1.0,
                "desk": null,
                "location": 1.0,
                "pool": null,
                "restaurant": null,
                "rooms": 4.0,
                "service": 2.0,
                "sleep": 4.0,
                "value": 2.0
            },
            "helpfulness": null,
            "id": 161829250,
            "likes": {
                "disliked": null,
                "liked": null
            },
            "rating": 3.0,
            "stay_parameters": "Stayed May 2013, traveled as a couple",
            "text": "Restaurant staff - 4 of 5",
            "title": "Won't stay there again",
            "user": "astridpoole"
        },
        {
            "date": "May 18, 2013",
            "detail_rating": {
                "business": null,
                "cleanliness": null,
                "desk": null,
                "location": null,
                "pool": null,
                "restaurant": null,
                "rooms": null,
                "service": null,
                "sleep": null,
                "value": null
            },
            "helpfulness": 4,
            "id": 161047909,
            "likes": {
                "disliked": null,
                "liked": null
            },
            "rating": 2.0,
            "stay_parameters": null,
            "text": "Room service staff - did not use",
            "title": "The most unprofessional hotel management ever",
            "user": "6Hartington"
        }
    ],
    "slim_ranking": 0.121661721068,
    "stars": 3.5,
    "tripadvisor": {
        "VISITED": false,
        "country_name": null,
        "locality": null,
        "pic_link": null,
        "street_address": null
    },
    "user_rating": 4.5,
    "variance": {
        "average": 10,
        "excellent": 37,
        "poor": 2,
        "terrible": 0,
        "very good": 42
    }
}