{
    "aka": "Cypress In Hotel Buenos Aires",
    "description": "Cypress In B&B, 13 suites, sobriety & nature with style in Soho, Buenos Aires.",
    "detail_rating": {
        "cleanliness": null,
        "location": null,
        "rooms": null,
        "service": null,
        "sleep": null,
        "value": null
    },
    "location": {
        "city": "Buenos Aires",
        "continent": "South America",
        "country": "Argentina",
        "proposed_city": "Cypress",
        "province": null,
        "region": null
    },
    "name": "Cypress In",
    "places": {
        "aka": [
            "Cypress"
        ],
        "hotel_description": [
            "Cypress"
        ],
        "hotel_name": [
            "Cypress"
        ]
    },
    "review_count": 49,
    "review_count_current": 4,
    "reviews": [
        {
            "date": "January 11, 2007",
            "detail_rating": {
                "business": null,
                "cleanliness": 3.0,
                "desk": null,
                "front_desk": 3.0,
                "location": 4.0,
                "pool": null,
                "restaurant": null,
                "rooms": 2.0,
                "service": 2.0,
                "sleep": null,
                "value": 3.0
            },
            "helpfulness": 3,
            "id": 6575238,
            "likes": {
                "disliked": "\u2014 Loud clubs played music all night, A/C only worked in 1 room, Shared bathroom",
                "liked": "\u2014 Location was convenient"
            },
            "rating": 2.0,
            "stay_parameters": "Stayed January 2007",
            "text": "I was forced to stay here when my original B&B lost my reservation. This hotel is more of a hostel but charges rates like a hotel. The rooms we had were on the third floor and the stairs were small and hard to navigate with our luggage. The rooms were basic and bare with no views out the window and A/C only worked in one room that we had. The rooms had 2 twin beds and space for our luggage and that was about it. The 2 showers and bathroom were shared (not adjoining the room) by everyone on the floor. The hotel is in a great location for nightlife, restaurants and especially shopping BUT it is right next to a club which BLASTS music until 6am. So members of our party couldn't sleep. I would not stay here again and was happy I only had to stay for one night.",
            "title": "More of Hostel than hotel near Palermo Soho",
            "user": "lolomojo"
        },
        {
            "date": "January 11, 2007",
            "detail_rating": {
                "business": null,
                "cleanliness": null,
                "desk": null,
                "location": null,
                "pool": null,
                "restaurant": null,
                "rooms": null,
                "service": null,
                "sleep": null,
                "value": 4.0
            },
            "helpfulness": 1,
            "id": 6574580,
            "likes": {
                "disliked": null,
                "liked": null
            },
            "rating": 4.0,
            "stay_parameters": "Stayed January 2007",
            "text": "I agree with the other reviews. The Japanese inspired decor is a bit random and the staff is young and a bit scattered. However I will take random pictures on the wall given the other attributes of the property.",
            "title": "Decent for the price",
            "user": "srfinger"
        },
        {
            "date": "December 7, 2006",
            "detail_rating": {
                "business": 3.0,
                "cleanliness": 5.0,
                "desk": null,
                "front_desk": 2.0,
                "location": 4.0,
                "pool": null,
                "restaurant": null,
                "rooms": 3.0,
                "service": 2.0,
                "sleep": null,
                "value": 2.0
            },
            "helpfulness": 1,
            "id": 6344463,
            "likes": {
                "disliked": null,
                "liked": null
            },
            "rating": 2.0,
            "stay_parameters": "Stayed November 2006, traveled as a couple",
            "text": "However the entire place is clean, the furnishings are new, fresh paint, cold AC, and the staff manages to do a reasonable job. Most rooms (maybe all) have shared baths, but they were impeccably clean with new marble countertops and large showers. We had a bad experience at another B&B in the same price range in Palermo, so I do not think these things should be ovelooked.",
            "title": "Not impressed",
            "user": "darhma"
        },
        {
            "date": "October 22, 2006",
            "detail_rating": {
                "business": 3.0,
                "cleanliness": 3.0,
                "desk": null,
                "front_desk": 2.0,
                "location": 4.0,
                "pool": null,
                "restaurant": null,
                "rooms": 2.0,
                "service": 2.0,
                "sleep": null,
                "value": null
            },
            "helpfulness": 2,
            "id": 5985066,
            "likes": {
                "disliked": null,
                "liked": null
            },
            "rating": 2.0,
            "stay_parameters": "Stayed September 2006, traveled as a couple",
            "text": "Plus it is in a GREAT location in the heart of Palermo Soho.",
            "title": "It's okay",
            "user": "cyw4"
        }
    ],
    "slim_ranking": 0.497872340426,
    "stars": 3,
    "tripadvisor": {
        "VISITED": false,
        "country_name": null,
        "locality": null,
        "pic_link": null,
        "street_address": null
    },
    "user_rating": 3.5,
    "variance": {
        "average": 13,
        "excellent": 9,
        "poor": 6,
        "terrible": 4,
        "very good": 17
    }
}