{
    "aka": "Premier Inn Bournemouth Central Hotel",
    "description": "This magnificent art deco hotel is a stone's throw away from the sea front. Local to major transport links (road, rail, bus and air). Walking distance to: 7 miles of award-winning beaches, Bournemouth town centre, Pavilion, Pier, B.I.C, Gardens and great night life.Our Bournemouth Central Premier Inn has everything you'd expect, incredibly comfy beds in every room and an integrated restaurant serving a mix of traditional and contemporary dishes.",
    "detail_rating": {
        "cleanliness": 4.5,
        "location": 5.0,
        "rooms": 4.5,
        "service": 4.5,
        "sleep": 4.5,
        "value": 4.5
    },
    "location": {
        "city": null,
        "continent": "Europe",
        "country": "United Kingdom (UK)",
        "proposed_city": null,
        "province": null,
        "region": null
    },
    "name": "Premier Inn Bournemouth Central",
    "places": {
        "aka": [
            "Bournemouth",
            "Central"
        ],
        "hotel_description": [
            "Bournemouth",
            "Central"
        ],
        "hotel_name": [
            "Bournemouth",
            "Central"
        ]
    },
    "review_count": 980,
    "review_count_current": 20,
    "reviews": [
        {
            "date": "September 6, 2010",
            "detail_rating": {
                "business": null,
                "cleanliness": 5.0,
                "desk": null,
                "location": 5.0,
                "pool": null,
                "restaurant": null,
                "rooms": 5.0,
                "service": 5.0,
                "sleep": 5.0,
                "value": 5.0
            },
            "helpfulness": null,
            "id": 78467868,
            "likes": {
                "disliked": null,
                "liked": null
            },
            "rating": 5.0,
            "stay_parameters": "Stayed August 2010, traveled on business",
            "text": "Worked and stayed in many hotels in bournemouth over 25 years...this was our third stay at Premiere Inn central, in comparison to many hotels it offers an excellent stay, BRILL!",
            "title": "Gets better every year",
            "user": "joanne8693"
        },
        {
            "date": "September 1, 2010",
            "detail_rating": {
                "business": null,
                "cleanliness": null,
                "desk": null,
                "location": null,
                "pool": null,
                "restaurant": null,
                "rooms": null,
                "service": null,
                "sleep": null,
                "value": null
            },
            "helpfulness": null,
            "id": 77779476,
            "likes": {
                "disliked": null,
                "liked": null
            },
            "rating": 5.0,
            "stay_parameters": null,
            "text": "Stayed here for one night - had a fantastic room with balcony and sea views. Staff were very helpful and friendly. Location of hotel was great - in the centre of the town just a 5 minute walk to the beach and across the road from a lovely park.",
            "title": "Excellent - fantastic location, great value!!",
            "user": "Beckmeghan"
        },
        {
            "date": "August 31, 2010",
            "detail_rating": {
                "business": null,
                "cleanliness": 4.0,
                "desk": null,
                "location": 5.0,
                "pool": null,
                "restaurant": null,
                "rooms": 4.0,
                "service": 5.0,
                "sleep": 5.0,
                "value": 5.0
            },
            "helpfulness": null,
            "id": 77655032,
            "likes": {
                "disliked": null,
                "liked": null
            },
            "rating": 4.0,
            "stay_parameters": "Stayed August 2010, traveled with family",
            "text": "Hotel was spotless. Breakfast was lovely - help yourself buffet - with veggie sausages available on request (which you don't normally get at large hotels!).",
            "title": "Excellent Stay",
            "user": "Bluesprings12"
        },
        {
            "date": "August 30, 2010",
            "detail_rating": {
                "business": null,
                "cleanliness": 5.0,
                "desk": null,
                "location": 5.0,
                "pool": null,
                "restaurant": null,
                "rooms": 5.0,
                "service": 5.0,
                "sleep": 5.0,
                "value": 5.0
            },
            "helpfulness": null,
            "id": 77463155,
            "likes": {
                "disliked": null,
                "liked": null
            },
            "rating": 5.0,
            "stay_parameters": "Stayed August 2010, traveled with family",
            "text": "Really quiet at night and if not you get your money back!! Had previously stayed at similar hotel where we were on 1st floor with wedding party/disco going on directly underneath us - all staff would say was \"sorry\"!",
            "title": "Excellent.",
            "user": "TIMMSBanbury"
        },
        {
            "date": "August 27, 2010",
            "detail_rating": {
                "business": null,
                "cleanliness": 4.0,
                "desk": null,
                "location": 4.0,
                "pool": null,
                "restaurant": null,
                "rooms": 4.0,
                "service": 4.0,
                "sleep": 4.0,
                "value": 4.0
            },
            "helpfulness": null,
            "id": 77105511,
            "likes": {
                "disliked": null,
                "liked": null
            },
            "rating": 4.0,
            "stay_parameters": "Stayed August 2010, traveled as a couple",
            "text": "Would definately stay here again.",
            "title": "Endorsement of previous reviewers experiences",
            "user": "Aliricht"
        },
        {
            "date": "August 20, 2010",
            "detail_rating": {
                "business": null,
                "cleanliness": 5.0,
                "desk": null,
                "location": 5.0,
                "pool": null,
                "restaurant": null,
                "rooms": 5.0,
                "service": 5.0,
                "sleep": 1.0,
                "value": 5.0
            },
            "helpfulness": null,
            "id": 76013968,
            "likes": {
                "disliked": null,
                "liked": null
            },
            "rating": 2.0,
            "stay_parameters": "Stayed August 2010, traveled with family",
            "text": "We went to this hotel because it was recommended by this website. It is in a great location and we parked behind the hotel in the carpark which has access to the hotel inside of the carpark. The staff were extremely polite and helpfull. Our room was huge and clean and the bathroom was big, well lit and clean. The decor of the hotel is very nice. Premier Inn have excelled with this hotel, we would recommend it to anyone and will be going back there very soon, it was so nice to just walk to the beach without getting the car and finding a parking space etc. It was all on the doorstep.",
            "title": "Great Hotel",
            "user": "Flower1999"
        },
        {
            "date": "August 15, 2010",
            "detail_rating": {
                "business": null,
                "cleanliness": 5.0,
                "desk": null,
                "location": 5.0,
                "pool": null,
                "restaurant": null,
                "rooms": 5.0,
                "service": 5.0,
                "sleep": 4.0,
                "value": 4.0
            },
            "helpfulness": null,
            "id": 75338965,
            "likes": {
                "disliked": null,
                "liked": null
            },
            "rating": 5.0,
            "stay_parameters": "Stayed August 2010, traveled with friends",
            "text": "My only complaint would be the length of time we had to wait for our food in the restaurant. However when it came it was delicious. Lucky we didn't have a theatre reservation or we would not have made it!! Plus the children were getting fidgety!! 2 hours in a restaurant, not good!!",
            "title": "Efficiency at its best..........",
            "user": "Burchells10"
        },
        {
            "date": "August 1, 2010",
            "detail_rating": {
                "business": null,
                "cleanliness": 5.0,
                "desk": null,
                "location": 5.0,
                "pool": null,
                "restaurant": null,
                "rooms": 5.0,
                "service": 5.0,
                "sleep": 5.0,
                "value": 5.0
            },
            "helpfulness": null,
            "id": 73221937,
            "likes": {
                "disliked": null,
                "liked": null
            },
            "rating": 5.0,
            "stay_parameters": "Stayed July 2010, traveled with family",
            "text": "All in all a brilliant hotel and a pleasant stay.",
            "title": "Exceeded expectations",
            "user": "Essingeviken"
        },
        {
            "date": "July 31, 2010",
            "detail_rating": {
                "business": null,
                "cleanliness": 5.0,
                "desk": null,
                "location": 5.0,
                "pool": null,
                "restaurant": null,
                "rooms": 5.0,
                "service": 5.0,
                "sleep": 5.0,
                "value": 5.0
            },
            "helpfulness": null,
            "id": 73143849,
            "likes": {
                "disliked": null,
                "liked": null
            },
            "rating": 5.0,
            "stay_parameters": "Stayed July 2010, traveled with family",
            "text": "Thank you Premier Inn Central, Bournemouth for looking after us so well this weekend. A special thank you to the lovely Chloe in the restaurant, she's an absolute asset to your hotel (I hope she does actually go home and have a sleep, she seems to be there all the time!). Lovely clean, quiet room, exceptionally friendly service from staff and sooooo efficient. I asked for more pillows, they were there in seconds, I asked whether we could change our daughter's put-me-up bed (a bit lumpy) and it was sorted within 5 minutes - brilliant.",
            "title": "What a fantastic holiday!",
            "user": "MummyC"
        },
        {
            "date": "July 29, 2010",
            "detail_rating": {
                "business": null,
                "cleanliness": 3.0,
                "desk": null,
                "location": 4.0,
                "pool": null,
                "restaurant": null,
                "rooms": 4.0,
                "service": 4.0,
                "sleep": 4.0,
                "value": 5.0
            },
            "helpfulness": null,
            "id": 72882827,
            "likes": {
                "disliked": null,
                "liked": null
            },
            "rating": 4.0,
            "stay_parameters": "Stayed July 2010, traveled as a couple",
            "text": "A fantastic location, couldn't be better. I guess my slight moan is the restaurant food takes ages to come. We booked evening supper on Thursday for 7.15 p.m. and left at 10 p.m. which usually is fine, but we have small children, so they were getting rather restless. The restaurant food is ok, nothing to write home about, the brushetta with prawns I suggest you take off the menu, it's rubbish and the surf and turf my husband said was tasteless! Apart from the restaurant evening meals being average, the place is brilliant.",
            "title": "Great budget hotel",
            "user": "mowjoy"
        },
        {
            "date": "August 26, 2010",
            "detail_rating": {
                "business": null,
                "cleanliness": 5.0,
                "desk": null,
                "location": 5.0,
                "pool": null,
                "restaurant": null,
                "rooms": 4.0,
                "service": 4.0,
                "sleep": 4.0,
                "value": 4.0
            },
            "helpfulness": null,
            "id": 76963423,
            "likes": {
                "disliked": null,
                "liked": null
            },
            "rating": 4.0,
            "stay_parameters": "Stayed August 2010, traveled as a couple",
            "text": "This was my first stay in a Premier Inn. They were extremely helpful and polite, the service included a text the day before to ensure we had the correct directions. The hotel is minutes from the beach and overlooks the gardens. The public areas are clean and well kept, as are the rooms. If you want a quiet room ask for the 'short' wing which only has two rooms. We did this but forfeited the chance of a room with a view. The room was quite small but well presented ( although the TV was on the side wall- giving me a crick in the neck)The Manhattan bar in the lobby was closed throughout our stay, with no explanation but this is not a problem as there plently of bars and restaurants in the area. The attached carpark has very small bays and two way traffic, so be aware that this may be an issue. best to leave your car there and use buses and taxis as the hotel advises. Overall a very pleasant experience for a reasonable high season cost.",
            "title": "excellent location",
            "user": "minibreaker1"
        },
        {
            "date": "August 22, 2010",
            "detail_rating": {
                "business": null,
                "cleanliness": 5.0,
                "desk": null,
                "location": 5.0,
                "pool": null,
                "restaurant": null,
                "rooms": 5.0,
                "service": 5.0,
                "sleep": 5.0,
                "value": 5.0
            },
            "helpfulness": null,
            "id": 76357101,
            "likes": {
                "disliked": null,
                "liked": null
            },
            "rating": 5.0,
            "stay_parameters": "Stayed August 2010, traveled as a couple",
            "text": "We have just spent a long weekend here for the Air Festival and have already booked for next year at this same hotel. We could not fault any part of our stay here, staff were friendly and very very helpful, our room was clean and very comfortable, everything worked. We had only booked breakfasts which were tasty, plentiful and very well cooked. Location for all the events, cinemas, bars and BIC was very convenient. I would definately recommend this hotel for value and satisfaction. I only wish you could book a balcony room ...to watch the air display when it rains!!! but it's first come first serve.",
            "title": "This hotel was first class and would recommend a stay here",
            "user": "birddiver"
        },
        {
            "date": "August 22, 2010",
            "detail_rating": {
                "business": null,
                "cleanliness": 5.0,
                "desk": null,
                "location": 5.0,
                "pool": null,
                "restaurant": null,
                "rooms": 5.0,
                "service": 5.0,
                "sleep": 5.0,
                "value": 5.0
            },
            "helpfulness": null,
            "id": 76301464,
            "likes": {
                "disliked": null,
                "liked": null
            },
            "rating": 5.0,
            "stay_parameters": "Stayed August 2009, traveled on business",
            "text": "Stayed here for one night for a business trip and was very impressed.",
            "title": "Excellent Hotel",
            "user": "Julesbusiness"
        },
        {
            "date": "August 22, 2010",
            "detail_rating": {
                "business": null,
                "cleanliness": 5.0,
                "desk": null,
                "location": 5.0,
                "pool": null,
                "restaurant": null,
                "rooms": 5.0,
                "service": 5.0,
                "sleep": 5.0,
                "value": 5.0
            },
            "helpfulness": null,
            "id": 76295165,
            "likes": {
                "disliked": null,
                "liked": null
            },
            "rating": 5.0,
            "stay_parameters": "Stayed August 2010, traveled with family",
            "text": "Premier Inns are usually modern purpose built buildings just on the outskirts of somewhere or other but this one is quite different. It\u2019s clearly a conversion from whatever it was before and has a nice art d\u00e9cor feel about it. Reception was very friendly and efficient and the lifts up to the rooms were plentiful and quick too.",
            "title": "as good as some five star hotels",
            "user": "noah55"
        },
        {
            "date": "August 20, 2010",
            "detail_rating": {
                "business": null,
                "cleanliness": 5.0,
                "desk": null,
                "location": 4.0,
                "pool": null,
                "restaurant": null,
                "rooms": 5.0,
                "service": 5.0,
                "sleep": 5.0,
                "value": 4.0
            },
            "helpfulness": null,
            "id": 76061924,
            "likes": {
                "disliked": null,
                "liked": null
            },
            "rating": 5.0,
            "stay_parameters": "Stayed August 2010, traveled with family",
            "text": "The room itself was very modern decorated in muted tones, flat screen TV, comfortable bed, tea & coffee facilities and a very nice bathroom.",
            "title": "Fantastic!",
            "user": "chezzabam"
        },
        {
            "date": "September 29, 2010",
            "detail_rating": {
                "business": null,
                "cleanliness": 5.0,
                "desk": null,
                "location": 5.0,
                "pool": null,
                "restaurant": null,
                "rooms": 5.0,
                "service": 5.0,
                "sleep": 5.0,
                "value": 5.0
            },
            "helpfulness": null,
            "id": 81483804,
            "likes": {
                "disliked": null,
                "liked": null
            },
            "rating": 5.0,
            "stay_parameters": "Stayed September 2010, traveled as a couple",
            "text": "My husband booked the hotel for my birthday weekend and what a surprise it was! He had asked for a sea view room when booking and we were given a fantastic family size accommodation with a huge balcony. The view was fabulous and we were directly opposite the pavilion! The rooms were spotlessly clean and the service was great as the staff were very friendly and helpful. The location is great and the shopping centre is only a five minute walk away. We will definitely be returning and I hope it's soon!",
            "title": "Perfect hotel with fantastic views!",
            "user": "SitaTorquay"
        },
        {
            "date": "September 22, 2010",
            "detail_rating": {
                "business": null,
                "cleanliness": 4.0,
                "desk": null,
                "location": 5.0,
                "pool": null,
                "restaurant": null,
                "rooms": 5.0,
                "service": 5.0,
                "sleep": 5.0,
                "value": 5.0
            },
            "helpfulness": null,
            "id": 80637712,
            "likes": {
                "disliked": null,
                "liked": null
            },
            "rating": 5.0,
            "stay_parameters": "Stayed September 2010, traveled with family",
            "text": "We went to the Premier inn having stayed there a few times",
            "title": "Perfect",
            "user": "martynbristol w"
        },
        {
            "date": "September 20, 2010",
            "detail_rating": {
                "business": null,
                "cleanliness": 5.0,
                "desk": null,
                "location": 5.0,
                "pool": null,
                "restaurant": null,
                "rooms": 5.0,
                "service": 3.0,
                "sleep": 4.0,
                "value": 4.0
            },
            "helpfulness": null,
            "id": 80354439,
            "likes": {
                "disliked": null,
                "liked": null
            },
            "rating": 4.0,
            "stay_parameters": "Stayed July 2010, traveled with friends",
            "text": "We had a family room (2 seperate bedrooms) and were on the 8th floor on the corner overlooking the sea and the gardens.It was the best room we have ever stayed in for views and size.It also had a huge balcony but unfortunatley we couldnt access it as the doors were locked as no partitions have been put in place on the balcony",
            "title": "Premier Inn At Its Best, Shame About The Reception team!",
            "user": "MissShoppaholic"
        },
        {
            "date": "September 18, 2010",
            "detail_rating": {
                "business": null,
                "cleanliness": 4.0,
                "desk": null,
                "location": 4.0,
                "pool": null,
                "restaurant": null,
                "rooms": 3.0,
                "service": 3.0,
                "sleep": 3.0,
                "value": 3.0
            },
            "helpfulness": null,
            "id": 80068514,
            "likes": {
                "disliked": null,
                "liked": null
            },
            "rating": 3.0,
            "stay_parameters": "Stayed September 2010, traveled with family",
            "text": "The breakfast was superb and the staff excellent",
            "title": "No sophistication, simple and I will stay again........",
            "user": "KG3"
        },
        {
            "date": "September 11, 2010",
            "detail_rating": {
                "business": null,
                "cleanliness": 5.0,
                "desk": null,
                "location": 5.0,
                "pool": null,
                "restaurant": null,
                "rooms": 4.0,
                "service": 4.0,
                "sleep": 5.0,
                "value": 5.0
            },
            "helpfulness": null,
            "id": 79120193,
            "likes": {
                "disliked": null,
                "liked": null
            },
            "rating": 5.0,
            "stay_parameters": "Stayed August 2010, traveled with family",
            "text": "There was only one small problem and that is a nasty smell as you enter the reception and it was also there when we went last time",
            "title": "Very good value - hard to fault.",
            "user": "RochdaleMasher"
        }
    ],
    "slim_ranking": 0.0281690140845,
    "stars": null,
    "tripadvisor": {
        "VISITED": false,
        "country_name": null,
        "locality": null,
        "pic_link": null,
        "street_address": null
    },
    "user_rating": 4.5,
    "variance": {
        "average": 51,
        "excellent": 624,
        "poor": 22,
        "terrible": 15,
        "very good": 268
    }
}