{
    "aka": "Accor Grand Hotel Doha",
    "description": "On the Persian Gulf and in the heart of the city, the hotel is located in the business district near the traditional Arab souk and the National Museum. 172 rooms and 3 suites. Non smoking floor. International cuisine at La Brasserie, Mediterranean cuisine at La Villa. The Old Manor Steakhouse and Bar. 3 meeting rooms for up to 200 people. Exhibition centre and golf course nearby. Airport shuttle (fees apply). Leisure facilities includes Swimming Pool and Fitness centre.",
    "detail_rating": {
        "cleanliness": null,
        "location": null,
        "rooms": null,
        "service": null,
        "sleep": null,
        "value": null
    },
    "location": {
        "city": null,
        "continent": "Middle East",
        "country": "Qatar",
        "proposed_city": "Doha",
        "province": null,
        "region": null
    },
    "name": "Mercure Grand Hotel Doha",
    "places": {
        "aka": [
            "Doha"
        ],
        "hotel_description": [
            "Bar"
        ],
        "hotel_name": [
            "Doha"
        ]
    },
    "review_count": 200,
    "review_count_current": 13,
    "reviews": [
        {
            "date": "January 25, 2008",
            "detail_rating": {
                "business": null,
                "cleanliness": 3.0,
                "desk": null,
                "front_desk": 3.0,
                "location": 5.0,
                "pool": null,
                "restaurant": null,
                "rooms": 3.0,
                "service": 2.0,
                "sleep": null,
                "value": 3.0
            },
            "helpfulness": 1,
            "id": 12998270,
            "likes": {
                "disliked": "\u2014 tired",
                "liked": "\u2014 location"
            },
            "rating": 3.0,
            "stay_parameters": "Stayed December 2007, traveled as a couple",
            "text": "the rooms were fine a bit dated though shower had bad pressure .for the price though it was fine.the location was great close to shops etc but not the new area which was fine as that is just like a new city any where in the world.my only big complaint was we booked an executive room but the exec lounge was closed and were basically told to bad.as we paid extra for the lounge we were unimpressed after several talks with the manager they finally decided to refund the difference in price we paid but it was a strugle to get it!would stay there again but make sure you get what you paid for!",
            "title": "good and bad points",
            "user": "wilhelmina"
        },
        {
            "date": "October 9, 2007",
            "detail_rating": {
                "business": 3.0,
                "cleanliness": 5.0,
                "desk": null,
                "front_desk": 4.0,
                "location": 5.0,
                "pool": null,
                "restaurant": null,
                "rooms": 5.0,
                "service": 4.0,
                "sleep": null,
                "value": 4.0
            },
            "helpfulness": 11,
            "id": 10061315,
            "likes": {
                "disliked": null,
                "liked": null
            },
            "rating": 4.0,
            "stay_parameters": "Stayed March 2006",
            "text": "The hotel is a good 4 star choice in central Doha, within walking distance of the main sights & shopping. The hotel operates a shuttle bus to/from the airport at a small charge.",
            "title": "Good 4 star hotel in central Doha",
            "user": "Cyprusguy"
        },
        {
            "date": "August 19, 2007",
            "detail_rating": {
                "business": null,
                "cleanliness": null,
                "desk": null,
                "location": null,
                "pool": null,
                "restaurant": null,
                "rooms": null,
                "service": null,
                "sleep": null,
                "value": null
            },
            "helpfulness": 7,
            "id": 8452091,
            "likes": {
                "disliked": null,
                "liked": null
            },
            "rating": 2.0,
            "stay_parameters": null,
            "text": "The buffet restaurant food was good, the room spacious, clean and quiet, with good views.",
            "title": "over rated",
            "user": "jpdoha"
        },
        {
            "date": "April 16, 2007",
            "detail_rating": {
                "business": 3.0,
                "cleanliness": 3.0,
                "desk": null,
                "front_desk": 3.0,
                "location": 4.0,
                "pool": null,
                "restaurant": null,
                "rooms": 3.0,
                "service": 4.0,
                "sleep": null,
                "value": 4.0
            },
            "helpfulness": 28,
            "id": 7366973,
            "likes": {
                "disliked": "\u2014 Noisy rooms on lower floors",
                "liked": "\u2014 Location"
            },
            "rating": 4.0,
            "stay_parameters": "Stayed March 2007, traveled on business",
            "text": "This hotel tries to earn money and have a high rate of occupation - there are more and more transit passengers out of the bush from all over the world having no idea what civilisation is - maintenance od the hotel building is poor",
            "title": "Great Value Rooftop Restaurant",
            "user": "mrken22"
        },
        {
            "date": "March 25, 2007",
            "detail_rating": {
                "business": null,
                "cleanliness": 4.0,
                "desk": null,
                "front_desk": 3.0,
                "location": 4.0,
                "pool": null,
                "restaurant": null,
                "rooms": 3.0,
                "service": 4.0,
                "sleep": null,
                "value": 4.0
            },
            "helpfulness": 14,
            "id": 7217350,
            "likes": {
                "disliked": null,
                "liked": null
            },
            "rating": 3.0,
            "stay_parameters": "Stayed March 2007, traveled on business",
            "text": "La Villa, the restaurant on the top floor offer good views of the city and a very interesting menu. It is great value for money compared to some of the big prices charged at other Doha hotels.",
            "title": "Good Place to Stay",
            "user": "EZT"
        },
        {
            "date": "July 18, 2008",
            "detail_rating": {
                "business": null,
                "cleanliness": 4.0,
                "desk": null,
                "front_desk": 5.0,
                "location": 5.0,
                "pool": null,
                "restaurant": null,
                "rooms": 3.0,
                "service": 4.0,
                "sleep": null,
                "value": 4.0
            },
            "helpfulness": 1,
            "id": 18009094,
            "likes": {
                "disliked": null,
                "liked": "\u2014 Location"
            },
            "rating": 3.0,
            "stay_parameters": "Stayed July 2008, traveled as a couple",
            "text": "We stayed at the mercure for three nights in July. I really have no complaints about the hotel. The beds were comfortable, the room clean, the air con was working and there was plenty of hot water.",
            "title": "A good enough hotel",
            "user": "BillParis"
        },
        {
            "date": "July 5, 2008",
            "detail_rating": {
                "business": 3.0,
                "cleanliness": 1.0,
                "desk": null,
                "front_desk": 4.0,
                "location": 2.0,
                "pool": null,
                "restaurant": null,
                "rooms": 1.0,
                "service": 2.0,
                "sleep": null,
                "value": 1.0
            },
            "helpfulness": null,
            "id": 17549299,
            "likes": {
                "disliked": null,
                "liked": "\u2014 Reception and reservation staff"
            },
            "rating": 1.0,
            "stay_parameters": "Stayed July 2008, traveled on business",
            "text": "True, the hotel has seen better days. The bathrooms are old fashioned (you have to climb into the bathtub to use the shower), the toilet paper is cheap and the two roll allowance is only just sufficient!",
            "title": "Stay some where else",
            "user": "Khurram-Dubai"
        },
        {
            "date": "July 4, 2008",
            "detail_rating": {
                "business": 3.0,
                "cleanliness": 3.0,
                "desk": null,
                "front_desk": 4.0,
                "location": 4.0,
                "pool": null,
                "restaurant": null,
                "rooms": 3.0,
                "service": 3.0,
                "sleep": null,
                "value": 3.0
            },
            "helpfulness": 2,
            "id": 17528057,
            "likes": {
                "disliked": null,
                "liked": "\u2014 location"
            },
            "rating": 3.0,
            "stay_parameters": "Stayed May 2008, traveled on business",
            "text": "However, the location is ideal being very close to the arab market and taxis are abundant. I suspect the whole area is due to be demolished in the next five years as Doha strives to be just as modern and vulgar as its neighbours in UAE.",
            "title": "Good hotel for shopping",
            "user": "DeadSeaFisherman"
        },
        {
            "date": "May 12, 2008",
            "detail_rating": {
                "business": 4.0,
                "cleanliness": 3.0,
                "desk": null,
                "front_desk": 3.0,
                "location": 3.0,
                "pool": null,
                "restaurant": null,
                "rooms": 3.0,
                "service": 3.0,
                "sleep": null,
                "value": null
            },
            "helpfulness": null,
            "id": 15974974,
            "likes": {
                "disliked": "\u2014 Lack of flair",
                "liked": "\u2014 Price"
            },
            "rating": 3.0,
            "stay_parameters": "Stayed January 2008, traveled on business",
            "text": "The hotel restaurant is very good and there are plenty of other restaurants in the nearby arab market (only a 5 min walk away).",
            "title": "Ok, really",
            "user": "Ciren_UKMonty"
        },
        {
            "date": "May 8, 2008",
            "detail_rating": {
                "business": null,
                "cleanliness": 1.0,
                "desk": null,
                "front_desk": 1.0,
                "location": null,
                "pool": null,
                "restaurant": null,
                "rooms": 1.0,
                "service": 1.0,
                "sleep": null,
                "value": 1.0
            },
            "helpfulness": null,
            "id": 15787070,
            "likes": {
                "disliked": "\u2014 The infestation which seemed to be a common occurance",
                "liked": "\u2014 Hot water in the bathroom plentiful"
            },
            "rating": 1.0,
            "stay_parameters": "Stayed May 2008, traveled solo",
            "text": "Good value for money by Doha standards, I would recommend the hotel to those only visiting the city for a few days.",
            "title": "Beware Of Infestations",
            "user": "TobyTobyLondon"
        },
        {
            "date": "September 13, 2006",
            "detail_rating": {
                "business": 4.0,
                "cleanliness": 5.0,
                "desk": null,
                "front_desk": 5.0,
                "location": 5.0,
                "pool": null,
                "restaurant": null,
                "rooms": 5.0,
                "service": 5.0,
                "sleep": null,
                "value": 4.0
            },
            "helpfulness": 20,
            "id": 5795359,
            "likes": {
                "disliked": "\u2014 no complaints!",
                "liked": "\u2014 staff"
            },
            "rating": 5.0,
            "stay_parameters": "Stayed August 2006, traveled as a couple",
            "text": "We stayed at the Mercure in the beginning of August. As mentioned by others, the hotel is quite centrally located, near the souqs and Al Corniche. Not that you'd want to walk around a lot in the summer, but it's the thought that counts.",
            "title": "Good location, wonderful staff",
            "user": "tissueprata"
        },
        {
            "date": "August 16, 2006",
            "detail_rating": {
                "business": null,
                "cleanliness": null,
                "desk": null,
                "location": null,
                "pool": null,
                "restaurant": null,
                "rooms": null,
                "service": null,
                "sleep": null,
                "value": null
            },
            "helpfulness": 16,
            "id": 5616734,
            "likes": {
                "disliked": null,
                "liked": null
            },
            "rating": 4.0,
            "stay_parameters": null,
            "text": "Our room had a nice view over Doha, only too bad that it was a bit hazy in the afternoon (don't know whether that's usual) and all the amenities you would expect in a 4 star hotel.",
            "title": "All Good",
            "user": "Little_Jen"
        },
        {
            "date": "August 16, 2006",
            "detail_rating": {
                "business": 3.0,
                "cleanliness": 4.0,
                "desk": null,
                "front_desk": 4.0,
                "location": 3.0,
                "pool": null,
                "restaurant": null,
                "rooms": 3.0,
                "service": 4.0,
                "sleep": null,
                "value": 4.0
            },
            "helpfulness": 27,
            "id": 5616082,
            "likes": {
                "disliked": "\u2014 Airconditioning",
                "liked": "\u2014 Location and Price"
            },
            "rating": 4.0,
            "stay_parameters": "Stayed August 2006, traveled as a couple",
            "text": "The hotel staff were simply wonderful, very friendly and attentive. I would especially would like to mention the bell captain, who seems to be genuinely concerned about the well-being of his guests. After the chaotic scenes at Doha airport, arriving at the Mercure was a breath of fresh air.",
            "title": "An excellent 4* Hotel - value for money compared to other hotels in Doha",
            "user": "travel4love"
        }
    ],
    "slim_ranking": 0.55652173913,
    "stars": 4,
    "tripadvisor": {
        "VISITED": false,
        "country_name": null,
        "locality": null,
        "pic_link": null,
        "street_address": null
    },
    "user_rating": 3.0,
    "variance": {
        "average": 63,
        "excellent": 13,
        "poor": 39,
        "terrible": 24,
        "very good": 61
    }
}