{
    "aka": "Hampi`s Boulders Hotel",
    "description": null,
    "detail_rating": {
        "cleanliness": null,
        "location": null,
        "rooms": null,
        "service": null,
        "sleep": null,
        "value": null
    },
    "location": {
        "city": "Hampi",
        "continent": "Asia",
        "country": "India",
        "proposed_city": null,
        "province": null,
        "region": "Karnataka"
    },
    "name": "Hampi's Boulders",
    "places": {
        "aka": [],
        "hotel_description": [],
        "hotel_name": []
    },
    "review_count": 79,
    "review_count_current": 10,
    "reviews": [
        {
            "date": "August 12, 2009",
            "detail_rating": {
                "business": null,
                "cleanliness": 4.0,
                "desk": null,
                "location": 5.0,
                "pool": null,
                "restaurant": null,
                "rooms": 4.0,
                "service": 5.0,
                "sleep": null,
                "value": 5.0
            },
            "helpfulness": 1,
            "id": 37531553,
            "likes": {
                "disliked": null,
                "liked": null
            },
            "rating": 5.0,
            "stay_parameters": "Stayed December 2008, traveled with family",
            "text": "i stayed at the hotel for 2 nights. it was fantastic. the hotel is located in massive area which is 20-30mins drive from hampi city. but the distance did not bother me. actually, it was quite nice to be bit far from hampi city, as it was peaceful and quiet. there were many animals in the hotel area. we walked a lot within the hotel and it took us nearly one hour! such a beautiful scenary!",
            "title": "unique place",
            "user": "churachura"
        },
        {
            "date": "June 2, 2009",
            "detail_rating": {
                "business": null,
                "cleanliness": 5.0,
                "desk": null,
                "front_desk": 5.0,
                "location": 4.0,
                "pool": null,
                "restaurant": null,
                "rooms": 5.0,
                "service": 5.0,
                "sleep": null,
                "value": 4.0
            },
            "helpfulness": 1,
            "id": 31355278,
            "likes": {
                "disliked": null,
                "liked": "\u2014 everything"
            },
            "rating": 5.0,
            "stay_parameters": "Stayed December 2006",
            "text": "negative point of the hotel was maybe food. it was just average. ( i live in india and i have eaten much better food before)and there is a swimming pool, but it was too dirty for me to swim. but there were some people who are swmimming, so it depends on you.",
            "title": "What a Treat!!!",
            "user": "Kavzchat"
        },
        {
            "date": "March 29, 2009",
            "detail_rating": {
                "business": null,
                "cleanliness": 3.0,
                "desk": null,
                "location": 5.0,
                "pool": null,
                "restaurant": null,
                "rooms": 2.0,
                "service": 3.0,
                "sleep": null,
                "value": 3.0
            },
            "helpfulness": 2,
            "id": 27056187,
            "likes": {
                "disliked": null,
                "liked": null
            },
            "rating": 3.0,
            "stay_parameters": "Stayed February 2009, traveled as a couple",
            "text": "anyway, i can say this is somewhere very special and i would love to come back again.",
            "title": "The best option but...",
            "user": "lns_dc"
        },
        {
            "date": "March 16, 2009",
            "detail_rating": {
                "business": null,
                "cleanliness": 4.0,
                "desk": null,
                "location": 3.0,
                "pool": null,
                "restaurant": null,
                "rooms": 3.0,
                "service": 4.0,
                "sleep": null,
                "value": 3.0
            },
            "helpfulness": 1,
            "id": 26295388,
            "likes": {
                "disliked": null,
                "liked": null
            },
            "rating": 4.0,
            "stay_parameters": "Stayed February 2008, traveled as a couple",
            "text": "I had come across reviews of Boulders in travel guides and so booked myself in.",
            "title": "Location, Location, Location",
            "user": "keatssycamore"
        },
        {
            "date": "March 1, 2009",
            "detail_rating": {
                "business": null,
                "cleanliness": 4.0,
                "desk": null,
                "location": 5.0,
                "pool": null,
                "restaurant": null,
                "rooms": 4.0,
                "service": 5.0,
                "sleep": null,
                "value": 4.0
            },
            "helpfulness": 1,
            "id": 25380638,
            "likes": {
                "disliked": null,
                "liked": null
            },
            "rating": 5.0,
            "stay_parameters": "Stayed February 2009, traveled solo",
            "text": "While this property is a lot more expensive than the typical back packer properties on the other side of the Tungabhadra, but the stay is completely worth it.",
            "title": "a pure delight",
            "user": "ParisJourno"
        },
        {
            "date": "January 22, 2008",
            "detail_rating": {
                "business": null,
                "cleanliness": null,
                "desk": null,
                "location": null,
                "pool": null,
                "restaurant": null,
                "rooms": null,
                "service": null,
                "sleep": null,
                "value": null
            },
            "helpfulness": 2,
            "id": 12905645,
            "likes": {
                "disliked": null,
                "liked": null
            },
            "rating": 1.0,
            "stay_parameters": null,
            "text": "hampi's boulders is way overrated. the rooms are rundown and the place is in serious need of repair. like hampi itself it is not worht the trouble.",
            "title": "overrated",
            "user": "ramram77"
        },
        {
            "date": "January 20, 2008",
            "detail_rating": {
                "business": null,
                "cleanliness": 5.0,
                "desk": null,
                "front_desk": 5.0,
                "location": 5.0,
                "pool": null,
                "restaurant": null,
                "rooms": 4.0,
                "service": 5.0,
                "sleep": null,
                "value": 5.0
            },
            "helpfulness": 3,
            "id": 12825528,
            "likes": {
                "disliked": "\u2014 its a little bit further away from the sites than altenate hotels",
                "liked": "\u2014 serenity and location"
            },
            "rating": 5.0,
            "stay_parameters": "Stayed December 2007, traveled as a couple",
            "text": "If you are visiting Vijaynagar, you absolutely must stay here. During the day, you can visit the busy sites of Vijaynagar. But after that, you can return to the relaxing oasis of Hampi Boulders Resort. The resort is absolutely serene. The only sounds you hear are the gurgling river and birds- there are no noises of cars or horns or trucks. The beautiful view consists of low mountains and enormous boulders.",
            "title": "An Oasis",
            "user": "jasraj"
        },
        {
            "date": "January 5, 2008",
            "detail_rating": {
                "business": null,
                "cleanliness": 4.0,
                "desk": null,
                "front_desk": 4.0,
                "location": 5.0,
                "pool": null,
                "restaurant": null,
                "rooms": 3.0,
                "service": 4.0,
                "sleep": null,
                "value": 4.0
            },
            "helpfulness": 4,
            "id": 12348495,
            "likes": {
                "disliked": "\u2014 really, there wasn't anything - it isn't glitzy, but this is a great place",
                "liked": "\u2014 The location"
            },
            "rating": 5.0,
            "stay_parameters": "Stayed December 2007, traveled solo",
            "text": "The manager (Vikram when we visited) was incredibly helpful as was the rest of the staff. Services was prompt and efficient. The food was very tasty as well. The room was basic and clean with a nice verandah to relax on.",
            "title": "A super get away!",
            "user": "Jellington"
        },
        {
            "date": "July 27, 2007",
            "detail_rating": {
                "business": null,
                "cleanliness": 2.0,
                "desk": null,
                "front_desk": 4.0,
                "location": 2.0,
                "pool": null,
                "restaurant": null,
                "rooms": 2.0,
                "service": 5.0,
                "sleep": null,
                "value": 5.0
            },
            "helpfulness": 3,
            "id": 8241195,
            "likes": {
                "disliked": "\u2014 Distance to city",
                "liked": "\u2014 Remote and Unique location/landscape"
            },
            "rating": 4.0,
            "stay_parameters": "Stayed November 2006, traveled with friends",
            "text": "The resort is a 15 minute journey from the main sites of Vijaynagar. The resort provides transport.",
            "title": "Far Off but worth it!",
            "user": "jjyw"
        },
        {
            "date": "May 29, 2006",
            "detail_rating": {
                "business": null,
                "cleanliness": 5.0,
                "desk": null,
                "location": null,
                "pool": null,
                "restaurant": null,
                "rooms": 3.0,
                "service": 5.0,
                "sleep": null,
                "value": 5.0
            },
            "helpfulness": 32,
            "id": 5233107,
            "likes": {
                "disliked": null,
                "liked": null
            },
            "rating": 5.0,
            "stay_parameters": "Stayed October 2005",
            "text": "The location reminds me of New Mexico or Colorado.",
            "title": "The Moab, Utah of India!",
            "user": "Tinysmom"
        }
    ],
    "slim_ranking": 0.333333333333,
    "stars": null,
    "tripadvisor": {
        "VISITED": false,
        "country_name": null,
        "locality": null,
        "pic_link": null,
        "street_address": null
    },
    "user_rating": 4.0,
    "variance": {
        "average": 11,
        "excellent": 41,
        "poor": 4,
        "terrible": 2,
        "very good": 21
    }
}