{
    "aka": "Crowne Plaza Changi Airport",
    "description": "Crowne Plaza Changi Airport is located within the immediate vicinity of Singapore Changi Airport, linked to Terminal 3 via covered walkways. Guests can also reach Terminals 1 and 2 via Changi Airport's automated People Mover System comprising ten train services. Close to the Singapore Expo, business parks, golf courses and East Coast Park Beach, one of Singapore's most popular recreational spots and coupled with easy downtown access by MRT or expressway, guests will find Crowne Plaza Changi Airport the perfect hub for corporate or social meetings. It is less an airport hotel than a superbly comfortable and stylish hotel in an extremely convenient location - a contemporary urban resort 'Where the world meets Singapore'.Designed by award-winning architects WOHA, Crowne Plaza Changi Airport encapsulates elements of both city and resort hotel. Its sleek modern lines are most contemporary, yet nature underpins its design so guests can take advantage of the balmy tropics and also enjoy that hideaway resort feel. The Place To Meet for work or play, Crowne Plaza Changi Airport promises to be special in many respects: sleek modern lines including a stunning facade. Rooms with private patios and poolside sundecks, creative oval-shaped meeting rooms.",
    "detail_rating": {
        "cleanliness": 4.5,
        "location": 4.5,
        "rooms": 4.5,
        "service": 4.0,
        "sleep": 4.5,
        "value": 4.0
    },
    "location": {
        "city": null,
        "continent": "Asia",
        "country": "Singapore",
        "proposed_city": null,
        "province": null,
        "region": null
    },
    "name": "Crowne Plaza Changi Airport Hotel",
    "places": {
        "aka": [],
        "hotel_description": [],
        "hotel_name": []
    },
    "review_count": 1780,
    "review_count_current": 34,
    "reviews": [
        {
            "date": "August 14, 2009",
            "detail_rating": {
                "business": null,
                "cleanliness": 4.0,
                "desk": null,
                "location": 5.0,
                "pool": null,
                "restaurant": null,
                "rooms": 4.0,
                "service": 4.0,
                "sleep": null,
                "value": 4.0
            },
            "helpfulness": 1,
            "id": 37634880,
            "likes": {
                "disliked": null,
                "liked": null
            },
            "rating": 4.0,
            "stay_parameters": "Stayed August 2009, traveled as a couple",
            "text": "Service is excellent & prompt. Smiley faces. Though the check-in girl was a little less friendly. No greeting at all.",
            "title": "A flightless getaway.",
            "user": "ro4ch"
        },
        {
            "date": "August 8, 2009",
            "detail_rating": {
                "business": null,
                "cleanliness": 5.0,
                "desk": null,
                "location": 5.0,
                "pool": null,
                "restaurant": null,
                "rooms": 5.0,
                "service": 5.0,
                "sleep": null,
                "value": 5.0
            },
            "helpfulness": 1,
            "id": 37075173,
            "likes": {
                "disliked": null,
                "liked": null
            },
            "rating": 5.0,
            "stay_parameters": "Stayed July 2009, traveled as a couple",
            "text": "We got a room with a great view of the tarmac. A very romantic thing to do is watching the planes land and take off\u2026especially during the night.",
            "title": "ASIA-TOUR-2009! Ideal stop at Changi Airport Terminal 3 before our flight!",
            "user": "Flyer007Dublin"
        },
        {
            "date": "August 5, 2009",
            "detail_rating": {
                "business": null,
                "cleanliness": 5.0,
                "desk": null,
                "location": 5.0,
                "pool": null,
                "restaurant": null,
                "rooms": 5.0,
                "service": 5.0,
                "sleep": null,
                "value": 3.0
            },
            "helpfulness": null,
            "id": 36786692,
            "likes": {
                "disliked": null,
                "liked": null
            },
            "rating": 5.0,
            "stay_parameters": "Stayed August 2009, traveled on business",
            "text": "The bathroom is spacious. But too bad, it didn't stock up a full amenities - no toothbrush, toothpaste, comb.",
            "title": "Resort hotel in an Airport",
            "user": "Aussie_Traveller_AU"
        },
        {
            "date": "August 4, 2009",
            "detail_rating": {
                "business": null,
                "cleanliness": 5.0,
                "desk": null,
                "location": 5.0,
                "pool": null,
                "restaurant": null,
                "rooms": 5.0,
                "service": 3.0,
                "sleep": null,
                "value": 5.0
            },
            "helpfulness": 1,
            "id": 36679142,
            "likes": {
                "disliked": null,
                "liked": null
            },
            "rating": 5.0,
            "stay_parameters": "Stayed July 2009, traveled solo",
            "text": "Also, should provide a complimentary bottle of drinking water. Would be a nice gesture.",
            "title": "Ideal hotel for a short stopover",
            "user": "young_dazza"
        },
        {
            "date": "July 30, 2009",
            "detail_rating": {
                "business": null,
                "cleanliness": 4.0,
                "desk": null,
                "location": 4.0,
                "pool": null,
                "restaurant": null,
                "rooms": 4.0,
                "service": 3.0,
                "sleep": null,
                "value": 3.0
            },
            "helpfulness": 1,
            "id": 36231889,
            "likes": {
                "disliked": null,
                "liked": null
            },
            "rating": 3.0,
            "stay_parameters": "Stayed July 2009, traveled with family",
            "text": "The room is quiet and swimming pool is grand - a pity I didn't get to swim innit. Perhaps, next time. I'll definitely be back again.",
            "title": "Great Room but not convenient as expected !",
            "user": "chawkok"
        },
        {
            "date": "July 7, 2009",
            "detail_rating": {
                "business": null,
                "cleanliness": 4.0,
                "desk": null,
                "location": 3.0,
                "pool": null,
                "restaurant": null,
                "rooms": 4.0,
                "service": 4.0,
                "sleep": null,
                "value": 5.0
            },
            "helpfulness": null,
            "id": 34101135,
            "likes": {
                "disliked": null,
                "liked": null
            },
            "rating": 4.0,
            "stay_parameters": "Stayed July 2009, traveled on business",
            "text": "I come to Singapore on business. And stay at Crowne Plaza Hotel Changi Airport for 2 days. Staff at the hotel are helpful and friendly. And I feel comfortable during time I stayed here.",
            "title": "It's also good for you",
            "user": "NguyenHa"
        },
        {
            "date": "July 5, 2009",
            "detail_rating": {
                "business": null,
                "cleanliness": 5.0,
                "desk": null,
                "location": 5.0,
                "pool": null,
                "restaurant": null,
                "rooms": 5.0,
                "service": 5.0,
                "sleep": null,
                "value": 5.0
            },
            "helpfulness": null,
            "id": 33960524,
            "likes": {
                "disliked": null,
                "liked": null
            },
            "rating": 5.0,
            "stay_parameters": "Stayed June 2009, traveled as a couple",
            "text": "Entrance to the hotel is in the airport. Very easy access to Singapore's outstanding rail system. Loved the bathroom: glass panel (will pull down shade) to view the TV, with speakers in the room. Shower has a massive shower head mounted to the ceiling. Enjoyed a day at the spa while waiting for my husband to join me in Singapore.",
            "title": "Super convenient",
            "user": "janannk"
        },
        {
            "date": "July 4, 2009",
            "detail_rating": {
                "business": null,
                "cleanliness": 5.0,
                "desk": null,
                "location": 5.0,
                "pool": null,
                "restaurant": null,
                "rooms": 5.0,
                "service": 5.0,
                "sleep": null,
                "value": 3.0
            },
            "helpfulness": null,
            "id": 33863221,
            "likes": {
                "disliked": null,
                "liked": null
            },
            "rating": 5.0,
            "stay_parameters": "Stayed March 2009, traveled as a couple",
            "text": "Stayed here for one night for a short stopover in Singapore. The hotel is handily located right next to one of the terminals, so no airport bus nonsense. Lots of features in the room, including fantastic bath from which you could watch the TV, and an ipod docking station.",
            "title": "great stop-over hotel",
            "user": "Londonexile"
        },
        {
            "date": "July 2, 2009",
            "detail_rating": {
                "business": null,
                "cleanliness": 5.0,
                "desk": null,
                "location": 5.0,
                "pool": null,
                "restaurant": null,
                "rooms": 5.0,
                "service": 5.0,
                "sleep": null,
                "value": 5.0
            },
            "helpfulness": null,
            "id": 33776079,
            "likes": {
                "disliked": null,
                "liked": null
            },
            "rating": 5.0,
            "stay_parameters": "Stayed June 2009, traveled as a couple",
            "text": "The rooms also seemed to be well soundproofed against aircraft noise. The bed might be slightly firm for some tastes, but we slept well.",
            "title": "Amazing Hotel! Would go back in a Heartbeat",
            "user": "HawaiiHolly"
        },
        {
            "date": "June 27, 2009",
            "detail_rating": {
                "business": null,
                "cleanliness": 5.0,
                "desk": null,
                "location": 4.0,
                "pool": null,
                "restaurant": null,
                "rooms": 4.0,
                "service": 4.0,
                "sleep": null,
                "value": 4.0
            },
            "helpfulness": null,
            "id": 33310586,
            "likes": {
                "disliked": null,
                "liked": null
            },
            "rating": 5.0,
            "stay_parameters": "Stayed June 2009, traveled as a couple",
            "text": "We loved this hotel. It is by far one of the best airport hotels. It is even better than the Fairmont Vancouver airport.",
            "title": "great location and stylish hotel",
            "user": "sean22"
        },
        {
            "date": "August 26, 2009",
            "detail_rating": {
                "business": null,
                "cleanliness": 5.0,
                "desk": null,
                "location": 5.0,
                "pool": null,
                "restaurant": null,
                "rooms": 5.0,
                "service": 5.0,
                "sleep": null,
                "value": 4.0
            },
            "helpfulness": null,
            "id": 38853486,
            "likes": {
                "disliked": null,
                "liked": null
            },
            "rating": 5.0,
            "stay_parameters": "Stayed August 2009, traveled with family",
            "text": "Stayed here with my family twice, firstly for 3 nights at the end of July and then again for one night on the 13th August.",
            "title": "Great Hotel.... pity about United Airlines",
            "user": "Binman62"
        },
        {
            "date": "August 25, 2009",
            "detail_rating": {
                "business": null,
                "cleanliness": 5.0,
                "desk": null,
                "location": 5.0,
                "pool": null,
                "restaurant": null,
                "rooms": 5.0,
                "service": 5.0,
                "sleep": null,
                "value": 5.0
            },
            "helpfulness": null,
            "id": 38782899,
            "likes": {
                "disliked": null,
                "liked": null
            },
            "rating": 5.0,
            "stay_parameters": "Stayed August 2009, traveled solo",
            "text": "This is a lovely hotel and I would recommend paying extra for the executive club. The breakfast here was good and the rooms on the top floor were spacious and comfortable. Internet access was free in the lounge but as now seems universal ludicrously expensive in room......this my only complaint.",
            "title": "My favourite hotel of all time!",
            "user": "fanUae"
        },
        {
            "date": "August 25, 2009",
            "detail_rating": {
                "business": null,
                "cleanliness": 5.0,
                "desk": null,
                "location": 5.0,
                "pool": null,
                "restaurant": null,
                "rooms": 5.0,
                "service": 5.0,
                "sleep": null,
                "value": 5.0
            },
            "helpfulness": null,
            "id": 38727159,
            "likes": {
                "disliked": null,
                "liked": null
            },
            "rating": 5.0,
            "stay_parameters": "Stayed November 2008, traveled as a couple",
            "text": "Each room had a separate bath and large rainfall shower.",
            "title": "Fantastic hotel",
            "user": "Neats1269"
        },
        {
            "date": "August 24, 2009",
            "detail_rating": {
                "business": null,
                "cleanliness": 5.0,
                "desk": null,
                "location": 5.0,
                "pool": null,
                "restaurant": null,
                "rooms": 5.0,
                "service": 5.0,
                "sleep": null,
                "value": 4.0
            },
            "helpfulness": null,
            "id": 38613934,
            "likes": {
                "disliked": null,
                "liked": null
            },
            "rating": 5.0,
            "stay_parameters": "Stayed August 2009, traveled as a couple",
            "text": "There is a super swimming pool and the MTR is under the hotel. Access to all the terminals and the hotels is via air conditioned trains which run almost 24 hours a day and you can take your trolley onto the train. (Heathrow airport could learn a lot)",
            "title": "Great Hotel. Perfect Stopover.",
            "user": "Chesty1"
        },
        {
            "date": "August 23, 2009",
            "detail_rating": {
                "business": null,
                "cleanliness": 5.0,
                "desk": null,
                "location": 3.0,
                "pool": null,
                "restaurant": null,
                "rooms": 3.0,
                "service": 4.0,
                "sleep": null,
                "value": 3.0
            },
            "helpfulness": 1,
            "id": 38567763,
            "likes": {
                "disliked": null,
                "liked": null
            },
            "rating": 3.0,
            "stay_parameters": "Stayed August 2009, traveled as a couple",
            "text": "Staff were as always in the Far East, efficient, courteous and always helpful.",
            "title": "Good pit stop",
            "user": "andricScotland"
        },
        {
            "date": "August 23, 2009",
            "detail_rating": {
                "business": null,
                "cleanliness": 5.0,
                "desk": null,
                "location": 5.0,
                "pool": null,
                "restaurant": null,
                "rooms": 5.0,
                "service": 5.0,
                "sleep": null,
                "value": 4.0
            },
            "helpfulness": null,
            "id": 38496088,
            "likes": {
                "disliked": null,
                "liked": null
            },
            "rating": 5.0,
            "stay_parameters": "Stayed May 2008, traveled solo",
            "text": "I first stayed here on the opening night in May 2009, but have not gotten around to adding my 2 cents here. I found the room spacious and very comfortable. I rate it as my favorite airport hotel of all time. If transiting through Singapore I recomend this to anyone who want a good nights sleep for an early mornign flight without the hastle of heading into Singapore itself. Looking forward to another stay this coming December.",
            "title": "My Favorite Airport Hotel",
            "user": "WannaFlyJ"
        },
        {
            "date": "August 21, 2009",
            "detail_rating": {
                "business": null,
                "cleanliness": 5.0,
                "desk": null,
                "location": 4.0,
                "pool": null,
                "restaurant": null,
                "rooms": 5.0,
                "service": 4.0,
                "sleep": null,
                "value": 4.0
            },
            "helpfulness": null,
            "id": 38322982,
            "likes": {
                "disliked": null,
                "liked": null
            },
            "rating": 4.0,
            "stay_parameters": "Stayed July 2009, traveled as a couple",
            "text": "Great for a stopover - fab comfy bed - first class. Very expensive food and alcohol - nip over to the terminal for a bight to eat :)",
            "title": "Fabulous hotel - huge groovy rooms",
            "user": "MickiAustralia"
        },
        {
            "date": "August 17, 2009",
            "detail_rating": {
                "business": null,
                "cleanliness": null,
                "desk": null,
                "location": null,
                "pool": null,
                "restaurant": null,
                "rooms": null,
                "service": null,
                "sleep": null,
                "value": null
            },
            "helpfulness": 1,
            "id": 37910975,
            "likes": {
                "disliked": null,
                "liked": null
            },
            "rating": 3.0,
            "stay_parameters": null,
            "text": "I stayed here for one night just to check out the hotel. Was given a room on the highest floor (9th) facing the swimming pool. You can ask for a room facing the runway if you are into aviation and love watching planes taking off, landing and on the apron. The room is big and modern with frangipani-printed glass bathroom walls. There is a bath, a separate shower and toilet, a sink with a large mirror. I won't call it luxurious but it is definitely modern. The bathroom has a sliding door.",
            "title": "A Good Airport Hotel",
            "user": "Balustroid"
        },
        {
            "date": "August 16, 2009",
            "detail_rating": {
                "business": null,
                "cleanliness": 5.0,
                "desk": null,
                "location": 5.0,
                "pool": null,
                "restaurant": null,
                "rooms": 5.0,
                "service": 3.0,
                "sleep": null,
                "value": 5.0
            },
            "helpfulness": 1,
            "id": 37850710,
            "likes": {
                "disliked": null,
                "liked": null
            },
            "rating": 5.0,
            "stay_parameters": "Stayed March 2009, traveled as a couple",
            "text": "The bed was so comfy and big and the dim lighting made me fall asleep. TV channels were rubbish and if you are thinking of watching live football matches in your comfy room, forget it. You have to go to the bar downstairs to watch live premier league games.",
            "title": "Wish my layover was longer - Stay here!",
            "user": "DRMBinDC"
        },
        {
            "date": "August 16, 2009",
            "detail_rating": {
                "business": null,
                "cleanliness": null,
                "desk": null,
                "location": null,
                "pool": null,
                "restaurant": null,
                "rooms": null,
                "service": null,
                "sleep": null,
                "value": null
            },
            "helpfulness": 5,
            "id": 37803272,
            "likes": {
                "disliked": null,
                "liked": null
            },
            "rating": 1.0,
            "stay_parameters": null,
            "text": "Didn't try any restaurants in this hotel because they were all full of people eating noisily. This is a good airport hotel if you are in transit.",
            "title": "The Greed \"corporate\" hotel - with no flexibility - they just want your money!",
            "user": "A TripAdvisor user"
        },
        {
            "date": "July 29, 2009",
            "detail_rating": {
                "business": null,
                "cleanliness": null,
                "desk": null,
                "location": null,
                "pool": null,
                "restaurant": null,
                "rooms": null,
                "service": null,
                "sleep": null,
                "value": null
            },
            "helpfulness": 1,
            "id": 36183800,
            "likes": {
                "disliked": null,
                "liked": null
            },
            "rating": 3.0,
            "stay_parameters": null,
            "text": "The lobby is also dark, quite depress after a long journey to wait in the lobby.",
            "title": "A hotel that cannot decide",
            "user": "TCritic"
        },
        {
            "date": "July 29, 2009",
            "detail_rating": {
                "business": null,
                "cleanliness": 5.0,
                "desk": null,
                "location": 5.0,
                "pool": null,
                "restaurant": null,
                "rooms": 5.0,
                "service": 5.0,
                "sleep": null,
                "value": 5.0
            },
            "helpfulness": null,
            "id": 36102778,
            "likes": {
                "disliked": null,
                "liked": null
            },
            "rating": 5.0,
            "stay_parameters": "Stayed May 2009, traveled as a couple",
            "text": "We had to wait the available of our rooms for about 30 min. at check in time 15.00 pm, and those are advanced purchased rooms! To walk to our rooms through open air corridor, it was hot ! The rooms are spacious, clean and modern, but the aircon blows to the bed, it can easy get cold when you go out again on the hot corridor to the lift.",
            "title": "FANTASTIC LOCATION STAFF FACILITIES THIS IS MY 10/10",
            "user": "ShaneandRose"
        },
        {
            "date": "July 26, 2009",
            "detail_rating": {
                "business": null,
                "cleanliness": 5.0,
                "desk": null,
                "location": 5.0,
                "pool": null,
                "restaurant": null,
                "rooms": 5.0,
                "service": 5.0,
                "sleep": null,
                "value": 4.0
            },
            "helpfulness": 1,
            "id": 35885244,
            "likes": {
                "disliked": null,
                "liked": null
            },
            "rating": 4.0,
            "stay_parameters": "Stayed July 2009, traveled as a couple",
            "text": "The restaurant / breakfast area is also quite dark and pricy.",
            "title": "A Perfect getaway! - But no complimentary parking.",
            "user": "Eeks_n_Buns"
        },
        {
            "date": "July 22, 2009",
            "detail_rating": {
                "business": null,
                "cleanliness": 5.0,
                "desk": null,
                "location": 5.0,
                "pool": null,
                "restaurant": null,
                "rooms": 5.0,
                "service": 4.0,
                "sleep": null,
                "value": 5.0
            },
            "helpfulness": null,
            "id": 35492549,
            "likes": {
                "disliked": null,
                "liked": null
            },
            "rating": 5.0,
            "stay_parameters": "Stayed June 2009, traveled as a couple",
            "text": "Trendy design but too dark.",
            "title": "Excellent hotel... reason to make a stopover in Singapore",
            "user": "TurboN"
        },
        {
            "date": "September 8, 2009",
            "detail_rating": {
                "business": null,
                "cleanliness": 4.0,
                "desk": null,
                "location": 5.0,
                "pool": null,
                "restaurant": null,
                "rooms": 5.0,
                "service": 4.0,
                "sleep": null,
                "value": 5.0
            },
            "helpfulness": 1,
            "id": 40181563,
            "likes": {
                "disliked": null,
                "liked": null
            },
            "rating": 5.0,
            "stay_parameters": "Stayed August 2009, traveled with family",
            "text": "Changi airport is an extraordinary airport, and this is a hotel in a similar vein...one of a kind. We only stayed here during the day, but we loved the airy open air corridors and clean, modern, well-thought-out rooms. For instance, the hotel has a long bench stretching the length of the guest room, and our loads of luggage fit on this bench very nicely, so we had easy access to all of our things. I can't think of another room, in any hotel, where we have been able to do this. Usually, a good part of our luggage ends up strewn about the floor.",
            "title": "True luxury at the airport",
            "user": "kingsroadgal"
        },
        {
            "date": "September 7, 2009",
            "detail_rating": {
                "business": null,
                "cleanliness": 5.0,
                "desk": null,
                "location": 5.0,
                "pool": null,
                "restaurant": null,
                "rooms": 4.0,
                "service": 5.0,
                "sleep": null,
                "value": 4.0
            },
            "helpfulness": null,
            "id": 40000649,
            "likes": {
                "disliked": null,
                "liked": null
            },
            "rating": 5.0,
            "stay_parameters": "Stayed July 2009, traveled on business",
            "text": "Also, the hotel has a fantastic open air pool about three or four floors up. The pool is gorgeous, filled with planters of palm trees and overlooking the busy scene at Changi airport. We spent a fantastic afternoon in the cool refreshing water.",
            "title": "Excellent Airport Hotel",
            "user": "Stecaz09"
        },
        {
            "date": "September 4, 2009",
            "detail_rating": {
                "business": null,
                "cleanliness": 5.0,
                "desk": null,
                "location": 5.0,
                "pool": null,
                "restaurant": null,
                "rooms": 5.0,
                "service": 5.0,
                "sleep": null,
                "value": 5.0
            },
            "helpfulness": 1,
            "id": 39731774,
            "likes": {
                "disliked": null,
                "liked": null
            },
            "rating": 4.0,
            "stay_parameters": "Stayed August 2009, traveled solo",
            "text": "Would also recommend the rooms overlooking Terminal 3 for an intersting view...and a quiet one too. In fact, the hotel entrance goes directly into Terminal 3, which made things extremely convenient.",
            "title": "Perfect for a stopover",
            "user": "Adele66"
        },
        {
            "date": "September 2, 2009",
            "detail_rating": {
                "business": null,
                "cleanliness": 5.0,
                "desk": null,
                "location": 5.0,
                "pool": null,
                "restaurant": null,
                "rooms": 5.0,
                "service": 5.0,
                "sleep": null,
                "value": 4.0
            },
            "helpfulness": 2,
            "id": 39557290,
            "likes": {
                "disliked": null,
                "liked": null
            },
            "rating": 5.0,
            "stay_parameters": "Stayed August 2009, traveled as a couple",
            "text": "This is an amazing airport hotel, and quite a fine hotel for any locale. I would agree with the other posting which took issue with the lobby decor. When we entered the dark lobby, I was really put off, and regretted my choice of hotel, until I saw the beautiful guest room and pool. So, give the Crowne Plaza a chance....",
            "title": "Great transit hotel",
            "user": "daisythecat"
        },
        {
            "date": "August 27, 2009",
            "detail_rating": {
                "business": null,
                "cleanliness": 3.0,
                "desk": null,
                "location": 5.0,
                "pool": null,
                "restaurant": null,
                "rooms": 3.0,
                "service": 2.0,
                "sleep": null,
                "value": 1.0
            },
            "helpfulness": null,
            "id": 38935059,
            "likes": {
                "disliked": null,
                "liked": null
            },
            "rating": 1.0,
            "stay_parameters": "Stayed August 2009, traveled with family",
            "text": "Stayed at this hotel for one night as a stopover on our way to Bali, the hotel is very modern with excellent facilities, the room we had was modern but quite small, but that was fine as it was a stopover, there are several restaurants and bars to choose from and the staff are very attentive and professional and being in the airport itself is in a very handy location,",
            "title": "Not actually that good",
            "user": "stu.bec"
        },
        {
            "date": "July 21, 2009",
            "detail_rating": {
                "business": null,
                "cleanliness": 5.0,
                "desk": null,
                "location": 5.0,
                "pool": null,
                "restaurant": null,
                "rooms": 5.0,
                "service": 5.0,
                "sleep": null,
                "value": 5.0
            },
            "helpfulness": null,
            "id": 35384498,
            "likes": {
                "disliked": null,
                "liked": null
            },
            "rating": 5.0,
            "stay_parameters": "Stayed May 2009, traveled on business",
            "text": "I stayed here for one night each on the outbond and inbound portions of my trip. I was considering staying at the terminal hotel in the airport but I'm very glad I choose the Crowne Plaza. Getting through customs at Changi only took minutes and security, when leaving, was not a problem either.",
            "title": "Excellent Hotel - Very Convenient",
            "user": "runhappy"
        },
        {
            "date": "July 21, 2009",
            "detail_rating": {
                "business": null,
                "cleanliness": 5.0,
                "desk": null,
                "location": 5.0,
                "pool": null,
                "restaurant": null,
                "rooms": 5.0,
                "service": 5.0,
                "sleep": null,
                "value": 4.0
            },
            "helpfulness": null,
            "id": 35381816,
            "likes": {
                "disliked": null,
                "liked": null
            },
            "rating": 5.0,
            "stay_parameters": "Stayed February 2009, traveled as a couple",
            "text": "I loved the hotel. I liked the room layout. Modern and clean. Check in and out was efficient which is really important to me after a long flight. The staff was pleasant. The fitness room was very nice and is open 24 hrs a day. The breakfast buffet was good with a wide variety of food. It was included in my room rate. The restaurant didn't open early enough for my flight on the return trip however. I thought the restaurant hours were reasonable. My flight was just too early.",
            "title": "Fantastic! Am I really at the airport?",
            "user": "PigAdvisor"
        },
        {
            "date": "July 20, 2009",
            "detail_rating": {
                "business": null,
                "cleanliness": 5.0,
                "desk": null,
                "location": 5.0,
                "pool": null,
                "restaurant": null,
                "rooms": 5.0,
                "service": 4.0,
                "sleep": null,
                "value": 3.0
            },
            "helpfulness": null,
            "id": 35318571,
            "likes": {
                "disliked": null,
                "liked": null
            },
            "rating": 4.0,
            "stay_parameters": "Stayed June 2009, traveled with family",
            "text": "Since the hotel is attached to the airport, if the hotel doesn't have exactly what you want, the airport will probably have it in its shopping center and many restaurants.",
            "title": "Lovely hotel but not perfect",
            "user": "Haggis45"
        },
        {
            "date": "July 13, 2009",
            "detail_rating": {
                "business": null,
                "cleanliness": 5.0,
                "desk": null,
                "location": 5.0,
                "pool": null,
                "restaurant": null,
                "rooms": 5.0,
                "service": 5.0,
                "sleep": null,
                "value": 5.0
            },
            "helpfulness": null,
            "id": 34605103,
            "likes": {
                "disliked": null,
                "liked": null
            },
            "rating": 5.0,
            "stay_parameters": "Stayed June 2009, traveled on business",
            "text": "I would stay there again and I recommend it if you have a layover.",
            "title": "WOW Not What I Expected\u2026",
            "user": "paulrc"
        },
        {
            "date": "July 11, 2009",
            "detail_rating": {
                "business": null,
                "cleanliness": 5.0,
                "desk": null,
                "location": 5.0,
                "pool": null,
                "restaurant": null,
                "rooms": 5.0,
                "service": 4.0,
                "sleep": null,
                "value": 5.0
            },
            "helpfulness": 1,
            "id": 34453098,
            "likes": {
                "disliked": null,
                "liked": null
            },
            "rating": 4.0,
            "stay_parameters": "Stayed July 2009, traveled as a couple",
            "text": "We arrived in Singapore around 6 am not expecting to get a room until at least noon. However, the excellent front desk staff were more than accomodating in finding us a room and upgrading us to a suite! The hotel is very new and tastefully furnished - soothing colors, lots of warm wood, great lighting, 2 flat screen televisions, amazing soaking tub and pocket doors separating the bedroom from the living area and the bathroom. There was an issue with the in-room wireless, but it was resolved promptly. We were able to keep our airport luggage cart with us in our room and check in for our next flight in the lobby. Absolutely the most well thought-out airport hotel ever! Pictures posted by other reviewers are very reliable!",
            "title": "Great airport hotel for one night",
            "user": "luxury-lizard"
        }
    ],
    "slim_ranking": 0.0798611111111,
    "stars": 4.5,
    "tripadvisor": {
        "VISITED": false,
        "country_name": null,
        "locality": null,
        "pic_link": null,
        "street_address": null
    },
    "user_rating": 4.5,
    "variance": {
        "average": 153,
        "excellent": 883,
        "poor": 49,
        "terrible": 32,
        "very good": 663
    }
}