{
    "aka": "Intercontinental Johannesburg Or Tambo Airport Hotel Kempton Park",
    "description": "InterContinental Johannesburg O.R. Tambo Airport is a safe and highly convenient hotel only 68.7 metres (225-foot) walk from the International Arrivals hall at Johannesburg's O.R. Tambo International Airport and is your ideal and hassle-free stopover for onward Southern African destinations, Game Reserves, Victoria Falls & Cape Town. Perfectly located for business and a 14-minute train ride from the Sandton CBD, the hotel facilities include free unlimited Wi-Fi, Business Centre, Health Spa, complimentary gym, swimming pool and DVD library. Guests love our large showers with massage showerheads and the ample natural light flowing from the floor to ceiling windows. In-room flight information allows you to time and plan your onward journeys from the comfort of your room. Soundproofed rooms, blackout curtains, king beds and fluffy duvets ensure you enjoy a great sleep experience. Quills Restaurant, open 24 hours daily, offers contemporary African dining, indoors or on the terrace. Winner of the 2011 Best Airport Hotel in Africa Award by Skytrax World Airport Awards and refurbished in 2008, the hotel offers the most sophisticated airport accommodations on the African Continent.",
    "detail_rating": {
        "cleanliness": null,
        "location": null,
        "rooms": null,
        "service": null,
        "sleep": null,
        "value": null
    },
    "location": {
        "city": null,
        "continent": "Africa",
        "country": "South Africa",
        "proposed_city": "Johannesburg",
        "province": null,
        "region": null
    },
    "name": "InterContinental Johannesburg OR Tambo Airport",
    "places": {
        "aka": [
            "Johannesburg"
        ],
        "hotel_description": [
            "Johannesburg",
            "Victoria",
            "Best"
        ],
        "hotel_name": [
            "Johannesburg"
        ]
    },
    "review_count": 449,
    "review_count_current": 20,
    "reviews": [
        {
            "date": "January 13, 2012",
            "detail_rating": {
                "business": null,
                "cleanliness": 5.0,
                "desk": null,
                "location": 5.0,
                "pool": null,
                "restaurant": null,
                "rooms": 4.0,
                "service": 5.0,
                "sleep": 5.0,
                "value": 4.0
            },
            "helpfulness": 1,
            "id": 123043732,
            "likes": {
                "disliked": null,
                "liked": null
            },
            "rating": 4.0,
            "stay_parameters": "Stayed December 2011, traveled as a couple",
            "text": "As Airport hotels go this is as good as it gets. It is very conveniently located just across the street from the terminal, the staff will meet you at the exit to help you to the check-in and do the reverse on check-out and departure, the room is very clean, quiet and comfortable and OK size, the restaurant is very good for a hotel restaurant and the breakfast is very good.",
            "title": "Perfect for an Airport Stayover",
            "user": "Fantokyo"
        },
        {
            "date": "January 6, 2012",
            "detail_rating": {
                "business": null,
                "cleanliness": 5.0,
                "desk": null,
                "location": 5.0,
                "pool": null,
                "restaurant": null,
                "rooms": 5.0,
                "service": 4.0,
                "sleep": 5.0,
                "value": 4.0
            },
            "helpfulness": null,
            "id": 122646046,
            "likes": {
                "disliked": null,
                "liked": null
            },
            "rating": 5.0,
            "stay_parameters": "Stayed December 2011, traveled with family",
            "text": "BA put us in this hotel after technical issue grounded us for 2 days. Couldn't fault it.",
            "title": "Excellent",
            "user": "Robert A"
        },
        {
            "date": "January 4, 2012",
            "detail_rating": {
                "business": null,
                "cleanliness": 5.0,
                "desk": null,
                "location": 5.0,
                "pool": null,
                "restaurant": null,
                "rooms": 5.0,
                "service": 4.0,
                "sleep": 5.0,
                "value": 5.0
            },
            "helpfulness": null,
            "id": 122524310,
            "likes": {
                "disliked": null,
                "liked": null
            },
            "rating": 5.0,
            "stay_parameters": "Stayed January 2012, traveled as a couple",
            "text": "After a terrifying aborted take-off, British Airways put us up in this hotel for 2 nights. Oh, it was JUST what I needed to calm my frazzled nerves before we finally flew home on a new plane BA flew out for us from London.",
            "title": "Lovely!",
            "user": "Tusabrat"
        },
        {
            "date": "December 21, 2011",
            "detail_rating": {
                "business": null,
                "cleanliness": 5.0,
                "desk": null,
                "location": 5.0,
                "pool": null,
                "restaurant": null,
                "rooms": 4.0,
                "service": 5.0,
                "sleep": 5.0,
                "value": 4.0
            },
            "helpfulness": null,
            "id": 121953342,
            "likes": {
                "disliked": null,
                "liked": null
            },
            "rating": 4.0,
            "stay_parameters": "Stayed December 2011, traveled as a couple",
            "text": "The bed...what can I say? I thought my bed at home (4-poster, vi-spring mattress, feather pillows) was the ultimate until I lay back on this...this... fluffy cloud of a bed! Turn down service, chocolate, slippers laid out. Marble-edged bathroom, wonderful shower with a massage setting, big bath tub. Sunny balcony. Nespresso machine, which thrilled my husband who loves his coffee.",
            "title": "VERY quiet and nicely appointed, but small room. Not cheap but VERY convienent.",
            "user": "LA-Backdoc"
        },
        {
            "date": "December 11, 2011",
            "detail_rating": {
                "business": null,
                "cleanliness": 5.0,
                "desk": null,
                "location": 5.0,
                "pool": null,
                "restaurant": null,
                "rooms": 4.0,
                "service": 4.0,
                "sleep": 5.0,
                "value": null
            },
            "helpfulness": 1,
            "id": 121626366,
            "likes": {
                "disliked": null,
                "liked": null
            },
            "rating": 4.0,
            "stay_parameters": "Stayed December 2011, traveled solo",
            "text": "Nice hotel, we loved relaxing on the patio under the umbrellas. Breakfast was lovely - you must try the omlette with bacon and cheese!",
            "title": "Ultra-Convenient to JNB and The Gautrain",
            "user": "QlobeTrotter"
        },
        {
            "date": "November 13, 2011",
            "detail_rating": {
                "business": null,
                "cleanliness": 5.0,
                "desk": null,
                "location": 5.0,
                "pool": null,
                "restaurant": null,
                "rooms": 5.0,
                "service": 5.0,
                "sleep": 5.0,
                "value": 5.0
            },
            "helpfulness": 1,
            "id": 120520427,
            "likes": {
                "disliked": null,
                "liked": null
            },
            "rating": 5.0,
            "stay_parameters": "Stayed September 2011, traveled solo",
            "text": "I was suffering from a recent dislocated shoulder injury and due to being unable to obtain an earlier flight home stayed at the hotel for 3 days because of the close proximity to the Tambo Airport The staff were extremely helpful, caring and thoughful to relieve my anxiety so I would not feel embarrassed with my inability to do meanial tasks is to be commended These difficult tasks for me included eating in the dining room but also my personal care ,hygiene and dressing abilities not easy to do one handed There are two female staff members that I would highly praise for their outstanding support and concern Michelle Heck and another very special staff member named Refilwe both ladies didn't want any reward for their efforts but both are an asset to your beautiful hotel where the rooms,,food and service is excellent",
            "title": "Exceptional Staff Service",
            "user": "Lynnette B"
        },
        {
            "date": "November 11, 2011",
            "detail_rating": {
                "business": null,
                "cleanliness": 5.0,
                "desk": null,
                "location": 5.0,
                "pool": null,
                "restaurant": null,
                "rooms": 5.0,
                "service": 5.0,
                "sleep": 5.0,
                "value": 4.0
            },
            "helpfulness": null,
            "id": 120476888,
            "likes": {
                "disliked": null,
                "liked": null
            },
            "rating": 3.0,
            "stay_parameters": "Stayed October 2011, traveled with family",
            "text": "This is a fairly typical Intercontinental in terms of its facilities etc. It is pricey, but one would expect that given its location and its target clientele.",
            "title": "Security",
            "user": "MickGloriaBrisbane"
        },
        {
            "date": "November 4, 2011",
            "detail_rating": {
                "business": null,
                "cleanliness": 5.0,
                "desk": null,
                "location": 5.0,
                "pool": null,
                "restaurant": null,
                "rooms": 5.0,
                "service": 4.0,
                "sleep": null,
                "value": 4.0
            },
            "helpfulness": 2,
            "id": 120156891,
            "likes": {
                "disliked": null,
                "liked": null
            },
            "rating": 5.0,
            "stay_parameters": "Stayed October 2011",
            "text": "I do have a serious security isue with this hotel. The telephones in the rooms are cordless and ours didn't work (possibly flat batteries. OK, I went down from the eleventh floor and picked up new batteries). However, Johannesburg being Johannesburg, the question comes up if one didn't know the phone didn't work and there was a series of strange noises outside the room in the middle of the night or if there was a fire, how does one contact the desk. Again, Johannesburg being Jhannesburg, I'm not going to poke my head outside the door to investigate!!",
            "title": "Best place to rest between flights",
            "user": "AlineGF"
        },
        {
            "date": "November 3, 2011",
            "detail_rating": {
                "business": null,
                "cleanliness": 5.0,
                "desk": null,
                "location": 5.0,
                "pool": null,
                "restaurant": null,
                "rooms": 4.0,
                "service": 3.0,
                "sleep": 5.0,
                "value": 2.0
            },
            "helpfulness": null,
            "id": 120103047,
            "likes": {
                "disliked": null,
                "liked": null
            },
            "rating": 4.0,
            "stay_parameters": "Stayed October 2011, traveled as a couple",
            "text": "Ditch the cordless phones and replace them with hard wired ones. They may not be as glamourous but at least they work.",
            "title": "Four and a half star hotel at six star price",
            "user": "BeachSwaggie"
        },
        {
            "date": "November 2, 2011",
            "detail_rating": {
                "business": null,
                "cleanliness": 5.0,
                "desk": null,
                "location": 5.0,
                "pool": null,
                "restaurant": null,
                "rooms": 5.0,
                "service": 5.0,
                "sleep": 5.0,
                "value": 3.0
            },
            "helpfulness": 1,
            "id": 120068016,
            "likes": {
                "disliked": null,
                "liked": null
            },
            "rating": 5.0,
            "stay_parameters": "Stayed September 2011, traveled as a couple",
            "text": "I stayed at this hotel for only a few hours heading to Seychelles. The hotel is great, very calm and clean, just across the street from the airport. As I had 10 hours to wait the flight, I loved resting in an excellent bed and watch DVDs, just after a bubble bath.",
            "title": "Top hotel, but top price, too!",
            "user": "Ken-Mandy"
        },
        {
            "date": "December 8, 2011",
            "detail_rating": {
                "business": null,
                "cleanliness": 5.0,
                "desk": null,
                "location": 5.0,
                "pool": null,
                "restaurant": null,
                "rooms": 5.0,
                "service": 4.0,
                "sleep": 5.0,
                "value": 5.0
            },
            "helpfulness": null,
            "id": 121535454,
            "likes": {
                "disliked": null,
                "liked": null
            },
            "rating": 5.0,
            "stay_parameters": "Stayed November 2011, traveled on business",
            "text": "Great hotel, walking distance to Tambo Airport in Joburg, you literally just walk across the arrivals area and you're there! Very clean and the bathroom is awesome. Great coffee machine in each room! Concierge was very helpful in our duty free selection. You get what you pay for with this classy hotel.",
            "title": "5 star accommodation",
            "user": "shoptiludrop1"
        },
        {
            "date": "November 25, 2011",
            "detail_rating": {
                "business": null,
                "cleanliness": 5.0,
                "desk": null,
                "location": 5.0,
                "pool": null,
                "restaurant": null,
                "rooms": 5.0,
                "service": 5.0,
                "sleep": 5.0,
                "value": 4.0
            },
            "helpfulness": null,
            "id": 121013901,
            "likes": {
                "disliked": null,
                "liked": null
            },
            "rating": 5.0,
            "stay_parameters": "Stayed November 2011, traveled on business",
            "text": "Because of stop over from Amsterdam to Port Elizabeth I stayed in Intercontinental Tambo Airport. It was a very nice experience, but because of late arrival and early flight in the morning I only experienced my room. However, room was very comfortable. Because of my short stay costs per hour was quite high.",
            "title": "Too short stay",
            "user": "Ole S"
        },
        {
            "date": "November 25, 2011",
            "detail_rating": {
                "business": null,
                "cleanliness": 5.0,
                "desk": null,
                "location": 4.0,
                "pool": null,
                "restaurant": null,
                "rooms": 5.0,
                "service": 4.0,
                "sleep": 5.0,
                "value": 3.0
            },
            "helpfulness": null,
            "id": 121013320,
            "likes": {
                "disliked": null,
                "liked": null
            },
            "rating": 4.0,
            "stay_parameters": "Stayed December 2010, traveled with friends",
            "text": "Will extend my stay during next vist.",
            "title": "Nice but expensive",
            "user": "Catherine A Mc D"
        },
        {
            "date": "November 24, 2011",
            "detail_rating": {
                "business": null,
                "cleanliness": 5.0,
                "desk": null,
                "location": 5.0,
                "pool": null,
                "restaurant": null,
                "rooms": 5.0,
                "service": 5.0,
                "sleep": 5.0,
                "value": 4.0
            },
            "helpfulness": 2,
            "id": 121003501,
            "likes": {
                "disliked": null,
                "liked": null
            },
            "rating": 5.0,
            "stay_parameters": "Stayed November 2011, traveled as a couple",
            "text": "Ole Sindberg",
            "title": "Best airport hotel I've ever stayed in!",
            "user": "plugga_syd"
        },
        {
            "date": "November 14, 2011",
            "detail_rating": {
                "business": null,
                "cleanliness": 5.0,
                "desk": null,
                "location": 5.0,
                "pool": null,
                "restaurant": null,
                "rooms": 5.0,
                "service": 5.0,
                "sleep": null,
                "value": 4.0
            },
            "helpfulness": 3,
            "id": 120578564,
            "likes": {
                "disliked": null,
                "liked": null
            },
            "rating": 4.0,
            "stay_parameters": "Stayed May 2011",
            "text": "Lovely hotel - good rooms and bathrooms and good available eating areas with bar and swimming pool. Very expensive though.",
            "title": "Everything u expected from a five star hotel but service is 6 stars!",
            "user": "Herman_Zaidin"
        },
        {
            "date": "October 31, 2011",
            "detail_rating": {
                "business": null,
                "cleanliness": 5.0,
                "desk": null,
                "location": 5.0,
                "pool": null,
                "restaurant": null,
                "rooms": 5.0,
                "service": 4.0,
                "sleep": 5.0,
                "value": 4.0
            },
            "helpfulness": 2,
            "id": 119943346,
            "likes": {
                "disliked": null,
                "liked": null
            },
            "rating": 5.0,
            "stay_parameters": "Stayed October 2011, traveled as a couple",
            "text": "If your plans call for a restful night in transit this is the spot. Very well located. Rooms extremely comfortable. Our first room had an unpleasant garage view so we asked for a higher level and better view and were accommodated. restaurant is good but pricey. There are quite a few less expensive food choices in the airport terminal.",
            "title": "Incredibly Convenient and Comfortable",
            "user": "Boomer_from_Boulder"
        },
        {
            "date": "October 27, 2011",
            "detail_rating": {
                "business": null,
                "cleanliness": 5.0,
                "desk": null,
                "location": 5.0,
                "pool": null,
                "restaurant": null,
                "rooms": 5.0,
                "service": 5.0,
                "sleep": 5.0,
                "value": 5.0
            },
            "helpfulness": 1,
            "id": 119803279,
            "likes": {
                "disliked": null,
                "liked": null
            },
            "rating": 5.0,
            "stay_parameters": "Stayed October 2011, traveled with family",
            "text": "This hotel was a very pleasant surprise. At first I was very apprehensive about staying at an \"airport\" hotel but quickly realized I had nothing to be worried about. The service was phenomonal and never heard ANY airplane noise at ALL. The concierge arranged for a couple of tours with a driver on very short notice. Hotel room was just lovely, and I loved having a Nepresso machine in our room. It was very easy to walk to the terminal and take the new Gautrain into Sandton and other areas. Beautiful way to get around Joburg! The staff was excellent. Only goof up was that we placed a breakfast the night before over the phone that evidently got lost but they quickly sent us up another order. The hotel has gone to great lenghts to make this not your typical airport hotel, excellent choice.",
            "title": "2 day stay",
            "user": "Ann Shannon C"
        },
        {
            "date": "October 26, 2011",
            "detail_rating": {
                "business": null,
                "cleanliness": 5.0,
                "desk": null,
                "location": 5.0,
                "pool": null,
                "restaurant": null,
                "rooms": 4.0,
                "service": 4.0,
                "sleep": 5.0,
                "value": 4.0
            },
            "helpfulness": 1,
            "id": 119775580,
            "likes": {
                "disliked": null,
                "liked": null
            },
            "rating": 4.0,
            "stay_parameters": "Stayed September 2011, traveled as a couple",
            "text": "We only stayed for one night on a stopover between flights. The hotel is literally across the road from the terminal exit doors. No need for a taxi or shuttle. We had pre-booked and the check-in was very efficient.",
            "title": "Comforatble and Convenient",
            "user": "OzSooty"
        },
        {
            "date": "October 19, 2011",
            "detail_rating": {
                "business": null,
                "cleanliness": 5.0,
                "desk": null,
                "location": 5.0,
                "pool": null,
                "restaurant": null,
                "rooms": 5.0,
                "service": 5.0,
                "sleep": 5.0,
                "value": 4.0
            },
            "helpfulness": 1,
            "id": 119478185,
            "likes": {
                "disliked": null,
                "liked": null
            },
            "rating": 5.0,
            "stay_parameters": "Stayed October 2011, traveled as a couple",
            "text": "The standard room was a good size and included an inroom safe and Wifi. Curtains provided excellent blackout and there was no airport noise. Very comfortable queen size bed, soft and soft pillows. The bathroom included a separate bath and shower (although tall people may find the bath a fraction on the shorter side).",
            "title": "Excellent airport hotel",
            "user": "llewellynroger"
        },
        {
            "date": "October 3, 2011",
            "detail_rating": {
                "business": null,
                "cleanliness": 5.0,
                "desk": null,
                "location": 5.0,
                "pool": null,
                "restaurant": null,
                "rooms": 5.0,
                "service": 5.0,
                "sleep": 5.0,
                "value": 5.0
            },
            "helpfulness": 1,
            "id": 118882193,
            "likes": {
                "disliked": null,
                "liked": null
            },
            "rating": 5.0,
            "stay_parameters": "Stayed June 2011, traveled as a couple",
            "text": "Although we didn't eat that night, the Quills restaurant looked appealing. It had a South African influenced menu, with fish and vegetarian offerings, and a suitably extensive wine list incluing six or so 'by the glass' options. (I am not sure what other dining options are nearby, if any.)",
            "title": "Wonderfully Convenient",
            "user": "Wahzah"
        }
    ],
    "slim_ranking": 0.0869565217391,
    "stars": 5,
    "tripadvisor": {
        "VISITED": false,
        "country_name": null,
        "locality": null,
        "pic_link": null,
        "street_address": null
    },
    "user_rating": 4.5,
    "variance": {
        "average": 27,
        "excellent": 281,
        "poor": 10,
        "terrible": 4,
        "very good": 127
    }
}