{
    "aka": null,
    "description": "Spacious luxury 2 bedroom, 2 bathroom, serviced Apartments right on Jomtien Beachfront! With Satellite TV, WiFi, Daily Service & Weekly Linen, these are truly a home from home. Just walk out the security gates and you're on the beach amidst the restaurants and nightlife of Jomtien.",
    "detail_rating": {
        "cleanliness": null,
        "location": null,
        "rooms": null,
        "service": null,
        "sleep": null,
        "value": null
    },
    "location": {
        "city": null,
        "continent": "Asia",
        "country": "Thailand",
        "proposed_city": null,
        "province": null,
        "region": null
    },
    "name": "Panchalae Boutique Residences",
    "places": {
        "aka": [],
        "hotel_description": [],
        "hotel_name": []
    },
    "review_count": 19,
    "review_count_current": 13,
    "reviews": [
        {
            "date": "February 20, 2011",
            "detail_rating": {
                "business": null,
                "cleanliness": 1.0,
                "desk": null,
                "location": 1.0,
                "pool": null,
                "restaurant": null,
                "rooms": 1.0,
                "service": 1.0,
                "sleep": null,
                "value": 1.0
            },
            "helpfulness": 1,
            "id": 97295454,
            "likes": {
                "disliked": null,
                "liked": null
            },
            "rating": 1.0,
            "stay_parameters": "Stayed January 2011, traveled with family",
            "text": "this can only be described as a tenement built on 2 acres of waste ground, the block interiour was was soleless and dirty, the apartment was big enough, but in desperate need of refurbishing, the terrace furnitrure was so broken down as to be dangerious to sit on, and we had to climb on a chair to switch on the AC. a visit to the pool area was beond belief, there was a sign saying under repair and the place looked like an eco desaster zone, with garbage and pool chairs strewn around and the pool half full of swamp water. We stayed two hours and then checked into a hotel up the road even though we paid in advance. Dont go there!",
            "title": "Shockingly bad",
            "user": "StPatrick17"
        },
        {
            "date": "November 18, 2010",
            "detail_rating": {
                "business": null,
                "cleanliness": 4.0,
                "desk": null,
                "location": 4.0,
                "pool": null,
                "restaurant": null,
                "rooms": 4.0,
                "service": 3.0,
                "sleep": 4.0,
                "value": 3.0
            },
            "helpfulness": null,
            "id": 87511603,
            "likes": {
                "disliked": null,
                "liked": null
            },
            "rating": 4.0,
            "stay_parameters": "Stayed November 2010, traveled with family",
            "text": "These apartments are of good value, and are situated in a prime location a short walk from the beach, shops bars and restaurants.The Salotto Cafe was exceptionally good for food and friendliness.If you want to go into the heart of Pattaya you only have to get the bart bus at the end of the road. Our only negative view would be the pool which was a little murky and didnt fancy using it, however we would not hesitate to return again, as it was quiet and within distance of all amenities.",
            "title": "A very pleasant Residence",
            "user": "min3"
        },
        {
            "date": "November 11, 2010",
            "detail_rating": {
                "business": null,
                "cleanliness": null,
                "desk": null,
                "location": null,
                "pool": null,
                "restaurant": null,
                "rooms": null,
                "service": null,
                "sleep": null,
                "value": null
            },
            "helpfulness": null,
            "id": 86743528,
            "likes": {
                "disliked": null,
                "liked": null
            },
            "rating": 5.0,
            "stay_parameters": null,
            "text": "Stayed here with my wife and 15 year old daughter.The apartment we stayed in was perfect owned by gregg. Nothing was to much trouble the staff and security were brilliant position of the property was perfect for the beach and restaurants als it is just a 10 min ride on a baht bus to central pattaya gregg and his wife also have a restaurant next to panchalae where the food is excellent and they do a great mohito all very reasonably priced we have booked again for 3 weeks again in dec/jan in a larger ground floor apartment and really cant wait to return so i really do recommend this property and take no notice of any negative reviews sometimes people just look for negatives but we are yet to find any.",
            "title": "perfect",
            "user": "gamelg"
        },
        {
            "date": "May 23, 2010",
            "detail_rating": {
                "business": null,
                "cleanliness": 1.0,
                "desk": null,
                "location": 5.0,
                "pool": null,
                "restaurant": null,
                "rooms": 3.0,
                "service": 1.0,
                "sleep": 3.0,
                "value": 2.0
            },
            "helpfulness": 1,
            "id": 65037544,
            "likes": {
                "disliked": null,
                "liked": null
            },
            "rating": 2.0,
            "stay_parameters": "Stayed May 2010, traveled with family",
            "text": "Stayed here with my family for one week. Plusses are that the appartments are very spacious with a huge living room with sofa, DVD,TV, and free WIFI, kitchen with everything you need, two bedrooms, two bathrooms and a big outdoor veranda (although no view, only backyard of the neighbours but since the beach is around the corner not a problem). Style is modern and very simple but fine. Also a very good location, 100 meters walk from the beach and close to restaurants and shops. So at checkin I was happy but after a few days we noticed lack of maintance and service, staff are nice but not interested to make your stay comfortable at all (apart from the guard at the road enterance, he was very sweet, helpfull and welcoming). Which means our appartment was bearly cleaned (could wright my name on the bedside table, appartment was only cleaned few times in a full week only sweeping the floor and a highspeed mop at 5 pm only because we asked!). Some days there wasn't cleaned at all and our carbage (kitchen!) was smelling away for a few days, nowhere to get rid of it (I wouldn't have mind doing it myself but nobody cared to explain where). Cleaning lady was mostly 'chilling out' outside the building when we came back from a day sightseeing not intending to do any work (we did get a nice smile and hello though). One day when she did a quick sweep through the appartment we noticed later she left all balcony doors unlocked....bit uncarefull. The worst was we didn't even had one towel change in one week!!! I knew in advance that they noticed on their website if you stay one week you only get a towel change twice, which is fine if you know in advance but no towel change at all is just very guest unfriendly. After 5 days we decided to buy ourselves some new towels....When we complained at the 'frontdesk' they said to go tell the cleaning lady ourselves.....OK???? Further we noticed little things kept unrepaired everywhere, from lightbulbs that were broken, parts of the door and floor beeing broken and eaten by termites, hughe brown stains in the curtains, pond in the garden green and empty, tiles at the pool broken.... all little things but it gave us the feeling nobody cares, in few years it will probably look terrible if it continues like this. Eveything is dusting away! So overall it was ok, the location and space inside were enjoyable but the 'no service' attitude did cause some irritation which is a pitty, beeing on holiday it would have been nice to come back after you day out in a cleaned place! We know it's not a hotel but cleaning/towel change was inluded and for what we paid (24.000 bath/week) we feel they could have a least have the appartment sweeped and mopped once a day + emptying the bins. Won't recommend and won't return......",
            "title": "OK but starts to get rundown....",
            "user": "Eefladya"
        },
        {
            "date": "January 10, 2010",
            "detail_rating": {
                "business": null,
                "cleanliness": 5.0,
                "desk": null,
                "location": 5.0,
                "pool": null,
                "restaurant": null,
                "rooms": 5.0,
                "service": 5.0,
                "sleep": null,
                "value": 5.0
            },
            "helpfulness": null,
            "id": 53129033,
            "likes": {
                "disliked": null,
                "liked": null
            },
            "rating": 5.0,
            "stay_parameters": "Stayed December 2009, traveled on business",
            "text": "The Panchalae apartments at Jomtien beach offers a more boutique style accommodation experience unlike other resorts in the area. Its location is close to all attractions of both Jomtien and Pattaya areas however not overcrowded by tourists. The apartment itself has an excellent layout with a large kitchen/living area and 2 x generious sized double bedrooms both with ensuites. Additional luxuries such as a LCD TV and air-conditioned rooms are included making sure our stay was more than comfortable. The room was serviced each day and kept very clean. The apartment complex was quiet at all times and the office staff and security were friendly and helpful.",
            "title": "First class apartments at Panchalae Jomtien",
            "user": "leftybass"
        },
        {
            "date": "December 8, 2008",
            "detail_rating": {
                "business": 5.0,
                "cleanliness": 5.0,
                "desk": null,
                "front_desk": 4.0,
                "location": 5.0,
                "pool": null,
                "restaurant": null,
                "rooms": 5.0,
                "service": 5.0,
                "sleep": null,
                "value": 5.0
            },
            "helpfulness": 1,
            "id": 22565130,
            "likes": {
                "disliked": null,
                "liked": "\u2014 it's totality"
            },
            "rating": 5.0,
            "stay_parameters": "Stayed October 2008, traveled with family",
            "text": "I know it's been a long time since our stay for this review. But as the quote say \" It's better late than never \". england pauline is my mother inlaw I agree totally on what she've said but in addition to it, no lies what you see in the website is what you get in the real thing with additions by your request. The personnels are so nice to us. TWO THUMBS UP!!!",
            "title": "We've Bonded",
            "user": "presya"
        },
        {
            "date": "November 5, 2008",
            "detail_rating": {
                "business": 5.0,
                "cleanliness": 5.0,
                "desk": null,
                "front_desk": 5.0,
                "location": 3.0,
                "pool": null,
                "restaurant": null,
                "rooms": 5.0,
                "service": 5.0,
                "sleep": null,
                "value": 5.0
            },
            "helpfulness": 2,
            "id": 21563440,
            "likes": {
                "disliked": "\u2014 N/A",
                "liked": "\u2014 it was perfect for the holiday we wanted"
            },
            "rating": 5.0,
            "stay_parameters": "Stayed October 2008, traveled with family",
            "text": "pauline england",
            "title": "super apartment (luxury)",
            "user": "englandpauline"
        },
        {
            "date": "May 7, 2008",
            "detail_rating": {
                "business": 5.0,
                "cleanliness": null,
                "desk": null,
                "front_desk": 5.0,
                "location": 5.0,
                "pool": null,
                "restaurant": null,
                "rooms": 4.0,
                "service": 4.0,
                "sleep": null,
                "value": 5.0
            },
            "helpfulness": 3,
            "id": 15755419,
            "likes": {
                "disliked": "\u2014 nothing",
                "liked": "\u2014 Size and quality"
            },
            "rating": 5.0,
            "stay_parameters": "Stayed April 2008, traveled with friends",
            "text": "stayed in this luxury apartment in october there were 4 adults and 1child in our party it was super 2 large bedrooms,2 bathrooms and loads of living space, very comfortable and clean, good pool (quite warm), quiet area away from traffic,lots of eating places and shops nearby would reccomend this apartment for all age groups.",
            "title": "Great Place to Stay",
            "user": "Malcolm9"
        },
        {
            "date": "January 7, 2010",
            "detail_rating": {
                "business": null,
                "cleanliness": 4.0,
                "desk": null,
                "location": 5.0,
                "pool": null,
                "restaurant": null,
                "rooms": 5.0,
                "service": 4.0,
                "sleep": null,
                "value": 4.0
            },
            "helpfulness": null,
            "id": 52829698,
            "likes": {
                "disliked": null,
                "liked": null
            },
            "rating": 4.0,
            "stay_parameters": "Stayed December 2009, traveled as a couple",
            "text": "We come back. Great stay nearby everything. Great rooms, friendly and helpfull staff. The only little minus was that there were some problems with the pool. But management promised to fix everything in th low season.",
            "title": "great quit condo nearby everything",
            "user": "johnvanw"
        },
        {
            "date": "October 11, 2009",
            "detail_rating": {
                "business": 4.0,
                "cleanliness": 5.0,
                "desk": null,
                "front_desk": 4.0,
                "location": 4.0,
                "pool": null,
                "restaurant": null,
                "rooms": 5.0,
                "service": 5.0,
                "sleep": null,
                "value": 5.0
            },
            "helpfulness": null,
            "id": 46508554,
            "likes": {
                "disliked": null,
                "liked": null
            },
            "rating": 5.0,
            "stay_parameters": "Stayed October 2009, traveled with family",
            "text": "We had a superb holiday",
            "title": "Perfect place to stay",
            "user": "tulle123"
        },
        {
            "date": "July 21, 2009",
            "detail_rating": {
                "business": null,
                "cleanliness": 5.0,
                "desk": null,
                "location": 4.0,
                "pool": null,
                "restaurant": null,
                "rooms": 5.0,
                "service": 5.0,
                "sleep": null,
                "value": 5.0
            },
            "helpfulness": null,
            "id": 35351672,
            "likes": {
                "disliked": null,
                "liked": null
            },
            "rating": 5.0,
            "stay_parameters": "Stayed June 2009, traveled with family",
            "text": "John and Christine",
            "title": "Isn't it always a gamble ? this one paid off.",
            "user": "ongiara"
        },
        {
            "date": "June 10, 2009",
            "detail_rating": {
                "business": null,
                "cleanliness": 5.0,
                "desk": null,
                "location": 5.0,
                "pool": null,
                "restaurant": null,
                "rooms": 5.0,
                "service": 5.0,
                "sleep": null,
                "value": 5.0
            },
            "helpfulness": 2,
            "id": 32040302,
            "likes": {
                "disliked": null,
                "liked": null
            },
            "rating": 5.0,
            "stay_parameters": "Stayed May 2009, traveled with family",
            "text": "Me and my husband stayed with our 5 month baby boy at Panchalae for 5 weeks, and all staff where so nice and helpful. Our housekeeper did also babysit our son a couple of times so we could go out for dinner.",
            "title": "Close your eyes & BOOK!",
            "user": "ruch69"
        },
        {
            "date": "March 17, 2009",
            "detail_rating": {
                "business": null,
                "cleanliness": 4.0,
                "desk": null,
                "location": 5.0,
                "pool": null,
                "restaurant": null,
                "rooms": 4.0,
                "service": 3.0,
                "sleep": null,
                "value": 4.0
            },
            "helpfulness": 1,
            "id": 26303320,
            "likes": {
                "disliked": null,
                "liked": null
            },
            "rating": 4.0,
            "stay_parameters": "Stayed August 2008, traveled with family",
            "text": "The appartment was very nice, and has all you need. Housekeeping everyday.",
            "title": "Definitely recommendable.",
            "user": "Panchalae"
        }
    ],
    "slim_ranking": 0.248484848485,
    "stars": 4,
    "tripadvisor": {
        "VISITED": false,
        "country_name": null,
        "locality": null,
        "pic_link": null,
        "street_address": null
    },
    "user_rating": 4.0,
    "variance": {
        "average": 0,
        "excellent": 11,
        "poor": 3,
        "terrible": 1,
        "very good": 4
    }
}