{
    "aka": "Sheraton Tokyo",
    "description": null,
    "detail_rating": {
        "cleanliness": 4.0,
        "location": 3.5,
        "rooms": 4.0,
        "service": 4.0,
        "sleep": 4.0,
        "value": 4.0
    },
    "location": {
        "city": null,
        "continent": "Asia",
        "country": "Japan",
        "proposed_city": "Tokyo",
        "province": null,
        "region": "Kanto"
    },
    "name": "Sheraton Miyako Hotel Tokyo",
    "places": {
        "aka": [
            "Tokyo"
        ],
        "hotel_description": [],
        "hotel_name": [
            "Miyako",
            "Tokyo"
        ]
    },
    "review_count": 635,
    "review_count_current": 36,
    "reviews": [
        {
            "date": "June 16, 2009",
            "detail_rating": {
                "business": null,
                "cleanliness": 5.0,
                "desk": null,
                "location": 4.0,
                "pool": null,
                "restaurant": null,
                "rooms": 4.0,
                "service": 5.0,
                "sleep": null,
                "value": 5.0
            },
            "helpfulness": null,
            "id": 32492600,
            "likes": {
                "disliked": null,
                "liked": null
            },
            "rating": 4.0,
            "stay_parameters": "Stayed June 2009, traveled as a couple",
            "text": "Just returned from 2 nights here.",
            "title": "A hidden gem",
            "user": "West_Coast_YVR"
        },
        {
            "date": "June 8, 2009",
            "detail_rating": {
                "business": null,
                "cleanliness": 5.0,
                "desk": null,
                "location": 4.0,
                "pool": null,
                "restaurant": null,
                "rooms": 4.0,
                "service": 5.0,
                "sleep": null,
                "value": 5.0
            },
            "helpfulness": 1,
            "id": 31898812,
            "likes": {
                "disliked": null,
                "liked": null
            },
            "rating": 5.0,
            "stay_parameters": "Stayed June 2009, traveled as a couple",
            "text": "Found service to be highly personalized by everyone we encountered. All of the staff went out of their way to help with the simplest of our requests (i.e., the girl at the bell desk went on line to calculate time/distances between train stations to ensure we allowed enough time not to be late for a reservation!).",
            "title": "Fantastic Hotel in Quiet Neighbourhood",
            "user": "JERVancouver_BC"
        },
        {
            "date": "May 14, 2009",
            "detail_rating": {
                "business": null,
                "cleanliness": 5.0,
                "desk": null,
                "location": 3.0,
                "pool": null,
                "restaurant": null,
                "rooms": 4.0,
                "service": 5.0,
                "sleep": null,
                "value": 4.0
            },
            "helpfulness": 1,
            "id": 29960190,
            "likes": {
                "disliked": null,
                "liked": null
            },
            "rating": 4.0,
            "stay_parameters": "Stayed April 2009, traveled on business",
            "text": "Booked on cash and points and the only option at time of rez was 2 single beds. Asked at check-in for a king bed but agent gave me a dumbfounded glare and re-confirmed my request for 2 beds. Since my knowledge of the language is non-existant, I didn't pursue it. And to be honest, it was nice not having anyone steal my covers for two nights! At $60 per night (converted to 5700 Yen) this was a bargain!",
            "title": "Another nice hotel in Tokyo",
            "user": "Minoue-Sisteron"
        },
        {
            "date": "April 18, 2009",
            "detail_rating": {
                "business": null,
                "cleanliness": 5.0,
                "desk": null,
                "location": 3.0,
                "pool": null,
                "restaurant": null,
                "rooms": 4.0,
                "service": 5.0,
                "sleep": null,
                "value": 4.0
            },
            "helpfulness": 1,
            "id": 28253530,
            "likes": {
                "disliked": null,
                "liked": null
            },
            "rating": 5.0,
            "stay_parameters": "Stayed April 2009, traveled on business",
            "text": "On arrival from NRT, we stopped by the JR Service Center and purchased the NEX/Suica combo. Had found directions on hotel website to give to driver once we arrived at Shinagawa Stn. which worked like clock-work. On our second day, we actually ventured back from Shinagawa Stn on foot and discovered a lovely residential neighbourhood with a school and temple within it. In all, it was a slow 25 minute walk with a few wrong turns along the way!",
            "title": "great hotel, good price and location not that bad",
            "user": "travelwellallthetime"
        },
        {
            "date": "March 20, 2009",
            "detail_rating": {
                "business": null,
                "cleanliness": 5.0,
                "desk": null,
                "location": 5.0,
                "pool": null,
                "restaurant": null,
                "rooms": 5.0,
                "service": 5.0,
                "sleep": null,
                "value": 5.0
            },
            "helpfulness": 2,
            "id": 26484959,
            "likes": {
                "disliked": null,
                "liked": null
            },
            "rating": 5.0,
            "stay_parameters": "Stayed March 2009, traveled on business",
            "text": "We used the shuttle to Meguro Stn a number of times and highly recommend it! We also walked down the street one time to Meguro Stn once so we could do some window shopping and stop into the 100 Yen store. Our first night, we were able to find the supermarket to pick up some Saki (to bring home) and some pastries and OJ to make our own Gold Member's continental breakfast!",
            "title": "High quality, with a friendly ambiance",
            "user": "SongOfTheRoad"
        },
        {
            "date": "August 2, 2009",
            "detail_rating": {
                "business": null,
                "cleanliness": 4.0,
                "desk": null,
                "location": 4.0,
                "pool": null,
                "restaurant": null,
                "rooms": 2.0,
                "service": 2.0,
                "sleep": null,
                "value": 2.0
            },
            "helpfulness": 3,
            "id": 36472456,
            "likes": {
                "disliked": null,
                "liked": null
            },
            "rating": 3.0,
            "stay_parameters": "Stayed June 2009, traveled on business",
            "text": "I was staying at Sheraton Miyako in June for one week with a number of colleagues and the fact that there were many of us in the same hotel helped to make some observations regarding the rooms and services. Overall, I would seriously suggest that the hotel either lowers its prices and rates itself as a 3 star hotel max, or does some changes quickly.",
            "title": "Below Sheraton standards, SPG membership means little",
            "user": "mijansso"
        },
        {
            "date": "July 13, 2009",
            "detail_rating": {
                "business": null,
                "cleanliness": 4.0,
                "desk": null,
                "location": 2.0,
                "pool": null,
                "restaurant": null,
                "rooms": 4.0,
                "service": 5.0,
                "sleep": null,
                "value": 3.0
            },
            "helpfulness": 1,
            "id": 34595230,
            "likes": {
                "disliked": null,
                "liked": null
            },
            "rating": 4.0,
            "stay_parameters": "Stayed July 2009, traveled as a couple",
            "text": "1. Room sizes vary *A LOT*..! Some of my colleagues managed to get a room at least twice as large as mine, whereas some of us were housed in rooms that were truly tiny - some of the smallest rooms I have seen anywhere inclusive of motels and express hotels!! I had a large nice bed in my room, but with the other somewhat oversized furniture (TV-cabinet/minibar combo, a small mini couch, tiny round \"work table\" and a chair) there, there was barely enough room for me to walk between the minicouche and my bed!! So beware and ask for a new larger room if you get stuffed in one of these \"cubicles\". And yes, even SPG Platinum and Gold members are put in these tiny rooms - forget about upgrades..",
            "title": "Very nice...from the inside",
            "user": "OCtraveler34"
        },
        {
            "date": "July 2, 2009",
            "detail_rating": {
                "business": null,
                "cleanliness": 3.0,
                "desk": null,
                "location": 2.0,
                "pool": null,
                "restaurant": null,
                "rooms": 3.0,
                "service": 4.0,
                "sleep": null,
                "value": 3.0
            },
            "helpfulness": 1,
            "id": 33738799,
            "likes": {
                "disliked": null,
                "liked": null
            },
            "rating": 3.0,
            "stay_parameters": "Stayed June 2009, traveled on business",
            "text": "2. If you arrive before 1PM, most likely your room will not be ready and you must wait, despite of giving the hotel a warning about an early arrival / not. And this goes also for Gold & Platinum SPG members.",
            "title": "Slightly disappointed",
            "user": "woodtiger"
        },
        {
            "date": "June 21, 2009",
            "detail_rating": {
                "business": null,
                "cleanliness": 4.0,
                "desk": null,
                "location": 4.0,
                "pool": null,
                "restaurant": null,
                "rooms": 3.0,
                "service": 5.0,
                "sleep": null,
                "value": 3.0
            },
            "helpfulness": null,
            "id": 32822744,
            "likes": {
                "disliked": null,
                "liked": null
            },
            "rating": 3.0,
            "stay_parameters": "Stayed June 2009, traveled with family",
            "text": "3. About the swimmingpool: It is stated that it is open until 9PM, however after 8PM SHARP you will not be allowed in. I gather they are worried about being able to close the place precisely as the clock strikes 9PM. No exceptions to this rule.",
            "title": "Outdated Rooms",
            "user": "GhoTravel"
        },
        {
            "date": "June 17, 2009",
            "detail_rating": {
                "business": null,
                "cleanliness": 2.0,
                "desk": null,
                "location": 4.0,
                "pool": null,
                "restaurant": null,
                "rooms": 2.0,
                "service": 5.0,
                "sleep": null,
                "value": 3.0
            },
            "helpfulness": null,
            "id": 32553769,
            "likes": {
                "disliked": null,
                "liked": null
            },
            "rating": 2.0,
            "stay_parameters": "Stayed June 2009, traveled as a couple",
            "text": "4. There is a very nice Bose radio / clock set in every room on the tiny round desk, but the TV's are well outdated and often as small as 17\" screens. Very few channels exist to watch in a language other than Japanese.",
            "title": "Price is excellent, but too much smoking everywhere....",
            "user": "ritzB8"
        },
        {
            "date": "January 30, 2009",
            "detail_rating": {
                "business": 5.0,
                "cleanliness": 5.0,
                "desk": null,
                "front_desk": 5.0,
                "location": 3.0,
                "pool": null,
                "restaurant": null,
                "rooms": 5.0,
                "service": 5.0,
                "sleep": null,
                "value": 4.0
            },
            "helpfulness": 1,
            "id": 24029706,
            "likes": {
                "disliked": "\u2014 I didn't dislike anything !",
                "liked": "\u2014 the swimmingpool ! ! !"
            },
            "rating": 4.0,
            "stay_parameters": "Stayed September 2008, traveled on business",
            "text": "the rooms are excellent. Tokyo is expensive city but this hotel has a price ressonable.",
            "title": "Swimpool in Tokyo ! ! !",
            "user": "acustiga"
        },
        {
            "date": "January 9, 2009",
            "detail_rating": {
                "business": 4.0,
                "cleanliness": 5.0,
                "desk": null,
                "front_desk": 5.0,
                "location": 2.0,
                "pool": null,
                "restaurant": null,
                "rooms": 4.0,
                "service": 4.0,
                "sleep": null,
                "value": 3.0
            },
            "helpfulness": 8,
            "id": 23395853,
            "likes": {
                "disliked": "\u2014 The location and the small bathroom.",
                "liked": "\u2014 The lobby area and the look of the rooms."
            },
            "rating": 3.0,
            "stay_parameters": "Stayed December 2008, traveled as a couple",
            "text": "If you book a room here you have acess to the 25 meters pool located in the gym club on the groung floor for free. The free buffet breakfast is excellent and all the personnel say \"good morning\" \"hello\" \"have a nice day\" etc all the time.",
            "title": "An off-located Four Star Hotel in Tokyo",
            "user": "MRIII"
        },
        {
            "date": "December 7, 2008",
            "detail_rating": {
                "business": null,
                "cleanliness": null,
                "desk": null,
                "location": null,
                "pool": null,
                "restaurant": null,
                "rooms": null,
                "service": null,
                "sleep": null,
                "value": null
            },
            "helpfulness": 2,
            "id": 22527311,
            "likes": {
                "disliked": null,
                "liked": null
            },
            "rating": 5.0,
            "stay_parameters": null,
            "text": "Service is always quick and you may ask whatever information about the city, Japan or whatever you need to the two persons located in the lobby. They know absolutely everything.",
            "title": "Very Nice Business/Tourist Hotel",
            "user": "GerOpp"
        },
        {
            "date": "September 17, 2008",
            "detail_rating": {
                "business": 5.0,
                "cleanliness": 5.0,
                "desk": null,
                "front_desk": 4.0,
                "location": 4.0,
                "pool": null,
                "restaurant": null,
                "rooms": 5.0,
                "service": 5.0,
                "sleep": null,
                "value": 5.0
            },
            "helpfulness": 2,
            "id": 20159438,
            "likes": {
                "disliked": "\u2014 the hotel food wasn't that good",
                "liked": "\u2014 Everything"
            },
            "rating": 5.0,
            "stay_parameters": "Stayed September 2008, traveled solo",
            "text": "A convenient bus drives you to Megureo metro station for free every 15 minutes. There is connection from the hotel to Narita Airport.",
            "title": "Great hotel & Staff",
            "user": "warytraveler01"
        },
        {
            "date": "June 2, 2008",
            "detail_rating": {
                "business": 3.0,
                "cleanliness": 3.0,
                "desk": null,
                "front_desk": 3.0,
                "location": 3.0,
                "pool": null,
                "restaurant": null,
                "rooms": 3.0,
                "service": null,
                "sleep": null,
                "value": 3.0
            },
            "helpfulness": 2,
            "id": 16585754,
            "likes": {
                "disliked": "\u2014 Decor",
                "liked": "\u2014 Large rooms for Japan"
            },
            "rating": 3.0,
            "stay_parameters": "Stayed May 2008, traveled as a couple",
            "text": "My partner and I recently stayed at the Sheraton Miyako Hotel - An off-located Four Star Hotel.",
            "title": "Little out of the way",
            "user": "Charleyquant"
        },
        {
            "date": "May 21, 2008",
            "detail_rating": {
                "business": null,
                "cleanliness": 4.0,
                "desk": null,
                "front_desk": 5.0,
                "location": 4.0,
                "pool": null,
                "restaurant": null,
                "rooms": 4.0,
                "service": 5.0,
                "sleep": null,
                "value": 5.0
            },
            "helpfulness": 2,
            "id": 16290777,
            "likes": {
                "disliked": null,
                "liked": "\u2014 Shuttle service and the hotel staff."
            },
            "rating": 5.0,
            "stay_parameters": "Stayed May 2008, traveled on business",
            "text": "I'll preface the value part in that I used a few of my Starwood reward points to snag a $45 per night rate. As others have pointed out the location is not in the middle of the \"action\" or main sight-seeing clusters. That said, the free shuttle to both Meguro and Shinagawa JR train stations is very convenient. There is a subway stop on the Tokyo Metro that is about a 5 minute walk away. We used all three transportation stations and were able to get to all sights with relative ease, so I wouldn't be too worried about the location. In fact, it's nice to return to an area that's NOT crowded and a bit more relaxed.",
            "title": "Great value and staff",
            "user": "hhyamamo"
        },
        {
            "date": "May 7, 2008",
            "detail_rating": {
                "business": 3.0,
                "cleanliness": 5.0,
                "desk": null,
                "front_desk": 5.0,
                "location": 5.0,
                "pool": null,
                "restaurant": null,
                "rooms": 4.0,
                "service": 4.0,
                "sleep": null,
                "value": 3.0
            },
            "helpfulness": null,
            "id": 15783836,
            "likes": {
                "disliked": "\u2014 N/A",
                "liked": "\u2014 Location"
            },
            "rating": 5.0,
            "stay_parameters": "Stayed April 2008, traveled as a couple",
            "text": "The rooms were what you'd expect for this level of property with clean rooms, firm beds, etc. They also have those fancy Japanese bidet toilets I miss so much now that I'm back home.",
            "title": "Loved It!",
            "user": "UptownHarlem145"
        },
        {
            "date": "May 7, 2008",
            "detail_rating": {
                "business": 3.0,
                "cleanliness": 5.0,
                "desk": null,
                "front_desk": 5.0,
                "location": 2.0,
                "pool": null,
                "restaurant": null,
                "rooms": 4.0,
                "service": 5.0,
                "sleep": null,
                "value": 4.0
            },
            "helpfulness": null,
            "id": 15742541,
            "likes": {
                "disliked": null,
                "liked": null
            },
            "rating": 4.0,
            "stay_parameters": "Stayed April 2008, traveled on business",
            "text": "The staff at this hotel was excellent during my visit. From the time we arrived, during our stay and when we departed, the staff was very attentive to our needs. The one nit is the service in the California Cafe is a bit spotty in a very minor sense where food doesn't come all at once (not that late either).",
            "title": "Nice Hotel, Excellent Service, Not A Good Location",
            "user": "duke_clar"
        },
        {
            "date": "April 15, 2008",
            "detail_rating": {
                "business": 5.0,
                "cleanliness": 4.0,
                "desk": null,
                "front_desk": 2.0,
                "location": 4.0,
                "pool": null,
                "restaurant": null,
                "rooms": 1.0,
                "service": 1.0,
                "sleep": null,
                "value": 1.0
            },
            "helpfulness": null,
            "id": 15051166,
            "likes": {
                "disliked": null,
                "liked": null
            },
            "rating": 1.0,
            "stay_parameters": "Stayed April 2008, traveled with family",
            "text": "We split our visit to Japan (Tokyo-Kyoto-Tokyo) so we were able to leave one of our bags behind for storage and everything worked out great.",
            "title": "the worst 4* experience in my life",
            "user": "mic27"
        },
        {
            "date": "March 3, 2008",
            "detail_rating": {
                "business": null,
                "cleanliness": null,
                "desk": null,
                "location": null,
                "pool": null,
                "restaurant": null,
                "rooms": null,
                "service": null,
                "sleep": null,
                "value": null
            },
            "helpfulness": null,
            "id": 14012831,
            "likes": {
                "disliked": null,
                "liked": null
            },
            "rating": 5.0,
            "stay_parameters": null,
            "text": "I'd stay here again if I return to Tokyo.",
            "title": "Loved the luxiry and the hospitality!",
            "user": "Kypeli"
        },
        {
            "date": "May 16, 2005",
            "detail_rating": {
                "business": null,
                "cleanliness": null,
                "desk": null,
                "location": null,
                "pool": null,
                "restaurant": null,
                "rooms": null,
                "service": null,
                "sleep": null,
                "value": null
            },
            "helpfulness": 12,
            "id": 3475820,
            "likes": {
                "disliked": null,
                "liked": null
            },
            "rating": 4.0,
            "stay_parameters": null,
            "text": "A busness trip brought me to the Radisson Miyako, Tokyo in the middle April of 2005.",
            "title": "quiet, classy and well run",
            "user": "chmod"
        },
        {
            "date": "February 24, 2008",
            "detail_rating": {
                "business": null,
                "cleanliness": 4.0,
                "desk": null,
                "front_desk": 4.0,
                "location": 3.0,
                "pool": null,
                "restaurant": null,
                "rooms": 4.0,
                "service": 4.0,
                "sleep": null,
                "value": 4.0
            },
            "helpfulness": null,
            "id": 13813685,
            "likes": {
                "disliked": null,
                "liked": null
            },
            "rating": 4.0,
            "stay_parameters": "Stayed February 2008, traveled solo",
            "text": "This is a nice clean renovated hotel but the location is not walking distance to any of the big sites or areas of Tokyo. The service is great and the price is great for Tokyo but you will need to take the subway/train to see the real sites of Tokyo. If you dont mind being in a quiet residential area then this hotel is for you. They have a bus to take you to train station or you can walk 5-7 mins to the subway station. At night there are not many options to eat in the area but if you want a good priced well serviced hotel then this place is for you. Keep in mind you need to take the subway or train all the time since Tokyo is so large... but if you stay in Shinjuku, Shibuya or Ginza there is a lot to see in walking distance. I would only stay here again because of the reasonable price and if I just wanted a place to rest at night.",
            "title": "Nice clean hotel with good service... OK location",
            "user": "nychellzkitchen"
        },
        {
            "date": "January 27, 2008",
            "detail_rating": {
                "business": 4.0,
                "cleanliness": 4.0,
                "desk": null,
                "front_desk": 5.0,
                "location": 2.0,
                "pool": null,
                "restaurant": null,
                "rooms": 3.0,
                "service": 5.0,
                "sleep": null,
                "value": 4.0
            },
            "helpfulness": null,
            "id": 13026524,
            "likes": {
                "disliked": "\u2014 No nearby points of interest",
                "liked": "\u2014 Hotel staff"
            },
            "rating": 4.0,
            "stay_parameters": "Stayed January 2008, traveled on business",
            "text": "I stayed in this hotel for one week for business.",
            "title": "More good than bad...",
            "user": "ldavisfl"
        },
        {
            "date": "November 24, 2007",
            "detail_rating": {
                "business": 1.0,
                "cleanliness": 4.0,
                "desk": null,
                "front_desk": 4.0,
                "location": 2.0,
                "pool": null,
                "restaurant": null,
                "rooms": 3.0,
                "service": 3.0,
                "sleep": null,
                "value": 2.0
            },
            "helpfulness": null,
            "id": 11018573,
            "likes": {
                "disliked": null,
                "liked": null
            },
            "rating": 2.0,
            "stay_parameters": "Stayed November 2007, traveled with family",
            "text": "There is a direct bus from Narita for 3000 yen. If you are tired from your trip, it's nice not to have to haul luggage through the train stations (the alternate way to get here). You just walk 20 ft outside and hop on the charter-style bus and in 1.5hrs it pulls up to the door of the hotel. The train is slightly faster but if you don't know what you are doing with respect to the trains you could end up talking longer.",
            "title": "Can't Use the Pool",
            "user": "fuchufour"
        },
        {
            "date": "October 7, 2007",
            "detail_rating": {
                "business": null,
                "cleanliness": null,
                "desk": null,
                "location": null,
                "pool": null,
                "restaurant": null,
                "rooms": null,
                "service": null,
                "sleep": null,
                "value": null
            },
            "helpfulness": 1,
            "id": 10051104,
            "likes": {
                "disliked": null,
                "liked": null
            },
            "rating": 5.0,
            "stay_parameters": null,
            "text": "There's not much around the hotel, but a free shuttle runs you to a nearby Japan Rail station every 15 minutes, and there are a few nice restaurants around there. The concierge is superb: friendly, helpful, and patient. They have lots of custom printed info for you to help you navigate Tokyo (which can be tricky for new visitors.\"",
            "title": "Excellent Choice!",
            "user": "ddilkens"
        },
        {
            "date": "September 23, 2007",
            "detail_rating": {
                "business": 5.0,
                "cleanliness": 5.0,
                "desk": null,
                "front_desk": 5.0,
                "location": 5.0,
                "pool": null,
                "restaurant": null,
                "rooms": 5.0,
                "service": 5.0,
                "sleep": null,
                "value": 5.0
            },
            "helpfulness": 1,
            "id": 8862464,
            "likes": {
                "disliked": "\u2014 You have to take a subway or train to get to the tourist spots",
                "liked": "\u2014 The friendly and competent staff"
            },
            "rating": 5.0,
            "stay_parameters": "Stayed September 2007, traveled on business",
            "text": "This hotel is dated. It feels like it's from the 70s. However, it was well built and appointed nicely, so it's not run down by any means. However, the gym is pathetic, so if exercise is important to you, you might be served better elsewhere (or plan on going to a separate gym). I am surprised they advertise having a gym at all... it is basically a couple of treadmill, some barbells, and a couple of dated looking machines. To add insult to injury, they charge you to use it!",
            "title": "Exceptional hotel!",
            "user": "AlamedaMichael"
        },
        {
            "date": "August 23, 2006",
            "detail_rating": {
                "business": 5.0,
                "cleanliness": 5.0,
                "desk": null,
                "front_desk": 5.0,
                "location": 4.0,
                "pool": null,
                "restaurant": null,
                "rooms": 5.0,
                "service": 5.0,
                "sleep": null,
                "value": 5.0
            },
            "helpfulness": 3,
            "id": 5701873,
            "likes": {
                "disliked": null,
                "liked": null
            },
            "rating": 5.0,
            "stay_parameters": "Stayed May 2006, traveled as a couple",
            "text": "very nice hotel. the concierge was OUTSTANDING. very helpful. easy shuttle service to nearby food/light shopping/train station.",
            "title": "would stay here",
            "user": "indycoltsfan"
        },
        {
            "date": "May 1, 2006",
            "detail_rating": {
                "business": null,
                "cleanliness": 5.0,
                "desk": null,
                "location": null,
                "pool": null,
                "restaurant": null,
                "rooms": 5.0,
                "service": 5.0,
                "sleep": null,
                "value": 5.0
            },
            "helpfulness": 4,
            "id": 5025193,
            "likes": {
                "disliked": null,
                "liked": null
            },
            "rating": 5.0,
            "stay_parameters": "Stayed April 2006, traveled on business",
            "text": "Didn't eat there so I can't comment on foods.",
            "title": "A nice business haven - good value for its level and amenities",
            "user": "7DegreesOfWonderment"
        },
        {
            "date": "February 26, 2006",
            "detail_rating": {
                "business": null,
                "cleanliness": null,
                "desk": null,
                "location": null,
                "pool": null,
                "restaurant": null,
                "rooms": null,
                "service": null,
                "sleep": null,
                "value": null
            },
            "helpfulness": 2,
            "id": 4521550,
            "likes": {
                "disliked": null,
                "liked": null
            },
            "rating": 4.0,
            "stay_parameters": null,
            "text": "Heated toliet seats need to catch on around the world. (they have them).",
            "title": "Great hotel, Very expensive",
            "user": "A TripAdvisor user"
        },
        {
            "date": "February 9, 2006",
            "detail_rating": {
                "business": null,
                "cleanliness": 5.0,
                "desk": null,
                "location": null,
                "pool": null,
                "restaurant": null,
                "rooms": 5.0,
                "service": 5.0,
                "sleep": null,
                "value": 4.0
            },
            "helpfulness": 4,
            "id": 4449974,
            "likes": {
                "disliked": null,
                "liked": null
            },
            "rating": 5.0,
            "stay_parameters": "Stayed January 2005",
            "text": "Bus picks up and drops off here to go to the airport...reccommend that too.",
            "title": "Great Service, Even for an Asian Hotel",
            "user": "Marybs6"
        },
        {
            "date": "June 2, 2005",
            "detail_rating": {
                "business": null,
                "cleanliness": 5.0,
                "desk": null,
                "location": null,
                "pool": null,
                "restaurant": null,
                "rooms": 4.0,
                "service": 5.0,
                "sleep": null,
                "value": 4.0
            },
            "helpfulness": 7,
            "id": 3521635,
            "likes": {
                "disliked": null,
                "liked": null
            },
            "rating": 4.0,
            "stay_parameters": "Stayed May 2005",
            "text": "would stay here again.",
            "title": "Great Staff and Hotel",
            "user": "Rhoramsay1"
        },
        {
            "date": "September 16, 2007",
            "detail_rating": {
                "business": 5.0,
                "cleanliness": 5.0,
                "desk": null,
                "front_desk": 3.0,
                "location": 3.0,
                "pool": null,
                "restaurant": null,
                "rooms": 3.0,
                "service": 4.0,
                "sleep": null,
                "value": 3.0
            },
            "helpfulness": 1,
            "id": 8721373,
            "likes": {
                "disliked": "\u2014 overpriced",
                "liked": "\u2014 the shuttle service and guest relation desk"
            },
            "rating": 3.0,
            "stay_parameters": "Stayed August 2007, traveled on business",
            "text": "this is a very nice hotel....but not worth how expensive it is. the room smelled faintly of smoke, but was clean. the hotel is off the beaten track but they do provide free drop off and pick up service from the nearby train stations. the guest relations are helfpful as well. there is no safe in the room, although there is a mini bar. (once you take things out of the minibar it is automatically charged to your bill- so if you take things out so that you can put your own things in, make sure to check your bill). Also, there were a lot of hidden service fees we were not expecting added to our bill upon check out.",
            "title": "not worth the amount",
            "user": "twojetsetters!"
        },
        {
            "date": "July 10, 2007",
            "detail_rating": {
                "business": 5.0,
                "cleanliness": 5.0,
                "desk": null,
                "front_desk": 5.0,
                "location": 5.0,
                "pool": null,
                "restaurant": null,
                "rooms": 4.0,
                "service": 5.0,
                "sleep": null,
                "value": 4.0
            },
            "helpfulness": 1,
            "id": 8097113,
            "likes": {
                "disliked": "\u2014 The washroom and TV",
                "liked": "\u2014 The free Internet service, the rooms, and the convenience to Tokyo"
            },
            "rating": 5.0,
            "stay_parameters": "Stayed July 2007, traveled with family",
            "text": "On my recent Japan trip, I stayed at Sheraton Yokohama Bay and then at this hotel. Again, the Sheraton staff are extremely friendly and remain diligent at doing their jobs; rooms are cleaned superbly.",
            "title": "Sheraton Miyako Tokyo - Not Bad",
            "user": "projectsw"
        },
        {
            "date": "January 3, 2007",
            "detail_rating": {
                "business": 4.0,
                "cleanliness": 4.0,
                "desk": null,
                "front_desk": 5.0,
                "location": 3.0,
                "pool": null,
                "restaurant": null,
                "rooms": 3.0,
                "service": 4.0,
                "sleep": null,
                "value": 5.0
            },
            "helpfulness": 2,
            "id": 6545957,
            "likes": {
                "disliked": null,
                "liked": null
            },
            "rating": 4.0,
            "stay_parameters": "Stayed April 2005, traveled with family",
            "text": "The shuttle bus to Meguro Station and to Shinagawa Station in the mornings is convenient. The shuttle bus drivers are courteous as well.",
            "title": "Great hotel in outskirts of Tokyo",
            "user": "pineappleeurope"
        },
        {
            "date": "December 11, 2006",
            "detail_rating": {
                "business": null,
                "cleanliness": null,
                "desk": null,
                "location": null,
                "pool": null,
                "restaurant": null,
                "rooms": null,
                "service": null,
                "sleep": null,
                "value": null
            },
            "helpfulness": 1,
            "id": 6362351,
            "likes": {
                "disliked": null,
                "liked": null
            },
            "rating": 4.0,
            "stay_parameters": null,
            "text": "However, I find that the lavatories are a bit old and could use some refurbishing. This hotel is older than the Sheraton Yokahama Bay so I suspect the age of the hotel is the problem. Also, the TVs are too small.",
            "title": "Excellent hotel",
            "user": "lavenderfld"
        },
        {
            "date": "October 9, 2006",
            "detail_rating": {
                "business": 3.0,
                "cleanliness": 5.0,
                "desk": null,
                "front_desk": 4.0,
                "location": 3.0,
                "pool": null,
                "restaurant": null,
                "rooms": 5.0,
                "service": 5.0,
                "sleep": null,
                "value": 4.0
            },
            "helpfulness": 2,
            "id": 5931048,
            "likes": {
                "disliked": "\u2014 The bar closes at midnight",
                "liked": "\u2014 Proximity to our Tokyo office, and fantastic comfortable beds."
            },
            "rating": 5.0,
            "stay_parameters": "Stayed September 2006, traveled on business",
            "text": "This is not a bad hotel, but it is not one of the most glamorous in Tokyo. With a few changes, I would stay here again.",
            "title": "Excellent Stay at the Miyako",
            "user": "Poots-UK"
        }
    ],
    "slim_ranking": 0.326086956522,
    "stars": 4,
    "tripadvisor": {
        "VISITED": false,
        "country_name": null,
        "locality": null,
        "pic_link": null,
        "street_address": null
    },
    "user_rating": 4.0,
    "variance": {
        "average": 105,
        "excellent": 145,
        "poor": 27,
        "terrible": 15,
        "very good": 343
    }
}