{
    "aka": "Hotel Torrecerredo s l",
    "description": "If you like: small, owner-managed places brimming with character and run by caring, direct, unpretentious, humorous hosts, with great food, views, and wildlife, the lived-in, the unexpected, the artistic, and even the eccentric. We are for you.",
    "detail_rating": {
        "cleanliness": null,
        "location": null,
        "rooms": null,
        "service": null,
        "sleep": null,
        "value": null
    },
    "location": {
        "city": null,
        "continent": "Europe",
        "country": "Spain",
        "proposed_city": null,
        "province": null,
        "region": "Asturias"
    },
    "name": "Hotel Torrecerredo",
    "places": {
        "aka": [],
        "hotel_description": [],
        "hotel_name": []
    },
    "review_count": 118,
    "review_count_current": 1,
    "reviews": [
        {
            "date": "July 24, 2008",
            "detail_rating": {
                "business": 3.0,
                "cleanliness": 3.0,
                "desk": null,
                "front_desk": 5.0,
                "location": 5.0,
                "pool": null,
                "restaurant": null,
                "rooms": 3.0,
                "service": 3.0,
                "sleep": null,
                "value": 3.0
            },
            "helpfulness": 2,
            "id": 18205600,
            "likes": {
                "disliked": null,
                "liked": "\u2014 Location"
            },
            "rating": 3.0,
            "stay_parameters": "Stayed July 2008, traveled as a couple",
            "text": "This hotel is perfect for doing stuff in the Picos, climbing, walking, biking, etc etc, and is very reasonable too!",
            "title": "Great location for Climbing in the Picos!",
            "user": "Angie_Paul"
        }
    ],
    "slim_ranking": 0.222222222222,
    "stars": 1,
    "tripadvisor": {
        "VISITED": false,
        "country_name": null,
        "locality": null,
        "pic_link": null,
        "street_address": null
    },
    "user_rating": 4.5,
    "variance": {
        "average": 5,
        "excellent": 82,
        "poor": 3,
        "terrible": 4,
        "very good": 24
    }
}