{
    "aka": "Park Hotel Singapore",
    "description": "With classic architecture inspired by Singapore\u2019s colonial past, Park Hotel Clarke Quay is a tropical retreat in the heart of the city, conveniently located next to the entertainment and dining hub of Clarke Quay and the iconic Singapore River. Enjoy sweeping views of the city skyline and the river from the hotel\u2019s 336 rooms and suites. Pampering facilities including a 25m outdoor pool and adjoining Jacuzzi, a spectacular deck and bar and cabana style spa pavilions \u2013 perfect additions to an ideal getaway.",
    "detail_rating": {
        "cleanliness": 4.5,
        "location": 4.5,
        "rooms": 4.0,
        "service": 4.5,
        "sleep": 4.0,
        "value": 4.5
    },
    "location": {
        "city": null,
        "continent": "Asia",
        "country": "Singapore",
        "proposed_city": null,
        "province": null,
        "region": null
    },
    "name": "Park Hotel Clarke Quay",
    "places": {
        "aka": [],
        "hotel_description": [],
        "hotel_name": []
    },
    "review_count": 1375,
    "review_count_current": 20,
    "reviews": [
        {
            "date": "December 14, 2011",
            "detail_rating": {
                "business": null,
                "cleanliness": 5.0,
                "desk": null,
                "location": 5.0,
                "pool": null,
                "restaurant": null,
                "rooms": 5.0,
                "service": 5.0,
                "sleep": 5.0,
                "value": 5.0
            },
            "helpfulness": 2,
            "id": 121735058,
            "likes": {
                "disliked": null,
                "liked": null
            },
            "rating": 5.0,
            "stay_parameters": "Stayed December 2011, traveled on business",
            "text": "I have used Park Hotel Clarke Q in Singapore many times now both for business and for leisure and it is a very nice hotel with excellent service. I have a Company account now and use to make the reservation on Crystal Club level which is very nice with separate breakfast for club guests, afternoon tea and a small buffe in the evening.",
            "title": "Perfect location in Singapore",
            "user": "Kenneth I"
        },
        {
            "date": "December 13, 2011",
            "detail_rating": {
                "business": null,
                "cleanliness": 5.0,
                "desk": null,
                "location": 4.0,
                "pool": null,
                "restaurant": null,
                "rooms": 4.0,
                "service": 5.0,
                "sleep": 4.0,
                "value": 5.0
            },
            "helpfulness": 3,
            "id": 121712226,
            "likes": {
                "disliked": null,
                "liked": null
            },
            "rating": 5.0,
            "stay_parameters": "Stayed December 2011, traveled on business",
            "text": "The staff on club level are very friendly and service minded, this hotel has become my second home now.",
            "title": "Crystal Club well worth it",
            "user": "Oz_Kiwi7"
        },
        {
            "date": "December 13, 2011",
            "detail_rating": {
                "business": null,
                "cleanliness": 4.0,
                "desk": null,
                "location": 4.0,
                "pool": null,
                "restaurant": null,
                "rooms": 3.0,
                "service": 4.0,
                "sleep": 3.0,
                "value": 3.0
            },
            "helpfulness": 2,
            "id": 121711494,
            "likes": {
                "disliked": null,
                "liked": null
            },
            "rating": 4.0,
            "stay_parameters": "Stayed November 2011, traveled on business",
            "text": "I have just returned from two weeks in a Crystal Club Superior room. As other reviewers have stated, the room is small (24sqm). I would have struggled for two weeks if I had another person in the room. The rooms were well set out and scrupulously clean as room service comes twice a day.",
            "title": "Good hotel... not totally five star but it's not totally a five star price either.",
            "user": "Mark G"
        },
        {
            "date": "December 13, 2011",
            "detail_rating": {
                "business": null,
                "cleanliness": 5.0,
                "desk": null,
                "location": 5.0,
                "pool": null,
                "restaurant": null,
                "rooms": 5.0,
                "service": 5.0,
                "sleep": 5.0,
                "value": 4.0
            },
            "helpfulness": 1,
            "id": 121690200,
            "likes": {
                "disliked": null,
                "liked": null
            },
            "rating": 4.0,
            "stay_parameters": "Stayed September 2011, traveled as a couple",
            "text": "The package was excellent value for money in Singapore. Daily I got breakfast, two items of laundry, unlimited internet, afternoon tea and two hours for drinks and canap\u00e9s in the evening.",
            "title": "Nice Hotel - Great Location - Would Definitely Return",
            "user": "simoo69"
        },
        {
            "date": "December 12, 2011",
            "detail_rating": {
                "business": null,
                "cleanliness": 5.0,
                "desk": null,
                "location": 3.0,
                "pool": null,
                "restaurant": null,
                "rooms": 5.0,
                "service": 5.0,
                "sleep": 5.0,
                "value": 4.0
            },
            "helpfulness": null,
            "id": 121663811,
            "likes": {
                "disliked": null,
                "liked": null
            },
            "rating": 4.0,
            "stay_parameters": "Stayed December 2011, traveled on business",
            "text": "The area had lots of restaurant choices and was a ten minute walk to Clark Quay MRT. I took a taxi to Science Park every morning and never had to wait as there are taxis at the front of the hotel.",
            "title": "Pleasant stay",
            "user": "KKKBoN"
        },
        {
            "date": "December 20, 2011",
            "detail_rating": {
                "business": null,
                "cleanliness": 5.0,
                "desk": null,
                "location": 5.0,
                "pool": null,
                "restaurant": null,
                "rooms": 4.0,
                "service": 5.0,
                "sleep": 5.0,
                "value": 4.0
            },
            "helpfulness": 3,
            "id": 121911310,
            "likes": {
                "disliked": null,
                "liked": null
            },
            "rating": 5.0,
            "stay_parameters": "Stayed December 2011, traveled as a couple",
            "text": "Just returned from 2 week stay in de luxe on room only basis. Agree rooms on smallish size - could have done with a tad more cupbpoard space but we coped with no problem. Standards of cleanliness first class and daily change of bedding. Pool good and no problem with sunbeds - only thing is the hotel is favoured for weddings and so at weekends may well find the terrace bar is taken over, but you can still use the pool. All staff extremely courteous and helpful. Ate in restaurant one evening food ok but expensive and with so many restaurants and food markets around then you need to get out. Location excellent and easy to get around by taxi bus or MRT. If you come out of hotel lobby turn left and left again you will come to the river. Turn left and under bridge and you get safely (no road to cross!) to Clarke Quay and beyond to Boat Quay if you want, both very lively and noisy, but hotel far enough away to be quiet. If you turn right and follow the river path and under bridge then on right at end of apartment block you will find an excellent place for breakfast -Kith's. Real bacon and leaf tea not tea bags and favoured by the expat wives! If you are into veggie breakfast and juices thern go up Unity Street to junction with Sultan Mohammed and on left a great little cafe, forgotten the name",
            "title": "Nice hotel with good location",
            "user": "Jodian"
        },
        {
            "date": "December 19, 2011",
            "detail_rating": {
                "business": null,
                "cleanliness": 4.0,
                "desk": null,
                "location": 5.0,
                "pool": null,
                "restaurant": null,
                "rooms": 4.0,
                "service": 5.0,
                "sleep": 5.0,
                "value": 4.0
            },
            "helpfulness": 2,
            "id": 121902703,
            "likes": {
                "disliked": null,
                "liked": null
            },
            "rating": 5.0,
            "stay_parameters": "Stayed December 2011, traveled on business",
            "text": "we were upgraded to Crystal Club on the tenth floor. Everyone is friendly. Convenient location to Chinatown, Orchard road and many other locations. View is fantastic.",
            "title": "very nice hotel, very good location",
            "user": "gwusc"
        },
        {
            "date": "December 18, 2011",
            "detail_rating": {
                "business": null,
                "cleanliness": 4.0,
                "desk": null,
                "location": 5.0,
                "pool": null,
                "restaurant": null,
                "rooms": 4.0,
                "service": 4.0,
                "sleep": 5.0,
                "value": 4.0
            },
            "helpfulness": 1,
            "id": 121868669,
            "likes": {
                "disliked": null,
                "liked": null
            },
            "rating": 4.0,
            "stay_parameters": "Stayed October 2011, traveled with family",
            "text": "To all the staff at The PArk hotel thanks, especially BAla,Alex and Sam who assisted us with our parents and made our stay great.",
            "title": "Fantastic",
            "user": "Arthur M"
        },
        {
            "date": "December 17, 2011",
            "detail_rating": {
                "business": null,
                "cleanliness": 5.0,
                "desk": null,
                "location": 4.0,
                "pool": null,
                "restaurant": null,
                "rooms": 4.0,
                "service": 5.0,
                "sleep": 3.0,
                "value": 4.0
            },
            "helpfulness": 2,
            "id": 121815467,
            "likes": {
                "disliked": null,
                "liked": null
            },
            "rating": 4.0,
            "stay_parameters": "Stayed December 2011, traveled as a couple",
            "text": "The food at breakfast was supurb. It is agreat place to stay .Thanks Guys and Gals.",
            "title": "Very good hotel close to Clarke quay (riverside area in Singapore)",
            "user": "Namrata_bh"
        },
        {
            "date": "December 16, 2011",
            "detail_rating": {
                "business": null,
                "cleanliness": 5.0,
                "desk": null,
                "location": 5.0,
                "pool": null,
                "restaurant": null,
                "rooms": 3.0,
                "service": 5.0,
                "sleep": 4.0,
                "value": 4.0
            },
            "helpfulness": 3,
            "id": 121793067,
            "likes": {
                "disliked": null,
                "liked": null
            },
            "rating": 4.0,
            "stay_parameters": "Stayed December 2011, traveled as a couple",
            "text": "The driver of the courtesy bus was very helpful to my aging parents",
            "title": "Brilliant location, nice hotel",
            "user": "Falcoperegrinus"
        },
        {
            "date": "January 3, 2012",
            "detail_rating": {
                "business": null,
                "cleanliness": 5.0,
                "desk": null,
                "location": 4.0,
                "pool": null,
                "restaurant": null,
                "rooms": 4.0,
                "service": 5.0,
                "sleep": 5.0,
                "value": 5.0
            },
            "helpfulness": null,
            "id": 122443643,
            "likes": {
                "disliked": null,
                "liked": null
            },
            "rating": 5.0,
            "stay_parameters": "Stayed January 2012, traveled with friends",
            "text": "I have been to Singapore numerous times for holidays over the years, and have stayed in a wide range of accommodation from YMCA to top-notch hotels on Orchard. Park Hotel Clarke Quay is by far the best I have ever stayed in. We were there for 2 nights from New Year's eve. I made a booking months ahead so the rate is not high at all for a hotel of this standard (<S$200 per night plus tax) at this time of the year. We arrived from Sri Lanka by a very early morning flight. With the previous evening being Dec 30 and NY's eve upcoming, I honestly did not expect an early check-in. To our surprise, the reception staff was very accommodating (perhaps noting that we looked horrible after only 2-3 hours' sleep on the flight) and let us have an early check at 10am!",
            "title": "Top choice so far",
            "user": "JJB"
        },
        {
            "date": "January 1, 2012",
            "detail_rating": {
                "business": null,
                "cleanliness": 5.0,
                "desk": null,
                "location": 5.0,
                "pool": null,
                "restaurant": null,
                "rooms": 5.0,
                "service": 5.0,
                "sleep": 3.0,
                "value": 4.0
            },
            "helpfulness": 1,
            "id": 122368849,
            "likes": {
                "disliked": null,
                "liked": null
            },
            "rating": 4.0,
            "stay_parameters": "Stayed November 2011, traveled as a couple",
            "text": "The room is very clean, modern, adequate (though I agree it's a bit small for 2 people) and is quiet albeit we actually stayed on the 2nd floor next to the pool!",
            "title": "Nice staff, good location.",
            "user": "Sazzle_funk"
        },
        {
            "date": "December 30, 2011",
            "detail_rating": {
                "business": null,
                "cleanliness": 5.0,
                "desk": null,
                "location": 5.0,
                "pool": null,
                "restaurant": null,
                "rooms": 4.0,
                "service": 5.0,
                "sleep": 4.0,
                "value": 4.0
            },
            "helpfulness": null,
            "id": 122304032,
            "likes": {
                "disliked": null,
                "liked": null
            },
            "rating": 4.0,
            "stay_parameters": "Stayed December 2011, traveled with family",
            "text": "We did not eat there so I can't comment. I did swim and the experience is delightful.",
            "title": "Business or pleasure",
            "user": "Pookiecat"
        },
        {
            "date": "December 29, 2011",
            "detail_rating": {
                "business": null,
                "cleanliness": 5.0,
                "desk": null,
                "location": 4.0,
                "pool": null,
                "restaurant": null,
                "rooms": 4.0,
                "service": 4.0,
                "sleep": 5.0,
                "value": 4.0
            },
            "helpfulness": 2,
            "id": 122207297,
            "likes": {
                "disliked": null,
                "liked": null
            },
            "rating": 4.0,
            "stay_parameters": "Stayed December 2011, traveled with family",
            "text": "Free shuttle service is available to Clarke Quay MRT and Orchard. Though infrequent (around once in an hour) it's good enough for connection to main business and tourist spots without hussle. Taxi fare (daytime) costs no more than S$5 to China Town, and around S$20 from airport.",
            "title": "Let's park! At Park Hotel Clarke Quay...",
            "user": "siobslim"
        },
        {
            "date": "December 28, 2011",
            "detail_rating": {
                "business": null,
                "cleanliness": 5.0,
                "desk": null,
                "location": 5.0,
                "pool": null,
                "restaurant": null,
                "rooms": 5.0,
                "service": 5.0,
                "sleep": 4.0,
                "value": 4.0
            },
            "helpfulness": null,
            "id": 122190271,
            "likes": {
                "disliked": null,
                "liked": null
            },
            "rating": 5.0,
            "stay_parameters": "Stayed September 2011, traveled as a couple",
            "text": "I will definitely stay here again unless the rate scars me off.",
            "title": "Comfortable stay at Park Hotel",
            "user": "Donald W"
        },
        {
            "date": "December 28, 2011",
            "detail_rating": {
                "business": null,
                "cleanliness": 5.0,
                "desk": null,
                "location": 5.0,
                "pool": null,
                "restaurant": null,
                "rooms": 5.0,
                "service": 5.0,
                "sleep": 5.0,
                "value": 5.0
            },
            "helpfulness": 2,
            "id": 122176846,
            "likes": {
                "disliked": null,
                "liked": null
            },
            "rating": 5.0,
            "stay_parameters": "Stayed December 2011, traveled as a couple",
            "text": "The Park Hotel was situated just a 5 minute walk from some lovely bars and clubs! Very expensive but worth it! If you like clubbing go to Zouk! Buy a lonely planet guide too. The hotel was great, amazing views, we did not get breakfast, but across the road there is a starbucks and a deli france. Great for a 3 night stay! We would go back in a flash. Enjoy.",
            "title": "Loved Singapore!",
            "user": "Eilidh P"
        },
        {
            "date": "December 28, 2011",
            "detail_rating": {
                "business": null,
                "cleanliness": 5.0,
                "desk": null,
                "location": 4.0,
                "pool": null,
                "restaurant": null,
                "rooms": 3.0,
                "service": 5.0,
                "sleep": 4.0,
                "value": 4.0
            },
            "helpfulness": null,
            "id": 122173476,
            "likes": {
                "disliked": null,
                "liked": null
            },
            "rating": 4.0,
            "stay_parameters": "Stayed December 2011, traveled with friends",
            "text": "As other reviewers have said this hotel is modern, very clean, in a good location and the staff that we encountered were all without exception very helpful and efficient. The rooms are well fitted out with quality linen and towels etc but they really are small - especially if you are not a couple and would like a bit more space. I was surprised that our room did not have free wi fi access although it was available in the lobby area you have to give your laptop to the reception staff to type in the code which seemed a bit strange. Didn't eat here as the food and drink is very expensive (as with a lot of Singapore) however Subway in the mall opposite does a basic breakfast deal for 4 Singapore dollars and there is free tea and coffee in the room. All in all given the prices in general for Singapore we felt we got a fair deal at \u00a360 per room per night. The complimentary shuttle bus is very useful for getting around and saves you a bit of money as will eating out in the many local food stalls and cafes just around the corner or in central Singapore. Would recommend at the right price.",
            "title": "Very good - let down by room size though...",
            "user": "rorycat"
        },
        {
            "date": "December 28, 2011",
            "detail_rating": {
                "business": null,
                "cleanliness": 5.0,
                "desk": null,
                "location": 5.0,
                "pool": null,
                "restaurant": null,
                "rooms": 4.0,
                "service": 5.0,
                "sleep": 5.0,
                "value": 5.0
            },
            "helpfulness": 1,
            "id": 122166699,
            "likes": {
                "disliked": null,
                "liked": null
            },
            "rating": 5.0,
            "stay_parameters": "Stayed December 2011, traveled on business",
            "text": "Whilst in Singapore we stayed 4 nights at the Park Hotel Clarke Quay. The staff were in EVERY area of service in the hotel absolutely TOP - polite, efficient and fast in answering any query we may have had. The breakfast room was very efficiently run and the choice of food excellent. The rooms were also top. Super clean bathroom and fresh towels daily.",
            "title": "Top service and location",
            "user": "735Cremedelacreme"
        },
        {
            "date": "December 27, 2011",
            "detail_rating": {
                "business": null,
                "cleanliness": 5.0,
                "desk": null,
                "location": 5.0,
                "pool": null,
                "restaurant": null,
                "rooms": 5.0,
                "service": 5.0,
                "sleep": 5.0,
                "value": 4.0
            },
            "helpfulness": 2,
            "id": 122143551,
            "likes": {
                "disliked": null,
                "liked": null
            },
            "rating": 5.0,
            "stay_parameters": "Stayed November 2011, traveled as a couple",
            "text": "The only thing which bothered us was the size of the room. We were on a business and pleasure trip throughout Asia and therefore found it difficult to find space for our two suitcases plus two board cases. Also the wardrobe was much too small. We agree with minimalizing where possible these days but all hotels should offer enough space for travellers baggage und its contents. We had a problem finding a space to put the suitcases and to find our belongings in that too small a wardrobe.",
            "title": "Lovely stay",
            "user": "Brendan C"
        },
        {
            "date": "December 22, 2011",
            "detail_rating": {
                "business": null,
                "cleanliness": 5.0,
                "desk": null,
                "location": 4.0,
                "pool": null,
                "restaurant": null,
                "rooms": 3.0,
                "service": 5.0,
                "sleep": 5.0,
                "value": 4.0
            },
            "helpfulness": 3,
            "id": 121985432,
            "likes": {
                "disliked": null,
                "liked": null
            },
            "rating": 4.0,
            "stay_parameters": "Stayed December 2011, traveled as a couple",
            "text": "Otherwise everything about the Park Hotel suited us very well. The pool was excellent and towels were to be had in plenty.The location was super. Many restaurants almost just in front of the door and lovely walks along the busy and interesting Quay in the evenings..",
            "title": "Rooms bit small",
            "user": "dorsetval"
        }
    ],
    "slim_ranking": 0.138888888889,
    "stars": 4,
    "tripadvisor": {
        "VISITED": false,
        "country_name": null,
        "locality": null,
        "pic_link": null,
        "street_address": null
    },
    "user_rating": 4.0,
    "variance": {
        "average": 194,
        "excellent": 517,
        "poor": 43,
        "terrible": 24,
        "very good": 597
    }
}