{
    "aka": "Novotel Amsterdam Airport Hotel Badhoevedorp",
    "description": "The Novotel Amsterdam Airport is a 4 star hotel ideally located in a quiet area around Schiphol Amsterdam Airport, which is only 5 km away. In our hotel, not far from the centre of Amsterdam, a good night sleep is guaranteed. The Novotel is an ideal base for guests on a business trip. All hotel rooms feature free WiFi and airconditioning. The hotel offers 10 meeting rooms, a lobby bar, pub, restaurant, swimming pool, sauna and hamam. Adjacent to a sports centre.",
    "detail_rating": {
        "cleanliness": null,
        "location": null,
        "rooms": null,
        "service": null,
        "sleep": null,
        "value": null
    },
    "location": {
        "city": null,
        "continent": "Europe",
        "country": "The Netherlands",
        "proposed_city": "Amsterdam",
        "province": null,
        "region": null
    },
    "name": "Novotel Amsterdam Airport",
    "places": {
        "aka": [
            "Amsterdam"
        ],
        "hotel_description": [
            "Amsterdam"
        ],
        "hotel_name": [
            "Amsterdam"
        ]
    },
    "review_count": 359,
    "review_count_current": 31,
    "reviews": [
        {
            "date": "July 14, 2013",
            "detail_rating": {
                "business": null,
                "cleanliness": 2.0,
                "desk": null,
                "location": 4.0,
                "pool": null,
                "restaurant": null,
                "rooms": 3.0,
                "service": 4.0,
                "sleep": 3.0,
                "value": 3.0
            },
            "helpfulness": 2,
            "id": 167488359,
            "likes": {
                "disliked": null,
                "liked": null
            },
            "rating": 3.0,
            "stay_parameters": "Stayed July 2013, traveled as a couple",
            "text": "This hotel is a good choice if you are on a budget. Its a quick bus trip from the airport (although be warned that the blue Accor Bus stops and the IBIS and IBIS Budget before it gets to Badhoevedorp so it can get a little bit packed!!)",
            "title": "Better this time.....",
            "user": "dogsareforlife"
        },
        {
            "date": "July 13, 2013",
            "detail_rating": {
                "business": null,
                "cleanliness": 2.0,
                "desk": null,
                "location": 3.0,
                "pool": null,
                "restaurant": null,
                "rooms": 2.0,
                "service": 3.0,
                "sleep": 3.0,
                "value": 3.0
            },
            "helpfulness": null,
            "id": 167368812,
            "likes": {
                "disliked": null,
                "liked": null
            },
            "rating": 2.0,
            "stay_parameters": "Stayed July 2013, traveled with family",
            "text": "I've reviewed it once before when I had a huge exec suite with a bath in the middle of the room. This time I went for a basic room in the hopes of getting a normal bathroom - which I did. It was OK - a small balcony and a view of Schiphol in the distance. They've also added a Nespresso machine. The furnishing is basic (a bit aged - the headboard has turned yellow!) and the TV is ancient. But they are OK for one night. However the bathroom was grim - small and very dark despite 3 eco-bulbs. The shower was disgusting and had mould all around it so I used the shower over the bath which was at least very clean.",
            "title": "very basic",
            "user": "ricc099"
        },
        {
            "date": "July 11, 2013",
            "detail_rating": {
                "business": null,
                "cleanliness": 3.0,
                "desk": null,
                "location": 2.0,
                "pool": null,
                "restaurant": null,
                "rooms": 3.0,
                "service": 3.0,
                "sleep": 3.0,
                "value": 3.0
            },
            "helpfulness": null,
            "id": 167211102,
            "likes": {
                "disliked": null,
                "liked": null
            },
            "rating": 3.0,
            "stay_parameters": "Stayed August 2012, traveled as a couple",
            "text": "The best bit about this hotel is the pub in the basement which is now open from 7pm during the week. This has a large screen showing sports and it serves a great selection of beers and wines. We had Pizza and a large plate of bitterballen (guilty pleasure!!) both of which were incredibly hot and really tasty (EUR 10 per dish) - it was a great surprise and we had a really enjoyable evening there. The barman was great - very friendly and he spoke perfect English for us (thank you!) There isn't much around the hotel so if you want to relax I really recommend the bar in the basement - I'd go back for the bitterballen alone!",
            "title": "good quality per cost",
            "user": "Gianluca M"
        },
        {
            "date": "July 10, 2013",
            "detail_rating": {
                "business": null,
                "cleanliness": 4.0,
                "desk": null,
                "location": 4.0,
                "pool": null,
                "restaurant": null,
                "rooms": 3.0,
                "service": 3.0,
                "sleep": 4.0,
                "value": 4.0
            },
            "helpfulness": null,
            "id": 167072093,
            "likes": {
                "disliked": null,
                "liked": null
            },
            "rating": 4.0,
            "stay_parameters": "Stayed July 2013, traveled as a couple",
            "text": "Missed connection at Schipol and KLM put us in here. It had the look and feel of a contracted room rate, check in process extremly efficient, hand over voucher & sign, dinner was a simple cafeteria food, - nothing wrong with it - but the room was passed it best, still had a small CRT TV and the bath was not as clean as it should be. on plus side it had a good free shuttle bus service both ways to airport,",
            "title": "Good out of town base.",
            "user": "norcol67"
        },
        {
            "date": "July 9, 2013",
            "detail_rating": {
                "business": null,
                "cleanliness": 4.0,
                "desk": null,
                "location": 3.0,
                "pool": null,
                "restaurant": null,
                "rooms": 3.0,
                "service": 4.0,
                "sleep": 4.0,
                "value": 4.0
            },
            "helpfulness": null,
            "id": 166861913,
            "likes": {
                "disliked": null,
                "liked": null
            },
            "rating": 4.0,
            "stay_parameters": "Stayed June 2013, traveled with family",
            "text": "We have been in this hotel on February 2012.I booked a no smoking room but when I went in suddenly I noticed it smelled like smoke, so I went down to the reception and asked for a new room, the receptionist apologized with me and said it was a no smoking room but some customers (not too polity ) decided to smoke even it was forbidden,than gave me a new room on the same floor and that worked good.The room was not too spacious and not too modern anyway it was nice and clean, with everything you need:safe box, iron and iron table for clothes, internet connection,TV, two armchairs,bed was comfy,the bathroom was nice and clean.One day we used the spa area with a pool, sauna and Turkish bath(steam bath) we enjoyed it,at it's same floor the is a pub as well. For two nights we called the room service and one night we have had dinner at the restaurant,good experiences.Breakfast was rich enough.The hotel is far from downtown but close to the airport,it is about 20 minutes far from the airport but well connected to it by a free bus shuttle (to/from the airport,at the reception you can find the time schedule).When at the airport just buy the train ticket to Amsterdam city,the run takes about 30 minutes.Good hotel service/price.",
            "title": "Okay",
            "user": "Ade P"
        },
        {
            "date": "August 16, 2012",
            "detail_rating": {
                "business": null,
                "cleanliness": 4.0,
                "desk": null,
                "location": 4.0,
                "pool": null,
                "restaurant": null,
                "rooms": 4.0,
                "service": 5.0,
                "sleep": 5.0,
                "value": 3.0
            },
            "helpfulness": null,
            "id": 137397285,
            "likes": {
                "disliked": null,
                "liked": null
            },
            "rating": 3.0,
            "stay_parameters": "Stayed August 2012, traveled as a couple",
            "text": "Our flight from Kuala Lumpur arrived into Schiphol early morning. The free shuttle to the Novotel Amsterdam Airport Hotel was quick and efficient. We were able to check into our suite by 9am, at a substantial 50 euro extra cost! We were not happy with this as there was no additional work undertaken by the hotel, and being set up as a Airport hotel they should allow for arrivals at all times of the day and night particularly when booked well in advance as we had!",
            "title": "It was adequate but ..........",
            "user": "FreoCreatures"
        },
        {
            "date": "August 14, 2012",
            "detail_rating": {
                "business": null,
                "cleanliness": 4.0,
                "desk": null,
                "location": 5.0,
                "pool": null,
                "restaurant": null,
                "rooms": 4.0,
                "service": 3.0,
                "sleep": 4.0,
                "value": 4.0
            },
            "helpfulness": null,
            "id": 137201763,
            "likes": {
                "disliked": null,
                "liked": null
            },
            "rating": 4.0,
            "stay_parameters": "Stayed July 2012, traveled as a couple",
            "text": "The suite was worn and dated but clean. Bedlinen was crisp and the bed very comfortable. Pillows of differing hardness were available. Lighting in the bathroom was extremely poor and the towels were small and very thin. There was however a large spa bath in addition to the shower.",
            "title": "watch out for the early check in fee",
            "user": "timothy s"
        },
        {
            "date": "November 7, 2012",
            "detail_rating": {
                "business": null,
                "cleanliness": 4.0,
                "desk": null,
                "location": 4.0,
                "pool": null,
                "restaurant": null,
                "rooms": 3.0,
                "service": 5.0,
                "sleep": 3.0,
                "value": 3.0
            },
            "helpfulness": null,
            "id": 144874503,
            "likes": {
                "disliked": null,
                "liked": null
            },
            "rating": 3.0,
            "stay_parameters": "Stayed November 2012, traveled as a couple",
            "text": "Stayed here 1 Sunday night before flight. The Novotel is located a few miles from Schiphol near the village of Badhoevedorp. It was easy to find by car. The rate was 230 euros per night (expensive but this was a late booking as I needed to stay near the village)",
            "title": "Very average hotel - saved by its helpful and cheerful staff",
            "user": "dogsareforlife"
        },
        {
            "date": "November 6, 2012",
            "detail_rating": {
                "business": null,
                "cleanliness": 5.0,
                "desk": null,
                "location": 3.0,
                "pool": null,
                "restaurant": null,
                "rooms": 4.0,
                "service": 3.0,
                "sleep": 5.0,
                "value": 4.0
            },
            "helpfulness": null,
            "id": 144781720,
            "likes": {
                "disliked": null,
                "liked": null
            },
            "rating": 4.0,
            "stay_parameters": "Stayed April 2012, traveled on business",
            "text": "There are about a dozen steps up to the hotel entrance and as it was raining very hard when I arrived I didn't see an alternative entry/exit for wheelchair users - you may want to check with the hotel if this is a need for you? I'm sure they cater for all guests but I felt the entrance was very unwelcoming for those with any sort of physical disability",
            "title": "Amsterdam ,city never sleeps",
            "user": "viksgup1977"
        },
        {
            "date": "October 21, 2012",
            "detail_rating": {
                "business": null,
                "cleanliness": 5.0,
                "desk": null,
                "location": 3.0,
                "pool": null,
                "restaurant": null,
                "rooms": 3.0,
                "service": 5.0,
                "sleep": 4.0,
                "value": 3.0
            },
            "helpfulness": null,
            "id": 143333781,
            "likes": {
                "disliked": null,
                "liked": null
            },
            "rating": 4.0,
            "stay_parameters": "Stayed October 2012, traveled on business",
            "text": "Check in staff was welcoming and very friendly - they spoke english too which is great as I don't speak Dutch. Was given a room on the 6th (top) floor. There are 2 lifts just off the lobby area. Also off the lobby area was a colourful gift shop, a seating area which one group was using for a meeting, a set of shelves displaying stuff for sale - small beers/wines/soft drinks and snacks etc so that you could stock your room mini-bar if you wanted to.",
            "title": "It Fills a Need With a 90's Vibe",
            "user": "Lewis-Graham"
        },
        {
            "date": "May 28, 2013",
            "detail_rating": {
                "business": null,
                "cleanliness": 5.0,
                "desk": null,
                "location": 3.0,
                "pool": null,
                "restaurant": null,
                "rooms": 2.0,
                "service": 4.0,
                "sleep": 3.0,
                "value": 2.0
            },
            "helpfulness": 3,
            "id": 162169418,
            "likes": {
                "disliked": null,
                "liked": null
            },
            "rating": 3.0,
            "stay_parameters": "Stayed May 2013, traveled on business",
            "text": "The Novotel at AMS airport is about a 15-20 minute bus ride from the main Schipol terminal. To get your transport, you follow the signs for busses after arrivals and exit the terminal and turn to your right. Bus stops A9 to A13 are where the hotel and rental car busses pull in. The ACCOR HOTELS bus is a large bus (not a minibus) and comes roughly every 20 minutes depending on the time of day. It is free to use. There is a timetable although it is not at all obvious from the hotel web-site what this is. I had to e-mail and ask for the schedule! The bus serves the IBIS and IBIS BUDGET hotels first. If staying at IBIS or NOVOTEL you can use this free bus to get to and from the terminal where you can get regular trains downtown to AMS centraal station.",
            "title": "Functional but dated and certainly not awe inspiring!!!",
            "user": "Craigie"
        },
        {
            "date": "May 21, 2013",
            "detail_rating": {
                "business": null,
                "cleanliness": 3.0,
                "desk": null,
                "location": 2.0,
                "pool": null,
                "restaurant": null,
                "rooms": 2.0,
                "service": 3.0,
                "sleep": 3.0,
                "value": 2.0
            },
            "helpfulness": null,
            "id": 161423450,
            "likes": {
                "disliked": null,
                "liked": null
            },
            "rating": 3.0,
            "stay_parameters": "Stayed May 2013, traveled as a couple",
            "text": "The hotel itself is fairly standard if you know what to expect from the Novotel brand. Free wifi, reasonably sized rooms, writing desk, tea/coffee, fridge, safe, etc. The rooms are a bit dated and will very soon be in need of a refurb\u2026 e.g. I haven\u2019t been in a hotel that hasn\u2019t moved over to flat screen TVs for a long time. In summary though, the rooms are perfectly functional, staff very amenable and helpful, etc.",
            "title": "Stay only if you must be close to airport",
            "user": "beachloverPrinceton"
        },
        {
            "date": "May 20, 2013",
            "detail_rating": {
                "business": null,
                "cleanliness": 4.0,
                "desk": null,
                "location": 5.0,
                "pool": null,
                "restaurant": null,
                "rooms": 4.0,
                "service": 4.0,
                "sleep": 4.0,
                "value": 4.0
            },
            "helpfulness": null,
            "id": 161337996,
            "likes": {
                "disliked": null,
                "liked": null
            },
            "rating": 4.0,
            "stay_parameters": "Stayed May 2013, traveled as a couple",
            "text": "The hotel bar and restaurant are a bit expensive price wise. There are two independent restaurants just over the road from the place \u2013 although these are not that cheap either. A 10-15 minute walk you find a small town centre for this airport community. There are a few small supermarkets, a couple of fast food joints, a couple of bars and a restaurant. This is where plenty of local busses come in.",
            "title": "Comfortable stay",
            "user": "Nick H"
        },
        {
            "date": "May 17, 2013",
            "detail_rating": {
                "business": null,
                "cleanliness": 4.0,
                "desk": null,
                "location": 4.0,
                "pool": null,
                "restaurant": null,
                "rooms": 4.0,
                "service": 4.0,
                "sleep": 4.0,
                "value": 4.0
            },
            "helpfulness": null,
            "id": 161000151,
            "likes": {
                "disliked": null,
                "liked": null
            },
            "rating": 4.0,
            "stay_parameters": "Stayed May 2013, traveled as a couple",
            "text": "Like many airport hotels, this place suffers from the tourist bus-group syndrome. Unfortunately, a busload of about 40 camera drunk Orientals (Japanese or Chinese??) had arrived about 5 minutes before I did. This meant that the reception area was in utter chaos with bags, chatter and amusing picture taking of inanimate objects such as fire extinguishers and parking ticket machine was going on all around but I eventually got checked in after about 20 minutes!",
            "title": "Quick response",
            "user": "Heriantoath"
        },
        {
            "date": "May 17, 2013",
            "detail_rating": {
                "business": null,
                "cleanliness": 3.0,
                "desk": null,
                "location": 3.0,
                "pool": null,
                "restaurant": null,
                "rooms": 3.0,
                "service": 3.0,
                "sleep": 3.0,
                "value": 3.0
            },
            "helpfulness": null,
            "id": 160991537,
            "likes": {
                "disliked": null,
                "liked": null
            },
            "rating": 3.0,
            "stay_parameters": "Stayed May 2013, traveled on business",
            "text": "Getting a short taxi ride to where I was working the next day proved a bit of a hassle. Booked a taxi nice and early but when came to get it, no sign of it. The company was hopeless and later informed the hotel they had picked up the wrong person \u2013 erm, I don\u2019t think so as we were waiting well before the allotted time. Got some transport in the end but 45 minutes after we ordered the taxi and had to negotiate with a separate company ourselves to get it and were late for the meeting!",
            "title": "airport hotel, nothing bad to say, nice touches",
            "user": "Countrybob"
        },
        {
            "date": "July 7, 2013",
            "detail_rating": {
                "business": null,
                "cleanliness": 4.0,
                "desk": null,
                "location": 5.0,
                "pool": null,
                "restaurant": null,
                "rooms": 3.0,
                "service": 4.0,
                "sleep": 5.0,
                "value": 5.0
            },
            "helpfulness": null,
            "id": 166605609,
            "likes": {
                "disliked": null,
                "liked": null
            },
            "rating": 3.0,
            "stay_parameters": "Stayed June 2013, traveled with family",
            "text": "We stayed at this hotel as we were flying out the next day. Very friendly at check-in, clean large rooms, restaurant had a wide selection for breakfast and the shuttle to the airport was prompt. Wifi in room was useful and computer in lobby was available to print out boarding passes.",
            "title": "Close to airport",
            "user": "RAM342"
        },
        {
            "date": "September 24, 2012",
            "detail_rating": {
                "business": null,
                "cleanliness": 5.0,
                "desk": null,
                "location": 4.0,
                "pool": null,
                "restaurant": null,
                "rooms": 4.0,
                "service": 5.0,
                "sleep": 4.0,
                "value": 4.0
            },
            "helpfulness": null,
            "id": 141163329,
            "likes": {
                "disliked": null,
                "liked": null
            },
            "rating": 4.0,
            "stay_parameters": "Stayed September 2012, traveled solo",
            "text": "It is always a pleasure to stay at this hotel. I often stay here alone and with a heavy suitcase I am very happy to have the luggage elevator at the entrance. Travel to the airport is convenient, either with car or the shuttlebus, and you are not in the middle of traffic. The rooms are quiet, food is good, staff is helpful and friendly. If I had one complaint it would be that the covers on the bed are almost uncomfortably hot, but that is a personal issue.",
            "title": "Dependable comfort",
            "user": "Euronaut"
        },
        {
            "date": "September 24, 2012",
            "detail_rating": {
                "business": null,
                "cleanliness": 3.0,
                "desk": null,
                "location": 2.0,
                "pool": null,
                "restaurant": null,
                "rooms": 4.0,
                "service": 4.0,
                "sleep": 4.0,
                "value": 3.0
            },
            "helpfulness": null,
            "id": 141101868,
            "likes": {
                "disliked": null,
                "liked": null
            },
            "rating": 3.0,
            "stay_parameters": "Stayed September 2012, traveled solo",
            "text": "Prices have gone up but you can still get a good deal here.",
            "title": "Tennis next door",
            "user": "WanyaF"
        },
        {
            "date": "September 17, 2012",
            "detail_rating": {
                "business": null,
                "cleanliness": 3.0,
                "desk": null,
                "location": 3.0,
                "pool": null,
                "restaurant": null,
                "rooms": 3.0,
                "service": 2.0,
                "sleep": null,
                "value": 2.0
            },
            "helpfulness": null,
            "id": 140477208,
            "likes": {
                "disliked": null,
                "liked": null
            },
            "rating": 2.0,
            "stay_parameters": "Stayed September 2012, traveled solo",
            "text": "This Novotel is a bit remote, not at the airport, but next door you find excellent indoor tennis and squash courts, and a large fitness/health centre. These facilities are NOT part of the hotel, but really next door and have a reasonable price level. So, if you want to get/stay fit on your Amsterdam stop-over, this is the place to be.",
            "title": "Hidden Charges",
            "user": "9mewses"
        },
        {
            "date": "September 12, 2012",
            "detail_rating": {
                "business": null,
                "cleanliness": 2.0,
                "desk": null,
                "location": 3.0,
                "pool": null,
                "restaurant": null,
                "rooms": 3.0,
                "service": 1.0,
                "sleep": 3.0,
                "value": 1.0
            },
            "helpfulness": 1,
            "id": 140099898,
            "likes": {
                "disliked": null,
                "liked": null
            },
            "rating": 2.0,
            "stay_parameters": "Stayed September 2012, traveled as a couple",
            "text": "Rooms and facilities of this hotel are standard Novotel, noting it looks like it could have some refurnishing.",
            "title": "Watch for hidden charges",
            "user": "R0cketCity"
        },
        {
            "date": "September 11, 2012",
            "detail_rating": {
                "business": null,
                "cleanliness": 3.0,
                "desk": null,
                "location": 1.0,
                "pool": null,
                "restaurant": null,
                "rooms": 2.0,
                "service": 3.0,
                "sleep": 3.0,
                "value": 2.0
            },
            "helpfulness": 1,
            "id": 140003791,
            "likes": {
                "disliked": null,
                "liked": null
            },
            "rating": 2.0,
            "stay_parameters": "Stayed September 2012, traveled on business",
            "text": "The staff is well trained and very help full, the restaurant menu average up to good, the breakfast really well done, with lots of organic choices.",
            "title": "Not good",
            "user": "cleopatraana"
        },
        {
            "date": "September 10, 2012",
            "detail_rating": {
                "business": null,
                "cleanliness": 4.0,
                "desk": null,
                "location": 2.0,
                "pool": null,
                "restaurant": null,
                "rooms": 3.0,
                "service": 1.0,
                "sleep": 2.0,
                "value": 1.0
            },
            "helpfulness": null,
            "id": 139943880,
            "likes": {
                "disliked": null,
                "liked": null
            },
            "rating": 3.0,
            "stay_parameters": "Stayed September 2012, traveled on business",
            "text": "I stayed here for a night and that was enough.There was a conference on in Amsterdam and rates were very high just about everywhere in the City. I decided to stay close to the airport and get a taxi from there in the morning. The cab fare was 18euro if you decide not to bus it.",
            "title": "So-so",
            "user": "dvdstv"
        },
        {
            "date": "September 4, 2012",
            "detail_rating": {
                "business": null,
                "cleanliness": 4.0,
                "desk": null,
                "location": 4.0,
                "pool": null,
                "restaurant": null,
                "rooms": 4.0,
                "service": 4.0,
                "sleep": 4.0,
                "value": 4.0
            },
            "helpfulness": 1,
            "id": 139409000,
            "likes": {
                "disliked": null,
                "liked": null
            },
            "rating": 4.0,
            "stay_parameters": "Stayed July 2012, traveled with family",
            "text": "If we start with the positive the room was clean and had a well fitted bathroom.",
            "title": "Good when you have to catch a plane early",
            "user": "Bart565"
        },
        {
            "date": "September 1, 2012",
            "detail_rating": {
                "business": null,
                "cleanliness": 5.0,
                "desk": null,
                "location": 5.0,
                "pool": null,
                "restaurant": null,
                "rooms": 4.0,
                "service": 5.0,
                "sleep": 5.0,
                "value": 5.0
            },
            "helpfulness": 1,
            "id": 139089452,
            "likes": {
                "disliked": null,
                "liked": null
            },
            "rating": 4.0,
            "stay_parameters": "Stayed August 2012, traveled with family",
            "text": "However the welcome was poor. On arrival I stood at the desk for what was longer than it should have been before the person on reception right in front of me acknowledged that I even existed - never mind a welcome ! The taciturn approach continued during check-in although the young chap checking in some-one else next to me seemed much more cheerful. Check-out was better in the morning and the two young ladies were pleasant and helpful",
            "title": "Good for the money providing you dont eat off the menu!",
            "user": "adgenlodge"
        },
        {
            "date": "August 30, 2012",
            "detail_rating": {
                "business": null,
                "cleanliness": 5.0,
                "desk": null,
                "location": 3.0,
                "pool": null,
                "restaurant": null,
                "rooms": 5.0,
                "service": 5.0,
                "sleep": 5.0,
                "value": 5.0
            },
            "helpfulness": 2,
            "id": 138890540,
            "likes": {
                "disliked": null,
                "liked": null
            },
            "rating": 4.0,
            "stay_parameters": "Stayed August 2012, traveled with family",
            "text": "In addition whilst my room was clean, there was a musty odour within and - when I went to open the window I saw the sign advising not to do so because of \"insects\". My room was opposite a rather stagnant looking stretch of water which explains the \"insect\" warning .",
            "title": "A very good transit hotel.",
            "user": "SERAN78"
        },
        {
            "date": "August 24, 2012",
            "detail_rating": {
                "business": null,
                "cleanliness": 3.0,
                "desk": null,
                "location": 5.0,
                "pool": null,
                "restaurant": null,
                "rooms": 4.0,
                "service": 4.0,
                "sleep": 4.0,
                "value": 5.0
            },
            "helpfulness": null,
            "id": 138176458,
            "likes": {
                "disliked": null,
                "liked": null
            },
            "rating": 4.0,
            "stay_parameters": "Stayed August 2012, traveled as a couple",
            "text": "So overall I would look elsewhere for an Airport Hotel",
            "title": "Very Good Airport Hotel",
            "user": "Aussie-Traveller3121"
        },
        {
            "date": "June 24, 2013",
            "detail_rating": {
                "business": null,
                "cleanliness": null,
                "desk": null,
                "location": null,
                "pool": null,
                "restaurant": null,
                "rooms": null,
                "service": null,
                "sleep": null,
                "value": null
            },
            "helpfulness": null,
            "id": 165129619,
            "likes": {
                "disliked": null,
                "liked": null
            },
            "rating": 4.0,
            "stay_parameters": null,
            "text": "We were booked on a 'park and fly' package in th Mercure Hotel but due to an over-booking there we were re-booked into their sister hotel.",
            "title": "Goed verblijf",
            "user": "Janny20"
        },
        {
            "date": "June 18, 2013",
            "detail_rating": {
                "business": null,
                "cleanliness": 2.0,
                "desk": null,
                "location": 3.0,
                "pool": null,
                "restaurant": null,
                "rooms": 1.0,
                "service": 3.0,
                "sleep": 2.0,
                "value": 2.0
            },
            "helpfulness": 1,
            "id": 164405844,
            "likes": {
                "disliked": null,
                "liked": null
            },
            "rating": 2.0,
            "stay_parameters": "Stayed June 2013, traveled solo",
            "text": "On arrival we could leave our car in the car park adjacent to the hotel.",
            "title": "Mixed Reviews",
            "user": "Jaddo"
        },
        {
            "date": "June 3, 2013",
            "detail_rating": {
                "business": null,
                "cleanliness": 3.0,
                "desk": null,
                "location": 3.0,
                "pool": null,
                "restaurant": null,
                "rooms": 3.0,
                "service": 3.0,
                "sleep": 3.0,
                "value": 2.0
            },
            "helpfulness": null,
            "id": 162875549,
            "likes": {
                "disliked": null,
                "liked": null
            },
            "rating": 3.0,
            "stay_parameters": "Stayed May 2013, traveled with family",
            "text": "Check in was quick and very friendly.",
            "title": "Is this a 4 star hotel?",
            "user": "Steluta_Cristina"
        },
        {
            "date": "June 1, 2013",
            "detail_rating": {
                "business": null,
                "cleanliness": 3.0,
                "desk": null,
                "location": 4.0,
                "pool": null,
                "restaurant": null,
                "rooms": 3.0,
                "service": 4.0,
                "sleep": 4.0,
                "value": 3.0
            },
            "helpfulness": null,
            "id": 162604652,
            "likes": {
                "disliked": null,
                "liked": null
            },
            "rating": 3.0,
            "stay_parameters": "Stayed May 2013, traveled as a couple",
            "text": "The room was very pleasant; clean, comfortable and spacious. We heard no aircraft noise or any other noise for that matter.",
            "title": "Convenient for airport and has regular shuttle service",
            "user": "Dale T"
        },
        {
            "date": "May 30, 2013",
            "detail_rating": {
                "business": null,
                "cleanliness": 3.0,
                "desk": null,
                "location": 3.0,
                "pool": null,
                "restaurant": null,
                "rooms": 3.0,
                "service": 3.0,
                "sleep": 3.0,
                "value": 2.0
            },
            "helpfulness": null,
            "id": 162378537,
            "likes": {
                "disliked": null,
                "liked": null
            },
            "rating": 4.0,
            "stay_parameters": "Stayed May 2013, traveled on business",
            "text": "You are as with most airport hotels, a bit out of the way in case you want to do something in the evening. We had a drink in the bar downstairs which was ok.",
            "title": "Not quite 4 star.. but still good!",
            "user": "Ravish_84"
        }
    ],
    "slim_ranking": 1.0,
    "stars": 4,
    "tripadvisor": {
        "VISITED": false,
        "country_name": null,
        "locality": null,
        "pic_link": null,
        "street_address": null
    },
    "user_rating": 3.5,
    "variance": {
        "average": 90,
        "excellent": 53,
        "poor": 27,
        "terrible": 15,
        "very good": 174
    }
}