{
    "aka": "b&b Belgravia Hotel London",
    "description": "This award-winning boutique B&B offers 17 en-suite rooms in exclusive Belgravia. The original grade II listed building has been sympathetically maintained and the interior design offers modern, contemporary and stylish accommodation. Extras include a guest lounge with free use of the laptop, free Wi-Fi access, complimentary teas & coffees 24/7, daily newspapers and bike hire. Design, service, quality and comfort are all part of the philosophy. To quote a regular Scandinavian guest: \"Sophisticated simplicity!\"",
    "detail_rating": {
        "cleanliness": null,
        "location": null,
        "rooms": null,
        "service": null,
        "sleep": null,
        "value": null
    },
    "location": {
        "city": "London",
        "continent": "Europe",
        "country": "United Kingdom (UK)",
        "proposed_city": "London",
        "province": null,
        "region": null
    },
    "name": "B&B Belgravia",
    "places": {
        "aka": [
            "London"
        ],
        "hotel_description": [],
        "hotel_name": []
    },
    "review_count": 367,
    "review_count_current": 20,
    "reviews": [
        {
            "date": "December 18, 2006",
            "detail_rating": {
                "business": 5.0,
                "cleanliness": 5.0,
                "desk": null,
                "front_desk": 5.0,
                "location": 5.0,
                "pool": null,
                "restaurant": null,
                "rooms": 4.0,
                "service": 5.0,
                "sleep": null,
                "value": 4.0
            },
            "helpfulness": 3,
            "id": 6470637,
            "likes": {
                "disliked": "\u2014 Nothing really",
                "liked": "\u2014 Location, cleanliness, modernization"
            },
            "rating": 4.0,
            "stay_parameters": "Stayed December 2006, traveled as a couple",
            "text": "Based on other TripAdvisor user reviews, we stayed at this very fine B&B for 3 nights in early December. We were not disappointed. It is less than a 10 minute walk from Victoria Station. Several restaurants are \"around the corner.\" There are rooms on 3 or 4 floors (no elevator). We asked for a room in the back and on the 1st floor (that's one flight up in American terms). Our room was as expected; clean and comfortable, though not very large - typical of Europe. The bathroom was bright and modern. There was a very good cooked to order English breakfast. The staff were kind, efficient and helpful. Tea and coffee were always available in the lounge as was free use of a computer/internet. There are any number of places to stay along this section of Ebury Street - this is the best of the three we have tried in recent years. Only downside is the price of over $200 a night, but this is London and like anywhere, you get what you pay for.",
            "title": "An excellent spot",
            "user": "mizella"
        },
        {
            "date": "November 23, 2006",
            "detail_rating": {
                "business": 3.0,
                "cleanliness": 4.0,
                "desk": null,
                "front_desk": 5.0,
                "location": 5.0,
                "pool": null,
                "restaurant": null,
                "rooms": 5.0,
                "service": null,
                "sleep": null,
                "value": 5.0
            },
            "helpfulness": 3,
            "id": 6169004,
            "likes": {
                "disliked": "\u2014 Too many stairs, no lift",
                "liked": "\u2014 Value for money"
            },
            "rating": 5.0,
            "stay_parameters": "Stayed November 2006, traveled as a couple",
            "text": "Like so many other posters on this site, my wife and I (both in our forties) really liked the place. A good location in a quiet street close to Victoria station; a decent sized room (for London), with a good bath and a surprisingly comfortable bed; and a great breakfast! Only downside for me was the climb to the top floor where our room (room 11) was; more than 50 stairs spread over 6 flights, and a steep climb at that. We had travelled light, and only stayed two nights; if we'd been visiting for a week or more, and had more luggage with us, the climb would have been somewhat challenging. That's the only downside to what otherwise was a really great place to stay, and the place deserves its good ranking on this site.",
            "title": "Great place to stay; but watch the climb",
            "user": "wrrllw"
        },
        {
            "date": "November 5, 2006",
            "detail_rating": {
                "business": 3.0,
                "cleanliness": 4.0,
                "desk": null,
                "front_desk": 5.0,
                "location": 4.0,
                "pool": null,
                "restaurant": null,
                "rooms": 4.0,
                "service": 5.0,
                "sleep": null,
                "value": 4.0
            },
            "helpfulness": 9,
            "id": 6059429,
            "likes": {
                "disliked": "\u2014 lack of solitude due to noise from breakfast room",
                "liked": "\u2014 Staff, price/quality ratio, location"
            },
            "rating": 4.0,
            "stay_parameters": "Stayed September 2006, traveled as a couple",
            "text": "We stayed at the B&B Belgravia for 2 weekend nights in September. Overall a pleasant stay \u2013 many very good things to say about the b&b but unfortunately there was one very big minus: the noise carrying into the room as soon as breakfast started.",
            "title": "Modern, charming b&b",
            "user": "fernweh"
        },
        {
            "date": "November 3, 2006",
            "detail_rating": {
                "business": 4.0,
                "cleanliness": 5.0,
                "desk": null,
                "front_desk": 5.0,
                "location": 5.0,
                "pool": null,
                "restaurant": null,
                "rooms": 5.0,
                "service": 4.0,
                "sleep": null,
                "value": 5.0
            },
            "helpfulness": 11,
            "id": 6051376,
            "likes": {
                "disliked": "\u2014 nothing worth mentioning",
                "liked": "\u2014 Decor and location"
            },
            "rating": 5.0,
            "stay_parameters": "Stayed October 2006, traveled as a couple",
            "text": "We paid 198pounds/300 Euro for a double for 2 nights (which in many cities would be overpriced for this b&b but for London seemes good value for money)",
            "title": "Fabulous",
            "user": "munchkp"
        },
        {
            "date": "October 23, 2006",
            "detail_rating": {
                "business": 5.0,
                "cleanliness": 5.0,
                "desk": null,
                "front_desk": 4.0,
                "location": 5.0,
                "pool": null,
                "restaurant": null,
                "rooms": 5.0,
                "service": 4.0,
                "sleep": null,
                "value": 5.0
            },
            "helpfulness": 6,
            "id": 5985851,
            "likes": {
                "disliked": "\u2014 Nothing",
                "liked": "\u2014 Clean and modern"
            },
            "rating": 5.0,
            "stay_parameters": "Stayed September 2006, traveled as a couple",
            "text": "Would not stay in the same room again but would consider staying in a room on a higher floor in the back of the building.",
            "title": "Central to all of London!",
            "user": "willclan"
        },
        {
            "date": "February 5, 2007",
            "detail_rating": {
                "business": null,
                "cleanliness": 4.0,
                "desk": null,
                "front_desk": 2.0,
                "location": 3.0,
                "pool": null,
                "restaurant": null,
                "rooms": 5.0,
                "service": 4.0,
                "sleep": null,
                "value": 5.0
            },
            "helpfulness": 4,
            "id": 6748445,
            "likes": {
                "disliked": null,
                "liked": null
            },
            "rating": 4.0,
            "stay_parameters": "Stayed December 2006, traveled as a couple",
            "text": "London is a wonderful city, but outrageously expensive. We found this hotel from a number of other reviews and were happy with our decision to try it.",
            "title": "Great Room, Fair Price.",
            "user": "DCJh2007"
        },
        {
            "date": "January 30, 2007",
            "detail_rating": {
                "business": 5.0,
                "cleanliness": 5.0,
                "desk": null,
                "front_desk": 5.0,
                "location": 5.0,
                "pool": null,
                "restaurant": null,
                "rooms": 5.0,
                "service": 5.0,
                "sleep": null,
                "value": 5.0
            },
            "helpfulness": 8,
            "id": 6715178,
            "likes": {
                "disliked": "\u2014 nothing",
                "liked": "\u2014 beautiful house, clean, fantastic staff"
            },
            "rating": 5.0,
            "stay_parameters": "Stayed January 2007, traveled with family",
            "text": "The immediate surrounding area is very subdued and residential, but close to the Tube and a decent walk from Sloane Square.",
            "title": "Fantastic Gem of a Place",
            "user": "TheSimpsonfamily"
        },
        {
            "date": "January 3, 2007",
            "detail_rating": {
                "business": 3.0,
                "cleanliness": 5.0,
                "desk": null,
                "front_desk": 5.0,
                "location": 5.0,
                "pool": null,
                "restaurant": null,
                "rooms": 5.0,
                "service": 5.0,
                "sleep": null,
                "value": 4.0
            },
            "helpfulness": 6,
            "id": 6549477,
            "likes": {
                "disliked": null,
                "liked": "\u2014 Location"
            },
            "rating": 5.0,
            "stay_parameters": "Stayed December 2006, traveled as a couple",
            "text": "Room was wonderful and large by London standards. The only minuses: When we first arrived at 3pm, no one would answer the door. It was raining and we had a lot of luggage so the extra 15 minutes in the cold put us in a foul mood.",
            "title": "Excellent, Excellent, Excellent !!!",
            "user": "tvlmonkey"
        },
        {
            "date": "January 2, 2007",
            "detail_rating": {
                "business": 5.0,
                "cleanliness": 5.0,
                "desk": null,
                "front_desk": 5.0,
                "location": 5.0,
                "pool": null,
                "restaurant": null,
                "rooms": 4.0,
                "service": 5.0,
                "sleep": null,
                "value": 5.0
            },
            "helpfulness": 3,
            "id": 6541221,
            "likes": {
                "disliked": "\u2014 the matresses and pillows",
                "liked": "\u2014 location and value"
            },
            "rating": 5.0,
            "stay_parameters": "Stayed December 2006, traveled with family",
            "text": "Since there isn't an elevator, trudging up our large suitcases was a pain as well. But, I guess that's not their fault.",
            "title": "A GREAT choice!",
            "user": "abrinnel"
        },
        {
            "date": "December 25, 2006",
            "detail_rating": {
                "business": null,
                "cleanliness": null,
                "desk": null,
                "location": null,
                "pool": null,
                "restaurant": null,
                "rooms": null,
                "service": null,
                "sleep": null,
                "value": 4.0
            },
            "helpfulness": 4,
            "id": 6495601,
            "likes": {
                "disliked": "\u2014 Name is easily confused with other not so desirable locations. Pricey like London.",
                "liked": "\u2014 Fantastic location."
            },
            "rating": 5.0,
            "stay_parameters": "Stayed December 2006, traveled as a couple",
            "text": "We would stay in this hotel again, and recommend it to others looking for an affordable, good quality hotel in London.",
            "title": "Caution. Do not confuse this with 118 Ebury St",
            "user": "DarthAnonymous"
        },
        {
            "date": "March 21, 2007",
            "detail_rating": {
                "business": 5.0,
                "cleanliness": 5.0,
                "desk": null,
                "front_desk": 5.0,
                "location": 5.0,
                "pool": null,
                "restaurant": null,
                "rooms": 5.0,
                "service": 5.0,
                "sleep": null,
                "value": 4.0
            },
            "helpfulness": 1,
            "id": 7197797,
            "likes": {
                "disliked": "\u2014 Getting luggage upstairs",
                "liked": "\u2014 Location , service, room quality"
            },
            "rating": 4.0,
            "stay_parameters": "Stayed March 2007, traveled as a couple",
            "text": "This may be the best hotel value in London. Friendly and attentive service, great breakfast, fresh towels every day, bed made every day, clean, public PC, quiet, TV, and convenient. Each room has a phone but you will need a calling card to dial out.",
            "title": "Quality Continues",
            "user": "AnotheeHappyTraveler"
        },
        {
            "date": "March 16, 2007",
            "detail_rating": {
                "business": 4.0,
                "cleanliness": 5.0,
                "desk": null,
                "front_desk": 4.0,
                "location": 5.0,
                "pool": null,
                "restaurant": null,
                "rooms": 4.0,
                "service": 4.0,
                "sleep": null,
                "value": 4.0
            },
            "helpfulness": 1,
            "id": 7171049,
            "likes": {
                "disliked": "\u2014 Street facing room",
                "liked": "\u2014 Breakfast, Coffee bar, Location"
            },
            "rating": 4.0,
            "stay_parameters": "Stayed March 2007, traveled with friends",
            "text": "Great find in London. Positives are room size, the breakfast and the help yourself coffee bar. Only negative the street facing rooms are noisy. Definitely going back. Highly recommended.",
            "title": "Great London value",
            "user": "spoza"
        },
        {
            "date": "March 8, 2007",
            "detail_rating": {
                "business": 4.0,
                "cleanliness": 4.0,
                "desk": null,
                "front_desk": 4.0,
                "location": 4.0,
                "pool": null,
                "restaurant": null,
                "rooms": 3.0,
                "service": 4.0,
                "sleep": null,
                "value": 5.0
            },
            "helpfulness": 2,
            "id": 6935668,
            "likes": {
                "disliked": "\u2014 Noisy",
                "liked": "\u2014 Price"
            },
            "rating": 4.0,
            "stay_parameters": "Stayed March 2007, traveled as a couple",
            "text": "I would recommend. The B&B is simple and satisfactory; nothing luxarious or special. The big pluses are price (for London, less than \u00a3100 is difficult to find) and location.",
            "title": "Recommended: Good value, Good location, but not spectacular",
            "user": "rbmb"
        },
        {
            "date": "February 8, 2007",
            "detail_rating": {
                "business": 3.0,
                "cleanliness": 4.0,
                "desk": null,
                "front_desk": 2.0,
                "location": 5.0,
                "pool": null,
                "restaurant": null,
                "rooms": 4.0,
                "service": 3.0,
                "sleep": null,
                "value": 4.0
            },
            "helpfulness": 10,
            "id": 6764726,
            "likes": {
                "disliked": "\u2014 Fire alarm going off, staff sometimes hard to locate",
                "liked": "\u2014 Very low price for London, easy access to public transportation"
            },
            "rating": 3.0,
            "stay_parameters": "Stayed February 2007, traveled as a couple",
            "text": "Plus",
            "title": "Good Value, With Some Drawbacks",
            "user": "GermanyBrandi"
        },
        {
            "date": "February 6, 2007",
            "detail_rating": {
                "business": 3.0,
                "cleanliness": 3.0,
                "desk": null,
                "front_desk": 3.0,
                "location": 5.0,
                "pool": null,
                "restaurant": null,
                "rooms": 2.0,
                "service": 3.0,
                "sleep": null,
                "value": 3.0
            },
            "helpfulness": 6,
            "id": 6750491,
            "likes": {
                "disliked": "\u2014 traffic noise",
                "liked": "\u2014 location"
            },
            "rating": 3.0,
            "stay_parameters": "Stayed February 2007, traveled as a couple",
            "text": "Good price",
            "title": "Too noisy",
            "user": "Alirog"
        },
        {
            "date": "October 11, 2006",
            "detail_rating": {
                "business": 5.0,
                "cleanliness": 5.0,
                "desk": null,
                "front_desk": 5.0,
                "location": 5.0,
                "pool": null,
                "restaurant": null,
                "rooms": 4.0,
                "service": 5.0,
                "sleep": null,
                "value": 4.0
            },
            "helpfulness": 4,
            "id": 5943142,
            "likes": {
                "disliked": "\u2014 No window in room, only door!",
                "liked": "\u2014 Location"
            },
            "rating": 5.0,
            "stay_parameters": "Stayed September 2006, traveled as a couple",
            "text": "My wife and I had a great stay at the B+B Belgravia during our recent trip to London. The entire hotel was very clean and all of the staff members we dealt with were extremely friendly and helpful. We stayed for three nights in a nice double room. The room was small, but had room for luggage for two people. We had a nice private bathroom. The hotel was very modern, with a nice lounge area with free internet access, coffee, tea, biscuits, etc. The breakfast was great each morning, too!",
            "title": "Perfect B+B in London!",
            "user": "jwreeve"
        },
        {
            "date": "October 7, 2006",
            "detail_rating": {
                "business": 5.0,
                "cleanliness": 4.0,
                "desk": null,
                "front_desk": 5.0,
                "location": 5.0,
                "pool": null,
                "restaurant": null,
                "rooms": 4.0,
                "service": 5.0,
                "sleep": null,
                "value": 5.0
            },
            "helpfulness": 4,
            "id": 5925934,
            "likes": {
                "disliked": null,
                "liked": null
            },
            "rating": 4.0,
            "stay_parameters": "Stayed October 2006",
            "text": "The location was very convenient, with a quick walk to Victoria Station and the Underground. It was a great hotel and I would definately reccommend.",
            "title": "Great Location",
            "user": "Haydenlin"
        },
        {
            "date": "October 7, 2006",
            "detail_rating": {
                "business": 3.0,
                "cleanliness": 5.0,
                "desk": null,
                "front_desk": 4.0,
                "location": 5.0,
                "pool": null,
                "restaurant": null,
                "rooms": 4.0,
                "service": 3.0,
                "sleep": null,
                "value": 4.0
            },
            "helpfulness": 6,
            "id": 5925692,
            "likes": {
                "disliked": "\u2014 no aircon",
                "liked": "\u2014 value for money"
            },
            "rating": 4.0,
            "stay_parameters": "Stayed September 2006, traveled as a couple",
            "text": "My husband and I stayed at the B&B Belgravia four nights while touring the U.K.. As others have stated, it is within walking distance to Victoria Station, Buckingham Palace, Harrods, and other tourist sights. Just be sure to wear comfortable shoes. The modern lobby with the coffee/tea/espresso machine was warm and inviting. Each day I would take a few moments to check emails on the computer in the lobby while eating a wonderful shorbread cookie and sipping an espresso; quite a treat after walking all day. The breakfast served in the cheery breakfast area was very filling and served promptly. The rooms, although small, were well appointed, and the shower had plenty of hot water. I loved the modern sink. We were given fresh towels daily, and the room was made up each day. The staff was wonderful, especially the little gal from Hungary.",
            "title": "Great Value",
            "user": "INDISGUISE1809"
        },
        {
            "date": "September 27, 2006",
            "detail_rating": {
                "business": 4.0,
                "cleanliness": 5.0,
                "desk": null,
                "front_desk": 5.0,
                "location": 5.0,
                "pool": null,
                "restaurant": null,
                "rooms": 5.0,
                "service": 5.0,
                "sleep": null,
                "value": 5.0
            },
            "helpfulness": 3,
            "id": 5882962,
            "likes": {
                "disliked": "\u2014 No printer available, so you can check in on line but cannot print boarding pass",
                "liked": "\u2014 The staff and the decor"
            },
            "rating": 5.0,
            "stay_parameters": "Stayed September 2006, traveled with family",
            "text": "My wife and I needed somewhere to stay near the Royal Albert Hall for one night and chose B+B Belgravia after seeing a review in a magazine. We thought it was great, quirky and friendly. The room was spotless and the bathroom small but adequate. Yes, there are drawbacks, the front door is permanently locked (they give you a daily code), it does not have air conditioning (but they do supply fans) and it does not have any lifts (we were on the top floor but, thankfully, very fit), but for \u00a399 per night it was good value. We recently stayed at a hotel in Covent Garden paying over \u00a3300 per night and whilst it was a fantastic place, it was not as good value for money, a critisism that you cannot direct at Belgravia B+B. Would we stay there again? yes, for sure. Would we recommend it? yes, just don't expect any frills.",
            "title": "Great value, great location, great hotel",
            "user": "SueMae"
        },
        {
            "date": "September 27, 2006",
            "detail_rating": {
                "business": null,
                "cleanliness": null,
                "desk": null,
                "front_desk": 2.0,
                "location": 3.0,
                "pool": null,
                "restaurant": null,
                "rooms": null,
                "service": null,
                "sleep": null,
                "value": 1.0
            },
            "helpfulness": 5,
            "id": 5881481,
            "likes": {
                "disliked": "\u2014 Room the size of a treehouse",
                "liked": "\u2014 Nothing!"
            },
            "rating": 1.0,
            "stay_parameters": "Stayed September 2006, traveled with family",
            "text": "The B&B Belgravia is a wonderful, clean, modern looking hotel with the warmth and service of an old fashioned B and B. We stayed three nights and found the location perfect, close to the tube. All of the staff was very welcoming and tried very hard to please. One staff member spent almost an hour on her personal laptop trying to assist us when we had a problem with the British Airway site. The hotel is very clean and our rooms were great. We had a room at the very top, so it was a bit of a climb with the suitcase, but it looked out over the trees and gardens in the back and had a lovely bathroom with a large tub. There was a fan in each room, which kept the room cool and a large window. The breakfast was very nice with many selections...the usual eggs, sausage, etc, plus fresh baked goods, toast, yogurt, jams, cereals, fresh fruit and some really good cheeses. The 24 coffee and tea machine was a great added touch. I hope to go be able to go back soon.",
            "title": "An absolute joke!",
            "user": "weluvweims"
        }
    ],
    "slim_ranking": 0.206412825651,
    "stars": 3,
    "tripadvisor": {
        "VISITED": false,
        "country_name": null,
        "locality": null,
        "pic_link": null,
        "street_address": null
    },
    "user_rating": 4.0,
    "variance": {
        "average": 45,
        "excellent": 136,
        "poor": 24,
        "terrible": 11,
        "very good": 151
    }
}