{
    "aka": "Nh Nurnberg City Hotel Nuremberg",
    "description": null,
    "detail_rating": {
        "cleanliness": null,
        "location": null,
        "rooms": null,
        "service": null,
        "sleep": null,
        "value": null
    },
    "location": {
        "city": null,
        "continent": "Europe",
        "country": "Germany",
        "proposed_city": null,
        "province": null,
        "region": null
    },
    "name": "NH Nurnberg City",
    "places": {
        "aka": [],
        "hotel_description": [],
        "hotel_name": []
    },
    "review_count": 410,
    "review_count_current": 20,
    "reviews": [
        {
            "date": "October 9, 2013",
            "detail_rating": {
                "business": null,
                "cleanliness": 4.0,
                "desk": null,
                "location": 5.0,
                "pool": null,
                "restaurant": null,
                "rooms": 4.0,
                "service": 4.0,
                "sleep": 4.0,
                "value": 3.0
            },
            "helpfulness": 1,
            "id": 180363526,
            "likes": {
                "disliked": null,
                "liked": null
            },
            "rating": 4.0,
            "stay_parameters": "Stayed October 2013, traveled with friends",
            "text": "Spent 3 nights here, overall pleasant experience. Staff were friendly & helpful. Beds comfortable. It would be nice to have wi-fi in rooms but it is free in the lobby. The location is great, an easy walk to the main shopping area & tram station directly across the street. I would recommend it.",
            "title": "Nice location",
            "user": "tedandbarb"
        },
        {
            "date": "October 4, 2013",
            "detail_rating": {
                "business": null,
                "cleanliness": 4.0,
                "desk": null,
                "location": 5.0,
                "pool": null,
                "restaurant": null,
                "rooms": 4.0,
                "service": 5.0,
                "sleep": 4.0,
                "value": 4.0
            },
            "helpfulness": null,
            "id": 179755032,
            "likes": {
                "disliked": null,
                "liked": null
            },
            "rating": 4.0,
            "stay_parameters": "Stayed October 2013, traveled as a couple",
            "text": "The location of the hotel was a real plus, especially as we were coming and going from the train station. It is also close to just about everything we wanted to see and we were able to walk. We had a nice size room which was very clean and quiet. The dining area looked beautiful however we did not have the breakfast so I can't comment.",
            "title": "nice hotel near the train station with helpful staff",
            "user": "tonichestnutantosha"
        },
        {
            "date": "October 4, 2013",
            "detail_rating": {
                "business": null,
                "cleanliness": 5.0,
                "desk": null,
                "location": 5.0,
                "pool": null,
                "restaurant": null,
                "rooms": 4.0,
                "service": 3.0,
                "sleep": 4.0,
                "value": 2.0
            },
            "helpfulness": null,
            "id": 179741718,
            "likes": {
                "disliked": null,
                "liked": null
            },
            "rating": 3.0,
            "stay_parameters": "Stayed September 2013, traveled on business",
            "text": "The staff were very good, very helpful. They held our luggage for us at the desk while we traveled to Bamburg for the day. They also gave us a free cable for our computer which worked much better than the other hotels we stayed in using wifi. Also, after moving on to other parts of Germany I realized I had left a scarf in our room. I emailed the hotel to ask if it would be possible to send it to me in Canada. They were very prompt in their responses and would have taken the trouble to mail it to me but in the end I told them not to bother. I really appreciated that they were very friendly in their correspondence.",
            "title": "Functional hotel",
            "user": "FamilleDiF"
        },
        {
            "date": "September 30, 2013",
            "detail_rating": {
                "business": null,
                "cleanliness": 5.0,
                "desk": null,
                "location": 5.0,
                "pool": null,
                "restaurant": null,
                "rooms": 4.0,
                "service": 3.0,
                "sleep": 5.0,
                "value": 4.0
            },
            "helpfulness": null,
            "id": 179205156,
            "likes": {
                "disliked": null,
                "liked": null
            },
            "rating": 4.0,
            "stay_parameters": "Stayed December 2012, traveled with family",
            "text": "Functional business, impersonal hotel",
            "title": "Nice Business Hotel",
            "user": "Holms11"
        },
        {
            "date": "September 20, 2013",
            "detail_rating": {
                "business": null,
                "cleanliness": 5.0,
                "desk": null,
                "location": 5.0,
                "pool": null,
                "restaurant": null,
                "rooms": 5.0,
                "service": 4.0,
                "sleep": 5.0,
                "value": 4.0
            },
            "helpfulness": null,
            "id": 177917404,
            "likes": {
                "disliked": null,
                "liked": null
            },
            "rating": 4.0,
            "stay_parameters": "Stayed August 2013, traveled with family",
            "text": "Positive: very good location, very clean and functional rooms, good breakfast buffet, nice bar/restaurant/lounge",
            "title": "Great location!",
            "user": "Maravell"
        },
        {
            "date": "July 9, 2013",
            "detail_rating": {
                "business": null,
                "cleanliness": null,
                "desk": null,
                "location": null,
                "pool": null,
                "restaurant": null,
                "rooms": null,
                "service": null,
                "sleep": null,
                "value": null
            },
            "helpfulness": 1,
            "id": 166975654,
            "likes": {
                "disliked": null,
                "liked": null
            },
            "rating": 4.0,
            "stay_parameters": null,
            "text": "Our family was on a Viking River Cruise; but due to unusual rain and flooding on the Danube, part of our cruise was altered due to a broken lock on the river. We were put up at the NH for two days/nights. The hotel was very modern, clean and comfortable. The hotel's location is conveniently located for walking into the city centre which we did several times. The meals we had at the hotel restaurant were very good also!",
            "title": "Convenient Location",
            "user": "joyful1LasVegas"
        },
        {
            "date": "July 8, 2013",
            "detail_rating": {
                "business": null,
                "cleanliness": 5.0,
                "desk": null,
                "location": 4.0,
                "pool": null,
                "restaurant": null,
                "rooms": 4.0,
                "service": 3.0,
                "sleep": 4.0,
                "value": 4.0
            },
            "helpfulness": null,
            "id": 166811732,
            "likes": {
                "disliked": null,
                "liked": null
            },
            "rating": 4.0,
            "stay_parameters": "Stayed July 2013, traveled as a couple",
            "text": "We booked this hotel as a \"Top Secret\" deal and got a great price for a city centre hotel, the location is great, near the main railway station but it has to be said that like any main railway station the area just outside the station was less than desirable,",
            "title": "Convenient location.",
            "user": "chrism1966"
        },
        {
            "date": "July 7, 2013",
            "detail_rating": {
                "business": null,
                "cleanliness": 5.0,
                "desk": null,
                "location": 5.0,
                "pool": null,
                "restaurant": null,
                "rooms": 4.0,
                "service": 4.0,
                "sleep": 5.0,
                "value": 5.0
            },
            "helpfulness": null,
            "id": 166645546,
            "likes": {
                "disliked": null,
                "liked": null
            },
            "rating": 4.0,
            "stay_parameters": "Stayed July 2013, traveled on business",
            "text": "The hotel is a typical for business, but it is great for tourists as well, rooms were large and quiet due to good insulation,",
            "title": "Well placed, dependable, clean",
            "user": "Haruspex17"
        },
        {
            "date": "July 7, 2013",
            "detail_rating": {
                "business": null,
                "cleanliness": 5.0,
                "desk": null,
                "location": 5.0,
                "pool": null,
                "restaurant": null,
                "rooms": 4.0,
                "service": 4.0,
                "sleep": 4.0,
                "value": 4.0
            },
            "helpfulness": null,
            "id": 166618872,
            "likes": {
                "disliked": null,
                "liked": null
            },
            "rating": 4.0,
            "stay_parameters": "Stayed June 2013, traveled as a couple",
            "text": "We were on a room only tariff so can not comment about food or drink my only real disappointment was internet was only available by a cable/LAN this is very old fashioned in the age of the ipad etc!",
            "title": "Well located city hotel ...",
            "user": "DeeMarshian"
        },
        {
            "date": "July 4, 2013",
            "detail_rating": {
                "business": null,
                "cleanliness": 5.0,
                "desk": null,
                "location": 5.0,
                "pool": null,
                "restaurant": null,
                "rooms": 3.0,
                "service": 4.0,
                "sleep": 5.0,
                "value": 3.0
            },
            "helpfulness": null,
            "id": 166334734,
            "likes": {
                "disliked": null,
                "liked": null
            },
            "rating": 3.0,
            "stay_parameters": "Stayed September 2012, traveled with family",
            "text": "Just one thing to add there is a full sized window in the room looking into the bathroom?? It does have slight frosting with visible slits in it?? Hope you share with a close friend. See picture.",
            "title": "Good, but nothing special",
            "user": "Gustavo P"
        },
        {
            "date": "September 15, 2013",
            "detail_rating": {
                "business": null,
                "cleanliness": 3.0,
                "desk": null,
                "location": 4.0,
                "pool": null,
                "restaurant": null,
                "rooms": 4.0,
                "service": 4.0,
                "sleep": 5.0,
                "value": 5.0
            },
            "helpfulness": null,
            "id": 177221098,
            "likes": {
                "disliked": null,
                "liked": null
            },
            "rating": 4.0,
            "stay_parameters": "Stayed September 2013, traveled as a couple",
            "text": "Got a pre-paid early bird price (25% off). Very cost effective for a convenient location just near the central railway station. We took this hotel as a base to explore Bavaria by train. A typical 4 star hotel. Well equipped, quiet and comfortable enough. Easy walk to the medieval old city of Nuremberg with great walking streets, restaurants and historical sites. The downside is the room is a little dusty and the bathroom needs some refreshment. Overall a very good choice in central Nuremberg.",
            "title": "Very Good Choice in Central Nuremberg",
            "user": "Fred_Yuanxin_Zhang"
        },
        {
            "date": "September 11, 2013",
            "detail_rating": {
                "business": null,
                "cleanliness": 4.0,
                "desk": null,
                "location": 4.0,
                "pool": null,
                "restaurant": null,
                "rooms": 5.0,
                "service": 4.0,
                "sleep": 5.0,
                "value": 5.0
            },
            "helpfulness": null,
            "id": 176704213,
            "likes": {
                "disliked": null,
                "liked": null
            },
            "rating": 4.0,
            "stay_parameters": "Stayed September 2013, traveled as a couple",
            "text": "My husband regularly stays at this hotel for business and I decided to join him for the weekend. The hotel is a hop, skip and a jump away from the main station and walking distance from the old town. Its location is also very quiet. The rooms are spacious, the bed huge and comfortable and the shower (over bath) has good water pressure (an absolute must for us). The front-of-house staff is very friendly and the hotel offers really good value.",
            "title": "A solid four star",
            "user": "RegularsGreece-v2"
        },
        {
            "date": "August 29, 2013",
            "detail_rating": {
                "business": null,
                "cleanliness": 5.0,
                "desk": null,
                "location": 5.0,
                "pool": null,
                "restaurant": null,
                "rooms": 5.0,
                "service": 5.0,
                "sleep": 5.0,
                "value": 5.0
            },
            "helpfulness": null,
            "id": 174690215,
            "likes": {
                "disliked": null,
                "liked": null
            },
            "rating": 5.0,
            "stay_parameters": "Stayed August 2013, traveled with friends",
            "text": "The hotel lost one star for the expensive breakfast (we opted out); and the internet, which is supposedly free, but is capped and only available via ethernet in the rooms. If you have multiple devices, your only solution is to sit in the lobby where there is wifi, but be warned - it is dead slow and there is not a lot of seating space available.",
            "title": "Clean, comfortable, Quality room",
            "user": "RichardMiltonKeynes"
        },
        {
            "date": "August 27, 2013",
            "detail_rating": {
                "business": null,
                "cleanliness": 5.0,
                "desk": null,
                "location": 5.0,
                "pool": null,
                "restaurant": null,
                "rooms": 5.0,
                "service": 5.0,
                "sleep": 4.0,
                "value": 5.0
            },
            "helpfulness": null,
            "id": 174416193,
            "likes": {
                "disliked": null,
                "liked": null
            },
            "rating": 5.0,
            "stay_parameters": "Stayed June 2013, traveled as a couple",
            "text": "All in all, a very pleasant stay and we will definitely be back.",
            "title": "Friendly and attentive staff, clean, good facilities.",
            "user": "Alexi7777777"
        },
        {
            "date": "August 27, 2013",
            "detail_rating": {
                "business": null,
                "cleanliness": 4.0,
                "desk": null,
                "location": 3.0,
                "pool": null,
                "restaurant": null,
                "rooms": 3.0,
                "service": 3.0,
                "sleep": 4.0,
                "value": 4.0
            },
            "helpfulness": 1,
            "id": 174404006,
            "likes": {
                "disliked": null,
                "liked": null
            },
            "rating": 3.0,
            "stay_parameters": "Stayed August 2013, traveled with friends",
            "text": "The hotel was of a high standard with a nicely designed room and bathroom. The wooden floors gave the room a modern feel, and there was plenty of storage and hanging space.",
            "title": "Comfortable",
            "user": "danmurphy"
        },
        {
            "date": "August 20, 2013",
            "detail_rating": {
                "business": null,
                "cleanliness": 4.0,
                "desk": null,
                "location": 4.0,
                "pool": null,
                "restaurant": null,
                "rooms": 4.0,
                "service": 3.0,
                "sleep": null,
                "value": 3.0
            },
            "helpfulness": null,
            "id": 173130370,
            "likes": {
                "disliked": null,
                "liked": null
            },
            "rating": 4.0,
            "stay_parameters": "Stayed August 2013",
            "text": "The room is very clean and comfortable, air conditioned in summer. The location is good, but in front of the hotel is a contruction area with much dust. Only 7 mins walking to the N\u00fcrnberg old town, main station and shopping area. The receptionist was not so friendly but it was ok. We can park our car in their underground garage, cost \u20ac14 per day. It's a little bit expensive but I think hotels which is located near the city center have more expensive parking cost. But overall we were satisfied with this hotel, will be one of our options when we visit N\u00fcrnberg again.",
            "title": "Clean comfortable room, good location",
            "user": "veronica_vania"
        },
        {
            "date": "August 13, 2013",
            "detail_rating": {
                "business": null,
                "cleanliness": null,
                "desk": null,
                "location": null,
                "pool": null,
                "restaurant": null,
                "rooms": null,
                "service": null,
                "sleep": null,
                "value": null
            },
            "helpfulness": null,
            "id": 172110741,
            "likes": {
                "disliked": null,
                "liked": null
            },
            "rating": 4.0,
            "stay_parameters": null,
            "text": "Good location to centre of town,plenty of shops,restaurants within 7 minute walk",
            "title": "Met expectations",
            "user": "stephen k"
        },
        {
            "date": "August 4, 2013",
            "detail_rating": {
                "business": null,
                "cleanliness": 3.0,
                "desk": null,
                "location": 3.0,
                "pool": null,
                "restaurant": null,
                "rooms": 3.0,
                "service": 3.0,
                "sleep": 3.0,
                "value": 4.0
            },
            "helpfulness": 2,
            "id": 170713085,
            "likes": {
                "disliked": null,
                "liked": null
            },
            "rating": 3.0,
            "stay_parameters": "Stayed August 2013, traveled as a couple",
            "text": "The hotel is about seven years old and is in reatively good condition.We had a triple bedroom which was a little tight,but for 2 nights fine,air condition worked well,tv is very old and picture quality not so good.One odd design was the frosted window from the bathroom to the bedroom.",
            "title": "Good Business Class Hotel With Amenities.",
            "user": "myomayaman"
        },
        {
            "date": "July 16, 2013",
            "detail_rating": {
                "business": null,
                "cleanliness": 5.0,
                "desk": null,
                "location": 4.0,
                "pool": null,
                "restaurant": null,
                "rooms": 4.0,
                "service": 5.0,
                "sleep": null,
                "value": 4.0
            },
            "helpfulness": 1,
            "id": 167739322,
            "likes": {
                "disliked": null,
                "liked": null
            },
            "rating": 4.0,
            "stay_parameters": "Stayed July 2013",
            "text": "Breakfast was excellent with ample choice to fit many needs,staff were attentive and friendly.",
            "title": "Ultra modern rooms just outside the city wall",
            "user": "Xenawman"
        },
        {
            "date": "July 15, 2013",
            "detail_rating": {
                "business": null,
                "cleanliness": 3.0,
                "desk": null,
                "location": 3.0,
                "pool": null,
                "restaurant": null,
                "rooms": 3.0,
                "service": 1.0,
                "sleep": 1.0,
                "value": 3.0
            },
            "helpfulness": 1,
            "id": 167677559,
            "likes": {
                "disliked": null,
                "liked": null
            },
            "rating": 2.0,
            "stay_parameters": "Stayed July 2013, traveled on business",
            "text": "Good reception team,efficeient and happy to please,I would use this hotel again.",
            "title": "Don't Book if you want Air Conditioning!",
            "user": "BusinessTravSie"
        }
    ],
    "slim_ranking": 0.267716535433,
    "stars": 4,
    "tripadvisor": {
        "VISITED": false,
        "country_name": null,
        "locality": null,
        "pic_link": null,
        "street_address": null
    },
    "user_rating": 4.0,
    "variance": {
        "average": 56,
        "excellent": 117,
        "poor": 9,
        "terrible": 8,
        "very good": 220
    }
}