{
    "aka": "Sheraton Bandara Hotel Jakarta",
    "description": "Just three kilometres from Soekarno-Hatta International Airport, Sheraton Bandara Hotel offers a unique, five-star, resort-style experience.",
    "detail_rating": {
        "cleanliness": null,
        "location": null,
        "rooms": null,
        "service": null,
        "sleep": null,
        "value": null
    },
    "location": {
        "city": "Jakarta",
        "continent": "Asia",
        "country": "Indonesia",
        "proposed_city": "Jakarta",
        "province": null,
        "region": "Java"
    },
    "name": "Sheraton Bandara",
    "places": {
        "aka": [
            "Jakarta"
        ],
        "hotel_description": [],
        "hotel_name": []
    },
    "review_count": 232,
    "review_count_current": 20,
    "reviews": [
        {
            "date": "January 15, 2011",
            "detail_rating": {
                "business": null,
                "cleanliness": 4.0,
                "desk": null,
                "location": 5.0,
                "pool": null,
                "restaurant": null,
                "rooms": 3.0,
                "service": 4.0,
                "sleep": 4.0,
                "value": 4.0
            },
            "helpfulness": 1,
            "id": 93042964,
            "likes": {
                "disliked": null,
                "liked": null
            },
            "rating": 4.0,
            "stay_parameters": "Stayed January 2011, traveled on business",
            "text": "I had stayed at the hotel about 7 years ago and remembered it as beautiful and pleasant, and an advantage is the location of the hotel near the airport. Now I returned for three nights and did not get the room I reserved (with furnished terrace), but a room on the first floor where windows cannot be opened. First that disturbed me, but then the advantage is that no mosquitoes come into the room. After the long journey from Europe I was just to tired to make a fuss shortly before midnight. There are also many airline crews residing at the hotel. To start with description of the hotel, the appearance is still very good, and the staff is as friendly and helpful without exception as it ever was. Unfortunately, the buildings are a bit run down and would deserve a touch up. Still, room utilities were all in good order, and something I always appreciate there was a coffee maker (coffee replenished regularly free of charge) and an ironing board in the room. Bottled and sealed mineral water of a reputed brand was also replenished regularly free of charge. Food (buffets) was good. A detail on the laundry service: Laundry delivered before 7 am should be returned same day at 20h, but I didn't receive my laundry. After a phone call at about 21 h I received it in five minutes. There is no service directory with phone numbers in the room, only the indication \"guest services\" on the phone. I regret I forgot my bathing trunks, as there is a nice swimming pool in the centre of the hotel. I did not have enough time to visit all other highlights of the hotel as I was on a business trip and not on holidays. A final positive point is that there is a reliable free shuttle service to the airport on demand. However on the other way form airport to hotel, I hadn\u2019t found a shuttle service, and had to take a local taxi. The driver asked for 40 USD, but then accepted 5 USD which is still an very high price, if not excessive, for the short stretch of about 2 km.",
            "title": "An Airport Hotel that has some local charm",
            "user": "Frequentvoyager"
        },
        {
            "date": "January 5, 2011",
            "detail_rating": {
                "business": null,
                "cleanliness": 2.0,
                "desk": null,
                "location": 5.0,
                "pool": null,
                "restaurant": null,
                "rooms": 2.0,
                "service": 2.0,
                "sleep": 2.0,
                "value": 2.0
            },
            "helpfulness": null,
            "id": 91896042,
            "likes": {
                "disliked": null,
                "liked": null
            },
            "rating": 2.0,
            "stay_parameters": "Stayed January 2011, traveled on business",
            "text": "Stayed for Buissness due to close proximity to airport.",
            "title": "Is This Really a Sheraton?",
            "user": "FLYISH"
        },
        {
            "date": "November 15, 2010",
            "detail_rating": {
                "business": null,
                "cleanliness": 4.0,
                "desk": null,
                "location": 5.0,
                "pool": null,
                "restaurant": null,
                "rooms": 4.0,
                "service": 5.0,
                "sleep": 4.0,
                "value": 4.0
            },
            "helpfulness": null,
            "id": 87189657,
            "likes": {
                "disliked": null,
                "liked": null
            },
            "rating": 4.0,
            "stay_parameters": "Stayed April 2010, traveled with friends",
            "text": "Promised a Airport pick up but never came ..waited 30 min. finally took a cab long flt and couldn't wait any longer. when told about the incident at front desk,....got a blank stare?",
            "title": "A very different Sheraton!!",
            "user": "marksa67"
        },
        {
            "date": "October 2, 2010",
            "detail_rating": {
                "business": null,
                "cleanliness": 2.0,
                "desk": null,
                "location": 3.0,
                "pool": null,
                "restaurant": null,
                "rooms": 2.0,
                "service": 3.0,
                "sleep": 2.0,
                "value": 2.0
            },
            "helpfulness": null,
            "id": 81818618,
            "likes": {
                "disliked": null,
                "liked": null
            },
            "rating": 3.0,
            "stay_parameters": "Stayed October 2010, traveled as a couple",
            "text": "Get to my room. (Starwood preffered level) Old type bed and covers! bathroom dated.",
            "title": "'Re-discover Sheraton' really missed this hotel!",
            "user": "LaoBlue"
        },
        {
            "date": "August 2, 2010",
            "detail_rating": {
                "business": null,
                "cleanliness": 3.0,
                "desk": null,
                "location": 2.0,
                "pool": null,
                "restaurant": null,
                "rooms": 2.0,
                "service": 3.0,
                "sleep": 1.0,
                "value": 3.0
            },
            "helpfulness": null,
            "id": 73399328,
            "likes": {
                "disliked": null,
                "liked": null
            },
            "rating": 2.0,
            "stay_parameters": "Stayed July 2010, traveled on business",
            "text": "take a early nap to catch up on the jetlag to be awoken by hammers pounding in the room next door under construction!! Are you Kidding Me!?",
            "title": "very tired hotel",
            "user": "Melamory_m"
        },
        {
            "date": "January 3, 2010",
            "detail_rating": {
                "business": null,
                "cleanliness": 5.0,
                "desk": null,
                "location": 5.0,
                "pool": null,
                "restaurant": null,
                "rooms": 4.0,
                "service": 5.0,
                "sleep": null,
                "value": 4.0
            },
            "helpfulness": null,
            "id": 52437480,
            "likes": {
                "disliked": null,
                "liked": null
            },
            "rating": 4.0,
            "stay_parameters": "Stayed December 2009, traveled on business",
            "text": "Coming through for 20 hours between planes at awkward times, not being charged for 2 days was an unexpected bonus. Not a sign of a mosquito and no smell of damp or dampness in the room I was given, which was upstairs and probably in a western wing. Just everything I needed. Including directions to get me to and from a place to pick up last minute purchases without missing the plane by sitting in a Jakarta mobile carpark masquerading as a freeway. I'm glad I didnt know it was a Starwood till I got there. It more than cured my promise to myself never to stay in one of their hotels again. If I have to overnight in Jakarta again I won't be staying anywhere else.",
            "title": "Top staff!",
            "user": "annmci"
        },
        {
            "date": "December 28, 2009",
            "detail_rating": {
                "business": null,
                "cleanliness": 5.0,
                "desk": null,
                "location": 4.0,
                "pool": null,
                "restaurant": null,
                "rooms": 4.0,
                "service": 5.0,
                "sleep": null,
                "value": 4.0
            },
            "helpfulness": null,
            "id": 52024913,
            "likes": {
                "disliked": null,
                "liked": null
            },
            "rating": 5.0,
            "stay_parameters": "Stayed April 2007, traveled solo",
            "text": "I stay here one night to flight back to Toronto Canada.",
            "title": "Best Airport Hotel",
            "user": "asujantos"
        },
        {
            "date": "December 28, 2009",
            "detail_rating": {
                "business": null,
                "cleanliness": 3.0,
                "desk": null,
                "location": 4.0,
                "pool": null,
                "restaurant": null,
                "rooms": 2.0,
                "service": 4.0,
                "sleep": null,
                "value": 2.0
            },
            "helpfulness": null,
            "id": 51980972,
            "likes": {
                "disliked": null,
                "liked": null
            },
            "rating": 3.0,
            "stay_parameters": "Stayed December 2009, traveled as a couple",
            "text": "The room was clean and elegant,and very good insulated to sound.",
            "title": "Needs an overhaul",
            "user": "Veteran_travelboy"
        },
        {
            "date": "December 22, 2009",
            "detail_rating": {
                "business": null,
                "cleanliness": 2.0,
                "desk": null,
                "location": 4.0,
                "pool": null,
                "restaurant": null,
                "rooms": 4.0,
                "service": 2.0,
                "sleep": null,
                "value": 3.0
            },
            "helpfulness": 1,
            "id": 51699151,
            "likes": {
                "disliked": null,
                "liked": null
            },
            "rating": 2.0,
            "stay_parameters": "Stayed December 2009, traveled on business",
            "text": "We were very happy with my stay here.",
            "title": "mosquitos, mosquitos!!!",
            "user": "kellycharles"
        },
        {
            "date": "December 21, 2009",
            "detail_rating": {
                "business": null,
                "cleanliness": 3.0,
                "desk": null,
                "location": 5.0,
                "pool": null,
                "restaurant": null,
                "rooms": 3.0,
                "service": 5.0,
                "sleep": null,
                "value": 4.0
            },
            "helpfulness": null,
            "id": 51639615,
            "likes": {
                "disliked": null,
                "liked": null
            },
            "rating": 3.0,
            "stay_parameters": "Stayed December 2009, traveled on business",
            "text": "I have stayed here on several occasions and on each one it seems to get worse.",
            "title": "Mosquitoes outweighed the benefits",
            "user": "OzML"
        },
        {
            "date": "June 2, 2010",
            "detail_rating": {
                "business": null,
                "cleanliness": 1.0,
                "desk": null,
                "location": 3.0,
                "pool": null,
                "restaurant": null,
                "rooms": 1.0,
                "service": 1.0,
                "sleep": 1.0,
                "value": 2.0
            },
            "helpfulness": null,
            "id": 66265193,
            "likes": {
                "disliked": null,
                "liked": null
            },
            "rating": 2.0,
            "stay_parameters": "Stayed May 2010, traveled as a couple",
            "text": "We were invited for the weekend to attend an event in Jakarta and accommodated at the Sheraton Bandara. It is very convenient and close to the airport (5 minutes drive) and we saw many airline crew members staying there. The hotel grounds are very nice but the bedrooms were something else. Ours had a musty smell and unfortunately, because the glass doors (we were on the ground floor) could not be opened, we could not freshen this up. My request to the reception to use some aromatherapy oils went unheeded. The bedsheets & towels supposedly white, were a greyish color. The sinks had mold. The floor were not clean and I picked up an old biscuit. I would not stay there again unless I had to leave for the airport on an early morning flight. I did not sleep well because the room felt so cold due to the tiled flooring, even though I adjusted the airconditioning.",
            "title": "Very convenient to airport but rooms are not clean",
            "user": "wong15"
        },
        {
            "date": "April 17, 2010",
            "detail_rating": {
                "business": null,
                "cleanliness": 4.0,
                "desk": null,
                "location": 5.0,
                "pool": null,
                "restaurant": null,
                "rooms": 4.0,
                "service": 5.0,
                "sleep": 4.0,
                "value": 3.0
            },
            "helpfulness": null,
            "id": 61783857,
            "likes": {
                "disliked": null,
                "liked": null
            },
            "rating": 3.0,
            "stay_parameters": "Stayed April 2010, traveled on business",
            "text": "Whilst I avoided staying in this hotel after being bitten my mozzies during my stay in 2009, due to work and colleagues already staying at this hotel, I chose to stay here again, and hoped that it would be better than my last visit.",
            "title": "Better than my 2009 stay, still aged and require refurbishment",
            "user": "GreyMatter_Singapore"
        },
        {
            "date": "April 7, 2010",
            "detail_rating": {
                "business": null,
                "cleanliness": 5.0,
                "desk": null,
                "location": 5.0,
                "pool": null,
                "restaurant": null,
                "rooms": 5.0,
                "service": 5.0,
                "sleep": 5.0,
                "value": 5.0
            },
            "helpfulness": null,
            "id": 60647074,
            "likes": {
                "disliked": null,
                "liked": null
            },
            "rating": 5.0,
            "stay_parameters": "Stayed March 2010, traveled solo",
            "text": "Surprisingly - minimal mosquitoes this time. Maybe it was the mosquitoe season in early 2009, however this time mozzies wasn't a problem.",
            "title": "Great AIRPORT hotel for transiting Jakarta",
            "user": "ViajeroCraig"
        },
        {
            "date": "March 8, 2010",
            "detail_rating": {
                "business": null,
                "cleanliness": 2.0,
                "desk": null,
                "location": 3.0,
                "pool": null,
                "restaurant": null,
                "rooms": 1.0,
                "service": 4.0,
                "sleep": 2.0,
                "value": 2.0
            },
            "helpfulness": null,
            "id": 58029149,
            "likes": {
                "disliked": null,
                "liked": null
            },
            "rating": 2.0,
            "stay_parameters": "Stayed February 2010, traveled solo",
            "text": "In addition, I believe they must have got a new F&B manager, as breakfast and dinner buffet selections have improved in the selection, quantity and quality. For the month of April 2009, they had a limited Mexican selection (burittos, nachos etc.) during dinner, and on Friday, they introduced a Surf & Turf section as well - this being beef steaks, Australian wagyu beef, some salmon, biggish prawns. While somewhat better, there is still room for further improvement.",
            "title": "How can Sheraton leave it's name on this dump?",
            "user": "Aldo48"
        },
        {
            "date": "March 7, 2010",
            "detail_rating": {
                "business": null,
                "cleanliness": 2.0,
                "desk": null,
                "location": 5.0,
                "pool": null,
                "restaurant": null,
                "rooms": 2.0,
                "service": 1.0,
                "sleep": 2.0,
                "value": 2.0
            },
            "helpfulness": null,
            "id": 57918252,
            "likes": {
                "disliked": null,
                "liked": null
            },
            "rating": 2.0,
            "stay_parameters": "Stayed February 2010, traveled on business",
            "text": "The sashimi spread was limited to some sushi and a couple of fresh sashimi selections.",
            "title": "Double booking of rooms is unacceptable",
            "user": "PeterSydney80"
        },
        {
            "date": "July 23, 2010",
            "detail_rating": {
                "business": null,
                "cleanliness": 5.0,
                "desk": null,
                "location": 5.0,
                "pool": null,
                "restaurant": null,
                "rooms": 4.0,
                "service": 5.0,
                "sleep": 5.0,
                "value": 5.0
            },
            "helpfulness": null,
            "id": 71990900,
            "likes": {
                "disliked": null,
                "liked": null
            },
            "rating": 4.0,
            "stay_parameters": "Stayed April 2010, traveled with family",
            "text": "My wife, Indonesian, just had given birth to our daughter 9 days ago when we traveled back home to the Maldives where we live and do business. We choose the Sheraton by 2 reasons, the close proximity to the Jakarta airport (3 minutes by car) and lastly Sheraton was my home for more than 10 years working for them internationally.",
            "title": "A wonderful surprise!",
            "user": "ThomasSalaFamily"
        },
        {
            "date": "July 16, 2010",
            "detail_rating": {
                "business": null,
                "cleanliness": 3.0,
                "desk": null,
                "location": 4.0,
                "pool": null,
                "restaurant": null,
                "rooms": 1.0,
                "service": null,
                "sleep": 1.0,
                "value": 1.0
            },
            "helpfulness": null,
            "id": 71095101,
            "likes": {
                "disliked": null,
                "liked": null
            },
            "rating": 1.0,
            "stay_parameters": "Stayed March 2010, traveled solo",
            "text": "Despite being so close to an international airport it felt like being in an oasis, right on a lake surrounded by green pure nature; don't expect the usual airport hotel setup! The property is laid out beautifully (which we saw only in the morning as we arrived very late in the evening) and is actually more a resort than an airport hotel. Having never been there and my reservation did not indicate to have been an \"old family member\" the staff of the hotel treated us very nice, had booked a junior suite and we were offered the Presidential Suit as an upgrade, as the suit was only ready in a little more than 30 minutes and having a 9 days old new born that needed a diapers change etc. we decided to stick to our junior suit, which was very fine, a well appointed room with all that one expects by booking a suit. Went for a late dinner to the restaurant and had a great meal at reasonable prices.",
            "title": "The smell woke me up at night",
            "user": "flybunnyB"
        },
        {
            "date": "July 1, 2010",
            "detail_rating": {
                "business": null,
                "cleanliness": 4.0,
                "desk": null,
                "location": 4.0,
                "pool": null,
                "restaurant": null,
                "rooms": 4.0,
                "service": 4.0,
                "sleep": 4.0,
                "value": 5.0
            },
            "helpfulness": null,
            "id": 69296356,
            "likes": {
                "disliked": null,
                "liked": null
            },
            "rating": 4.0,
            "stay_parameters": "Stayed March 2010, traveled solo",
            "text": "This property is ideal for stop over before a next flight to wind down and relax and enjoy; the Bandara will see us again in September when we will fly home again from our Ramadan holidays in Indonesia, that's for sure!",
            "title": "perfect for transit",
            "user": "cozyking"
        },
        {
            "date": "June 15, 2010",
            "detail_rating": {
                "business": null,
                "cleanliness": 3.0,
                "desk": null,
                "location": 4.0,
                "pool": null,
                "restaurant": null,
                "rooms": 2.0,
                "service": 2.0,
                "sleep": 3.0,
                "value": 1.0
            },
            "helpfulness": null,
            "id": 67643217,
            "likes": {
                "disliked": null,
                "liked": null
            },
            "rating": 2.0,
            "stay_parameters": "Stayed June 2010, traveled on business",
            "text": "Thomas and Liza & Aaliyah Stahl",
            "title": "All the reviews are correct. Stay here only as a last resort.",
            "user": "Happytiler"
        },
        {
            "date": "June 4, 2010",
            "detail_rating": {
                "business": null,
                "cleanliness": 5.0,
                "desk": null,
                "location": 5.0,
                "pool": null,
                "restaurant": null,
                "rooms": 3.0,
                "service": 4.0,
                "sleep": 5.0,
                "value": 2.0
            },
            "helpfulness": null,
            "id": 66427443,
            "likes": {
                "disliked": null,
                "liked": null
            },
            "rating": 3.0,
            "stay_parameters": "Stayed June 2010, traveled solo",
            "text": "It was a terrible mistake not check the review before I book this place. I trusted the Sheraton brand and expect 5 star quality. Instead, my room were as described by many here; out-dated, old, tired, and worst of all the smell.",
            "title": "Not even 4 star...",
            "user": "fulklur"
        }
    ],
    "slim_ranking": 0.27797833935,
    "stars": 4,
    "tripadvisor": {
        "VISITED": false,
        "country_name": null,
        "locality": null,
        "pic_link": null,
        "street_address": null
    },
    "user_rating": 3.0,
    "variance": {
        "average": 75,
        "excellent": 26,
        "poor": 39,
        "terrible": 19,
        "very good": 73
    }
}