{
    "aka": "Hilton Knoxville Hotel Knoxville",
    "description": null,
    "detail_rating": {
        "cleanliness": 4.0,
        "location": 4.5,
        "rooms": 4.0,
        "service": 4.0,
        "sleep": 4.0,
        "value": 4.0
    },
    "location": {
        "city": "Knoxville",
        "continent": null,
        "country": "United States",
        "proposed_city": "Knoxville",
        "province": null,
        "region": null
    },
    "name": "Hilton Knoxville",
    "places": {
        "aka": [
            "Knoxville"
        ],
        "hotel_description": [],
        "hotel_name": [
            "Knoxville"
        ]
    },
    "review_count": 371,
    "review_count_current": 40,
    "reviews": [
        {
            "date": "November 18, 2011",
            "detail_rating": {
                "business": null,
                "cleanliness": 4.0,
                "desk": null,
                "location": 5.0,
                "pool": null,
                "restaurant": null,
                "rooms": 4.0,
                "service": 4.0,
                "sleep": 4.0,
                "value": 4.0
            },
            "helpfulness": null,
            "id": 120761452,
            "likes": {
                "disliked": null,
                "liked": null
            },
            "rating": 4.0,
            "stay_parameters": "Stayed October 2011, traveled solo",
            "text": "Booked via PL for 75$. And for that price, got a good deal. Checked in around 11h00Am and service was courteous. They only had pet friendly room when I arrived, but was told that they are well cleaned (I am allergic to animal hair) and could be moved to another room later, if needed. The room was indeed clean, no reactions, and was ample and sunny, with a nice king bed, a good 2 place sofa and ottoman, nice LCD TV, free wifi, decent sized bathroom. Was also given some vouchers for breakfast, which I could not use due to early departure time. I didn't visit the gym or pool, given I was out most of the day. The parking is not expensive (15$ for valet, a good deal) and did not experience the garage itself. The area itself is in walking distance to a nice pedestrian mall, with a farmers market on Saturday, and good restaurants. I liked this place.",
            "title": "Nice hotel in the warm heart of Knoxville",
            "user": "Lubiere"
        },
        {
            "date": "November 15, 2011",
            "detail_rating": {
                "business": null,
                "cleanliness": 4.0,
                "desk": null,
                "location": 5.0,
                "pool": null,
                "restaurant": null,
                "rooms": 4.0,
                "service": 5.0,
                "sleep": 4.0,
                "value": 4.0
            },
            "helpfulness": null,
            "id": 120619768,
            "likes": {
                "disliked": null,
                "liked": null
            },
            "rating": 4.0,
            "stay_parameters": "Stayed November 2011, traveled with friends",
            "text": "Me and a buddy met in Knoxville for weekend. Hotel is in great location, very accessible to interstate for trip in and out of city. Was in walking distance (couple blocks) to Market Square, which is a pedestrian friendly area of downtown containing restaurants, shops, and bars. The lobby has been updated to Hilton standards, but room were a bit dated. Parking garage on site, rate was $12/day. Would stay here again.",
            "title": "Excellent location, right off interstate and close to Market Square",
            "user": "myconductor"
        },
        {
            "date": "November 10, 2011",
            "detail_rating": {
                "business": null,
                "cleanliness": 4.0,
                "desk": null,
                "location": 4.0,
                "pool": null,
                "restaurant": null,
                "rooms": 4.0,
                "service": 4.0,
                "sleep": 4.0,
                "value": 4.0
            },
            "helpfulness": null,
            "id": 120425692,
            "likes": {
                "disliked": null,
                "liked": null
            },
            "rating": 4.0,
            "stay_parameters": "Stayed November 2011, traveled with family",
            "text": "I have stayed in this hotel on three occasions, each time the staff have been very helpful. The reservations are always right, the rooms are always ready and clean. the bellman and the valet or helpful and prompt. the executive lounge is well apointed and welcoming. This is a good hotel.",
            "title": "Great Staff",
            "user": "rtp1960"
        },
        {
            "date": "October 31, 2011",
            "detail_rating": {
                "business": null,
                "cleanliness": 3.0,
                "desk": null,
                "location": 4.0,
                "pool": null,
                "restaurant": null,
                "rooms": 4.0,
                "service": 5.0,
                "sleep": 3.0,
                "value": 5.0
            },
            "helpfulness": null,
            "id": 119943831,
            "likes": {
                "disliked": null,
                "liked": null
            },
            "rating": 4.0,
            "stay_parameters": "Stayed October 2011, traveled with friends",
            "text": "just stayed at this hotel for a UT home game. The hotel is updated, wonderful attentive staff, nice little hotel bar and cafe, starbucks on site, great location. The room was very comfortable and decorated nicely. Bathroom was TINY! My only complaints are the speed of the elevators....I waited almost 15 minutes for one on one of the mornings! I know its a large hotel and can be busy - but 15 minutes for an elevator was ridiculous!! And the other complaint was the noise. Granted...it was a home football game and there was of course extra party goers in the hotel... however, not only could I hear people in the hallways... I could actually hear the person in the room above us going ot the bathroom! I'm sure it is just because it is an old hotel... I would stay here again definitely...",
            "title": "decent hotel - great location - fantastic staff - but very thin walls!",
            "user": "onmyway78"
        },
        {
            "date": "October 29, 2011",
            "detail_rating": {
                "business": null,
                "cleanliness": 5.0,
                "desk": null,
                "location": 4.0,
                "pool": null,
                "restaurant": null,
                "rooms": 5.0,
                "service": 5.0,
                "sleep": 5.0,
                "value": 3.0
            },
            "helpfulness": null,
            "id": 119877502,
            "likes": {
                "disliked": null,
                "liked": null
            },
            "rating": 4.0,
            "stay_parameters": "Stayed October 2011, traveled on business",
            "text": "I stay in hotels approx 10 nights a month. The Hilton in downtown Knoxville is my favorite place to stay in Knoxville. Clean rooms, good workout facility, and very friendly staff. Valet parking is the best option in parking since self parking makes for a long walk sometimes. A good choice for a hotel in Knoxville.",
            "title": "Good choice in Knoxville",
            "user": "Tennesse_Travel"
        },
        {
            "date": "January 9, 2012",
            "detail_rating": {
                "business": null,
                "cleanliness": 4.0,
                "desk": null,
                "location": 4.0,
                "pool": null,
                "restaurant": null,
                "rooms": 3.0,
                "service": 3.0,
                "sleep": 4.0,
                "value": 3.0
            },
            "helpfulness": null,
            "id": 122827129,
            "likes": {
                "disliked": null,
                "liked": null
            },
            "rating": 2.0,
            "stay_parameters": "Stayed October 2011, traveled on business",
            "text": "I booked a stay well in advance under a corporate rate and as a Hilton Honors Gold member. Plans changed, and I was only going to be able to stay the 2nd of the two nights. I contacted the contract manager to ask about keeping the reservation, but for one night, and had to leave a voicemail with her. One of her colleagues replied back to me, instead, and my conversation with him was rather unprofessional:",
            "title": "Poor Management",
            "user": "mrredskin"
        },
        {
            "date": "January 5, 2012",
            "detail_rating": {
                "business": null,
                "cleanliness": 5.0,
                "desk": null,
                "location": 5.0,
                "pool": null,
                "restaurant": null,
                "rooms": 5.0,
                "service": 5.0,
                "sleep": 5.0,
                "value": 5.0
            },
            "helpfulness": null,
            "id": 122627066,
            "likes": {
                "disliked": null,
                "liked": null
            },
            "rating": 5.0,
            "stay_parameters": "Stayed July 2011, traveled as a couple",
            "text": "I inquired about only staying the 2nd night, and was told I would have to cancel the reservation and rebook. Well, the cost of that one night (Saturday) was going to be MORE than the Friday AND Saturday rate I had previously booked... by about $100. Of course I wasn\u2019t going to do this. Hypothetically, I asked what happens if I come the first night but leave before the 2nd. I was informed I would still get my original, cheaper rate. Say what? I asked why this was and did not get an answer from him, but instead he essentially told me I wasn\u2019t even deserving of this rate since it\u2019s no longer able to be booked like this. His replies were very short and rude. I asked a few more questions, and still got the run-around, and was ultimately asked if I wanted to cancel the reservation. I told him \u201cno, if it comes to that then I will cancel myself online and stay at other hotels in Knoxville from now on.\u201d",
            "title": "Good convention hotel, nice stay",
            "user": "OutsidePlaying"
        },
        {
            "date": "December 30, 2011",
            "detail_rating": {
                "business": null,
                "cleanliness": 5.0,
                "desk": null,
                "location": 5.0,
                "pool": null,
                "restaurant": null,
                "rooms": 4.0,
                "service": 4.0,
                "sleep": 3.0,
                "value": 3.0
            },
            "helpfulness": null,
            "id": 122305071,
            "likes": {
                "disliked": null,
                "liked": null
            },
            "rating": 4.0,
            "stay_parameters": "Stayed February 2011, traveled as a couple",
            "text": "Fast forward to the stay, which I ended up keeping, as I go to check in at the front desk and find out my reservation has been canceled. Say what? The Hilton rep had canceled my reservation without my authorization. I received no email or other notice about this cancelation. The front desk clerk was able to revive the reservation, fortunately, but I can\u2019t believe this manager/supervisor had the audacity to do something like that.",
            "title": "Nice Stay - Needs minor improvements",
            "user": "BKrunners"
        },
        {
            "date": "December 14, 2011",
            "detail_rating": {
                "business": null,
                "cleanliness": 3.0,
                "desk": null,
                "location": 4.0,
                "pool": null,
                "restaurant": null,
                "rooms": 4.0,
                "service": 4.0,
                "sleep": 4.0,
                "value": 4.0
            },
            "helpfulness": null,
            "id": 121731213,
            "likes": {
                "disliked": null,
                "liked": null
            },
            "rating": 4.0,
            "stay_parameters": "Stayed December 2011, traveled on business",
            "text": "I called the original contract manager again, leaving a voicemail, and did not hear anything back from her. I was transferred to the Property Manager\u2019s voicemail, and did not hear anything back from him. None of my emails have been given a reply, either. As professional as I have been in my attempts to contact them, I have not received the same professionalism from any of those managers. I waited more than two months to write this review, as well, giving them ample time to reply to me.",
            "title": "Good hotel except for smoking on 9th floor",
            "user": "Mike F"
        },
        {
            "date": "December 3, 2011",
            "detail_rating": {
                "business": null,
                "cleanliness": 3.0,
                "desk": null,
                "location": 4.0,
                "pool": null,
                "restaurant": null,
                "rooms": 3.0,
                "service": 2.0,
                "sleep": 2.0,
                "value": 3.0
            },
            "helpfulness": null,
            "id": 121358148,
            "likes": {
                "disliked": null,
                "liked": null
            },
            "rating": 2.0,
            "stay_parameters": "Stayed December 2011, traveled on business",
            "text": "As for the rest of the staff, they have always been courteous, caring, and welcoming, with each stay I have logged here - even when I was not an elite member. It\u2019s a shame that some of their management team don\u2019t display that same amount of care towards their customers.",
            "title": "Nice location but.....",
            "user": "NC_Hiker"
        },
        {
            "date": "September 22, 2007",
            "detail_rating": {
                "business": 3.0,
                "cleanliness": 2.0,
                "desk": null,
                "front_desk": 3.0,
                "location": 5.0,
                "pool": null,
                "restaurant": null,
                "rooms": 1.0,
                "service": 3.0,
                "sleep": null,
                "value": 1.0
            },
            "helpfulness": null,
            "id": 8851775,
            "likes": {
                "disliked": null,
                "liked": null
            },
            "rating": 2.0,
            "stay_parameters": "Stayed April 2007",
            "text": "Excellent location. Pretty lobby. Garage is not exactly connected and not owned by the hotel. Often full. The non-smoking room smelled from smoke (they never clean the air conditioning filters). The paint was wearing off the toilet seat. The complimentary breakfast was poor, the \"short order cook\" was indifferent if not down right nasty, while the waiter was wonderful.The manager was very nice. I was sorry that I had to discuss the hotel problems with her. You can do better.",
            "title": "Really Bad Hotel",
            "user": "Tommmmmmmm"
        },
        {
            "date": "September 17, 2007",
            "detail_rating": {
                "business": null,
                "cleanliness": 4.0,
                "desk": null,
                "front_desk": 5.0,
                "location": 5.0,
                "pool": null,
                "restaurant": null,
                "rooms": 4.0,
                "service": 4.0,
                "sleep": null,
                "value": 4.0
            },
            "helpfulness": null,
            "id": 8740389,
            "likes": {
                "disliked": null,
                "liked": "\u2014 Buffet breakfast; full service Starbucks in hotel lobby"
            },
            "rating": 4.0,
            "stay_parameters": "Stayed September 2007, traveled as a couple",
            "text": "My wife and I recently stayed at the Hilton in Knoxville as part of a driving tour of Tenessee. The room was a typical 2 double bed standard room, but everything worked. The pluses were a full Starbucks in the lobby, an excellent buffet breakfast, convenient self-parking next door to the hotel, and the fact that the hotel is 2 short blocks from Chesapeake's, which may be the best seafood restaurant in Knoxville.",
            "title": "Good buffet breakfast, good coffe",
            "user": "alexofoaktonva"
        },
        {
            "date": "August 25, 2007",
            "detail_rating": {
                "business": 5.0,
                "cleanliness": 4.0,
                "desk": null,
                "front_desk": 5.0,
                "location": 4.0,
                "pool": null,
                "restaurant": null,
                "rooms": 4.0,
                "service": 5.0,
                "sleep": null,
                "value": 3.0
            },
            "helpfulness": null,
            "id": 8504810,
            "likes": {
                "disliked": "\u2014 The restaurant in the hotel - horrible!!",
                "liked": "\u2014 Quick check-in"
            },
            "rating": 3.0,
            "stay_parameters": "Stayed August 2007, traveled with family",
            "text": "Our stay at The Hilton Knoxville was a mixed one. The check-in was very smooth and quick 'cos being a Hilton Honors Member helped a lot. Our room was not ready but 'cos we checked earlier than expected, they had another room set up for us. We were relieved as we had driven a long way to get to Knoxville. The room is clean and cool and every thing was in place.",
            "title": "Great hotel!",
            "user": "Travellerforlife"
        },
        {
            "date": "July 11, 2007",
            "detail_rating": {
                "business": 2.0,
                "cleanliness": 1.0,
                "desk": null,
                "front_desk": 2.0,
                "location": 1.0,
                "pool": null,
                "restaurant": null,
                "rooms": 2.0,
                "service": 2.0,
                "sleep": null,
                "value": 2.0
            },
            "helpfulness": 2,
            "id": 8102438,
            "likes": {
                "disliked": "\u2014 it was not clean",
                "liked": "\u2014 nothing"
            },
            "rating": 2.0,
            "stay_parameters": "Stayed July 2007, traveled on business",
            "text": "The only thing I didn't like was the restaurant on site. Don't eat there. The food was terrible.",
            "title": "Stay Elsewhere!",
            "user": "AvaTennessee"
        },
        {
            "date": "June 12, 2007",
            "detail_rating": {
                "business": 4.0,
                "cleanliness": 5.0,
                "desk": null,
                "front_desk": 4.0,
                "location": 5.0,
                "pool": null,
                "restaurant": null,
                "rooms": 5.0,
                "service": 4.0,
                "sleep": null,
                "value": 4.0
            },
            "helpfulness": 5,
            "id": 7839508,
            "likes": {
                "disliked": null,
                "liked": null
            },
            "rating": 4.0,
            "stay_parameters": "Stayed June 2007, traveled with family",
            "text": "I stayed at the Knoxville Hilton July 8-11, 2007. The hotel is obviously old despite efforts to update its appearance. The main lobby was fairly nice. However, I was very disappointed with the cleanliness of the hotel rooms. The bathroom was clean, but not spotless. A wash cloth that had been used by a previous guest had been left in the shower. The carpets smelled kind of musky. I requested a refrigerator for the room and the one that was brought up was old, beaten, and rusty in places. I was also told there was no charge for its use and then billed $5 per night for it. The pillowcases on the pillows were stained all over. The parking deck was not supervised or monitored, but did cost $8-$12 per night. I did not feel safe in it at night. The 3 elevators were very slow and ice machines only worked on 2 of the 18 floors. The location of the hotel is not close to much of anything except the UT conference center, so plan to drive to get to restaurants, shops, etc. I was very disappointed with the hotel and would not stay here again if in the area.",
            "title": "Great location, nice hotel",
            "user": "Paris0618"
        },
        {
            "date": "July 17, 2008",
            "detail_rating": {
                "business": null,
                "cleanliness": null,
                "desk": null,
                "location": null,
                "pool": null,
                "restaurant": null,
                "rooms": null,
                "service": null,
                "sleep": null,
                "value": null
            },
            "helpfulness": null,
            "id": 17969199,
            "likes": {
                "disliked": null,
                "liked": null
            },
            "rating": 2.0,
            "stay_parameters": null,
            "text": "The people working there were nice and tried to remedy the problems, but those problems were numerous and irritating:",
            "title": "To Be Avoided",
            "user": "NJtraveler48"
        },
        {
            "date": "June 24, 2008",
            "detail_rating": {
                "business": null,
                "cleanliness": null,
                "desk": null,
                "location": null,
                "pool": null,
                "restaurant": null,
                "rooms": null,
                "service": null,
                "sleep": null,
                "value": null
            },
            "helpfulness": null,
            "id": 17185213,
            "likes": {
                "disliked": null,
                "liked": null
            },
            "rating": 5.0,
            "stay_parameters": null,
            "text": "-Air conditioning unit in Room #1 blew out at 3 in the morning on a warm night.",
            "title": "Very lovely hotel",
            "user": "funeventsgal"
        },
        {
            "date": "June 4, 2008",
            "detail_rating": {
                "business": null,
                "cleanliness": null,
                "desk": null,
                "location": null,
                "pool": null,
                "restaurant": null,
                "rooms": null,
                "service": null,
                "sleep": null,
                "value": null
            },
            "helpfulness": null,
            "id": 16684244,
            "likes": {
                "disliked": null,
                "liked": null
            },
            "rating": 3.0,
            "stay_parameters": null,
            "text": "-Much disgusting black sediment in tub in Room #2 to which we were moved in the morning.",
            "title": "Good Hilton property!",
            "user": "worldtraveler786"
        },
        {
            "date": "April 8, 2008",
            "detail_rating": {
                "business": null,
                "cleanliness": null,
                "desk": null,
                "location": null,
                "pool": null,
                "restaurant": null,
                "rooms": null,
                "service": null,
                "sleep": null,
                "value": null
            },
            "helpfulness": null,
            "id": 14898868,
            "likes": {
                "disliked": null,
                "liked": null
            },
            "rating": 4.0,
            "stay_parameters": null,
            "text": "-Room #3 on concierge floor was adequate. Concierge facility for breakfast and evening snacks loaded with unsupervised adolescents. More people there than in the lobby!",
            "title": "Adequate, Downtown Knoxville Hotel",
            "user": "gsully224"
        },
        {
            "date": "March 29, 2008",
            "detail_rating": {
                "business": null,
                "cleanliness": null,
                "desk": null,
                "location": null,
                "pool": null,
                "restaurant": null,
                "rooms": null,
                "service": null,
                "sleep": null,
                "value": null
            },
            "helpfulness": null,
            "id": 14632301,
            "likes": {
                "disliked": null,
                "liked": null
            },
            "rating": 3.0,
            "stay_parameters": null,
            "text": "-Couldn't exit garage b/c Room #3 card not keyed for garage.",
            "title": "It was just \"okay\".",
            "user": "Cathryn H"
        },
        {
            "date": "January 24, 2012",
            "detail_rating": {
                "business": null,
                "cleanliness": 4.0,
                "desk": null,
                "location": 5.0,
                "pool": null,
                "restaurant": null,
                "rooms": 4.0,
                "service": 4.0,
                "sleep": 4.0,
                "value": 4.0
            },
            "helpfulness": null,
            "id": 123544466,
            "likes": {
                "disliked": null,
                "liked": null
            },
            "rating": 4.0,
            "stay_parameters": "Stayed January 2012, traveled as a couple",
            "text": "We've stayed at the Hilton Knoxville twice, when we've travelled to Knoxville for New Year's Eve. Both times have been great. The rooms are big and clean. The customer service is great. The hotel is located in a really good area and close to everything we wanted. You can walk to the square and eat at the Tomato Head, which is awesome. Don't miss it! It feels really safe to walk around at night, but still easy to get back home when you're done.",
            "title": "Nice place and close to everything",
            "user": "FloridaGator40"
        },
        {
            "date": "January 22, 2012",
            "detail_rating": {
                "business": null,
                "cleanliness": null,
                "desk": null,
                "location": null,
                "pool": null,
                "restaurant": null,
                "rooms": null,
                "service": null,
                "sleep": null,
                "value": null
            },
            "helpfulness": null,
            "id": 123443658,
            "likes": {
                "disliked": null,
                "liked": null
            },
            "rating": 4.0,
            "stay_parameters": null,
            "text": "P.S. We didn't have any issues with the construction, but I did see workers around the hotel.",
            "title": "Construction was a pain, but service good",
            "user": "brettscan"
        },
        {
            "date": "January 21, 2012",
            "detail_rating": {
                "business": null,
                "cleanliness": 4.0,
                "desk": null,
                "location": 4.0,
                "pool": null,
                "restaurant": null,
                "rooms": 4.0,
                "service": 4.0,
                "sleep": 2.0,
                "value": 4.0
            },
            "helpfulness": null,
            "id": 123420767,
            "likes": {
                "disliked": null,
                "liked": null
            },
            "rating": 3.0,
            "stay_parameters": "Stayed January 2012, traveled on business",
            "text": "Thank goodness I had ear plugs for my trip. My husband and I went just to catch up on some sleep (we have a 2 year old!) Construction noise would have ruined my afternoon nap plans if I hadn't had my ear plugs. The worst part is they started working at 8am on a SATURDAY morning! My contractor husband laid in bed guessing what they were working on over our heads. Not very relaxing! In an 18 story hotel, it seems that they could close certain parts of the hotel for construction.",
            "title": "gem in the rough right now",
            "user": "UpintheairGirl"
        },
        {
            "date": "January 16, 2012",
            "detail_rating": {
                "business": null,
                "cleanliness": 3.0,
                "desk": null,
                "location": 5.0,
                "pool": null,
                "restaurant": null,
                "rooms": 3.0,
                "service": 4.0,
                "sleep": null,
                "value": 4.0
            },
            "helpfulness": null,
            "id": 123187599,
            "likes": {
                "disliked": null,
                "liked": null
            },
            "rating": 4.0,
            "stay_parameters": "Stayed January 2012",
            "text": "When we complained, the staff was very nice and gracious. I could tell they have taken lots of heat for this, but they were still very understanding and asked what they could do to help. So, if you're going to stay there, ask specifically for a room far away from the construction if possible!",
            "title": "Service makes up for the inconvenience of the remodeling.",
            "user": "pdtravel1"
        },
        {
            "date": "January 10, 2012",
            "detail_rating": {
                "business": null,
                "cleanliness": 5.0,
                "desk": null,
                "location": 5.0,
                "pool": null,
                "restaurant": null,
                "rooms": 5.0,
                "service": 4.0,
                "sleep": 5.0,
                "value": 4.0
            },
            "helpfulness": null,
            "id": 122898923,
            "likes": {
                "disliked": null,
                "liked": null
            },
            "rating": 4.0,
            "stay_parameters": "Stayed December 2011, traveled with family",
            "text": "Another reviewer said it perfectly...service makes up for the remodeling. If you work night shift or plan to work in your room during the day make sure you ask the front desk where you are staying right now - as they start banging at 9am and will still be going around 6pm. Computer with good speed in lobby area, staff will fax for you at front desk. Cons: bathroom door placement, air blows loud from a/c -needed to turn up volume 5-6 units every time it came on, hearing newspaper \"plops\" at 430am up & down the hall, always needing to remember to have cash for valet, room-service food. Pros: bright bathrooms, the view, staff, the 18th floor for breakfast & then a beer/soda at night, Starbucks on site.",
            "title": "Good breakfast.",
            "user": "nancy1755"
        },
        {
            "date": "March 26, 2008",
            "detail_rating": {
                "business": null,
                "cleanliness": null,
                "desk": null,
                "location": null,
                "pool": null,
                "restaurant": null,
                "rooms": null,
                "service": null,
                "sleep": null,
                "value": null
            },
            "helpfulness": null,
            "id": 14565698,
            "likes": {
                "disliked": null,
                "liked": null
            },
            "rating": 5.0,
            "stay_parameters": null,
            "text": "This was our second stay at the Hilton. We like staying here in warmer weather because it is an easy walk to market square. But being that it is a Hilton it is more expensive then some of the hotels we stay at. It again met all of our expectations. There is a nice bar in the lobby that had been redone since our last visit in June. The beds are very comfortable and everything is very clean.",
            "title": "Nice Hotel in Downtown Knoxville",
            "user": "terpfan1"
        },
        {
            "date": "March 15, 2008",
            "detail_rating": {
                "business": null,
                "cleanliness": null,
                "desk": null,
                "location": null,
                "pool": null,
                "restaurant": null,
                "rooms": null,
                "service": null,
                "sleep": null,
                "value": null
            },
            "helpfulness": null,
            "id": 14303190,
            "likes": {
                "disliked": null,
                "liked": null
            },
            "rating": 5.0,
            "stay_parameters": null,
            "text": "We have already booked it for the weekend in May when we pick up our daughter from UT. It is also a great place to stay if going to Sundown in the City.",
            "title": "I could live here!",
            "user": "alwaysatwork"
        },
        {
            "date": "February 28, 2008",
            "detail_rating": {
                "business": null,
                "cleanliness": null,
                "desk": null,
                "location": null,
                "pool": null,
                "restaurant": null,
                "rooms": null,
                "service": null,
                "sleep": null,
                "value": null
            },
            "helpfulness": null,
            "id": 13920100,
            "likes": {
                "disliked": null,
                "liked": null
            },
            "rating": 4.0,
            "stay_parameters": null,
            "text": "I stayed at the Hilton downtown for the first time this week, and I was quite amazed with my room, the staff, and the overall appearance of the hotel. Their guest rooms have obviously just been renovated and very well taken care of. I'm a picky traveler since I'm always on the road. They even put 3 sheets on their beds and have flat panel televisions....VERY nice touch.",
            "title": "Nice and Convenient Hotel",
            "user": "krchamp"
        },
        {
            "date": "February 2, 2008",
            "detail_rating": {
                "business": null,
                "cleanliness": null,
                "desk": null,
                "location": null,
                "pool": null,
                "restaurant": null,
                "rooms": null,
                "service": null,
                "sleep": null,
                "value": null
            },
            "helpfulness": null,
            "id": 13214353,
            "likes": {
                "disliked": null,
                "liked": null
            },
            "rating": 4.0,
            "stay_parameters": null,
            "text": "I have never been treated like such a VIP as I was at the Hilton. My housekeeper was the friendliest I have seen, and the women at Starbucks knew my order the 2nd morning! The cozy fireplace in the lobby was nice to look at while I was waiting on my cab.",
            "title": "In house Starbucks, now flat screen TVs!",
            "user": "Padre-N-TN"
        },
        {
            "date": "January 21, 2008",
            "detail_rating": {
                "business": null,
                "cleanliness": null,
                "desk": null,
                "location": null,
                "pool": null,
                "restaurant": null,
                "rooms": null,
                "service": null,
                "sleep": null,
                "value": null
            },
            "helpfulness": null,
            "id": 12863535,
            "likes": {
                "disliked": null,
                "liked": null
            },
            "rating": 2.0,
            "stay_parameters": null,
            "text": "I visit the First Tennessee Bank building there when I visit and I didn't order a cab for my return -- the hotel was only a couple of blocks away. Very convenient, great hotel, I will definitely recommend the Hilton to my colleagues.",
            "title": "Below Hilton Standards",
            "user": "JLP246"
        },
        {
            "date": "February 4, 2012",
            "detail_rating": {
                "business": null,
                "cleanliness": 4.0,
                "desk": null,
                "location": 4.0,
                "pool": null,
                "restaurant": null,
                "rooms": 4.0,
                "service": 3.0,
                "sleep": 4.0,
                "value": 5.0
            },
            "helpfulness": null,
            "id": 124132864,
            "likes": {
                "disliked": null,
                "liked": null
            },
            "rating": 4.0,
            "stay_parameters": "Stayed February 2012, traveled on business",
            "text": "Here are the highlights:",
            "title": "Good Stay",
            "user": "daisy20071960"
        },
        {
            "date": "February 4, 2012",
            "detail_rating": {
                "business": null,
                "cleanliness": 4.0,
                "desk": null,
                "location": 4.0,
                "pool": null,
                "restaurant": null,
                "rooms": 4.0,
                "service": 4.0,
                "sleep": 4.0,
                "value": 4.0
            },
            "helpfulness": null,
            "id": 124123428,
            "likes": {
                "disliked": null,
                "liked": null
            },
            "rating": 4.0,
            "stay_parameters": "Stayed January 2012, traveled on business",
            "text": "This property is under construction, the upper key access rooms are very nice and almost done. I picked this property for a team of 8 folks for a week.....most were happy, one checked out after one night. The menu in the restaurant and the bar are the same, the service in the bar is SLOW, expect a wait, even when there is not many people there.",
            "title": "Good Stay (just short of excellent)",
            "user": "dickson_thunder"
        },
        {
            "date": "January 30, 2012",
            "detail_rating": {
                "business": null,
                "cleanliness": 4.0,
                "desk": null,
                "location": 5.0,
                "pool": null,
                "restaurant": null,
                "rooms": 4.0,
                "service": 3.0,
                "sleep": 4.0,
                "value": 3.0
            },
            "helpfulness": null,
            "id": 123873947,
            "likes": {
                "disliked": null,
                "liked": null
            },
            "rating": 3.0,
            "stay_parameters": "Stayed January 2012, traveled on business",
            "text": "The location is very good (so they say), yet I did not have the opportunity to venture out into the city.....",
            "title": "Surprise! We're renovating! Go to our bar for rudeness!",
            "user": "Tekinidiver"
        },
        {
            "date": "January 27, 2012",
            "detail_rating": {
                "business": null,
                "cleanliness": 5.0,
                "desk": null,
                "location": 5.0,
                "pool": null,
                "restaurant": null,
                "rooms": 5.0,
                "service": 5.0,
                "sleep": 5.0,
                "value": 5.0
            },
            "helpfulness": null,
            "id": 123690311,
            "likes": {
                "disliked": null,
                "liked": null
            },
            "rating": 5.0,
            "stay_parameters": "Stayed December 2011, traveled as a couple",
            "text": "I recently stayed for 3 nights to attend some training at a local business. The rooms were nice but starting to show a little wear. (I believe they may be renovating now) The staff was very friendly and knowledgeable (except for a semi-smart comment from one bellhop). The breakfast buffet was excellent. I will most likely stay again next time in town for business,",
            "title": "Perfect way to start the new year!",
            "user": "Andy M"
        },
        {
            "date": "January 25, 2012",
            "detail_rating": {
                "business": null,
                "cleanliness": 5.0,
                "desk": null,
                "location": 4.0,
                "pool": null,
                "restaurant": null,
                "rooms": 5.0,
                "service": 5.0,
                "sleep": 5.0,
                "value": 4.0
            },
            "helpfulness": null,
            "id": 123611707,
            "likes": {
                "disliked": null,
                "liked": null
            },
            "rating": 4.0,
            "stay_parameters": "Stayed January 2012, traveled as a couple",
            "text": "When I checked in, everything seemed normal, as I walked by the large poster showing the renovations being done wait ... renovations? I made my reservation through the Hilton website - there is no such notice of renovations. I get to my room after walking out of the elevator to an unfinished hall. The room has a persistent odor of paint and adhesives, clearly this room was recently finished, or not so finished as I see the vent cover off the bath vent. Okay, its late and I don't want to crab, after all, I feel comfortable being able to walking on a clean carpet! But in reality for staying three nights, I would have preferred not to have the smell, especially when the window doesn't open.",
            "title": "Dog welcome",
            "user": "rompar"
        },
        {
            "date": "January 21, 2008",
            "detail_rating": {
                "business": null,
                "cleanliness": null,
                "desk": null,
                "location": null,
                "pool": null,
                "restaurant": null,
                "rooms": null,
                "service": null,
                "sleep": null,
                "value": null
            },
            "helpfulness": null,
            "id": 12849149,
            "likes": {
                "disliked": null,
                "liked": null
            },
            "rating": 4.0,
            "stay_parameters": null,
            "text": "Stayed at this hotel 2 nights for basketball week-end. Hotel adjusted rate when I found a cheaper rate on their web site the day before my reservation. Bed and breakfast rate is the best value for this hotel because the breakfast is delicious and we had attentive service both days. The first room they put us in had a smoky smell and crying baby next door but they quickly put us in another room. Recommend keeping the fan on at night to drown out the traffic and any hall noise.",
            "title": "Great service - delicious buffet breakfast",
            "user": "cpafan"
        },
        {
            "date": "December 26, 2007",
            "detail_rating": {
                "business": null,
                "cleanliness": null,
                "desk": null,
                "location": null,
                "pool": null,
                "restaurant": null,
                "rooms": null,
                "service": null,
                "sleep": null,
                "value": null
            },
            "helpfulness": null,
            "id": 11974924,
            "likes": {
                "disliked": null,
                "liked": null
            },
            "rating": 3.0,
            "stay_parameters": null,
            "text": "Stayed 2 nights and wasn't wowed and wasn't turned-off either. The lobby if very nice. There didn't appear to be a bell hop on staff even though there is a separate bell hop area.",
            "title": "decent hotel experience",
            "user": "JoelZR"
        },
        {
            "date": "December 1, 2007",
            "detail_rating": {
                "business": null,
                "cleanliness": null,
                "desk": null,
                "location": null,
                "pool": null,
                "restaurant": null,
                "rooms": null,
                "service": null,
                "sleep": null,
                "value": null
            },
            "helpfulness": null,
            "id": 11186646,
            "likes": {
                "disliked": null,
                "liked": null
            },
            "rating": 4.0,
            "stay_parameters": null,
            "text": "The hallways looked dated and old. The room was fine, clean, and relatively quiet.",
            "title": "Wonderful hotel!",
            "user": "knapster2005"
        },
        {
            "date": "October 31, 2007",
            "detail_rating": {
                "business": null,
                "cleanliness": null,
                "desk": null,
                "location": null,
                "pool": null,
                "restaurant": null,
                "rooms": null,
                "service": null,
                "sleep": null,
                "value": null
            },
            "helpfulness": null,
            "id": 10475489,
            "likes": {
                "disliked": null,
                "liked": null
            },
            "rating": 5.0,
            "stay_parameters": null,
            "text": "The breakfast buffet was good. The full service Starbucks was great. Lunch at the hotel was poor.",
            "title": "good location, great hotel",
            "user": "BluEyezNSC"
        },
        {
            "date": "October 17, 2007",
            "detail_rating": {
                "business": null,
                "cleanliness": null,
                "desk": null,
                "location": null,
                "pool": null,
                "restaurant": null,
                "rooms": null,
                "service": null,
                "sleep": null,
                "value": null
            },
            "helpfulness": null,
            "id": 10090183,
            "likes": {
                "disliked": null,
                "liked": null
            },
            "rating": 5.0,
            "stay_parameters": null,
            "text": "Overall an okay experience.",
            "title": "Great Location - Great Hotel",
            "user": "m25cls1"
        }
    ],
    "slim_ranking": 0.369565217391,
    "stars": 3.5,
    "tripadvisor": {
        "VISITED": false,
        "country_name": null,
        "locality": null,
        "pic_link": null,
        "street_address": null
    },
    "user_rating": 4.0,
    "variance": {
        "average": 73,
        "excellent": 120,
        "poor": 29,
        "terrible": 15,
        "very good": 134
    }
}