{
    "aka": "Westward Look Hotel Tucson",
    "description": null,
    "detail_rating": {
        "cleanliness": 4.5,
        "location": 4.5,
        "rooms": 4.0,
        "service": 4.0,
        "sleep": 4.5,
        "value": 4.0
    },
    "location": {
        "city": "Tucson",
        "continent": null,
        "country": "United States",
        "proposed_city": "Tucson",
        "province": null,
        "region": null
    },
    "name": "Westward Look Wyndham Grand Resort and Spa",
    "places": {
        "aka": [
            "Tucson"
        ],
        "hotel_description": [],
        "hotel_name": []
    },
    "review_count": 1319,
    "review_count_current": 20,
    "reviews": [
        {
            "date": "February 25, 2008",
            "detail_rating": {
                "business": 3.0,
                "cleanliness": 4.0,
                "desk": null,
                "front_desk": 3.0,
                "location": 4.0,
                "pool": null,
                "restaurant": null,
                "rooms": 2.0,
                "service": 2.0,
                "sleep": null,
                "value": 2.0
            },
            "helpfulness": 2,
            "id": 13841889,
            "likes": {
                "disliked": "\u2014 very uncomfortable beds",
                "liked": "\u2014 Tennis courts"
            },
            "rating": 2.0,
            "stay_parameters": "Stayed February 2008, traveled with family",
            "text": "As we sat sipping our ersatz resort coffee on our first day at the Westward Look Resort in Tucson Arizona AZ, because the expresso machine was broken, our aching backs kept us leaning on the table trying to stretch out our backs a bit. Our waiter Brett waiter had no idea when it might be fixed.",
            "title": "Bedder not sleep here",
            "user": "AndrewNewYorkCity"
        },
        {
            "date": "February 13, 2008",
            "detail_rating": {
                "business": 3.0,
                "cleanliness": 4.0,
                "desk": null,
                "front_desk": 3.0,
                "location": 3.0,
                "pool": null,
                "restaurant": null,
                "rooms": 4.0,
                "service": 3.0,
                "sleep": null,
                "value": 3.0
            },
            "helpfulness": 1,
            "id": 13522352,
            "likes": {
                "disliked": null,
                "liked": null
            },
            "rating": 3.0,
            "stay_parameters": "Stayed February 2008, traveled on business",
            "text": "It was the first day of our 7 day stay from 2.15.08 thru 2.22.08 at the Westward Look Resort (www.westwardlook.com ), doyenne of resorts in the Tucson area. We are a family of five, joining three more family members for a mini family reunion at Westward Look.",
            "title": "In Rennovation",
            "user": "EarthlyElements"
        },
        {
            "date": "December 27, 2007",
            "detail_rating": {
                "business": null,
                "cleanliness": 4.0,
                "desk": null,
                "front_desk": 5.0,
                "location": 4.0,
                "pool": null,
                "restaurant": null,
                "rooms": 4.0,
                "service": 5.0,
                "sleep": null,
                "value": 4.0
            },
            "helpfulness": 3,
            "id": 11991227,
            "likes": {
                "disliked": "\u2014 View not up to expectations",
                "liked": "\u2014 Mountain Lions & Great Dining Experience"
            },
            "rating": 4.0,
            "stay_parameters": "Stayed December 2007, traveled as a couple",
            "text": "The grounds are impressive and well-kept with all variety of cactus, euphorbia, citrus trees and palms. A resident owl hooted hello to the twilight every evening near building 9, where we stayed.",
            "title": "Lovely Midweek Stay",
            "user": "Member from Surprise"
        },
        {
            "date": "December 18, 2007",
            "detail_rating": {
                "business": 3.0,
                "cleanliness": 3.0,
                "desk": null,
                "front_desk": 1.0,
                "location": 4.0,
                "pool": null,
                "restaurant": null,
                "rooms": 4.0,
                "service": 4.0,
                "sleep": null,
                "value": 4.0
            },
            "helpfulness": 3,
            "id": 11672176,
            "likes": {
                "disliked": "\u2014 our greeting",
                "liked": "\u2014 full service resort"
            },
            "rating": 4.0,
            "stay_parameters": "Stayed December 2007, traveled with family",
            "text": "Back to our backs and the aches: the beds are old and so soft that it was like sleeping in an upholstered salad bowl, causing us to wake up with our middle-aged backs in agony. The front desk readily acknowledged that the beds were too soft for \u201csome tastes\u201d but that there was no solution until the rooms were renovated. We repeatedly requested to speak to a manager, but the manager Alan Klein was never available, even when asked for by name. Much insistence finally brought the engineering department around to putting boards between the box spring and the mattress, but we ended up sleeping on the floor on cot mattresses as the beds were still too soft and worn out in the center. This is really a scandal for a resort charging $391 per night. Please do not believe the standard corporate reply that Westward Look will post in reply to this decidedly mixed review which blames everything on the on-going renovation: while some small part of the resort is being renovated, none of our complaints were related to renovation issue, as beds can be replaced anytime. The beds are so bad that the staff had many excuses ready.",
            "title": "Great stay...a little off-putting at first...",
            "user": "joiefm"
        },
        {
            "date": "December 16, 2007",
            "detail_rating": {
                "business": null,
                "cleanliness": null,
                "desk": null,
                "location": null,
                "pool": null,
                "restaurant": null,
                "rooms": null,
                "service": null,
                "sleep": null,
                "value": null
            },
            "helpfulness": 1,
            "id": 11612481,
            "likes": {
                "disliked": null,
                "liked": null
            },
            "rating": 3.0,
            "stay_parameters": null,
            "text": "Our room had an aging bathroom with mildew and shower flow issues, and the whole bath area just had paint slathered all over it with no effort to smooth out the walls after repairs.",
            "title": "Not worth the high rate",
            "user": "Travel_Happy00"
        },
        {
            "date": "April 25, 2008",
            "detail_rating": {
                "business": 4.0,
                "cleanliness": 4.0,
                "desk": null,
                "front_desk": 5.0,
                "location": 3.0,
                "pool": null,
                "restaurant": null,
                "rooms": 4.0,
                "service": 5.0,
                "sleep": null,
                "value": 4.0
            },
            "helpfulness": 1,
            "id": 15364712,
            "likes": {
                "disliked": "\u2014 Dirty sofa and blow dryer in room.",
                "liked": "\u2014 Friendly staff & beautiful resort grounds."
            },
            "rating": 4.0,
            "stay_parameters": "Stayed April 2008, traveled on business",
            "text": "The grounds of this hotel were very well maintained and very beautiful. There are several walking trails around the hotel that are very nice. The hotel offers horseback riding, and has a full service spa. The entire staff was probably the friendliest I have encountered at any hotel. They went out of their way to make you feel at home.",
            "title": "Not too bad....",
            "user": "tbalberts"
        },
        {
            "date": "April 23, 2008",
            "detail_rating": {
                "business": 3.0,
                "cleanliness": 1.0,
                "desk": null,
                "front_desk": 3.0,
                "location": 4.0,
                "pool": null,
                "restaurant": null,
                "rooms": 1.0,
                "service": 2.0,
                "sleep": null,
                "value": 1.0
            },
            "helpfulness": 4,
            "id": 15268499,
            "likes": {
                "disliked": "\u2014 dirty",
                "liked": "\u2014 price, but in end was not value"
            },
            "rating": 1.0,
            "stay_parameters": "Stayed April 2008, traveled as a couple",
            "text": "The room was OK. The bed was very comfortable, but the armoire that housed the TV was off to one side of the room, so it was difficult to watch unless you laid all the way to one side. The sofa set showed wear and was dirty, but the rest of the furniture was good. Bring your own blow dryer as the one provided in the hotel barely did the job (especially if you have long hair). The resort is planning on updating all the rooms as they had displays of the new decor in the lobby. Overall, the room was very clean and cozy.",
            "title": "Poor Quality, Poor Service, But with a smile",
            "user": "ribbitOregon"
        },
        {
            "date": "April 13, 2008",
            "detail_rating": {
                "business": null,
                "cleanliness": 4.0,
                "desk": null,
                "front_desk": 3.0,
                "location": 5.0,
                "pool": null,
                "restaurant": null,
                "rooms": 4.0,
                "service": 5.0,
                "sleep": null,
                "value": 5.0
            },
            "helpfulness": 1,
            "id": 15003381,
            "likes": {
                "disliked": "\u2014 no complaints",
                "liked": "\u2014 Views, grounds"
            },
            "rating": 5.0,
            "stay_parameters": "Stayed April 2008",
            "text": "I also appreciated that all areas at night were well-lit, especially around the room entrance.",
            "title": "Good value",
            "user": "BuddyPennsylvania"
        },
        {
            "date": "April 10, 2008",
            "detail_rating": {
                "business": 5.0,
                "cleanliness": 5.0,
                "desk": null,
                "front_desk": 5.0,
                "location": 5.0,
                "pool": null,
                "restaurant": null,
                "rooms": 4.0,
                "service": 5.0,
                "sleep": null,
                "value": 5.0
            },
            "helpfulness": null,
            "id": 14943095,
            "likes": {
                "disliked": "\u2014 beds and a dank bar and grille",
                "liked": "\u2014 size of room; efficient and friendly staff; beautiful grounds and mountain views; food"
            },
            "rating": 4.0,
            "stay_parameters": "Stayed April 2008, traveled with family",
            "text": "The pool area was nice with padded lounge chairs and beverage service! The outside patio from the lobby has a breakfast cart in the morning/afternoon that serves pastries, fruit and Starbucks coffee (not just regular coffee, but most everything you can normally get from Starbucks).",
            "title": "Wonderful experience",
            "user": "NY55"
        },
        {
            "date": "April 8, 2008",
            "detail_rating": {
                "business": null,
                "cleanliness": 1.0,
                "desk": null,
                "front_desk": 4.0,
                "location": 4.0,
                "pool": null,
                "restaurant": null,
                "rooms": 1.0,
                "service": 4.0,
                "sleep": null,
                "value": 1.0
            },
            "helpfulness": 1,
            "id": 14882912,
            "likes": {
                "disliked": "\u2014 rooms and lack of maintenance",
                "liked": "\u2014 location, and restaurants"
            },
            "rating": 2.0,
            "stay_parameters": "Stayed April 2008, traveled as a couple",
            "text": "Parking was a bit scarce but I always found a place. We were also part of a convention that was held at the hotel, which most likey explains the parking situation. Please note that there is parking by the rooms, but the main parking lot for the resort is a bit odd as it seems to be built on a sloping hill divided into several sections, so be prepared to walk up hill when heading to the resort.",
            "title": "Westward Look Resort Vacation",
            "user": "larryknutson"
        },
        {
            "date": "April 7, 2008",
            "detail_rating": {
                "business": 3.0,
                "cleanliness": 5.0,
                "desk": null,
                "front_desk": 5.0,
                "location": 4.0,
                "pool": null,
                "restaurant": null,
                "rooms": 5.0,
                "service": 5.0,
                "sleep": null,
                "value": 5.0
            },
            "helpfulness": null,
            "id": 14850005,
            "likes": {
                "disliked": "\u2014 no dislikes",
                "liked": "\u2014 high qualty execution of all details"
            },
            "rating": 5.0,
            "stay_parameters": "Stayed March 2008, traveled as a couple",
            "text": "Over a 9-day stay, the place was flawless. Room comfortable and quiet, staff polite, efficient, helpful when given the opportunity; grounds attractive, food good, prices acceptable for a resort. 3 swimming pools. Many attractions in the area, all reached by long drives through unattractive urban sprawl.",
            "title": "Great experience",
            "user": "hptn"
        },
        {
            "date": "April 3, 2008",
            "detail_rating": {
                "business": 3.0,
                "cleanliness": 3.0,
                "desk": null,
                "front_desk": 5.0,
                "location": 4.0,
                "pool": null,
                "restaurant": null,
                "rooms": 2.0,
                "service": 5.0,
                "sleep": null,
                "value": 3.0
            },
            "helpfulness": 1,
            "id": 14769625,
            "likes": {
                "disliked": "\u2014 Room plumbing",
                "liked": "\u2014 The grounds: trails, garden, etc."
            },
            "rating": 4.0,
            "stay_parameters": "Stayed April 2008, traveled as a couple",
            "text": "Having just returned from this resort I must agree that the rooms are in need of attention. Our hot water handle didn't work one one sink, but there was two -there was more than a little \"crud\" around the tub and the drain was clogged- But when we told the staff it was backing up \"hair that was not ours\" they took care of it immediately. The staff was attentive and pleasant and because the grounds area is so nice we saw no reason to hang out in the room. I wasn't real happy with the super soft bed, but I was thrilled to find extra blankets and pillows - no shortage of toiletries either. I think the resort may be past its prime but it is in a nice area, with good amenities and is priced accordingly. They offer pre-printed out directions to area attractions. Besides 2 guests pools, they have a lap pool and fitness center by the tennis courts. The grounds are clean and most paths lit after dark. It is a very nice atmosphere to walk around in and view birds, snakes, rabbits, and various flora.",
            "title": "The grounds make the difference",
            "user": "MontanaBones"
        },
        {
            "date": "March 14, 2008",
            "detail_rating": {
                "business": null,
                "cleanliness": 5.0,
                "desk": null,
                "front_desk": 5.0,
                "location": 4.0,
                "pool": null,
                "restaurant": null,
                "rooms": 5.0,
                "service": 5.0,
                "sleep": null,
                "value": 5.0
            },
            "helpfulness": null,
            "id": 14289999,
            "likes": {
                "disliked": "\u2014 nothing",
                "liked": "\u2014 the southwest feel"
            },
            "rating": 5.0,
            "stay_parameters": "Stayed August 2007, traveled with family",
            "text": "I use trip advisor for all of our trips...and it has not failed me yet. After reviewing the reviews..throwing out the extreme good and bad..I decided on Westward Look Resort and 7 visits later, I have never been disappointed!!! We have also stayed at the Westin, which is double the cost. I would take the Westward Look hands down over the Westin, even if it was the same price!!!",
            "title": "Choose this over the Westin, hands down!",
            "user": "penelopeChicago"
        },
        {
            "date": "March 13, 2008",
            "detail_rating": {
                "business": null,
                "cleanliness": 2.0,
                "desk": null,
                "front_desk": 3.0,
                "location": 5.0,
                "pool": null,
                "restaurant": null,
                "rooms": 2.0,
                "service": 4.0,
                "sleep": null,
                "value": 3.0
            },
            "helpfulness": 1,
            "id": 14260126,
            "likes": {
                "disliked": "\u2014 Rooms need updating and cleaning",
                "liked": "\u2014 Beautiful location and landscaping"
            },
            "rating": 3.0,
            "stay_parameters": "Stayed February 2008",
            "text": "The rooms...the size is amazing. So roomy and allows several women to get ready at once! You should stay at the Westin and then decide if these rooms and beds are really as bad as you say.",
            "title": "Rooms need updating!",
            "user": "LilCo"
        },
        {
            "date": "March 12, 2008",
            "detail_rating": {
                "business": 3.0,
                "cleanliness": 2.0,
                "desk": null,
                "front_desk": 1.0,
                "location": 5.0,
                "pool": null,
                "restaurant": null,
                "rooms": 1.0,
                "service": 1.0,
                "sleep": null,
                "value": 1.0
            },
            "helpfulness": 5,
            "id": 14243672,
            "likes": {
                "disliked": "\u2014 The condition of the hotel",
                "liked": "\u2014 The grounds were nice"
            },
            "rating": 1.0,
            "stay_parameters": "Stayed January 2008, traveled on business",
            "text": "The Restaurants...normally we don't like resort restaurants, way too pricey. This is the first resort where we can't wait to dine at the restaurant. The variety on the menu is so nice to see, but wait until you see the presentation and the platters that are used. The food tastes so good and is so enjoyable on the patio overlooking the foothills.",
            "title": "Great views, terrible rooms, beds, pool. Unsafe",
            "user": "Sapppro"
        },
        {
            "date": "May 14, 2008",
            "detail_rating": {
                "business": 5.0,
                "cleanliness": 5.0,
                "desk": null,
                "front_desk": 4.0,
                "location": 4.0,
                "pool": null,
                "restaurant": null,
                "rooms": 4.0,
                "service": 4.0,
                "sleep": null,
                "value": 5.0
            },
            "helpfulness": 1,
            "id": 16033903,
            "likes": {
                "disliked": "\u2014 Lack of fridge in room",
                "liked": "\u2014 Setting & grounds"
            },
            "rating": 4.0,
            "stay_parameters": "Stayed May 2008, traveled with family",
            "text": "We really enjoyed our 3 nite stay here, largely based on the reviews I had read from other TripAdvisor users. Our room was lovely, we had a nice view of the mountains & one of the pools; the only negative was that we were on the lower level & could sometimes hear the floor creak when the people above us walked around their room. Loved the pillow top mattress on our King bed & the quality linens. And, the resort gives you very generous sizes of skin & hair products - & they are of excellent quality too.",
            "title": "Really, really nice stay; 2 thumbs up",
            "user": "Luvtotravel7"
        },
        {
            "date": "May 7, 2008",
            "detail_rating": {
                "business": null,
                "cleanliness": null,
                "desk": null,
                "location": null,
                "pool": null,
                "restaurant": null,
                "rooms": null,
                "service": null,
                "sleep": null,
                "value": null
            },
            "helpfulness": 1,
            "id": 15764251,
            "likes": {
                "disliked": null,
                "liked": null
            },
            "rating": 5.0,
            "stay_parameters": null,
            "text": "Although it has quite a few rooms, it doesn't give the impression of being large because there are at least 3 pools in different locations and a couple of spas spread around. We found the food in the Gold Room to be of excellent quality. The grounds, trails & the wildlife were fantastic. We would most definitely return to this hotel and would recommend it highly.",
            "title": "Loved the ambience of this charming resort\u2026.",
            "user": "kskobra"
        },
        {
            "date": "May 1, 2008",
            "detail_rating": {
                "business": null,
                "cleanliness": 5.0,
                "desk": null,
                "front_desk": 5.0,
                "location": 5.0,
                "pool": null,
                "restaurant": null,
                "rooms": 4.0,
                "service": 5.0,
                "sleep": null,
                "value": 5.0
            },
            "helpfulness": 1,
            "id": 15548776,
            "likes": {
                "disliked": null,
                "liked": "\u2014 the beautiful desert setting and southwestern ambiance"
            },
            "rating": 5.0,
            "stay_parameters": "Stayed April 2008, traveled with family",
            "text": "We stayed for 5 nights. We enjoyed the favor of the southwest it gave us, mountain views, walking trails and adobe style buildings. The plants around the resort were remarkable beautiful flowering cactus, saguaros, palm trees.",
            "title": "Westward Look is a Keeper",
            "user": "huevosverdes"
        },
        {
            "date": "May 1, 2008",
            "detail_rating": {
                "business": null,
                "cleanliness": null,
                "desk": null,
                "location": null,
                "pool": null,
                "restaurant": null,
                "rooms": null,
                "service": null,
                "sleep": null,
                "value": null
            },
            "helpfulness": 2,
            "id": 15543362,
            "likes": {
                "disliked": null,
                "liked": null
            },
            "rating": 2.0,
            "stay_parameters": null,
            "text": "They seem to hold small conventions/business meetings; there were some business people around. Everyone seemed happy to be there.",
            "title": "Hotel has management problems",
            "user": "fgossette"
        },
        {
            "date": "April 27, 2008",
            "detail_rating": {
                "business": 4.0,
                "cleanliness": 5.0,
                "desk": null,
                "front_desk": 5.0,
                "location": 5.0,
                "pool": null,
                "restaurant": null,
                "rooms": 5.0,
                "service": 5.0,
                "sleep": null,
                "value": 5.0
            },
            "helpfulness": 1,
            "id": 15413025,
            "likes": {
                "disliked": null,
                "liked": null
            },
            "rating": 4.0,
            "stay_parameters": "Stayed December 2007, traveled on business",
            "text": "Our room was 104, which was very close to the main pool; it was a quiet room facing the trail and mountain. The room was clean and spacious the bed was extremely comfy. The small refrigerator was an added benefit. The room is in need of updating but as stated in previous reviews they are in the process of renovating the rooms.",
            "title": "It's the Real Deal, Dudes and Dudettes",
            "user": "Andromeda07"
        }
    ],
    "slim_ranking": 0.236220472441,
    "stars": 4,
    "tripadvisor": {
        "VISITED": false,
        "country_name": null,
        "locality": null,
        "pic_link": null,
        "street_address": null
    },
    "user_rating": 4.0,
    "variance": {
        "average": 184,
        "excellent": 600,
        "poor": 71,
        "terrible": 33,
        "very good": 431
    }
}