{
    "aka": null,
    "description": "On the banks of the famous Big Thompson River is a charming historic B&B with family Cabins, just 3 minutes from Estes Park Colorado. All cabins and rooms have clean, bubbling private hot tubs and great beds, some have Sleep Number beds. A country style Breakfast for the B&B guests is a treat, with your special needs considered (cabins have kitchens, no breakfast). Close to RMNP. Beautiful scenery great fishing and lots of privacy in this small family run resort. Perfect for romantic getaways, family vacations, adventure, reunions. Free wifi, parking, fishing and firepits; we guarantee if you like \"Old Colorado\" style you will love it here. We even have a riverside massage house. We do the best economical weddings around, with an onside officiant. And pets are Welcome!",
    "detail_rating": {
        "cleanliness": null,
        "location": null,
        "rooms": null,
        "service": null,
        "sleep": null,
        "value": null
    },
    "location": {
        "city": null,
        "continent": null,
        "country": "United States",
        "proposed_city": null,
        "province": null,
        "region": null
    },
    "name": "Dripping Springs Resort",
    "places": {
        "aka": [],
        "hotel_description": [
            "Colorado"
        ],
        "hotel_name": [
            "Springs"
        ]
    },
    "review_count": 221,
    "review_count_current": 20,
    "reviews": [
        {
            "date": "July 4, 2012",
            "detail_rating": {
                "business": null,
                "cleanliness": null,
                "desk": null,
                "location": null,
                "pool": null,
                "restaurant": null,
                "rooms": null,
                "service": null,
                "sleep": null,
                "value": null
            },
            "helpfulness": null,
            "id": 133434767,
            "likes": {
                "disliked": null,
                "liked": null
            },
            "rating": 5.0,
            "stay_parameters": null,
            "text": "We stayed here for two nights in the Encantado cabin with three children ages 14, 2 and 1. There was plenty of space for everyone and the decor was perfect for a mountain retreat. Our two year old loved the river access and spent many hours standing ankle deep and skipping stones.",
            "title": "Great cabin right by the river",
            "user": "bethkay"
        },
        {
            "date": "June 29, 2012",
            "detail_rating": {
                "business": null,
                "cleanliness": 4.0,
                "desk": null,
                "location": 5.0,
                "pool": null,
                "restaurant": null,
                "rooms": 5.0,
                "service": 5.0,
                "sleep": 5.0,
                "value": 4.0
            },
            "helpfulness": 2,
            "id": 133043867,
            "likes": {
                "disliked": null,
                "liked": null
            },
            "rating": 5.0,
            "stay_parameters": "Stayed June 2012, traveled as a couple",
            "text": "My wife and I spent a weekend here in the Pinewood cabin as a welcome home from Afghanistan present. The cabin seemed older than most others in the area, but was newly renovated and clean. It was great having a private hot tub. The best thing about Dripping Springs resort was the layout of the property... most other resorts had their cabins just stacked on top of each other with no privacy. Not here, we had a nice \"yard\" that went right down to river with plenty of trees and bushes. We didn't even know that there were other cabins with people in them. We would definitely go back to Dripping Springs Resort.",
            "title": "Romantic Getaway",
            "user": "onmya55"
        },
        {
            "date": "June 25, 2012",
            "detail_rating": {
                "business": null,
                "cleanliness": 5.0,
                "desk": null,
                "location": 5.0,
                "pool": null,
                "restaurant": null,
                "rooms": 5.0,
                "service": 5.0,
                "sleep": null,
                "value": 5.0
            },
            "helpfulness": null,
            "id": 132718550,
            "likes": {
                "disliked": null,
                "liked": null
            },
            "rating": 5.0,
            "stay_parameters": "Stayed June 2012",
            "text": "Dripping Springs resort has beautiful, rustic, stylized accommodations, reasonably priced. The staff were helpful and abundantly accommodating. They even declined to charge us for damages and lost items. The location was ideally close to the town of Estes Park, but removed enough to allow for visitations by local wildlife. Two elk wandered through our backyard one morning, and my children were delighted by constant sightings of chipmunks and rabbits. I can't recommend this resort highly enough!",
            "title": "Terrific!",
            "user": "hartwellhgary"
        },
        {
            "date": "June 23, 2012",
            "detail_rating": {
                "business": null,
                "cleanliness": 5.0,
                "desk": null,
                "location": 5.0,
                "pool": null,
                "restaurant": null,
                "rooms": 5.0,
                "service": 5.0,
                "sleep": 5.0,
                "value": 5.0
            },
            "helpfulness": 1,
            "id": 132610491,
            "likes": {
                "disliked": null,
                "liked": null
            },
            "rating": 5.0,
            "stay_parameters": "Stayed June 2012, traveled as a couple",
            "text": "We just spent a week here to celebrate our 30th anniversary. Having stayed at Dripping Springs before, we knew what to expect- private hot tub, river view, tranquility, great location & gracious hosts! We were not dissappointed! Owners Janie & Oliver have made this a perfect oasis from hectic city life. Breakfast here is not to be missed, from Janie's cooking to John's entertaining conversation ( resident comedian ) it's a good start to your day! Renting a scooter from ZootScoot and heading to the RMNP is one of my favorite ways to spend a day or make your way down the path after breakfast to a hammock by the river and relax.",
            "title": "Love this place!",
            "user": "Kathy R"
        },
        {
            "date": "June 21, 2012",
            "detail_rating": {
                "business": null,
                "cleanliness": 5.0,
                "desk": null,
                "location": 5.0,
                "pool": null,
                "restaurant": null,
                "rooms": 5.0,
                "service": 5.0,
                "sleep": 5.0,
                "value": 5.0
            },
            "helpfulness": 1,
            "id": 132452226,
            "likes": {
                "disliked": null,
                "liked": null
            },
            "rating": 5.0,
            "stay_parameters": "Stayed June 2012, traveled as a couple",
            "text": "My husband and I were doing some hiking in Rocky Mountain National Park and stayed at Dripping Springs for several days in early June, and we had an absolutely wonderful time. We stayed in the Angler's Retreat (which we highly recommend!), and the private hot tub overlooking the river absolutely made our trip. We thought the location was perfect, as it was easy to access RMNP and was quiet because it isn't right in town. The owners and operators of Dripping Springs were very welcoming, and Janey makes a killer breakfast each morning. I whole heartedly recommend Dripping Springs for anyone traveling to Estes Park. It was fantastic in all ways!",
            "title": "What a wonderful place!",
            "user": "Katie K"
        },
        {
            "date": "June 11, 2012",
            "detail_rating": {
                "business": null,
                "cleanliness": 4.0,
                "desk": null,
                "location": 5.0,
                "pool": null,
                "restaurant": null,
                "rooms": 5.0,
                "service": 4.0,
                "sleep": 5.0,
                "value": 4.0
            },
            "helpfulness": 2,
            "id": 131758967,
            "likes": {
                "disliked": null,
                "liked": null
            },
            "rating": 5.0,
            "stay_parameters": "Stayed June 2012, traveled as a couple",
            "text": "We spent two nights in the Alamo cabin. It is a wonderful 1-bedroom cottage with direct, private river access, a small but very functional kitchen and a nice living room. The highlight is the private porch with 2-person Jacuzzi. Very convenient to Estes Park but remote enough to get out of town. Would DEFINITELY stay there again!",
            "title": "Great getaway stay",
            "user": "dcknight"
        },
        {
            "date": "June 9, 2012",
            "detail_rating": {
                "business": null,
                "cleanliness": 5.0,
                "desk": null,
                "location": 5.0,
                "pool": null,
                "restaurant": null,
                "rooms": 5.0,
                "service": 5.0,
                "sleep": 5.0,
                "value": 5.0
            },
            "helpfulness": null,
            "id": 131619153,
            "likes": {
                "disliked": null,
                "liked": null
            },
            "rating": 5.0,
            "stay_parameters": "Stayed May 2012, traveled with family",
            "text": "My husband and I have been to Estes Park several times, but this was our first time to stay at the Dripping Springs with one of our sons and his family. We loved it, they loved it! Janie, Oliver and John treated our family like we were old friends; all very friendly. The Encatada Cabin exceeded our expectations, and staying right on the Big Thompson River was heaven! The guys could step out the door and fly fish! Kirk's Fly Shop said that area has the best fly fishing spot. Yes, they did catch some trout! It's beautiful, relaxing with a private hot tub to unwind in. The weather could not have been more perfect! Being close to town and the Rocky Mountain Park, sightseeing was easy and fun. We all decided we will be back again! Thank you Janie, Oliver and John!",
            "title": "Dripping Springs - Rustic, Relaxing & Awesome!",
            "user": "Carolyn M"
        },
        {
            "date": "June 8, 2012",
            "detail_rating": {
                "business": null,
                "cleanliness": 5.0,
                "desk": null,
                "location": 5.0,
                "pool": null,
                "restaurant": null,
                "rooms": 5.0,
                "service": 5.0,
                "sleep": null,
                "value": 5.0
            },
            "helpfulness": null,
            "id": 131578378,
            "likes": {
                "disliked": null,
                "liked": null
            },
            "rating": 5.0,
            "stay_parameters": "Stayed August 2011",
            "text": "It is one of the greatest place's the food is amazing, the beds are well made I love it!",
            "title": "Dripping Springs",
            "user": "Sagalisous"
        },
        {
            "date": "June 8, 2012",
            "detail_rating": {
                "business": null,
                "cleanliness": 5.0,
                "desk": null,
                "location": 5.0,
                "pool": null,
                "restaurant": null,
                "rooms": 5.0,
                "service": 5.0,
                "sleep": 5.0,
                "value": 5.0
            },
            "helpfulness": null,
            "id": 131578287,
            "likes": {
                "disliked": null,
                "liked": null
            },
            "rating": 5.0,
            "stay_parameters": "Stayed May 2012, traveled as a couple",
            "text": "We have been going to Dripping Springs B&B for the last 12 years. Every year there is something new to see. The rooms are always clean and the decor changes from year to year. Janie and Oliver are some of the friendliest people around. I can go there and just relax and do nothing if I want to. If I want to go on a picnic Janie will fix us a lunch to take with us. Since finding Dripping Springs I have not gone to any other B&B in Estes Park. We will be coming back for another visit before the season is over.",
            "title": "Great Place to Stay",
            "user": "Lilly78010"
        },
        {
            "date": "June 8, 2012",
            "detail_rating": {
                "business": null,
                "cleanliness": 5.0,
                "desk": null,
                "location": 5.0,
                "pool": null,
                "restaurant": null,
                "rooms": 5.0,
                "service": 5.0,
                "sleep": null,
                "value": 5.0
            },
            "helpfulness": null,
            "id": 131578285,
            "likes": {
                "disliked": null,
                "liked": null
            },
            "rating": 5.0,
            "stay_parameters": "Stayed June 2012",
            "text": "This is our favorite place to stay in Estes. Janie, Oliver, and John always make us feel welcome. It's a great place to relax and unwind after a stressful week in Denver.",
            "title": "Charming alternative to a hotel.",
            "user": "Mmsmith60"
        },
        {
            "date": "June 21, 2012",
            "detail_rating": {
                "business": null,
                "cleanliness": 5.0,
                "desk": null,
                "location": 5.0,
                "pool": null,
                "restaurant": null,
                "rooms": 5.0,
                "service": 5.0,
                "sleep": 5.0,
                "value": 5.0
            },
            "helpfulness": null,
            "id": 132443501,
            "likes": {
                "disliked": null,
                "liked": null
            },
            "rating": 5.0,
            "stay_parameters": "Stayed June 2012, traveled with family",
            "text": "This was our second visit to Dripping Springs and we couldn't wait to get back here. We'd stayed in the B&B rooms before but we wanted to have a little place to ourselves and the Willow was just what we were looking for. It's like something out of a Disney movie- What with the twinkle lights, the jacuzzi on the back deck, the wildlife (bunny in the yard and marmots across the way), the open windows onto the woods and river sounds. Paradise! I didn't call in enough time to have it our whole stay, but Janie managed to work it out for us that we could. She is amazing! There isn't any wish that she can't fulfill! We had champagne and a cake waiting in our frig when we arrived- It was our 30th anniversary.Cabins don't get breakfasts but with enough notice she can work you into the B&B one. And you owe it to yourself to sample at least one of her breakfasts. I've never seen so much different delicious food on one table before- You name it, she provides it. I've been at B&B's where there just doesn't seem to be enough to go around-NEVER the case here! There's always plenty for all.",
            "title": "\"Couldn't get any better\"",
            "user": "lindak26"
        },
        {
            "date": "June 17, 2012",
            "detail_rating": {
                "business": null,
                "cleanliness": 5.0,
                "desk": null,
                "location": 5.0,
                "pool": null,
                "restaurant": null,
                "rooms": 5.0,
                "service": 5.0,
                "sleep": 5.0,
                "value": 5.0
            },
            "helpfulness": null,
            "id": 132178890,
            "likes": {
                "disliked": null,
                "liked": null
            },
            "rating": 5.0,
            "stay_parameters": "Stayed June 2012, traveled as a couple",
            "text": "We also fly fish and they have THE BEST private water on the Big Thompson- bar none. We always catch plenty of gorgeous fish without having to worry about others fishing there first. No crowds- Love it!",
            "title": "Wonderful place to stay!",
            "user": "kwjust1"
        },
        {
            "date": "June 15, 2012",
            "detail_rating": {
                "business": null,
                "cleanliness": 5.0,
                "desk": null,
                "location": 5.0,
                "pool": null,
                "restaurant": null,
                "rooms": 4.0,
                "service": 5.0,
                "sleep": 5.0,
                "value": 5.0
            },
            "helpfulness": null,
            "id": 132062938,
            "likes": {
                "disliked": null,
                "liked": null
            },
            "rating": 5.0,
            "stay_parameters": "Stayed June 2012, traveled with family",
            "text": "Janie, Oliver and John are some of the THE MOST welcoming people I've ever dealt with. You're like a member of the family when you stay here. I HIGHLY recommend you stay here on your next trip to Estes park. You won't be sorry!",
            "title": "A slice of heaven.",
            "user": "Chelsey P"
        },
        {
            "date": "June 15, 2012",
            "detail_rating": {
                "business": null,
                "cleanliness": 5.0,
                "desk": null,
                "location": 5.0,
                "pool": null,
                "restaurant": null,
                "rooms": 5.0,
                "service": 5.0,
                "sleep": 5.0,
                "value": 5.0
            },
            "helpfulness": null,
            "id": 132034738,
            "likes": {
                "disliked": null,
                "liked": null
            },
            "rating": 5.0,
            "stay_parameters": "Stayed June 2012, traveled as a couple",
            "text": "My wife and I just got married and found this place. We were actually upgraded to a bigger cabin (the Dancing Bear cabin) for free because of someone staying longer than us. We really enjoyed how well kept the place is. Everything smelled nice and looked great. The location was even better. We were right next to the river and were able to enjoy some relaxing time in some outdoor chairs right beside it. The hot tub added more to the relaxation department and we took advantage of that every night. Janie was a very sweet lady and made sure that we were well taken care of. We hope to have the chance to go back again. It's definitely a beautiful place to stay!",
            "title": "Relaxing, fun getaway",
            "user": "relativelyirish"
        },
        {
            "date": "June 12, 2012",
            "detail_rating": {
                "business": null,
                "cleanliness": 5.0,
                "desk": null,
                "location": 5.0,
                "pool": null,
                "restaurant": null,
                "rooms": 5.0,
                "service": 5.0,
                "sleep": 5.0,
                "value": 5.0
            },
            "helpfulness": null,
            "id": 131824111,
            "likes": {
                "disliked": null,
                "liked": null
            },
            "rating": 5.0,
            "stay_parameters": "Stayed June 2012, traveled as a couple",
            "text": "Me and my family spent two nights in their two bedroom bigger cabin, located right off the river. Very clean, quiet, and cozy. We had a private hot tub on our back porch, and an awesome fire pit for s'mores down by the river. A 10 min drive to the shopping in Estes Parks. Can't wait to go back! Will definetly be staying at Dripping Springs again!",
            "title": "Great Getaway",
            "user": "Dana496"
        },
        {
            "date": "July 14, 2012",
            "detail_rating": {
                "business": null,
                "cleanliness": 4.0,
                "desk": null,
                "location": 3.0,
                "pool": null,
                "restaurant": null,
                "rooms": 2.0,
                "service": 4.0,
                "sleep": 2.0,
                "value": 3.0
            },
            "helpfulness": null,
            "id": 134349566,
            "likes": {
                "disliked": null,
                "liked": null
            },
            "rating": 3.0,
            "stay_parameters": "Stayed August 2011, traveled with family",
            "text": "We stayed at Dripping Springs Resort in late August 2011 in the Phoenix Cabin -- a family of four. When staying in the cabins, you do not have the opportunity to enjoy the breakfast that the innkeepers serve, so our interactions with them were limited to check-in and out. They are friendly, helpful and hardworking innkeepers!",
            "title": "A bit like staying at Grandma's condo...",
            "user": "blondfromBeantown"
        },
        {
            "date": "July 13, 2012",
            "detail_rating": {
                "business": null,
                "cleanliness": 5.0,
                "desk": null,
                "location": 5.0,
                "pool": null,
                "restaurant": null,
                "rooms": 5.0,
                "service": 5.0,
                "sleep": 5.0,
                "value": 5.0
            },
            "helpfulness": null,
            "id": 134277251,
            "likes": {
                "disliked": null,
                "liked": null
            },
            "rating": 5.0,
            "stay_parameters": "Stayed June 2012, traveled as a couple",
            "text": "My rating is not higher simply because we were a little disappointed in the Phoenix cabin. First because it is attached to the Thunderbird...it is one building with two units. The other unit was occupied by another quiet couple, but it was a bit uncomfortable for our family hanging out on the balcony chatting with the neighbors about 3 feet away on the other side of a wooden privacy panel hearing every word. This building would work well for two families traveling together or a group, since you could open up the door between the porches and hand out together.",
            "title": "Hidden Gem in the Rockies",
            "user": "34Sparky"
        },
        {
            "date": "July 11, 2012",
            "detail_rating": {
                "business": null,
                "cleanliness": 5.0,
                "desk": null,
                "location": 5.0,
                "pool": null,
                "restaurant": null,
                "rooms": 5.0,
                "service": 5.0,
                "sleep": 5.0,
                "value": 5.0
            },
            "helpfulness": null,
            "id": 134105040,
            "likes": {
                "disliked": null,
                "liked": null
            },
            "rating": 5.0,
            "stay_parameters": "Stayed July 2012, traveled as a couple",
            "text": "Second, the unit sits close to Hwy 34 and high above the river and the firepit and hot tub area has no river view. I probably could've figured this out from the website photos, but it was a short walk down a steep path to the river and it would've been nicer to have views from the unit of the river. Additionally, with no AC (understandable in that climate) and the windows wide open, noise from the road woke us in the morning (we live in a completely quiet, no-street-noise neighborhood so we're just not used to hearing cars).",
            "title": "City Boy Loved Dripping Springs",
            "user": "TSchreider"
        },
        {
            "date": "July 8, 2012",
            "detail_rating": {
                "business": null,
                "cleanliness": 5.0,
                "desk": null,
                "location": 5.0,
                "pool": null,
                "restaurant": null,
                "rooms": 5.0,
                "service": 5.0,
                "sleep": 5.0,
                "value": 5.0
            },
            "helpfulness": null,
            "id": 133802378,
            "likes": {
                "disliked": null,
                "liked": null
            },
            "rating": 5.0,
            "stay_parameters": "Stayed July 2012, traveled as a couple",
            "text": "Finally, and most importantly, while we enjoyed having the space to spread out, the furnishing and decor were dated and older. From looking at the website, they appear to have updated the living room decor with new paneling and some other \"southwest\" elements and that may help. However, when we were there less than a year ago, the bedroom furniture, window treatments, the lamps, the nicknacks, art of the walls, the clean but worn carpeting, thin polyester bedspreads, old worn out pillows and sheets, linoleum flooring in the kitchen and baths - all gave us the feeling of staying in an older person's condo, not at a riverside resort that cost over $250 a night.",
            "title": "A lovely and hospitable stay",
            "user": "Mj F"
        },
        {
            "date": "July 4, 2012",
            "detail_rating": {
                "business": null,
                "cleanliness": 5.0,
                "desk": null,
                "location": 5.0,
                "pool": null,
                "restaurant": null,
                "rooms": 4.0,
                "service": 5.0,
                "sleep": 4.0,
                "value": 5.0
            },
            "helpfulness": null,
            "id": 133448749,
            "likes": {
                "disliked": null,
                "liked": null
            },
            "rating": 5.0,
            "stay_parameters": "Stayed June 2012, traveled with family",
            "text": "It also appears that the innkeepers have changed the cleaning requirements for the cabin guests and that is a good thing. Since at the end of our stay we were required to strip the beds, remove all towels, unload the dishwasher and do all other dishes and remove all food. Whew...I was ready for a vacation from my vacation that morning. Now it looks like they just ask you to clean the dishes, which is fine, but I thought having to strip the beds was a bit much to ask when also charging me a \"cleaning fee.\"",
            "title": "Our Favorite!",
            "user": "2tocruz"
        }
    ],
    "slim_ranking": 0.227272727273,
    "stars": null,
    "tripadvisor": {
        "VISITED": false,
        "country_name": null,
        "locality": null,
        "pic_link": null,
        "street_address": null
    },
    "user_rating": 4.5,
    "variance": {
        "average": 10,
        "excellent": 168,
        "poor": 3,
        "terrible": 6,
        "very good": 34
    }
}