{
    "aka": "Sofitel Berlin Gendarmenmarkt Hotel Berlin",
    "description": "The Sofitel Berlin Gendarmenmarkt welcomes you in the heart of the capital. Located close to the Reichstag and the Brandenburg Gate, only 10 km from the exhibition centre and the airports, our prestigious hotel featuring 92 rooms and 4 conference rooms is the premier address for leisure and business stays. French elegance and historical charm characterise our spa area as well. Another highlight is our breakfast, considered the best in the city by the media.",
    "detail_rating": {
        "cleanliness": null,
        "location": null,
        "rooms": null,
        "service": null,
        "sleep": null,
        "value": null
    },
    "location": {
        "city": null,
        "continent": "Europe",
        "country": "Germany",
        "proposed_city": "Berlin",
        "province": null,
        "region": null
    },
    "name": "Sofitel Berlin Gendarmenmarkt",
    "places": {
        "aka": [
            "Berlin"
        ],
        "hotel_description": [
            "Berlin"
        ],
        "hotel_name": [
            "Berlin"
        ]
    },
    "review_count": 649,
    "review_count_current": 16,
    "reviews": [
        {
            "date": "June 27, 2011",
            "detail_rating": {
                "business": null,
                "cleanliness": null,
                "desk": null,
                "location": null,
                "pool": null,
                "restaurant": null,
                "rooms": null,
                "service": null,
                "sleep": null,
                "value": null
            },
            "helpfulness": null,
            "id": 114786663,
            "likes": {
                "disliked": null,
                "liked": null
            },
            "rating": 4.0,
            "stay_parameters": null,
            "text": "The localisation is very good. The breakfast had plenty of food and it was very good. The rooms were quiet and very good. If I had someone going to Berlin I will definetly recommend the hotel. Keep the goog work!",
            "title": "Muito Bom",
            "user": "A TripAdvisor user"
        },
        {
            "date": "June 27, 2011",
            "detail_rating": {
                "business": null,
                "cleanliness": null,
                "desk": null,
                "location": null,
                "pool": null,
                "restaurant": null,
                "rooms": null,
                "service": null,
                "sleep": null,
                "value": null
            },
            "helpfulness": null,
            "id": 114786322,
            "likes": {
                "disliked": null,
                "liked": null
            },
            "rating": 5.0,
            "stay_parameters": null,
            "text": "Very comfortable bed and great power shower, helped to set me up for the day ahead. I know Berlin well and have stayed there several times. As my time in the city was very limited on this occasion I chose this hotel as the location is very central within easy reach of bus to Berlin Tegel Airport. I found the staff welcoming and helpful.",
            "title": "Excellent hotel",
            "user": "A TripAdvisor user"
        },
        {
            "date": "June 22, 2011",
            "detail_rating": {
                "business": null,
                "cleanliness": 5.0,
                "desk": null,
                "location": null,
                "pool": null,
                "restaurant": null,
                "rooms": null,
                "service": 5.0,
                "sleep": 5.0,
                "value": 4.0
            },
            "helpfulness": 4,
            "id": 114635177,
            "likes": {
                "disliked": null,
                "liked": null
            },
            "rating": 5.0,
            "stay_parameters": "Stayed April 2011, traveled as a couple",
            "text": "We really have to thank this beautiful hotel (and its staff), perfectly located in the most beautiful Berlin\u00b4s square. Excellent service, comfort, cleanliness and the beautiful view from our room, have contributed to make our three days in Berlin were even better.",
            "title": "Thanks for making our days in Berlin even better",
            "user": "GUSDALI"
        },
        {
            "date": "June 19, 2011",
            "detail_rating": {
                "business": null,
                "cleanliness": null,
                "desk": null,
                "location": null,
                "pool": null,
                "restaurant": null,
                "rooms": null,
                "service": null,
                "sleep": null,
                "value": null
            },
            "helpfulness": 2,
            "id": 114393202,
            "likes": {
                "disliked": null,
                "liked": null
            },
            "rating": 5.0,
            "stay_parameters": null,
            "text": "Stayed here for 5 nites - Really nice room with a large comfy bed.",
            "title": "Great area, really nice hotel",
            "user": "Fiona019"
        },
        {
            "date": "June 19, 2011",
            "detail_rating": {
                "business": null,
                "cleanliness": 4.0,
                "desk": null,
                "location": null,
                "pool": null,
                "restaurant": null,
                "rooms": null,
                "service": 5.0,
                "sleep": 5.0,
                "value": 4.0
            },
            "helpfulness": 1,
            "id": 114379697,
            "likes": {
                "disliked": null,
                "liked": null
            },
            "rating": 5.0,
            "stay_parameters": "Stayed June 2011, traveled solo",
            "text": "Staff very pleasant/helpful. Didn't try the restaurant but it was always very busy.",
            "title": "Great Food!!",
            "user": "beno77"
        },
        {
            "date": "April 15, 2011",
            "detail_rating": {
                "business": null,
                "cleanliness": 5.0,
                "desk": null,
                "location": 5.0,
                "pool": null,
                "restaurant": null,
                "rooms": 4.0,
                "service": 5.0,
                "sleep": 4.0,
                "value": 4.0
            },
            "helpfulness": null,
            "id": 104159675,
            "likes": {
                "disliked": null,
                "liked": null
            },
            "rating": 4.0,
            "stay_parameters": "Stayed April 2011, traveled as a couple",
            "text": "The good far outweigh the bad that's for sure. Fantastic staff, from the front desk to the super nice bartender to the housekeepers. We had many questions for the concierge and they were always very helpful with restaurant suggestions and directions. They even printed a map of the area to help us find a particular restaurnt. We didn't eat at the restaurant, but it was packed every single night. The rooms are decorated quite nicely and are very clean, and the bed was super comfortable. It was nice having turn down service as well.",
            "title": "Great hotel, with some quirks",
            "user": "olympicnut"
        },
        {
            "date": "April 8, 2011",
            "detail_rating": {
                "business": null,
                "cleanliness": 2.0,
                "desk": null,
                "location": 5.0,
                "pool": null,
                "restaurant": null,
                "rooms": 3.0,
                "service": 4.0,
                "sleep": 4.0,
                "value": 3.0
            },
            "helpfulness": 1,
            "id": 103290190,
            "likes": {
                "disliked": null,
                "liked": null
            },
            "rating": 3.0,
            "stay_parameters": "Stayed April 2011, traveled solo",
            "text": "One quirk was the air conditioning. We couldn't seem to get it to cool off at all, and had to open the windows to get fresh, cool air (we prefer to sleep in cool hotel rooms). We just attributed it to being different than in the States. A couple of days went by and I mentioned it to the front desk, whereupon they said they hadn't switched the air conditioning for the building to \"summer\" mode, which is why we couldn't get cool air. Luckily our room faced the courtyard, so it was relatively quiet, and we could open the windows with no sound issues. If it faced the street, the noise with the windows open would definitely had been an issue.",
            "title": "Only OK",
            "user": "Sagittarius_7"
        },
        {
            "date": "March 24, 2011",
            "detail_rating": {
                "business": null,
                "cleanliness": 5.0,
                "desk": null,
                "location": 5.0,
                "pool": null,
                "restaurant": null,
                "rooms": 5.0,
                "service": 5.0,
                "sleep": 5.0,
                "value": 5.0
            },
            "helpfulness": null,
            "id": 101406646,
            "likes": {
                "disliked": null,
                "liked": null
            },
            "rating": 5.0,
            "stay_parameters": "Stayed March 2011, traveled on business",
            "text": "The door to the toilet doubled as the door to the bathroom when you opened it all the way, which was fine, but it was a frosted glass door. I HATE that! I've seen that so much in Europe and I really dislike feeling like the people in the room can see me do my \"stuff\".",
            "title": "Exceptionally nice hotel for business",
            "user": "mrwatson"
        },
        {
            "date": "March 18, 2011",
            "detail_rating": {
                "business": null,
                "cleanliness": 5.0,
                "desk": null,
                "location": 5.0,
                "pool": null,
                "restaurant": null,
                "rooms": 5.0,
                "service": 5.0,
                "sleep": 5.0,
                "value": 5.0
            },
            "helpfulness": null,
            "id": 100576288,
            "likes": {
                "disliked": null,
                "liked": null
            },
            "rating": 5.0,
            "stay_parameters": "Stayed March 2011, traveled on business",
            "text": "Outside of that, I highly recommend the Sofitel. The location is fabulous!! Especially for tourists like us.",
            "title": "Fabulous hotel during ITB, glad to be back again!",
            "user": "Feyenoorder"
        },
        {
            "date": "June 12, 2011",
            "detail_rating": {
                "business": null,
                "cleanliness": 5.0,
                "desk": null,
                "location": null,
                "pool": null,
                "restaurant": null,
                "rooms": null,
                "service": 5.0,
                "sleep": 4.0,
                "value": 4.0
            },
            "helpfulness": null,
            "id": 112915498,
            "likes": {
                "disliked": null,
                "liked": null
            },
            "rating": 5.0,
            "stay_parameters": "Stayed March 2011, traveled as a couple",
            "text": "This Sofitel hotel provided the best lodging experience my wife and I have had to date. From our stylish room and amazing view of the square outside to the tasty food and exceptional service, it was a first class stay on every level. I was most impressed by the little things such as the staff calling me by my first name as I entered and exited the hotel, as well as the concierge's persistence in helping us get great seats at the Deutsche Oper Berlin on short notice. Kudos to the staff!",
            "title": "Exceptional ambiance and service!",
            "user": "GlobeStomper"
        },
        {
            "date": "May 16, 2011",
            "detail_rating": {
                "business": null,
                "cleanliness": 5.0,
                "desk": null,
                "location": 5.0,
                "pool": null,
                "restaurant": null,
                "rooms": 5.0,
                "service": 5.0,
                "sleep": 5.0,
                "value": 5.0
            },
            "helpfulness": 1,
            "id": 108456414,
            "likes": {
                "disliked": null,
                "liked": null
            },
            "rating": 5.0,
            "stay_parameters": "Stayed May 2011",
            "text": "Friendly service from every single staff member, top location, value for money.",
            "title": "5 Star quality +",
            "user": "vivehodie"
        },
        {
            "date": "May 9, 2011",
            "detail_rating": {
                "business": null,
                "cleanliness": 3.0,
                "desk": null,
                "location": 5.0,
                "pool": null,
                "restaurant": null,
                "rooms": 3.0,
                "service": 3.0,
                "sleep": 5.0,
                "value": 3.0
            },
            "helpfulness": 2,
            "id": 107546743,
            "likes": {
                "disliked": null,
                "liked": null
            },
            "rating": 3.0,
            "stay_parameters": "Stayed December 2010, traveled as a couple",
            "text": "Best hotel we stayed in while in Europe",
            "title": "Very well located but disapointing hotel",
            "user": "AddAdrTA"
        },
        {
            "date": "July 29, 2011",
            "detail_rating": {
                "business": null,
                "cleanliness": 5.0,
                "desk": null,
                "location": null,
                "pool": null,
                "restaurant": null,
                "rooms": null,
                "service": 5.0,
                "sleep": 5.0,
                "value": 3.0
            },
            "helpfulness": 3,
            "id": 115944151,
            "likes": {
                "disliked": null,
                "liked": null
            },
            "rating": 5.0,
            "stay_parameters": "Stayed July 2011, traveled as a couple",
            "text": "What can you say other than very sophisticated slick hotel in a truly great location.",
            "title": "Beautiful Hotel, Slick Design ,Quality Rooms - FANTASTIC LOCATION!!",
            "user": "zedmeister"
        },
        {
            "date": "July 23, 2011",
            "detail_rating": {
                "business": null,
                "cleanliness": 5.0,
                "desk": null,
                "location": null,
                "pool": null,
                "restaurant": null,
                "rooms": null,
                "service": 5.0,
                "sleep": 5.0,
                "value": 5.0
            },
            "helpfulness": null,
            "id": 115682943,
            "likes": {
                "disliked": null,
                "liked": null
            },
            "rating": 5.0,
            "stay_parameters": "Stayed July 2011, traveled on business",
            "text": "The rooms were slick and fantastically appointed in every way.",
            "title": "We'll be back for more",
            "user": "farawayfromhere44"
        },
        {
            "date": "July 19, 2011",
            "detail_rating": {
                "business": null,
                "cleanliness": 5.0,
                "desk": null,
                "location": null,
                "pool": null,
                "restaurant": null,
                "rooms": null,
                "service": 5.0,
                "sleep": 5.0,
                "value": 4.0
            },
            "helpfulness": null,
            "id": 115518626,
            "likes": {
                "disliked": null,
                "liked": null
            },
            "rating": 5.0,
            "stay_parameters": "Stayed October 2010, traveled as a couple",
            "text": "There really is a well heeled clientele that frequents this hotel and the only negative is the looks up and down from other guests who think they are just so much better than the rest, but thats to be expected in this type of hotel, we were just in for a few good days and were out to impress no-one.",
            "title": "Amazing hotel facing a beautiful square",
            "user": "InspirationLondon"
        },
        {
            "date": "July 14, 2011",
            "detail_rating": {
                "business": null,
                "cleanliness": 5.0,
                "desk": null,
                "location": null,
                "pool": null,
                "restaurant": null,
                "rooms": null,
                "service": 5.0,
                "sleep": 4.0,
                "value": 3.0
            },
            "helpfulness": null,
            "id": 115352884,
            "likes": {
                "disliked": null,
                "liked": null
            },
            "rating": 5.0,
            "stay_parameters": "Stayed August 2010, traveled with family",
            "text": "I cant fault this property..",
            "title": "Enjoyable time in Berlin",
            "user": "MoooTi"
        }
    ],
    "slim_ranking": 0.0435435435435,
    "stars": 5,
    "tripadvisor": {
        "VISITED": false,
        "country_name": null,
        "locality": null,
        "pic_link": null,
        "street_address": null
    },
    "user_rating": 4.5,
    "variance": {
        "average": 49,
        "excellent": 383,
        "poor": 11,
        "terrible": 5,
        "very good": 201
    }
}