{
    "aka": "Clarion Hotel",
    "description": "Newly renovated, full-service hotel conveniently located between Hartford, CT and Springfield, MA. Minutes away from Bradley International Airport. Free WIFI, Airport Shuttle, Deluxe Continental Breakfast & choice privileges rewards program.On site restaurant and Bar . Easy on/off I-91 Exit 45 .",
    "detail_rating": {
        "cleanliness": null,
        "location": null,
        "rooms": null,
        "service": null,
        "sleep": null,
        "value": null
    },
    "location": {
        "city": "East Windsor",
        "continent": null,
        "country": "United States",
        "proposed_city": null,
        "province": null,
        "region": null
    },
    "name": "Clarion Inn",
    "places": {
        "aka": [],
        "hotel_description": [
            "Hartford",
            "Springfield",
            "Bradley",
            "Bar"
        ],
        "hotel_name": []
    },
    "review_count": 85,
    "review_count_current": 20,
    "reviews": [
        {
            "date": "August 8, 2013",
            "detail_rating": {
                "business": null,
                "cleanliness": 2.0,
                "desk": null,
                "location": 4.0,
                "pool": null,
                "restaurant": null,
                "rooms": 2.0,
                "service": 5.0,
                "sleep": 3.0,
                "value": 3.0
            },
            "helpfulness": null,
            "id": 171388299,
            "likes": {
                "disliked": null,
                "liked": null
            },
            "rating": 2.0,
            "stay_parameters": "Stayed August 2013, traveled with family",
            "text": "In my case, I didn't have a choice. It was what was available for a meeting in the area. I read the reviews and cringed at the thought of staying here but just hoped for the best. Check-in was quick and easy. Front desk staff was very friendly and helpful. We were directed to our room and upon opening the door to the hallway of rooms, noticed that there were several blowers on down the hallway. Apparently, the hotel cleaned the rugs in an entire bank of hallways and rooms and the carpets were still soaking wet. Upon entering our room, our feet squished into the rug and upon feeling it, realized it too was soaking wet. We had to walk around our room with shoes on. No need to change rooms - they were all the same. With the wet floors came the wet smell. Not pleasant. We had wallpaper falling down due to a previous water problem in the corner of the room and the caulking in the bathroom was all moldy. It is dated and in desperate need of repair. However, all of the staff was great and did what they could with what they had.",
            "title": "STAY ONLY IF YOU HAVE TO!",
            "user": "shida_girlBoston_MA"
        },
        {
            "date": "July 19, 2013",
            "detail_rating": {
                "business": null,
                "cleanliness": 5.0,
                "desk": null,
                "location": 4.0,
                "pool": null,
                "restaurant": null,
                "rooms": 4.0,
                "service": 5.0,
                "sleep": 5.0,
                "value": 5.0
            },
            "helpfulness": null,
            "id": 168238700,
            "likes": {
                "disliked": null,
                "liked": null
            },
            "rating": 4.0,
            "stay_parameters": "Stayed July 2013, traveled with family",
            "text": "Pleasant check-in. Coffee and more available 24 hours.",
            "title": "Worked out nicely, would stay again",
            "user": "B B"
        },
        {
            "date": "July 18, 2013",
            "detail_rating": {
                "business": null,
                "cleanliness": 5.0,
                "desk": null,
                "location": 5.0,
                "pool": null,
                "restaurant": null,
                "rooms": 5.0,
                "service": 4.0,
                "sleep": 5.0,
                "value": 5.0
            },
            "helpfulness": null,
            "id": 168106016,
            "likes": {
                "disliked": null,
                "liked": null
            },
            "rating": 4.0,
            "stay_parameters": "Stayed July 2013, traveled as a couple",
            "text": "In room: convenient power outlets, strong shower & fan, shower was a 3/4 style with a seat.",
            "title": "The Whole Package at a Reasonable price",
            "user": "Jandy5770"
        },
        {
            "date": "July 15, 2013",
            "detail_rating": {
                "business": null,
                "cleanliness": 3.0,
                "desk": null,
                "location": 4.0,
                "pool": null,
                "restaurant": null,
                "rooms": 3.0,
                "service": 5.0,
                "sleep": null,
                "value": 4.0
            },
            "helpfulness": null,
            "id": 167589329,
            "likes": {
                "disliked": null,
                "liked": null
            },
            "rating": 3.0,
            "stay_parameters": "Stayed June 2013",
            "text": "Typical Clarion amenities in linens, both foam and feather pillows.",
            "title": "Great service",
            "user": "Brighteyes77"
        },
        {
            "date": "July 11, 2013",
            "detail_rating": {
                "business": null,
                "cleanliness": 5.0,
                "desk": null,
                "location": 5.0,
                "pool": null,
                "restaurant": null,
                "rooms": 4.0,
                "service": 5.0,
                "sleep": 5.0,
                "value": 5.0
            },
            "helpfulness": null,
            "id": 167200250,
            "likes": {
                "disliked": null,
                "liked": null
            },
            "rating": 4.0,
            "stay_parameters": "Stayed July 2013, traveled as a couple",
            "text": "AC struggled a bit on a 90F+ hot day to cool down room. After 30 min was fine, and then very cool for sleeping. Both the AC and the mini-fridge were rather quiet compared to other hotels.",
            "title": "Best Value",
            "user": "Picaname"
        },
        {
            "date": "March 1, 2013",
            "detail_rating": {
                "business": null,
                "cleanliness": 5.0,
                "desk": null,
                "location": 5.0,
                "pool": null,
                "restaurant": null,
                "rooms": 4.0,
                "service": 2.0,
                "sleep": null,
                "value": 4.0
            },
            "helpfulness": null,
            "id": 153467000,
            "likes": {
                "disliked": null,
                "liked": null
            },
            "rating": 4.0,
            "stay_parameters": "Stayed February 2013",
            "text": "Booked it thru Priceline and when I saw some of the reviews I thought about eating the reservation but I didn't",
            "title": "Much nicer than some review",
            "user": "rodgerdodger1"
        },
        {
            "date": "February 17, 2013",
            "detail_rating": {
                "business": null,
                "cleanliness": null,
                "desk": null,
                "location": null,
                "pool": null,
                "restaurant": null,
                "rooms": null,
                "service": null,
                "sleep": null,
                "value": null
            },
            "helpfulness": null,
            "id": 152351760,
            "likes": {
                "disliked": null,
                "liked": null
            },
            "rating": 5.0,
            "stay_parameters": null,
            "text": "Rooms were very clean. There was a small stain on the carpet. Had 2 newspapers in the room. Nice touch",
            "title": "Great service",
            "user": "lindawesc"
        },
        {
            "date": "February 17, 2013",
            "detail_rating": {
                "business": null,
                "cleanliness": 1.0,
                "desk": null,
                "location": 3.0,
                "pool": null,
                "restaurant": null,
                "rooms": 1.0,
                "service": 3.0,
                "sleep": 1.0,
                "value": 1.0
            },
            "helpfulness": 1,
            "id": 152347116,
            "likes": {
                "disliked": null,
                "liked": null
            },
            "rating": 1.0,
            "stay_parameters": "Stayed January 2013, traveled on business",
            "text": "Shower massage head was great. And water hot. Kind of like a pressure washer",
            "title": "Awful Awful",
            "user": "Rebecca w"
        },
        {
            "date": "February 6, 2013",
            "detail_rating": {
                "business": null,
                "cleanliness": 5.0,
                "desk": null,
                "location": 5.0,
                "pool": null,
                "restaurant": null,
                "rooms": 5.0,
                "service": 5.0,
                "sleep": 5.0,
                "value": 5.0
            },
            "helpfulness": null,
            "id": 151574276,
            "likes": {
                "disliked": null,
                "liked": null
            },
            "rating": 5.0,
            "stay_parameters": "Stayed February 2013, traveled solo",
            "text": "The disappointing part was a strange charge that showed up on my credit card almost $100 for misc. called the hotel and they claimed it was a mistake. ??",
            "title": "Another Excellent Stay",
            "user": "Joanna787"
        },
        {
            "date": "January 24, 2013",
            "detail_rating": {
                "business": null,
                "cleanliness": 1.0,
                "desk": null,
                "location": 1.0,
                "pool": null,
                "restaurant": null,
                "rooms": 1.0,
                "service": 1.0,
                "sleep": null,
                "value": 1.0
            },
            "helpfulness": null,
            "id": 150498621,
            "likes": {
                "disliked": null,
                "liked": null
            },
            "rating": 1.0,
            "stay_parameters": "Stayed January 2013",
            "text": "I would stay there again. Ez drive to airport and there is a couple of restaurant. Close by that I like",
            "title": "Women travelling alone beware...",
            "user": "SavoirClaire"
        },
        {
            "date": "April 22, 2013",
            "detail_rating": {
                "business": null,
                "cleanliness": 3.0,
                "desk": null,
                "location": 2.0,
                "pool": null,
                "restaurant": null,
                "rooms": 2.0,
                "service": 4.0,
                "sleep": 4.0,
                "value": 2.0
            },
            "helpfulness": null,
            "id": 158500409,
            "likes": {
                "disliked": null,
                "liked": null
            },
            "rating": 3.0,
            "stay_parameters": "Stayed April 2013, traveled with family",
            "text": "Park-Sleep-Fly: Room shabby, but pleasant staff and OK for a quick overnight. Bag breakfast and shuttle to airport at 5 AM were fine. BUT returning we waited over an hour for pick-up in the cold wind after a trip to a tropical paradise. The \"return van\" was smaller than the first and there were six of us plus luggage to fit in. The other family included an elderly man, and we had a young grandson with us. A lot of \"pass-the-buck\" that no-one had notified the van driver (I had called the hotel THREE times and been told driver was \"on the way\")....rather aggravating.",
            "title": "Clarion near Bradley Airport-Hartford",
            "user": "Bookworm290"
        },
        {
            "date": "April 17, 2013",
            "detail_rating": {
                "business": null,
                "cleanliness": null,
                "desk": null,
                "location": null,
                "pool": null,
                "restaurant": null,
                "rooms": null,
                "service": null,
                "sleep": null,
                "value": null
            },
            "helpfulness": null,
            "id": 158058125,
            "likes": {
                "disliked": null,
                "liked": null
            },
            "rating": 3.0,
            "stay_parameters": null,
            "text": "Will Clarion pay for my doctor visit for a VERY bad sinus infection???",
            "title": "Meh. Not quite a 2.5 star. More like 2.",
            "user": "CultureCouple2"
        },
        {
            "date": "April 16, 2013",
            "detail_rating": {
                "business": null,
                "cleanliness": null,
                "desk": null,
                "location": null,
                "pool": null,
                "restaurant": null,
                "rooms": null,
                "service": null,
                "sleep": null,
                "value": null
            },
            "helpfulness": 2,
            "id": 157882128,
            "likes": {
                "disliked": null,
                "liked": null
            },
            "rating": 1.0,
            "stay_parameters": null,
            "text": "BHS",
            "title": "Go Elsewhere, Fast",
            "user": "123450JL"
        },
        {
            "date": "March 21, 2013",
            "detail_rating": {
                "business": null,
                "cleanliness": 2.0,
                "desk": null,
                "location": 4.0,
                "pool": null,
                "restaurant": null,
                "rooms": 3.0,
                "service": 4.0,
                "sleep": 2.0,
                "value": 5.0
            },
            "helpfulness": 2,
            "id": 155266978,
            "likes": {
                "disliked": null,
                "liked": null
            },
            "rating": 3.0,
            "stay_parameters": "Stayed March 2013, traveled as a couple",
            "text": "This hotel is not very close to the airport. So make sure you realize that. The shuttle will still pick you up and drop you off (mine even brought me to the rental car place), but it's by no means close to the airport. Expect a 20 minute drive\u2014plan on that when you call for a pickup.",
            "title": "Time to Refurbish",
            "user": "StepMorris1"
        },
        {
            "date": "March 19, 2013",
            "detail_rating": {
                "business": null,
                "cleanliness": 3.0,
                "desk": null,
                "location": 4.0,
                "pool": null,
                "restaurant": null,
                "rooms": null,
                "service": 4.0,
                "sleep": null,
                "value": null
            },
            "helpfulness": 1,
            "id": 155108208,
            "likes": {
                "disliked": null,
                "liked": null
            },
            "rating": 3.0,
            "stay_parameters": "Stayed March 2013, traveled on business",
            "text": "The rooms are slightly dated and are closer, in my opinion, to a 2 star hotel in quality. But this was an okay stay. No major complaints. Bathroom counter was nicely remodeled.",
            "title": "Baby, It's Cold Inside",
            "user": "DealMom"
        },
        {
            "date": "July 7, 2013",
            "detail_rating": {
                "business": null,
                "cleanliness": 3.0,
                "desk": null,
                "location": 3.0,
                "pool": null,
                "restaurant": null,
                "rooms": 1.0,
                "service": 1.0,
                "sleep": 1.0,
                "value": 1.0
            },
            "helpfulness": null,
            "id": 166683723,
            "likes": {
                "disliked": null,
                "liked": null
            },
            "rating": 1.0,
            "stay_parameters": "Stayed July 2013, traveled with family",
            "text": "My family and I are on an East Coast 14 day trip....staying in many different hotels within the Choice Hotel Family. This hotel was the absolute worst hotel I have been in-in 46 years!",
            "title": ".....stay someplace else......",
            "user": "DLM31"
        },
        {
            "date": "July 2, 2013",
            "detail_rating": {
                "business": null,
                "cleanliness": 1.0,
                "desk": null,
                "location": 2.0,
                "pool": null,
                "restaurant": null,
                "rooms": 3.0,
                "service": 1.0,
                "sleep": 1.0,
                "value": 1.0
            },
            "helpfulness": null,
            "id": 166087882,
            "likes": {
                "disliked": null,
                "liked": null
            },
            "rating": 1.0,
            "stay_parameters": "Stayed May 2013, traveled with family",
            "text": "1.The hotel restaurant is closed for remodeling---nothing on webpage saying that--not even mentioned at check-in",
            "title": "this is more like a 1 star",
            "user": "abr1231"
        },
        {
            "date": "July 1, 2013",
            "detail_rating": {
                "business": null,
                "cleanliness": 3.0,
                "desk": null,
                "location": 5.0,
                "pool": null,
                "restaurant": null,
                "rooms": 4.0,
                "service": 4.0,
                "sleep": 3.0,
                "value": 4.0
            },
            "helpfulness": null,
            "id": 165874752,
            "likes": {
                "disliked": null,
                "liked": null
            },
            "rating": 4.0,
            "stay_parameters": "Stayed June 2013, traveled with friends",
            "text": "2. After getting to our room-the bathroom door is a \"pocket\" door which is broken off the track and cannot be closed! After asking for maintenance or a different room-we were given a different room----only to see the employee on duty to turn around and give that room to the next person in line!!!!!",
            "title": "A pleasant stay",
            "user": "mx998"
        },
        {
            "date": "May 27, 2013",
            "detail_rating": {
                "business": null,
                "cleanliness": 4.0,
                "desk": null,
                "location": 4.0,
                "pool": null,
                "restaurant": null,
                "rooms": 3.0,
                "service": 5.0,
                "sleep": 4.0,
                "value": 5.0
            },
            "helpfulness": null,
            "id": 162046545,
            "likes": {
                "disliked": null,
                "liked": null
            },
            "rating": 4.0,
            "stay_parameters": "Stayed May 2013, traveled solo",
            "text": "3. The new room---has a sliding glass door to access a courtyard type area......where there is a large number of people gathered and grilling out----not a common sight for a hotel! It appeared to us that they were living there-but do not know that as a fact!",
            "title": "Staff was incredible, room was ok.",
            "user": "lighthouseboy"
        },
        {
            "date": "May 9, 2013",
            "detail_rating": {
                "business": null,
                "cleanliness": 4.0,
                "desk": null,
                "location": 5.0,
                "pool": null,
                "restaurant": null,
                "rooms": 4.0,
                "service": 4.0,
                "sleep": 4.0,
                "value": 5.0
            },
            "helpfulness": null,
            "id": 160214004,
            "likes": {
                "disliked": null,
                "liked": null
            },
            "rating": 4.0,
            "stay_parameters": "Stayed May 2013, traveled with family",
            "text": "4. Going out the side door to retrieve some stuff from the car-we are greeted by a young foreign boy telling us that we had to keep the door propped open with a rock so that they all could get in and out!!!! they are secured by key cards for a reason!!!!!!!!!!! no security whatsoever",
            "title": "Chocolate Cookies at Check in",
            "user": "Kathleen B"
        }
    ],
    "slim_ranking": 0.75,
    "stars": 3,
    "tripadvisor": {
        "VISITED": false,
        "country_name": null,
        "locality": null,
        "pic_link": null,
        "street_address": null
    },
    "user_rating": 2.5,
    "variance": {
        "average": 16,
        "excellent": 9,
        "poor": 9,
        "terrible": 29,
        "very good": 22
    }
}