{
    "aka": "Green Bough Chester",
    "description": "Winner of 'best Small Hotel Of The Year 2006', Enjoy England for Excellence Awards. A warm, friendly welcome; luxurious surroundings, relaxing ambiance; thoughtful, professional service; superb food; dedication. The award-winning Green Bough is an exclusive, privately owned, Victorian Townhouse, lovingly restored using Italian wall-coverings and fabrics and original antique beds to provide sumptuous, individually designed, bedrooms and suites.",
    "detail_rating": {
        "cleanliness": 5.0,
        "location": 4.5,
        "rooms": 5.0,
        "service": 5.0,
        "sleep": 4.5,
        "value": 5.0
    },
    "location": {
        "city": null,
        "continent": "Europe",
        "country": "United Kingdom (UK)",
        "proposed_city": "Green",
        "province": null,
        "region": null
    },
    "name": "Green Bough Hotel",
    "places": {
        "aka": [
            "Green",
            "Chester"
        ],
        "hotel_description": [
            "Of",
            "Green"
        ],
        "hotel_name": [
            "Green"
        ]
    },
    "review_count": 585,
    "review_count_current": 20,
    "reviews": [
        {
            "date": "May 6, 2013",
            "detail_rating": {
                "business": null,
                "cleanliness": 5.0,
                "desk": null,
                "location": 4.0,
                "pool": null,
                "restaurant": null,
                "rooms": 5.0,
                "service": 5.0,
                "sleep": 5.0,
                "value": 5.0
            },
            "helpfulness": null,
            "id": 159819242,
            "likes": {
                "disliked": null,
                "liked": null
            },
            "rating": 5.0,
            "stay_parameters": "Stayed May 2013, traveled as a couple",
            "text": "`Lovely bed and breakfast. We arrived late and the staff still managed to serve us a delicious meal and upgraded us to a junior suite. Nothing was too much trouble and we look forward to returning later in the year. A nice touch was the designer toiletries in the bathroom.",
            "title": "will return",
            "user": "Cairolass_12"
        },
        {
            "date": "May 5, 2013",
            "detail_rating": {
                "business": null,
                "cleanliness": 5.0,
                "desk": null,
                "location": 5.0,
                "pool": null,
                "restaurant": null,
                "rooms": 5.0,
                "service": 5.0,
                "sleep": 5.0,
                "value": 5.0
            },
            "helpfulness": null,
            "id": 159726237,
            "likes": {
                "disliked": null,
                "liked": null
            },
            "rating": 5.0,
            "stay_parameters": "Stayed May 2013, traveled as a couple",
            "text": "Myself and my husband are just back from a 2 night stay at the hotel and what a lovely stay it was too!!",
            "title": "Beautiful Hotel, fantastic hospitality!!",
            "user": "elaine2508"
        },
        {
            "date": "May 4, 2013",
            "detail_rating": {
                "business": null,
                "cleanliness": 4.0,
                "desk": null,
                "location": 5.0,
                "pool": null,
                "restaurant": null,
                "rooms": 4.0,
                "service": 5.0,
                "sleep": 4.0,
                "value": 5.0
            },
            "helpfulness": 1,
            "id": 159619980,
            "likes": {
                "disliked": null,
                "liked": null
            },
            "rating": 5.0,
            "stay_parameters": "Stayed February 2013, traveled as a couple",
            "text": "We stayed in the 'Tabley' room which was beautiful, clean, comfortable and cosy.",
            "title": "Good Experience all round",
            "user": "no_nonsense52"
        },
        {
            "date": "May 2, 2013",
            "detail_rating": {
                "business": null,
                "cleanliness": 5.0,
                "desk": null,
                "location": 5.0,
                "pool": null,
                "restaurant": null,
                "rooms": 5.0,
                "service": 5.0,
                "sleep": 5.0,
                "value": 4.0
            },
            "helpfulness": null,
            "id": 159414853,
            "likes": {
                "disliked": null,
                "liked": null
            },
            "rating": 5.0,
            "stay_parameters": "Stayed April 2013, traveled as a couple",
            "text": "The staff are a credit to Janice and Philip who are the propietors, nothing was too much trouble and they were VERY friendly.",
            "title": "Lovely place to Stay",
            "user": "Johnny1964"
        },
        {
            "date": "May 1, 2013",
            "detail_rating": {
                "business": null,
                "cleanliness": 5.0,
                "desk": null,
                "location": 4.0,
                "pool": null,
                "restaurant": null,
                "rooms": 5.0,
                "service": 5.0,
                "sleep": 5.0,
                "value": 5.0
            },
            "helpfulness": null,
            "id": 159330837,
            "likes": {
                "disliked": null,
                "liked": null
            },
            "rating": 5.0,
            "stay_parameters": "Stayed April 2013, traveled on business",
            "text": "We dined in the restaurant on the first evening and can vouch that the food is absolutely exquisite and the wine menu is superb. Thanks to the lovely weather we were blessed with, we managed to take advantage of the roof-top terrace which is lovely on a warm evening.",
            "title": "Agree with other positive assessments; access could be an issue",
            "user": "Cassini"
        },
        {
            "date": "June 8, 2013",
            "detail_rating": {
                "business": null,
                "cleanliness": 5.0,
                "desk": null,
                "location": 4.0,
                "pool": null,
                "restaurant": null,
                "rooms": 5.0,
                "service": 5.0,
                "sleep": 4.0,
                "value": null
            },
            "helpfulness": null,
            "id": 163383405,
            "likes": {
                "disliked": null,
                "liked": null
            },
            "rating": 5.0,
            "stay_parameters": "Stayed May 2013, traveled on business",
            "text": "This was a second or third time here for work, and again the service and attention to detail was excellent. My room was spacious and comfortable (Eaton) and all the staff did everything to make us feel at home and to allow us to work comfortably. Breakfast was very good too, as always, and the food in the restaurant every lunchtime was delicious.",
            "title": "Excellent again",
            "user": "JeffStranks"
        },
        {
            "date": "June 6, 2013",
            "detail_rating": {
                "business": null,
                "cleanliness": 5.0,
                "desk": null,
                "location": 4.0,
                "pool": null,
                "restaurant": null,
                "rooms": 4.0,
                "service": 5.0,
                "sleep": 5.0,
                "value": 5.0
            },
            "helpfulness": 1,
            "id": 163140650,
            "likes": {
                "disliked": null,
                "liked": null
            },
            "rating": 4.0,
            "stay_parameters": "Stayed May 2013, traveled on business",
            "text": "Highly recommended, again.",
            "title": "Good Hotel",
            "user": "Tombobee"
        },
        {
            "date": "June 1, 2013",
            "detail_rating": {
                "business": null,
                "cleanliness": 5.0,
                "desk": null,
                "location": 4.0,
                "pool": null,
                "restaurant": null,
                "rooms": 5.0,
                "service": 5.0,
                "sleep": 5.0,
                "value": 5.0
            },
            "helpfulness": null,
            "id": 162610263,
            "likes": {
                "disliked": null,
                "liked": null
            },
            "rating": 5.0,
            "stay_parameters": "Stayed May 2013, traveled as a couple",
            "text": "Good Hotel + location, cosy atmosphere, excellent service, attentive, kind, ready to assist - Thank you Janice, & thanks David for giving us a rid downtown!",
            "title": "Lovely stay in Chester",
            "user": "Josephine617"
        },
        {
            "date": "May 29, 2013",
            "detail_rating": {
                "business": null,
                "cleanliness": 5.0,
                "desk": null,
                "location": 5.0,
                "pool": null,
                "restaurant": null,
                "rooms": 4.0,
                "service": 5.0,
                "sleep": 4.0,
                "value": 5.0
            },
            "helpfulness": null,
            "id": 162338684,
            "likes": {
                "disliked": null,
                "liked": null
            },
            "rating": 5.0,
            "stay_parameters": "Stayed May 2013, traveled on business",
            "text": "Rooms are simply furnished and comfortable, bathroom are a bit small.",
            "title": "Superb personal service!",
            "user": "EJVS"
        },
        {
            "date": "May 29, 2013",
            "detail_rating": {
                "business": null,
                "cleanliness": null,
                "desk": null,
                "location": null,
                "pool": null,
                "restaurant": null,
                "rooms": null,
                "service": null,
                "sleep": null,
                "value": null
            },
            "helpfulness": 8,
            "id": 162252128,
            "likes": {
                "disliked": null,
                "liked": null
            },
            "rating": 1.0,
            "stay_parameters": null,
            "text": "Excellent food, Michelin star level.",
            "title": "Would not recommend!",
            "user": "Wendy A"
        },
        {
            "date": "April 30, 2013",
            "detail_rating": {
                "business": null,
                "cleanliness": 4.0,
                "desk": null,
                "location": 4.0,
                "pool": null,
                "restaurant": null,
                "rooms": 3.0,
                "service": 4.0,
                "sleep": null,
                "value": 3.0
            },
            "helpfulness": null,
            "id": 159241319,
            "likes": {
                "disliked": null,
                "liked": null
            },
            "rating": 3.0,
            "stay_parameters": "Stayed April 2013",
            "text": "My husband and I stayed here for one night. I must say I was disappointed with this hotel. After reading so many other reviews where people had free upgrades and nice gestures in their room for special occasions I was a bit upset to find none of this applied to us. This was the case even though the hotel was empty, we booked months in advance and were even asked at the time of booking if this was a special occasion. There was not even a \"happy anniversary\" said to us.",
            "title": "Disappointing",
            "user": "BedfordScaff"
        },
        {
            "date": "April 29, 2013",
            "detail_rating": {
                "business": null,
                "cleanliness": 5.0,
                "desk": null,
                "location": 4.0,
                "pool": null,
                "restaurant": null,
                "rooms": 5.0,
                "service": 5.0,
                "sleep": null,
                "value": 5.0
            },
            "helpfulness": null,
            "id": 159157434,
            "likes": {
                "disliked": null,
                "liked": null
            },
            "rating": 5.0,
            "stay_parameters": "Stayed April 2013",
            "text": "We were in the Rode Junior Suite and this did not meet our expectations. There are cracks in the wall, stains on the carpet and a bedknob missing. The shower was also inadequate.",
            "title": "What a marvellous welcome.",
            "user": "Bao4033"
        },
        {
            "date": "April 28, 2013",
            "detail_rating": {
                "business": null,
                "cleanliness": 5.0,
                "desk": null,
                "location": 5.0,
                "pool": null,
                "restaurant": null,
                "rooms": 5.0,
                "service": 5.0,
                "sleep": 4.0,
                "value": 5.0
            },
            "helpfulness": null,
            "id": 159008457,
            "likes": {
                "disliked": null,
                "liked": null
            },
            "rating": 5.0,
            "stay_parameters": "Stayed April 2013, traveled with friends",
            "text": "Despite the above we would like to give credit to the lovely lady who served us at dinner and breakfast and advised us on where to park for the city centre.",
            "title": "Reunion of Traveller Friends",
            "user": "BobNapthne"
        },
        {
            "date": "April 24, 2013",
            "detail_rating": {
                "business": null,
                "cleanliness": 5.0,
                "desk": null,
                "location": 3.0,
                "pool": null,
                "restaurant": null,
                "rooms": 5.0,
                "service": 5.0,
                "sleep": 5.0,
                "value": 5.0
            },
            "helpfulness": null,
            "id": 158697198,
            "likes": {
                "disliked": null,
                "liked": null
            },
            "rating": 5.0,
            "stay_parameters": "Stayed April 2013, traveled on business",
            "text": "An average stay for an expensive price.",
            "title": "Home from home",
            "user": "YannCramer"
        },
        {
            "date": "April 21, 2013",
            "detail_rating": {
                "business": null,
                "cleanliness": 5.0,
                "desk": null,
                "location": 5.0,
                "pool": null,
                "restaurant": null,
                "rooms": 5.0,
                "service": 5.0,
                "sleep": 5.0,
                "value": 5.0
            },
            "helpfulness": null,
            "id": 158348889,
            "likes": {
                "disliked": null,
                "liked": null
            },
            "rating": 5.0,
            "stay_parameters": "Stayed April 2013, traveled as a couple",
            "text": "We were only staying in Chester one night. Had we known this hotel was going to be so good we would haves extended the visit. The staff were so accommodating and the hotel so well cared for we will be back.",
            "title": "Hidden Gem",
            "user": "Havewindwilltravel"
        },
        {
            "date": "May 19, 2013",
            "detail_rating": {
                "business": null,
                "cleanliness": 5.0,
                "desk": null,
                "location": 5.0,
                "pool": null,
                "restaurant": null,
                "rooms": 5.0,
                "service": 5.0,
                "sleep": null,
                "value": 5.0
            },
            "helpfulness": null,
            "id": 161179262,
            "likes": {
                "disliked": null,
                "liked": null
            },
            "rating": 5.0,
            "stay_parameters": "Stayed May 2013",
            "text": "We had a last minute deal through a website were we had a deal on a deluxe double room & breakfast for 2 nights. We were met with a wonderful, warm welcome & our room was something special! Very luxurious with beautiful, tasteful decor & spotlessly clean. I felt spoilt with thick cotton robes & toiletries from The White Company. All staff were so very friendly & made us feel very welcome. We ate at the restaurant, Olive Tree, situated at the hotel on the Saturday evening with a three course meal which is absolutely beautiful! I would highly recommend Green Bough to anyone who would like a weekend away to relax, unwind & be though of as a vip. Beautiful!",
            "title": "AMAZING!",
            "user": "SallyPhillips85"
        },
        {
            "date": "May 15, 2013",
            "detail_rating": {
                "business": null,
                "cleanliness": 5.0,
                "desk": null,
                "location": 4.0,
                "pool": null,
                "restaurant": null,
                "rooms": 5.0,
                "service": 5.0,
                "sleep": 5.0,
                "value": 5.0
            },
            "helpfulness": null,
            "id": 160799487,
            "likes": {
                "disliked": null,
                "liked": null
            },
            "rating": 5.0,
            "stay_parameters": "Stayed May 2013, traveled as a couple",
            "text": "We would recommend this hotel to anyone visiting Chester. The room we had was luxurious, on the ground floor so it was ideal if you are disabled with only a few small steps into the front door. It was the Cholmondley.",
            "title": "We cannot fault this hotel in any way",
            "user": "cruise61"
        },
        {
            "date": "May 10, 2013",
            "detail_rating": {
                "business": null,
                "cleanliness": 5.0,
                "desk": null,
                "location": 4.0,
                "pool": null,
                "restaurant": null,
                "rooms": 4.0,
                "service": 5.0,
                "sleep": 4.0,
                "value": 4.0
            },
            "helpfulness": null,
            "id": 160305246,
            "likes": {
                "disliked": null,
                "liked": null
            },
            "rating": 5.0,
            "stay_parameters": "Stayed April 2013, traveled as a couple",
            "text": "The staff were excellent, attentive and caring. The food also was excellent.",
            "title": "Very Welcoming",
            "user": "Judith M"
        },
        {
            "date": "May 10, 2013",
            "detail_rating": {
                "business": null,
                "cleanliness": 5.0,
                "desk": null,
                "location": 5.0,
                "pool": null,
                "restaurant": null,
                "rooms": 5.0,
                "service": 5.0,
                "sleep": 5.0,
                "value": 5.0
            },
            "helpfulness": null,
            "id": 160269984,
            "likes": {
                "disliked": null,
                "liked": null
            },
            "rating": 5.0,
            "stay_parameters": "Stayed May 2013, traveled as a couple",
            "text": "We would certainly go back there.",
            "title": "70th Birthday Celebration break",
            "user": "William F"
        },
        {
            "date": "May 9, 2013",
            "detail_rating": {
                "business": null,
                "cleanliness": 5.0,
                "desk": null,
                "location": 5.0,
                "pool": null,
                "restaurant": null,
                "rooms": 5.0,
                "service": 5.0,
                "sleep": 5.0,
                "value": 5.0
            },
            "helpfulness": null,
            "id": 160161417,
            "likes": {
                "disliked": null,
                "liked": null
            },
            "rating": 5.0,
            "stay_parameters": "Stayed March 2013, traveled as a couple",
            "text": "Mr and Mrs Cooper",
            "title": "Lovely hotel, brilliant staff!!",
            "user": "Emily W"
        }
    ],
    "slim_ranking": 0.0227272727273,
    "stars": null,
    "tripadvisor": {
        "VISITED": false,
        "country_name": null,
        "locality": null,
        "pic_link": null,
        "street_address": null
    },
    "user_rating": 5.0,
    "variance": {
        "average": 24,
        "excellent": 490,
        "poor": 6,
        "terrible": 1,
        "very good": 64
    }
}