{
    "aka": "Hampton Inn & Suites Chino Hills Hotel",
    "description": null,
    "detail_rating": {
        "cleanliness": null,
        "location": null,
        "rooms": null,
        "service": null,
        "sleep": null,
        "value": null
    },
    "location": {
        "city": "Chino Hills",
        "continent": null,
        "country": "United States",
        "proposed_city": null,
        "province": null,
        "region": null
    },
    "name": "Hampton Inn & Suites Chino Hills",
    "places": {
        "aka": [
            "Hampton",
            "Chino"
        ],
        "hotel_description": [],
        "hotel_name": [
            "Hampton",
            "Chino"
        ]
    },
    "review_count": 87,
    "review_count_current": 1,
    "reviews": [
        {
            "date": "May 30, 2007",
            "detail_rating": {
                "business": 5.0,
                "cleanliness": 5.0,
                "desk": null,
                "front_desk": 5.0,
                "location": 5.0,
                "pool": null,
                "restaurant": null,
                "rooms": 5.0,
                "service": 5.0,
                "sleep": null,
                "value": 5.0
            },
            "helpfulness": 3,
            "id": 7715621,
            "likes": {
                "disliked": "\u2014 fitness area was small",
                "liked": "\u2014 cleanliness, affordability, amenities"
            },
            "rating": 5.0,
            "stay_parameters": "Stayed May 2007, traveled on business",
            "text": "We really enjoyed our stay at the Hampton Inn Chino Hills in May 2007. The facility appeared to be brand new and clean. The rooms were well maintained and comfortable. There is a small business room off the lobby that had a computer with internet access and fax. A small fitness room was also available. The complementary breakfast was not elaborate, but was adequete for a light breakfast. The staff was friendly and helpful. The location of the hotel is in a new area - movie theater, Starbucks, pizza place all within walking distance. Very affordable. Would definetely stay here again.",
            "title": "Wonderful affordable hotel",
            "user": "GFlorida"
        }
    ],
    "slim_ranking": 0.666666666667,
    "stars": 2.5,
    "tripadvisor": {
        "VISITED": false,
        "country_name": null,
        "locality": null,
        "pic_link": null,
        "street_address": null
    },
    "user_rating": 4.0,
    "variance": {
        "average": 10,
        "excellent": 40,
        "poor": 4,
        "terrible": 6,
        "very good": 27
    }
}