{
    "aka": "Balmacara Hotel Lochalsh",
    "description": null,
    "detail_rating": {
        "cleanliness": null,
        "location": null,
        "rooms": null,
        "service": null,
        "sleep": null,
        "value": null
    },
    "location": {
        "city": null,
        "continent": "Europe",
        "country": "United Kingdom (UK)",
        "proposed_city": null,
        "province": null,
        "region": null
    },
    "name": "Balmacara Hotel",
    "places": {
        "aka": [],
        "hotel_description": [],
        "hotel_name": []
    },
    "review_count": 111,
    "review_count_current": 20,
    "reviews": [
        {
            "date": "June 19, 2013",
            "detail_rating": {
                "business": null,
                "cleanliness": null,
                "desk": null,
                "location": null,
                "pool": null,
                "restaurant": null,
                "rooms": null,
                "service": null,
                "sleep": null,
                "value": null
            },
            "helpfulness": null,
            "id": 164522141,
            "likes": {
                "disliked": null,
                "liked": null
            },
            "rating": 4.0,
            "stay_parameters": null,
            "text": "We are staying in a cottage nearby so decided to try the restaurant in this hotel. Nice choice of starters and main courses and a nice view from the restaurant of the nearby loch. My starter was a little bland (hot crab, could have done with a kick of flavour, lemon etc...) but main (steak) was tasty. My 2 travelling companions really enjoyed their meals. Service was a little slow but only 2 staff on, the veg could have come out a bit quicker with the main meals. Comfy seating area in the bar, would go back but would try different meals next time.",
            "title": "Nice restaurant....service could be a bit quicker",
            "user": "auntallie"
        },
        {
            "date": "June 11, 2013",
            "detail_rating": {
                "business": null,
                "cleanliness": null,
                "desk": null,
                "location": null,
                "pool": null,
                "restaurant": null,
                "rooms": null,
                "service": null,
                "sleep": null,
                "value": null
            },
            "helpfulness": null,
            "id": 163708991,
            "likes": {
                "disliked": null,
                "liked": null
            },
            "rating": 3.0,
            "stay_parameters": null,
            "text": "This was not the intended place to stay but was where I stayed. The view was lovely. Wi-Fi was not available every place in the hotel and not in my room. I sat for nearly 3 hours doing necessary correspondence on e-mail in a very cold hallway. The lights in the hallways were not illuminated by the staff at night, but I finally found a light switch in the last hallway after feeling my way up the previous flights. The room was clean. The food was satisfactory as was the service. Staff was friendly. Parking was convenient.",
            "title": "Average",
            "user": "ShirleyAR2013"
        },
        {
            "date": "May 28, 2013",
            "detail_rating": {
                "business": null,
                "cleanliness": 4.0,
                "desk": null,
                "location": 4.0,
                "pool": null,
                "restaurant": null,
                "rooms": 3.0,
                "service": 3.0,
                "sleep": 4.0,
                "value": 3.0
            },
            "helpfulness": 1,
            "id": 162064454,
            "likes": {
                "disliked": null,
                "liked": null
            },
            "rating": 3.0,
            "stay_parameters": "Stayed May 2013, traveled with friends",
            "text": "My daughter and I had a 2 night break here after travelling from Caithness. We were given a room on the ground floor which would have had a terrific view of the loch if we hadnt had to look over the car park. Suggest anyone booking this hotel asks for an upper floor for the view but there is no lift.",
            "title": "Bit out of the way",
            "user": "Jennifer R"
        },
        {
            "date": "May 6, 2013",
            "detail_rating": {
                "business": null,
                "cleanliness": 4.0,
                "desk": null,
                "location": 4.0,
                "pool": null,
                "restaurant": null,
                "rooms": 2.0,
                "service": 2.0,
                "sleep": 2.0,
                "value": 2.0
            },
            "helpfulness": null,
            "id": 159757844,
            "likes": {
                "disliked": null,
                "liked": null
            },
            "rating": 2.0,
            "stay_parameters": "Stayed April 2013, traveled with friends",
            "text": "The room was comfortable but furniture a bit dated and we did have a small deck outside the patio door.",
            "title": "Its Cold",
            "user": "arthur j"
        },
        {
            "date": "May 2, 2013",
            "detail_rating": {
                "business": null,
                "cleanliness": 5.0,
                "desk": null,
                "location": 5.0,
                "pool": null,
                "restaurant": null,
                "rooms": 4.0,
                "service": 5.0,
                "sleep": 4.0,
                "value": 4.0
            },
            "helpfulness": null,
            "id": 159484318,
            "likes": {
                "disliked": null,
                "liked": null
            },
            "rating": 2.0,
            "stay_parameters": "Stayed May 2013, traveled as a couple",
            "text": "The reception area also doubled as a bar but there was limited seating we went round to the pub attached to the hotel. Mistake. Food was expensive and bar needed complete renovation.",
            "title": "big mistake because of food",
            "user": "JoSwartz1000"
        },
        {
            "date": "April 6, 2013",
            "detail_rating": {
                "business": null,
                "cleanliness": 5.0,
                "desk": null,
                "location": 3.0,
                "pool": null,
                "restaurant": null,
                "rooms": 4.0,
                "service": 5.0,
                "sleep": 3.0,
                "value": 5.0
            },
            "helpfulness": null,
            "id": 156816181,
            "likes": {
                "disliked": null,
                "liked": null
            },
            "rating": 5.0,
            "stay_parameters": "Stayed November 2012, traveled as a couple",
            "text": "Hotel was fine even with a French party being there. They ate early so we were well looked after after they went. The view was lovely as we were upgraded to a front room and the staff were lovely.It is a bit remote, but we went over to Plockton on the second night and that wasn't too far.",
            "title": "Balmacara",
            "user": "RobsheDunfermline"
        },
        {
            "date": "October 15, 2012",
            "detail_rating": {
                "business": null,
                "cleanliness": 4.0,
                "desk": null,
                "location": 5.0,
                "pool": null,
                "restaurant": null,
                "rooms": 2.0,
                "service": 1.0,
                "sleep": 3.0,
                "value": 2.0
            },
            "helpfulness": 3,
            "id": 142838468,
            "likes": {
                "disliked": null,
                "liked": null
            },
            "rating": 1.0,
            "stay_parameters": "Stayed October 2012, traveled on business",
            "text": "Greeted by an englishman at the desk who juggled the prices before squeezing an extra tenner out of me the Balmacarra was a Hotel that might once have been quite nice. The room was dated and didn't lock, I had to sit in a corridor outside an office to pick up wi-fi and they couldn't be bothered to start breakfast half an hour early for me and 7 other guests. Not good enough and poor value. Keep going there are plenty good B&Bs on Skye.",
            "title": "Poor service at the Balmacarra",
            "user": "ianjacksonbfp"
        },
        {
            "date": "October 14, 2012",
            "detail_rating": {
                "business": null,
                "cleanliness": 5.0,
                "desk": null,
                "location": 4.0,
                "pool": null,
                "restaurant": null,
                "rooms": 5.0,
                "service": 5.0,
                "sleep": 5.0,
                "value": 5.0
            },
            "helpfulness": 1,
            "id": 142774234,
            "likes": {
                "disliked": null,
                "liked": null
            },
            "rating": 4.0,
            "stay_parameters": "Stayed October 2012, traveled as a couple",
            "text": "We booked our twin room for 65 GBP (for 2) on booking.com, but noticed a sign in the lobby that said the rack rate was about double that. We had a great view, buffet breakfast, with the usual Scottish breakfast items. Large room and you could set the temperature. The only negatives (and for the price I'm not complaining) was that there was an odd variety of different styles of furniture in the room and there also was no lift so had to use stairs with our cases.",
            "title": "Great view, great price",
            "user": "sherry246"
        },
        {
            "date": "October 8, 2012",
            "detail_rating": {
                "business": null,
                "cleanliness": 3.0,
                "desk": null,
                "location": 3.0,
                "pool": null,
                "restaurant": null,
                "rooms": 2.0,
                "service": 3.0,
                "sleep": 3.0,
                "value": 1.0
            },
            "helpfulness": 1,
            "id": 142297317,
            "likes": {
                "disliked": null,
                "liked": null
            },
            "rating": 2.0,
            "stay_parameters": "Stayed August 2012, traveled as a couple",
            "text": "If your main objective is to explore isle of Skye and its surroundings, Balmacara Hotel is not the place to stay. it is charmless, the rooms look like a big dorm and it is too expensive. The location is poor. There is nothing nice around in a walking distance. Prefer to get a bed and breakfast in Isle of Skye or Stockton (charming village!) that you will have a much better experience, with nice rooms, the chance to interact with the nice local people for half of the price. The only reason for staying here it would be if you are traveling in a big bus with a huge group of people...",
            "title": "Not worth it. Too expensive for what it is",
            "user": "Ariane2012"
        },
        {
            "date": "October 5, 2012",
            "detail_rating": {
                "business": null,
                "cleanliness": 5.0,
                "desk": null,
                "location": 5.0,
                "pool": null,
                "restaurant": null,
                "rooms": 4.0,
                "service": 5.0,
                "sleep": 5.0,
                "value": 5.0
            },
            "helpfulness": 1,
            "id": 142045059,
            "likes": {
                "disliked": null,
                "liked": null
            },
            "rating": 4.0,
            "stay_parameters": "Stayed May 2012, traveled as a couple",
            "text": "The hotel, staff, food and facilities are great. We were well looked after. As we stayed out of season we managed to miss the coach tours which I believe are frequent but I am assured don't interfere with other residents. We had a beautiful view from the room which was very clean and comfortable. Would definitely stay there again.",
            "title": "Great Base for Touring",
            "user": "Alan M"
        },
        {
            "date": "July 10, 2013",
            "detail_rating": {
                "business": null,
                "cleanliness": 5.0,
                "desk": null,
                "location": 5.0,
                "pool": null,
                "restaurant": null,
                "rooms": 5.0,
                "service": 5.0,
                "sleep": 5.0,
                "value": 5.0
            },
            "helpfulness": null,
            "id": 167117888,
            "likes": {
                "disliked": null,
                "liked": null
            },
            "rating": 4.0,
            "stay_parameters": "Stayed June 2013, traveled with family",
            "text": "In total, I stayed at 7 different hotels in Scotland on this trip, and this was one of the best places I stayed. The food was good, the views were fantastic, there were well groomed trails, a store right next door with a post office in it. My 20 yr old son had a small room in back with a view of a parking lot, and he liked this place better than any place we stayed. personally I wouldn't go that far, but I really liked it for it's charm. I would definitely go back!",
            "title": "I liked it in spite of it's shortcomings",
            "user": "Cyberdaddy"
        },
        {
            "date": "July 8, 2013",
            "detail_rating": {
                "business": null,
                "cleanliness": 4.0,
                "desk": null,
                "location": 5.0,
                "pool": null,
                "restaurant": null,
                "rooms": 4.0,
                "service": 4.0,
                "sleep": 4.0,
                "value": 4.0
            },
            "helpfulness": null,
            "id": 166735215,
            "likes": {
                "disliked": null,
                "liked": null
            },
            "rating": 4.0,
            "stay_parameters": "Stayed June 2013, traveled on business",
            "text": "Good location. Pleasant welcome and a rather nice room with a comfortable bed and a decent-sized bathroom. Window view over a low roof to the loch. The restaurant was fine, with white table cloths and well-polished cutlery and glassware. Good, generous and unfussy food. Breakfast nice (but no kippers on offer). Mix of business guests and tourists - not too busy in June. Had to stock up on some essentials for lunch etc., so the little supermarket next door was handy. Didn't try the pub that belongs to the hotel. Maybe next time.",
            "title": "A nice hotel with a Spar (next door)!",
            "user": "AlexandraUB"
        },
        {
            "date": "June 30, 2013",
            "detail_rating": {
                "business": null,
                "cleanliness": 4.0,
                "desk": null,
                "location": 4.0,
                "pool": null,
                "restaurant": null,
                "rooms": 4.0,
                "service": 4.0,
                "sleep": 3.0,
                "value": 3.0
            },
            "helpfulness": null,
            "id": 165758648,
            "likes": {
                "disliked": null,
                "liked": null
            },
            "rating": 4.0,
            "stay_parameters": "Stayed June 2013, traveled as a couple",
            "text": "Great location with excellent views. Great base for visiting other locations. Room was clean and good size. Breakfast was good, good portions. Ate both in the pub next door and the alacarte both good but alacarte better. Staff friendly and helpful. Very relaxing atmosphere.",
            "title": "Anniversary weekend",
            "user": "Roryboy10"
        },
        {
            "date": "June 22, 2013",
            "detail_rating": {
                "business": null,
                "cleanliness": 5.0,
                "desk": null,
                "location": 5.0,
                "pool": null,
                "restaurant": null,
                "rooms": 5.0,
                "service": 5.0,
                "sleep": 5.0,
                "value": null
            },
            "helpfulness": 1,
            "id": 164839126,
            "likes": {
                "disliked": null,
                "liked": null
            },
            "rating": 5.0,
            "stay_parameters": "Stayed June 2013, traveled on business",
            "text": "Got told room number at time of booking and this is what we got -great view",
            "title": "Coach Driver Opinion (Professional Traveller)",
            "user": "Chris W"
        },
        {
            "date": "June 21, 2013",
            "detail_rating": {
                "business": null,
                "cleanliness": 4.0,
                "desk": null,
                "location": 5.0,
                "pool": null,
                "restaurant": null,
                "rooms": 4.0,
                "service": 5.0,
                "sleep": 5.0,
                "value": 4.0
            },
            "helpfulness": null,
            "id": 164726743,
            "likes": {
                "disliked": null,
                "liked": null
            },
            "rating": 4.0,
            "stay_parameters": "Stayed June 2013, traveled solo",
            "text": "I've only visited here for lunch on tours before however my first night in the hotel was more than comfortable.",
            "title": "A Hidden Gem right outside Kyle of Lochalsh",
            "user": "Lonnie H"
        },
        {
            "date": "October 4, 2012",
            "detail_rating": {
                "business": null,
                "cleanliness": 5.0,
                "desk": null,
                "location": 5.0,
                "pool": null,
                "restaurant": null,
                "rooms": 4.0,
                "service": 5.0,
                "sleep": 5.0,
                "value": 5.0
            },
            "helpfulness": null,
            "id": 141988232,
            "likes": {
                "disliked": null,
                "liked": null
            },
            "rating": 5.0,
            "stay_parameters": "Stayed September 2012, traveled with family",
            "text": "My husband and I choose Balmacara Hotel to have our wedding reception after our ceremony in Eilean Donan Castle. We stayed at the hotel from the Friday to Monday with our guests staying Sat-Mon.... throughout the whole process of organising the wedding Helen was on hand to help us as was Liz and Andrew, made it easy for us and put our mind at rest as we are from Glasgow so had to rely on them a lot to help us with organising. The staff really made our stay enjoyable and from the moment we arrived we received a top class service, Helen was around to talk through all the plans and make sure that our wedding ran smoothly! The food was delicious and the views from the hotel breath taking, all of our guests thought the setting was gorgeous! We stayed in room 35 which was beautiful, spacious and looked out onto the loch.",
            "title": "Wedding Party",
            "user": "xLizzyx"
        },
        {
            "date": "September 17, 2012",
            "detail_rating": {
                "business": null,
                "cleanliness": 5.0,
                "desk": null,
                "location": 5.0,
                "pool": null,
                "restaurant": null,
                "rooms": 5.0,
                "service": 4.0,
                "sleep": 5.0,
                "value": 3.0
            },
            "helpfulness": null,
            "id": 140526359,
            "likes": {
                "disliked": null,
                "liked": null
            },
            "rating": 4.0,
            "stay_parameters": "Stayed September 2012, traveled with friends",
            "text": "I would recommend this hotel and we will be returning for many anniversary's to come!",
            "title": "One night stay",
            "user": "433Liz"
        },
        {
            "date": "September 10, 2012",
            "detail_rating": {
                "business": null,
                "cleanliness": 5.0,
                "desk": null,
                "location": 5.0,
                "pool": null,
                "restaurant": null,
                "rooms": 4.0,
                "service": 5.0,
                "sleep": 4.0,
                "value": 4.0
            },
            "helpfulness": null,
            "id": 139899379,
            "likes": {
                "disliked": null,
                "liked": null
            },
            "rating": 4.0,
            "stay_parameters": "Stayed July 2012, traveled on business",
            "text": "Thanks to all the staff at Balmacara, you helped make our big day very special! :)",
            "title": "Nice, little hotel in a beautiful spot in the Highlands",
            "user": "dspolarbears"
        },
        {
            "date": "September 5, 2012",
            "detail_rating": {
                "business": null,
                "cleanliness": 4.0,
                "desk": null,
                "location": 5.0,
                "pool": null,
                "restaurant": null,
                "rooms": 4.0,
                "service": 4.0,
                "sleep": 4.0,
                "value": 4.0
            },
            "helpfulness": null,
            "id": 139452441,
            "likes": {
                "disliked": null,
                "liked": null
            },
            "rating": 4.0,
            "stay_parameters": "Stayed August 2012, traveled as a couple",
            "text": "We made a mistake when booking and thought our first hotel was on Skye, so when we got over the shock of arriving on the island by boat and 20 mins later leaving over the bridge, we arrived at the hotel, very nicely situated on the loch, our twin room was clean and big enough for 2 tired travellers, lovely bath and large bathroom, our 2nd mistake was to drive into town and eat at one of the hotels there with no atmosphere, should have gone to the bar,the only complaint I have is our room was just above the large spotlight and we could not darken the room to go to sleep.It would have been nice to know on arrival that the wifi was not available in the room, we tried for ages to connect, when we could have gone to the lobby.",
            "title": "A great stop over",
            "user": "Tim C"
        },
        {
            "date": "September 2, 2012",
            "detail_rating": {
                "business": null,
                "cleanliness": 3.0,
                "desk": null,
                "location": 4.0,
                "pool": null,
                "restaurant": null,
                "rooms": 4.0,
                "service": 4.0,
                "sleep": 4.0,
                "value": 3.0
            },
            "helpfulness": null,
            "id": 139185914,
            "likes": {
                "disliked": null,
                "liked": null
            },
            "rating": 4.0,
            "stay_parameters": "Stayed August 2012, traveled with friends",
            "text": "I have a problem with stairs and there is a lot of them to carry luggage up.",
            "title": "Have dinner in the hotel!",
            "user": "FedericaF3"
        }
    ],
    "slim_ranking": 1.0,
    "stars": 3,
    "tripadvisor": {
        "VISITED": false,
        "country_name": null,
        "locality": null,
        "pic_link": null,
        "street_address": null
    },
    "user_rating": 3.5,
    "variance": {
        "average": 18,
        "excellent": 24,
        "poor": 11,
        "terrible": 10,
        "very good": 48
    }
}