<?xml version="1.0" encoding="UTF-8" standalone="no"?>
<svg
   xmlns:dc="http://purl.org/dc/elements/1.1/"
   xmlns:cc="http://creativecommons.org/ns#"
   xmlns:rdf="http://www.w3.org/1999/02/22-rdf-syntax-ns#"
   xmlns:svg="http://www.w3.org/2000/svg"
   xmlns="http://www.w3.org/2000/svg"
   xmlns:sodipodi="http://sodipodi.sourceforge.net/DTD/sodipodi-0.dtd"
   xmlns:inkscape="http://www.inkscape.org/namespaces/inkscape"
   width="8.1357994mm"
   height="10mm"
   viewBox="0 0 2.3708586 2.9141065"
   id="svg4200"
   version="1.1"
   inkscape:version="0.92.2 2405546, 2018-03-11"
   sodipodi:docname="labor-tux-pcb.svg"
   inkscape:export-filename="/tmp/tux.png"
   inkscape:export-xdpi="14.4"
   inkscape:export-ydpi="14.4">
  <metadata
     id="metadata4224">
    <rdf:RDF>
      <cc:Work
         rdf:about="">
        <dc:format>image/svg+xml</dc:format>
        <dc:type
           rdf:resource="http://purl.org/dc/dcmitype/StillImage" />
        <dc:title></dc:title>
      </cc:Work>
    </rdf:RDF>
  </metadata>
  <defs
     id="defs4222">
    <inkscape:path-effect
       effect="skeletal"
       id="path-effect4307"
       is_visible="true"
       pattern="M 36.233654,30.067578 A 23.411487,23.411487 0 0 1 12.82219,53.479042 23.411487,23.411487 0 0 1 -10.589273,30.067578 23.411487,23.411487 0 0 1 12.82219,6.6561149 23.411487,23.411487 0 0 1 36.233654,30.067578 Z"
       copytype="single_stretched"
       prop_scale="0.05"
       scale_y_rel="false"
       spacing="0"
       normal_offset="0"
       tang_offset="0"
       prop_units="false"
       vertical_pattern="false"
       fuse_tolerance="0" />
    <inkscape:path-effect
       effect="skeletal"
       id="path-effect4294"
       is_visible="true"
       pattern="M 0,0 H 1"
       copytype="repeated"
       prop_scale="1"
       scale_y_rel="false"
       spacing="0"
       normal_offset="0"
       tang_offset="0"
       prop_units="false"
       vertical_pattern="false"
       fuse_tolerance="0" />
    <inkscape:path-effect
       effect="powerstroke"
       id="path-effect4290"
       is_visible="true"
       offset_points="0,0.0771024 | 3,0.0771024 | 6,0.0771024"
       sort_points="true"
       interpolator_type="Linear"
       interpolator_beta="0.22972973"
       start_linecap_type="round"
       linejoin_type="round"
       miter_limit="9.9"
       end_linecap_type="round" />
  </defs>
  <sodipodi:namedview
     pagecolor="#ffffff"
     bordercolor="#666666"
     borderopacity="1"
     objecttolerance="10"
     gridtolerance="10"
     guidetolerance="10"
     inkscape:pageopacity="0"
     inkscape:pageshadow="2"
     inkscape:window-width="1742"
     inkscape:window-height="1416"
     id="namedview4220"
     showgrid="false"
     inkscape:zoom="181.01934"
     inkscape:cx="13.405754"
     inkscape:cy="27.922391"
     inkscape:window-x="0"
     inkscape:window-y="0"
     inkscape:window-maximized="0"
     inkscape:current-layer="layer1"
     units="mm"
     fit-margin-top="0"
     fit-margin-left="0"
     fit-margin-right="0"
     fit-margin-bottom="0" />
  <g
     inkscape:groupmode="layer"
     id="layer1"
     inkscape:label="Cu"
     style="display:inline"
     transform="translate(-0.2807301,-189.84187)">
    <path
       inkscape:connector-curvature="0"
       style="clip-rule:evenodd;display:inline;fill-rule:evenodd;stroke-width:0.01581112;fill:#000000;fill-opacity:0.98188406"
       d="m 1.2825089,190.47082 c -0.00881,0.002 -0.01692,0.006 -0.022739,0.0125 -0.00456,0.005 -0.00249,0.0177 0.00557,0.0211 0.010561,0.005 0.01776,-0.006 0.019878,-0.014 0.00106,-0.004 0.00232,-0.009 0.00587,-0.009 0.00456,-0.003 0.011331,-3.7e-4 0.016264,-0.003 0.00564,-0.002 0.00349,-0.007 0.00211,-0.007 v 3e-4 c -0.00863,-0.002 -0.018149,-0.003 -0.026956,-9e-4 z"
       id="path4216-6" />
    <path
       inkscape:connector-curvature="0"
       style="clip-rule:evenodd;display:inline;fill-rule:evenodd;stroke-width:0.01581112;fill:#1d1b00;fill-opacity:1"
       d="m 1.4302249,190.46906 c -0.00973,-0.001 -0.022464,7.6e-4 -0.03057,7.6e-4 -0.00333,0 -0.010294,-5.2e-4 -0.00798,0.005 0.00708,0.0104 0.019621,0.0105 0.030118,0.0151 0.00562,0.003 0.017272,0.006 0.020782,-0.002 0.00405,-0.0128 -0.00262,-0.0172 -0.012348,-0.0184 z m -0.038551,0.005 c 0,0 -1.542e-4,-1.5e-4 -1.542e-4,-1.5e-4 v 6e-4 c -1.696e-4,-2.9e-4 2.699e-4,-2e-4 1.542e-4,-4.5e-4 z"
       id="path4216-7" />
    <path
       style="clip-rule:evenodd;fill-rule:evenodd;stroke-width:0.01581112"
       sodipodi:nodetypes="cccccccccccccccccsscccccccccccccccccccccccccccccccscccccccccccccscscccccsccccccccccccscccccccccccccscccccsccccsccccscccscccccccscccccccccccccccccccccccccccccccccccccccccccccccccc"
       inkscape:connector-curvature="0"
       id="path4216"
       d="m 1.0565101,190.30088 c -0.0095,-0.31525 0.1134287,-0.45439 0.3687944,-0.45895 0.2550332,-0.005 0.4149467,0.12961 0.4477076,0.30609 0.032395,0.17613 0.013742,0.40824 0.078898,0.52873 0.064826,0.12081 0.1063931,0.21345 0.218051,0.35258 0.1112946,0.13915 0.1806895,0.28074 0.2131181,0.45263 0.03273,0.17154 0.05107,0.25257 -0.032428,0.34096 -0.083468,0.0881 -0.2317593,0.23177 -0.3430852,0.0694 -0.055986,-0.0814 -0.06198,-0.18248 0.032428,-0.20394 0.060224,-0.0141 0.1035466,-0.009 0.1482923,0.0137 0.045091,0.0233 0.055655,0.0123 0.00175,-0.0278 -0.054263,-0.0401 -0.065158,-0.003 -0.046503,-0.068 0.018691,-0.0649 0.042989,-0.18142 -0.00774,-0.30963 -0.023591,-0.0592 -0.103547,-0.2212 -0.1785869,-0.261 -0.0067,-0.004 -0.026406,-0.0119 -0.013031,0.005 0.020081,0.025 0.1282122,0.18423 0.158854,0.27897 0.032762,0.10182 0.037327,0.19904 0.020443,0.26067 -0.016885,0.062 -0.046503,0.0866 -0.082075,0.0866 -0.035575,0 -0.067972,0.0168 -0.067972,-0.0648 0,-0.0821 0.00845,-0.20572 -0.035576,-0.31034 -0.044033,-0.10427 -0.097586,-0.17612 -0.1091914,-0.22015 -0.011273,-0.044 -0.037,-0.16238 -0.090171,-0.22967 -0.053552,-0.0673 -0.076794,-0.11131 -0.048984,-0.18808 0.02783,-0.0764 0.00703,-0.0972 -0.048605,-0.11343 -0.055655,-0.0162 -0.1299836,-0.0395 -0.1482929,-0.0768 -0.018674,-0.0369 -0.00703,-0.11132 0.03453,-0.12962 0.0419,-0.0188 0.1112942,0.007 0.113761,0.0602 0.00244,0.0532 -0.023257,0.0811 -0.016173,0.0927 0.00703,0.0117 0.044003,0.0303 0.062692,0.009 0.018308,-0.0211 0.023257,-0.086 0.00456,-0.14619 -0.018691,-0.0602 -0.027829,-0.10215 -0.09512,-0.11589 -0.06726,-0.0141 -0.097555,-0.009 -0.1299671,0.0324 -0.032411,0.0416 -0.046482,0.10884 -0.036982,0.15781 0.00916,0.0486 -0.00952,0.0207 -0.041916,0.0183 -0.032411,-0.002 -0.023241,-0.005 -0.055654,-0.002 -0.032411,0.002 -0.020777,-0.0187 -0.023257,-0.0535 -0.00212,-0.0348 -0.00668,-0.10672 -0.055654,-0.13454 -0.048618,-0.0278 -0.1320864,0.005 -0.1299832,0.12082 0.00244,0.1159 0.041916,0.17155 0.065173,0.12962 0.023241,-0.0416 0.011624,-0.0207 -0.011624,-0.0395 -0.023241,-0.0183 -0.039447,-0.0951 -0.014086,-0.118 0.02571,-0.0233 0.055655,-0.0233 0.07221,-0.009 0.016206,0.0141 0.041565,0.0606 0.036983,0.0905 -0.00456,0.0303 -0.00705,0.0324 -0.036983,0.0535 -0.030293,0.0207 -0.041916,0.0395 -0.076779,0.0623 -0.03488,0.0233 -0.048606,0.0768 -0.020777,0.0905 0.02783,0.0141 0.030293,0.0117 0.053189,0.0465 0.023241,0.0348 0.062692,0.0511 0.1602616,0.0348 0.097222,-0.0162 0.1373669,-0.0395 0.2109992,-0.0651 0.053552,-0.0185 0.034863,-0.0162 0.053552,-0.0369 0.018308,-0.0207 0.048606,0.009 0.020777,0.0278 -0.02783,0.0188 -0.090551,0.0369 -0.1370192,0.0532 -0.046152,0.0166 -0.099689,0.0627 -0.1969115,0.0581 -0.097571,-0.005 -0.030293,-0.003 -0.06059,-0.005 -0.029948,-0.003 -0.044034,0.002 -0.011624,0.0254 0.032762,0.0233 0.030293,0.0303 0.058121,0.0395 0.02783,0.009 0.064811,0.009 0.1091914,-0.007 0.044034,-0.0166 0.1553603,-0.0651 0.1902238,-0.0884 0.03453,-0.0233 0.062343,0.007 0.02783,0.0303 -0.034863,0.0233 -0.04438,0.0162 -0.076794,0.0369 -0.032395,0.0211 -0.092637,0.0558 -0.1320863,0.0931 -0.039447,0.0369 -0.048607,0.0395 -0.09757,0.0416 -0.048606,0.003 -0.078898,-0.0486 -0.099689,-0.0719 -0.020777,-0.0233 -0.018674,-0.0369 -0.044033,-0.0648 -0.025359,-0.0278 -0.02783,-0.0211 -0.032411,0.009 -0.00456,0.0302 -0.039447,0.10672 -0.069742,0.15781 -0.029947,0.051 -0.032411,0.11377 -0.027829,0.1578 0.00456,0.044 -0.00703,0.0486 -0.0415491,0.0997 -0.0348801,0.051 -0.0930014,0.20183 -0.10215591,0.25045 -0.00917,0.0486 -0.0207773,0.14864 -0.0162056,0.2064 0.004565,0.0581 -0.0116232,0.0698 -0.0535367,0.0303 -0.0415652,-0.0395 -0.0556706,-0.0835 -0.0531883,-0.1416 0.002124,-0.0496 0.008809,-0.0846 0.0151489,-0.10286 0.00634,-0.0184 3.4778e-4,-0.0311 -0.0130303,-0.009 -0.0285402,0.0492 -0.0299474,0.13454 -0.022896,0.16485 0.00669,0.0299 0.009155,0.0835 0.0856016,0.15532 0.0767787,0.0719 0.18808941,0.17156 0.28074241,0.23883 0.092985,0.0674 0.1253981,0.15076 -0.011624,0.211 0.085948,0.11625 0.1324336,0.17647 0.095103,0.2529 0.076779,-0.044 0.047199,-0.14793 0.010217,-0.17578 -0.037343,-0.0278 -0.014798,-0.0492 0.017612,-0.0281 0.032411,0.0207 0.044035,0.0623 0.1718987,0.0602 0.1275007,-0.003 0.2648835,-0.0152 0.3416941,-0.1268 0.07643,-0.11132 0.091231,-0.0176 0.072541,0.0475 -0.018308,0.0648 -0.064114,0.21134 0.00774,0.19761 0.00917,-0.086 0.030293,-0.16028 0.030293,-0.25292 0,-0.0931 0.00917,-0.13774 0.00212,-0.27229 -0.00706,-0.12964 0.08614,-0.13849 0.1150268,-0.13849 -1.53e-5,0.003 -6.902e-4,0.016 0.00318,0.0345 -0.018664,-9.5e-4 -0.085498,0.012 -0.087933,0.10713 -0.00244,0.0951 0,0.086 0.016173,0.17155 0.016205,0.086 0.018691,0.11131 0.00462,0.20641 -0.013742,0.0951 -0.025376,0.14617 0.037327,0.20432 0.062343,0.0581 0.157431,0.0416 0.206414,0.005 0.048605,-0.0369 0.1412563,-0.1229 0.2247233,-0.15076 0.083847,-0.0278 0.1719141,-0.0486 0.2183829,-0.0951 0.046169,-0.0465 0.034529,-0.0789 -0.014086,-0.10428 -0.048606,-0.0257 -0.09512,-0.0141 -0.1320864,-0.0558 -0.037359,-0.0419 -0.05567,-0.13457 -0.041931,-0.18353 0.014087,-0.0486 0.030293,-0.0278 0.030293,0.007 0,0.0348 0.00212,0.0674 0.037,0.11129 0.034864,0.044 0.06726,0.0651 0.1229316,0.0997 0.055654,0.0348 0.090518,0.0905 0.020777,0.13949 -0.069396,0.0486 -0.1088596,0.0764 -0.1669812,0.0997 -0.057774,0.0233 -0.1528621,0.0789 -0.2110151,0.13669 -0.058121,0.0581 -0.090519,0.10918 -0.2042801,0.10918 -0.1134286,0 -0.1655581,-0.0275 -0.199362,-0.0951 -0.023257,-0.0465 -0.034896,-0.0395 -0.088067,-0.0418 -0.053552,-0.002 -0.232139,-0.005 -0.3712607,-0.002 -0.1391383,0.002 -0.185623,0.0254 -0.2483297,0.0764 -0.062343,0.051 -0.085602,0.0905 -0.20394778,0.051 -0.11834608,-0.0395 -0.18105279,-0.0835 -0.35717332,-0.11835 -0.1764837,-0.0348 -0.0813638,-0.0187 -0.18810475,-0.0418 -0.10672502,-0.0229 -0.0996891,-0.0739 -0.0855855,-0.11589 0.0137418,-0.0416 0.048606,-0.10675 0.0183082,-0.19233 -0.0299473,-0.086 -0.0183082,-0.17402 0.0626913,-0.17402 0.0813638,0 0.15781071,0.0162 0.19020744,-0.0905 0.0324111,-0.10673 0.0419156,-0.0233 0.0324111,0.005 -0.009155,0.0278 -0.0137418,0.10426 -0.0856016,0.11589 -0.0718614,0.0116 -0.088052,-0.005 -0.13245,-0.005 -0.0440184,0 -0.0623429,0.0303 -0.0394466,0.0813 0.0232411,0.051 0.0489512,0.10426 0.0443795,0.1483 -0.004937,0.044 -0.009521,0.0602 -0.0419155,0.10214 -0.0324111,0.0416 -0.0278287,0.0627 0.0302925,0.0764 0.057758,0.0141 0.1623798,0.0419 0.2596024,0.0651 0.0975704,0.0229 0.10462234,0.0229 0.27369038,0.0673 0.16943233,0.044 0.21593303,-0.0348 0.22967273,-0.12998 0.014086,-0.0951 -0.05107,-0.18564 -0.1113103,-0.27617 -0.0602408,-0.0905 -0.125082,-0.19475 -0.20399532,-0.28988 -0.0788973,-0.0951 -0.12539804,-0.10216 -0.16484673,-0.0813 -0.0394625,0.0211 -0.046498,0.0166 -0.0486165,-0.0369 -0.002442,-0.0532 -0.007052,-0.088 0.0369829,-0.16696 0.0440342,-0.0789 0.0834829,-0.16485 0.1299836,-0.29694 0.0464821,-0.13209 0.088052,-0.1578 0.16696534,-0.27158 0.0789134,-0.11341 0.0440343,-0.0694 0.0996889,-0.14583 0.055655,-0.0768 0.039447,-0.0627 0.03488,-0.18352 -0.00456,-0.12047 -0.00916,-0.19022 -0.013742,-0.34803 z m -0.2215614,0.94332 c 0.0119843,0.0145 0.0288855,-0.0197 0.0465032,-0.0328 0.0154409,-0.0139 0.0226304,-0.0348 0.0190197,-0.0553 -0.001752,-0.0109 -0.0193861,-0.008 -0.022896,-0.004 -0.0109117,0.0109 -0.008459,0.0286 -0.0162056,0.0437 -0.008809,0.0183 -0.03839,0.0331 -0.0264216,0.0479 z m 0.9972071,-0.4847 c 0.025015,0.0211 0.040508,0.0395 0.054232,0.009 0.014119,-0.0313 0.014119,-0.0441 -0.0197,-0.0568 -0.033473,-0.0131 -0.048606,-0.0268 -0.063767,-0.044 -0.015132,-0.0176 -0.020411,0.0123 -0.00809,0.0416 0.015132,0.036 0.023937,0.0402 0.037327,0.051 z m -0.271556,-0.39715 c 0.015845,5.4e-4 0.037327,0.0289 0.039435,0.0616 3.319e-4,0.005 0.013742,0.005 0.016556,-3.5e-4 0.00741,-0.013 0.00212,-0.0275 -0.00138,-0.0431 -0.00287,-0.0127 -0.017979,-0.0257 -0.030659,-0.0313 -0.00845,-0.004 -0.017267,-0.006 -0.02854,-0.004 -0.00281,0.002 -0.012664,0.0162 0.00462,0.0172 z m -0.3455677,-0.009 c -0.014453,9.4e-4 -0.00916,0.0123 -0.00845,0.0215 0.020081,0.0113 0.021835,0.0366 0.026056,0.0567 3.48e-4,0.008 0.011968,0.004 0.013031,0.002 0.00881,-0.0162 -0.00212,-0.0345 -0.00597,-0.0535 -0.0035,-0.0101 -0.010217,-0.0211 -0.019386,-0.0278 -0.00138,-0.002 -0.00387,0.002 -0.00525,0.002 z m 0.4431068,-0.35542 c -0.014453,-0.0116 -0.037,-0.0162 -0.043672,0.003 -0.00703,0.0162 -0.00425,0.0328 -0.00812,0.0504 0,0.006 -0.00703,0.007 -0.010896,0.0123 -0.00564,0.007 -0.00425,0.0152 -0.00143,0.0176 0.013407,0.0137 0.03804,-0.0134 0.056019,-0.0229 0.013375,-0.009 0.032729,0.003 0.04756,-0.007 0.00419,-0.003 0.00561,-0.009 0.00138,-0.0148 -0.0095,-0.0166 -0.026056,-0.026 -0.040854,-0.0383 z" />
    <path
       style="fill:#010101;fill-opacity:1;fill-rule:evenodd;stroke:#000000;stroke-width:0.01219076;stroke-linecap:butt;stroke-linejoin:miter;stroke-miterlimit:4;stroke-dasharray:none;stroke-opacity:1"
       d="m 1.9972516,191.75271 c -1.848e-4,2e-5 -4.178e-4,1.5e-4 -6.903e-4,4.2e-4 -3.366e-4,3.2e-4 -7.433e-4,9.6e-4 -0.00116,0.002 -7.966e-4,9.4e-4 -0.00181,0.003 -0.00265,0.006 -0.00149,0.005 -0.00281,0.0127 -0.00116,0.0223 0.00154,0.009 0.00499,0.0171 0.010821,0.0258 l 0.00793,-0.009 c -0.00515,-0.007 -0.00851,-0.0129 -0.010566,-0.0197 -0.00255,-0.008 -0.00271,-0.015 -0.0025,-0.0196 1.132e-4,-0.003 3.298e-4,-0.005 4.402e-4,-0.007 6.23e-5,-5.3e-4 9.4e-5,-0.002 6.23e-5,-0.002 -3.3e-5,-5e-4 -1.238e-4,-5.3e-4 -3.261e-4,-9.4e-4 -5.1e-5,-2e-5 -1.072e-4,-3e-5 -1.69e-4,-2e-5 z m 0.257882,0.23345 -0.018977,0.0193 c 0.0093,0.009 0.01853,0.0189 0.027483,0.0288 0.00922,0.0102 0.018346,0.0208 0.026236,0.032 0.00531,0.008 0.010295,0.0149 0.011898,0.0215 0.00881,0.0319 0.00377,0.0729 -0.022019,0.0945 -0.021659,0.0191 -0.046583,0.036 -0.074137,0.0454 -0.028201,0.0101 -0.059329,0.013 -0.092227,0.0142 -0.046413,0.002 -0.096215,-0.007 -0.1492843,-0.004 -0.025557,9.5e-4 -0.052413,0.006 -0.078018,0.0166 -0.025332,0.0111 -0.047284,0.0298 -0.061803,0.0541 -0.010641,0.0182 -0.018876,0.0374 -0.024834,0.0573 -0.013338,0.0446 -0.015213,0.0921 -0.00742,0.13724 0.00989,0.0582 0.032873,0.11301 0.065042,0.16018 0.02426,0.0352 0.054949,0.0639 0.088591,0.0866 h 0.068389 c -0.049578,-0.0242 -0.096016,-0.0592 -0.1273551,-0.10664 -0.02898,-0.0435 -0.049684,-0.0935 -0.058402,-0.14628 -0.00652,-0.0402 -0.00493,-0.0821 0.00648,-0.12063 0.00509,-0.0172 0.012164,-0.0337 0.021324,-0.049 0.010032,-0.0172 0.026294,-0.0311 0.044804,-0.0392 v 0 c 0.019525,-0.009 0.042196,-0.0122 0.065373,-0.0138 0.047634,-0.003 0.097534,0.005 0.1485489,0.003 0.034435,-0.002 0.069017,-0.006 0.1021474,-0.0174 0.032793,-0.012 0.061113,-0.0314 0.084675,-0.0534 0.035805,-0.0346 0.042048,-0.0864 0.028907,-0.12721 -0.00414,-0.0125 -0.010805,-0.0223 -0.016966,-0.0301 -0.0093,-0.0124 -0.019418,-0.0237 -0.029305,-0.0339 -0.00957,-0.0101 -0.019359,-0.0197 -0.029151,-0.0288 z"
       id="path4288"
       inkscape:connector-curvature="0" />
    <path
       style="fill:#000000;stroke-width:0.01581112"
       d="m 2.2806005,192.01312 -0.0077,0.008 -0.0077,0.008 c -0.012733,0.009 -0.014405,0.0101 -0.026629,0.0111 -0.010885,9.4e-4 -0.015861,-5.4e-4 -0.027972,-0.0117 -0.00899,-0.008 -0.020365,-0.014 -0.029194,-0.0154 -0.011846,-0.002 -0.034896,-0.0193 -0.1272692,-0.0963 -0.062041,-0.0518 -0.1179918,-0.0956 -0.1243339,-0.0974 -0.017241,-0.005 -0.020061,-0.008 -0.1241524,-0.0998 l -0.096384,-0.0857 -0.020783,0.002 c -0.011432,9.6e-4 -0.025498,5.3e-4 -0.031259,-9.4e-4 -0.00576,-0.002 -0.025613,-0.0174 -0.044115,-0.0355 -0.025343,-0.0248 -0.034646,-0.0366 -0.037731,-0.0481 -0.00489,-0.0181 -0.00169,-0.0439 0.00842,-0.0669 0.00409,-0.009 0.00607,-0.018 0.00446,-0.0195 -0.00671,-0.006 -0.2416647,-0.22453 -0.3153209,-0.29337 l -0.079595,-0.0744 0.00181,-0.019 0.00181,-0.0188 -0.052923,-0.0599 c -0.029108,-0.0329 -0.052923,-0.0624 -0.052923,-0.0654 0,-0.008 0.00774,-0.0146 0.015568,-0.0146 0.0035,0 0.034658,0.0214 0.069184,0.0476 l 0.062774,0.0476 0.018776,-0.002 0.018776,-0.002 0.1984344,0.18497 0.1984355,0.18497 0.018426,-0.009 c 0.020863,-0.0105 0.048574,-0.015 0.069384,-0.011 0.010742,0.002 0.022174,0.0105 0.048049,0.0353 0.036739,0.0354 0.044305,0.0501 0.039744,0.0771 l -0.00239,0.0141 0.09942,0.0982 c 0.067533,0.0667 0.099419,0.10072 0.099419,0.10621 0,0.006 0.025557,0.0346 0.073901,0.0848 0.1299751,0.13503 0.1397988,0.14614 0.1397988,0.15799 0,0.008 0.00462,0.0152 0.015473,0.0258 0.012844,0.0125 0.015346,0.0173 0.014713,0.0285 -0.00143,0.0138 1.582e-4,0.0131 -0.00843,0.0261 z m -0.048181,-9.5e-4 c -0.00737,-0.008 -0.014957,-0.0121 -0.018159,-0.0109 -0.00763,0.003 0.012691,0.024 0.023145,0.024 0.0067,0 0.00608,-0.002 -0.00499,-0.0131 z m -0.026437,-0.0246 c 0.018446,-0.0117 0.0324,-0.0306 0.035911,-0.0486 0.00196,-0.0101 -0.00534,-0.0188 -0.095703,-0.11309 -0.053816,-0.0562 -0.098365,-0.10208 -0.098998,-0.10208 -6.372e-4,0 -0.00571,0.009 -0.011283,0.0207 -0.011113,0.0227 -0.049971,0.0616 -0.065366,0.0655 -0.00969,0.003 -0.012059,0.007 -0.00564,0.011 0.00489,0.003 0.02595,-0.008 0.039728,-0.0204 0.00629,-0.006 0.010248,-0.008 0.00926,-0.004 -9.563e-4,0.003 -0.010922,0.0121 -0.022142,0.02 -0.011491,0.009 -0.017554,0.0143 -0.01389,0.0143 0.00774,0 0.023225,-0.009 0.037727,-0.0224 0.00578,-0.006 0.010492,-0.008 0.010492,-0.006 0,0.004 -0.021717,0.0226 -0.036251,0.0309 -0.0076,0.004 -0.0076,0.004 9.45e-5,0.004 0.00847,1.2e-4 0.020649,-0.008 0.037599,-0.0224 0.0093,-0.009 0.01036,-0.009 0.00691,-0.002 -0.00223,0.004 -0.011485,0.0129 -0.020527,0.0189 -0.00905,0.006 -0.017161,0.0115 -0.018037,0.0121 -9.026e-4,5.4e-4 -5.841e-4,0.002 5.841e-4,0.003 0.00287,0.003 0.021494,-0.007 0.037743,-0.0197 0.010614,-0.009 0.010157,-0.008 -0.0026,0.005 -0.0085,0.009 -0.017947,0.016 -0.020989,0.0171 -0.00303,9.3e-4 -0.00419,0.003 -0.0026,0.006 0.00159,0.002 0.013626,-0.004 0.026715,-0.013 0.021563,-0.0146 0.02254,-0.0149 0.010438,-0.004 -0.00735,0.007 -0.017649,0.0154 -0.022895,0.019 -0.00721,0.005 -0.00798,0.007 -0.00313,0.007 0.0035,9e-5 0.014411,-0.006 0.024223,-0.0135 0.00981,-0.008 0.018601,-0.0129 0.019535,-0.0119 0.00175,0.002 -0.013115,0.0151 -0.029316,0.0263 -0.00515,0.004 -0.0074,0.007 -0.00499,0.007 0.00239,9e-5 0.013402,-0.006 0.024425,-0.0132 0.022301,-0.0151 0.017821,-0.007 -0.00554,0.0103 -0.00836,0.006 -0.012249,0.0108 -0.00888,0.0108 0.00329,0 0.014049,-0.007 0.023883,-0.0136 0.00983,-0.008 0.01715,-0.0115 0.016258,-0.009 -9.024e-4,0.003 -0.00985,0.0105 -0.019912,0.0175 -0.010062,0.007 -0.016274,0.0126 -0.013811,0.0126 0.00646,0 0.019811,-0.008 0.029724,-0.0164 0.00472,-0.004 0.00955,-0.007 0.010742,-0.006 0.00122,9.4e-4 -0.00436,0.007 -0.012387,0.0129 -0.020719,0.0152 -0.022429,0.0169 -0.017619,0.0169 0.00228,0 0.013386,-0.006 0.024615,-0.0134 l 0.020417,-0.0135 -0.013625,0.0125 c -0.00749,0.007 -0.016939,0.0146 -0.020989,0.017 -0.00631,0.004 -0.00645,0.005 -9.565e-4,0.005 0.0035,9e-5 0.014676,-0.006 0.024808,-0.0133 l 0.01842,-0.0135 -0.018977,0.0173 c -0.010438,0.009 -0.017623,0.0173 -0.015968,0.0173 0.00566,0 0.019678,-0.009 0.03042,-0.0187 0.00686,-0.007 0.00985,-0.008 0.00829,-0.004 -0.00133,0.004 -0.00921,0.0111 -0.017485,0.0168 -0.00827,0.006 -0.01432,0.0112 -0.013428,0.012 0.00175,0.002 0.017597,-0.007 0.032863,-0.017 0.00899,-0.007 0.00925,-0.007 0.00437,-2e-5 -0.00287,0.004 -0.011109,0.0102 -0.01833,0.0147 -0.00722,0.004 -0.01234,0.009 -0.011374,0.0101 0.00175,0.002 0.015069,-0.005 0.03299,-0.0165 0.00889,-0.006 0.00882,-0.006 -9.565e-4,0.004 -0.00576,0.006 -0.013471,0.0114 -0.01714,0.0135 -0.00366,0.002 -0.00561,0.005 -0.00431,0.006 0.00128,9.4e-4 0.01029,-0.004 0.020002,-0.0112 0.00971,-0.008 0.01766,-0.0119 0.01766,-0.0101 0,0.002 -0.00685,0.009 -0.015181,0.0143 -0.015627,0.0111 -0.02022,0.0182 -0.00899,0.0138 0.00425,-0.002 0.00544,-9.5e-4 0.00361,0.002 -0.00509,0.009 0.010843,0.002 0.026559,-0.0103 0.00436,-0.003 0.00112,2.3e-4 -0.00717,0.009 -0.018208,0.0173 -0.013726,0.0187 0.00922,0.003 l 0.016789,-0.0117 -0.011931,0.0112 c -0.00656,0.007 -0.014289,0.012 -0.017171,0.0131 -0.00287,9.5e-4 -0.00409,0.003 -0.00265,0.005 0.00143,0.002 0.010869,-0.003 0.02099,-0.0101 0.01696,-0.0115 0.017677,-0.0117 0.00921,-0.002 -0.00505,0.006 -0.012351,0.0111 -0.016217,0.0123 -0.00933,0.003 -0.00892,0.009 8.497e-4,0.0114 0.00525,0.002 0.012876,-5.3e-4 0.022895,-0.008 0.019896,-0.0132 0.01928,-0.009 -8.497e-4,0.006 -0.00871,0.007 -0.013338,0.0115 -0.01028,0.0115 0.00309,0 0.011374,-0.004 0.018484,-0.0101 0.018117,-0.0134 0.019906,-0.0116 0.00309,0.003 -0.011077,0.0101 -0.013035,0.0132 -0.00923,0.0166 0.00543,0.005 0.013296,0.002 0.029018,-0.0114 0.00525,-0.004 0.00361,-0.002 -0.00361,0.007 -0.015744,0.0171 -0.011724,0.0183 0.011804,0.003 z m -0.032809,-0.003 c 0.00202,-0.002 0.00878,-0.008 0.015074,-0.0124 l 0.011449,-0.009 -0.011209,0.0124 c -0.00616,0.007 -0.012945,0.0124 -0.015075,0.0124 -0.00239,0 -0.0025,-9.5e-4 -2.469e-4,-0.003 z m -0.028812,-0.0175 c 0,-5.4e-4 0.0073,-0.006 0.016222,-0.0117 l 0.016217,-0.0103 -0.012463,0.0117 c -0.010789,0.0101 -0.019975,0.0149 -0.019975,0.0103 z m -0.024615,-0.032 c 0.00202,-0.002 0.00845,-0.008 0.014332,-0.0123 0.00746,-0.007 0.00996,-0.008 0.00827,-0.003 -0.00133,0.004 -0.00653,0.009 -0.011527,0.0123 -0.00924,0.006 -0.017698,0.009 -0.011072,0.003 z M 1.9421096,191.8024 c 0,-9.5e-4 -0.00636,-0.008 -0.014146,-0.0143 -0.026783,-0.0233 -0.1633171,-0.14485 -0.1720261,-0.1532 l -0.00872,-0.009 0.019083,-0.0124 c 0.030472,-0.0198 0.069216,-0.0686 0.078329,-0.0988 0.00483,-0.0159 -0.00356,-0.009 -0.014746,0.0127 -0.014214,0.0272 -0.056834,0.0727 -0.081879,0.0875 -0.010689,0.007 -0.019041,0.0125 -0.018564,0.0138 0.00116,0.003 0.1782233,0.16039 0.1899425,0.16861 0.00865,0.006 0.022721,0.009 0.022721,0.004 z m -0.2811737,-0.19217 c -0.00832,-0.007 -0.00832,-0.007 0.013609,-0.0131 0.043233,-0.012 0.093548,-0.0552 0.1181507,-0.10134 0.013428,-0.0252 0.025567,-0.0659 0.022231,-0.0746 -0.00419,-0.0109 -0.00893,-0.007 -0.00954,0.009 -0.00249,0.0634 -0.081163,0.15046 -0.1487738,0.16449 l -0.021441,0.004 0.010577,0.009 c 0.00582,0.005 0.013487,0.009 0.017044,0.009 0.00543,-9e-5 0.00515,-9.3e-4 -0.00187,-0.007 z m 0.024755,-0.0431 c 0.03067,-0.0147 0.070588,-0.0541 0.088112,-0.0869 0.015939,-0.03 0.020798,-0.07 0.010408,-0.0859 -0.010126,-0.0154 -0.027563,-0.0224 -0.050353,-0.02 -0.015881,0.002 -0.039256,0.0101 -0.046721,0.0162 -6.902e-4,5.3e-4 0.0077,0.009 0.018579,0.0195 0.023714,0.0222 0.027925,0.0315 0.022795,0.0506 -0.00446,0.0166 -0.026734,0.0439 -0.042272,0.052 -0.023071,0.0119 -0.040673,0.007 -0.069357,-0.0205 l -0.01422,-0.0135 -0.00545,0.0132 c -0.018585,0.0446 -0.00836,0.0767 0.027941,0.0877 0.01458,0.004 0.033686,5.2e-4 0.060537,-0.0123 z m -0.027494,-0.0675 c -0.00366,-0.006 -0.4068459,-0.3803 -0.4111294,-0.38174 -0.00234,-5.2e-4 -0.00361,4.1e-4 -0.00281,0.003 7.965e-4,0.002 0.070256,0.0682 0.1543758,0.14643 0.08412,0.0784 0.175485,0.16337 0.2030343,0.18908 0.027547,0.0257 0.051983,0.0468 0.054301,0.0468 0.00234,0 0.00334,-0.002 0.00223,-0.003 z m 0.033483,-0.0107 c 0.012553,-0.0116 0.025545,-0.0382 0.022535,-0.046 -0.00112,-0.003 -0.094133,-0.0911 -0.2066741,-0.19586 l -0.2046205,-0.19051 -0.00612,0.0142 c -0.00334,0.008 -0.013126,0.0205 -0.021685,0.0283 l -0.015568,0.0141 0.2066477,0.19297 c 0.1136564,0.10612 0.2084349,0.19295 0.2106188,0.19295 0.00218,0 0.00887,-0.005 0.014863,-0.0101 z M 1.251166,191.08755 c 0.014395,-0.0106 0.023108,-0.0242 0.0257,-0.0402 0.00255,-0.0155 -0.00165,-0.0213 -0.015562,-0.0214 -0.00687,-5e-5 -0.00692,3.4e-4 -7.436e-4,0.008 0.00898,0.0101 0.00467,0.0243 -0.011581,0.0385 -0.013683,0.012 -0.02718,0.0147 -0.034954,0.007 -0.00356,-0.004 -0.00456,-0.003 -0.00456,0.003 0,0.0179 0.021457,0.0209 0.04174,0.006 z m -0.010561,-0.026 c 0.00382,-0.004 0.00698,-0.009 0.00698,-0.0132 0,-0.004 -0.023305,-0.0248 -0.063919,-0.056 -0.035157,-0.0271 -0.064495,-0.0488 -0.065198,-0.0482 -0.00234,0.002 0.1069554,0.12383 0.1110923,0.12383 0.00222,0 0.00721,-0.003 0.011044,-0.007 z"
       id="path4291"
       inkscape:connector-curvature="0"
       sodipodi:nodetypes="ccccccscsccsssccscccsssscccccscsccsssscccccscccssccsccsscsccccccccsccccccscccccscccscccscccccccsssccscccccccccscccccscccccsccscsccccsccccccsccsscsscscccscccccssccsscsscccccccccsscccccccccccccsssccccsccccsscccccssscccsscsc" />
  </g>
</svg>
